##TITLE=	Sep11-2019.51.fid
TH051 McMurry 1H

##JCAMP-DX=	6.0	$$ MestReNova 14.1.1-24571
##DATA TYPE=	LINK
##BLOCK_ID=	1
##BLOCKS=	1    
##ORIGIN=	Mestrelab Research S.L.
##OWNER=	hrzepa
##$MNOVA/LINK_BLOCK_TYPE=	ITEM	$$ NMR Spectrum
##$MNOVA/ITEM/POLYGON=	(XY..XY)
5321,5835
8722,5835
8722,8208
5321,8208
5321,5835
##$MNOVA/ITEM/Z=	0
##$MNOVA/ITEM/ANGLE=	0
##TITLE=	Sep11-2019.51.fid
##JCAMP-DX=	6.0	$$ MestReNova 14.1.1-24571
##BLOCK_ID=	2
##DATA TYPE=	NMR SPECTRUM
##DATA CLASS=	XYDATA
##NUMDIM=	1
##ORIGIN=	Bruker BioSpin GmbH
##OWNER=	nmr
##.OBSERVE FREQUENCY=	100.64143942070799653
##.OBSERVE NUCLEUS=	^13C
##.SOLVENT NAME=	CDCl3
##.PULSE SEQUENCE=	zgpg30
##LONGDATE=	2019/09/12 04:20:00.000
##.ACQUISITIONMODE=	SIMULTANEOUS (DQD)
##$ORIGINAL FORMAT=	Bruker XWIN-NMR
##$MNOVA/SCALES_VERSION=	9
##$PARAMETER FILE=	(acqus, ASCII, /Users/hrzepa/Downloads/Polysiphenol%20SI%20NMR%20Original%20Data/3/3d%20-%2013C%20-%20400C.19.09.11.051/51/acqus, 0)
$$ ##TITLE= Parameter file, TOPSPIN		Version 3.2
$$ ##JCAMPDX= 5.0
$$ ##DATATYPE= Parameter Values
$$ ##NPOINTS= 11	$$ modification sequence number
$$ ##ORIGIN= Bruker BioSpin GmbH
$$ ##OWNER= nmr
$$ $$ 2019-09-12 04:20:51.930 +0100  nmr@CZC2439F63
$$ $$ /opt/topspin/data/brad/nmr/Sep11-2019/51/acqus
$$ $$ process /opt/topspin3.2/prog/mod/shimcntl
$$ ##$ACQT0= -1.90126054427203
$$ ##$AMP= (0..31)
$$ 100 100 100 100 100 100 100 100 100 100 100 100 100 100 100 100 100 100
$$ 100 100 100 100 100 100 100 100 100 100 100 100 100 100
$$ ##$AMPCOIL= (0..19)
$$ 0 0 0 0 0 0 0 0 0 0 0 0 0 0 0 0 0 0 0 0
$$ ##$ANAVPT= -1
$$ ##$AQSEQ= 0
$$ ##$AQ_mod= 3
$$ ##$AUNM= <au_zg>
$$ ##$AUTOPOS= <36 >
$$ ##$BF1= 100.63037
$$ ##$BF2= 400.2
$$ ##$BF3= 100.63037
$$ ##$BF4= 100.63037
$$ ##$BF5= 100.63037
$$ ##$BF6= 100.63037
$$ ##$BF7= 100.63037
$$ ##$BF8= 100.63037
$$ ##$BYTORDA= 0
$$ ##$CAGPARS= (0..11)
$$ 0 0 0 0 0 0 0 0 0 0 0 0
$$ ##$CFDGTYP= 0
$$ ##$CFRGTYP= 9
$$ ##$CHEMSTR= <none>
$$ ##$CNST= (0..63)
$$ 1 1 145 1 1 1 1 1 1 1 1 1 1 1 1 1 1 1 1 1 1 1 1 1 1 1 1 1 1 1 1 1 1 1 1
$$ 1 1 1 1 1 1 1 1 1 1 1 1 1 1 1 1 1 1 1 1 1 1 1 1 1 1 1 1 1
$$ ##$CPDPRG= (0..8)
$$ <waltz16> <> <waltz16> <> <mlev> <mlev> <mlev> <mlev> <mlev>
$$ ##$D= (0..63)
$$ 0 1 0.00345 0 0 0 0 0 0 0.06 0 0.03 2e-05 3e-06 0 0 0.0002 0 0 0 0 0 0
$$ 0 0 0 0 0 0 0 0 0 0 0 0 0 0 0 0 0 0 0 0 0 0 0 0 0 0 0 0 0 0 0 0 0 0 0 0
$$ 0 0 0 0 0
$$ ##$DATE= 1568258451
$$ ##$DE= 6.5
$$ ##$DECBNUC= <off>
$$ ##$DECIM= 704
$$ ##$DECNUC= <off>
$$ ##$DECSTAT= 4
$$ ##$DIGMOD= 1
$$ ##$DIGTYP= 12
$$ ##$DQDMODE= 0
$$ ##$DR= 21
$$ ##$DS= 4
$$ ##$DSPFIRM= 0
$$ ##$DSPFVS= 20
$$ ##$DTYPA= 0
$$ ##$EXP= <c13>
$$ ##$F1LIST= <111111111111111>
$$ ##$F2LIST= <222222222222222>
$$ ##$F3LIST= <333333333333333>
$$ ##$FCUCHAN= (0..9)
$$ 0 1 2 0 0 0 0 0 0 0
$$ ##$FL1= 83
$$ ##$FL2= 83
$$ ##$FL3= 83
$$ ##$FL4= 83
$$ ##$FOV= 20
$$ ##$FQ1LIST= <freqlist>
$$ ##$FQ2LIST= <freqlist>
$$ ##$FQ3LIST= <freqlist>
$$ ##$FQ4LIST= <freqlist>
$$ ##$FQ5LIST= <freqlist>
$$ ##$FQ6LIST= <freqlist>
$$ ##$FQ7LIST= <freqlist>
$$ [...]
$$ ##$Sgu3PowerLevels= (0..7)
$$ 0 0 0 0 0 0 0 0
$$ ##$Sgu4PowerLevels= (0..7)
$$ 0 0 0 0 0 0 0 0
$$ ##$Sgu5PowerLevels= (0..7)
$$ 0 0 0 0 0 0 0 0
$$ ##$Sgu6PowerLevels= (0..7)
$$ 0 0 0 0 0 0 0 0
$$ ##$Sgu7PowerLevels= (0..7)
$$ 0 0 0 0 0 0 0 0
$$ ##$Sgu8PowerLevels= (0..7)
$$ 0 0 0 0 0 0 0 0
$$ ##$SguType= 3
$$ ##$ShimPowMaxUA= (0..63)
$$ 130000 130000 130000 130000 130000 130000 130000 130000 130000 130000 130000
$$ 130000 130000 130000 130000 130000 130000 130000 130000 130000 0 0 0 0
$$ 0 0 0 0 0 0 0 0 0 0 0 0 0 0 0 0 0 0 0 0 0 0 0 0 0 0 0 0 0 0 0 0 0 0 0 0
$$ 0 0 0 0
$$ ##$ShimPowMaxUC= (0..63)
$$ 130000 130000 130000 130000 130000 130000 130000 130000 130000 130000 130000
$$ 130000 130000 130000 130000 130000 130000 130000 130000 130000 0 0 0 0
$$ 0 0 0 0 0 0 0 0 0 0 0 0 0 0 0 0 0 0 0 0 0 0 0 0 0 0 0 0 0 0 0 0 0 0 0 0
$$ 0 0 0 0
$$ ##$ShimPowMaxUG= (0..63)
$$ 524287 524287 524287 524287 524287 524287 524287 524287 524287 524287 524287
$$ 524287 524287 524287 524287 524287 524287 524287 524287 524287 0 0 0 0
$$ 0 0 0 0 0 0 0 0 0 0 0 0 0 0 0 0 0 0 0 0 0 0 0 0 0 0 0 0 0 0 0 0 0 0 0 0
$$ 0 0 0 0
$$ ##$ShimPowRcbType= 3
$$ ##$ShimPowRes= (0..63)
$$ 1e-20 1e-20 1e-20 1e-20 1e-20 1e-20 1e-20 1e-20 1e-20 1e-20 1e-20 1e-20
$$ 1e-20 1e-20 1e-20 1e-20 1e-20 1e-20 1e-20 1e-20 0 0 0 0 0 0 0 0 0 0 0 0
$$ 0 0 0 0 0 0 0 0 0 0 0 0 0 0 0 0 0 0 0 0 0 0 0 0 0 0 0 0 0 0 0 0
$$ ##$ShimPowRng0= (0..63)
$$ 1 1 1 1 1 1 1 1 1 1 1 1 1 1 1 1 1 1 1 1 0 0 0 0 0 0 0 0 0 0 0 0 0 0 0 0
$$ 0 0 0 0 0 0 0 0 0 0 0 0 0 0 0 0 0 0 0 0 0 0 0 0 0 0 0 0
$$ ##$ShimPowRng1= (0..63)
$$ 1 1 1 1 1 1 1 1 1 1 1 1 1 1 1 1 1 1 1 1 0 0 0 0 0 0 0 0 0 0 0 0 0 0 0 0
$$ 0 0 0 0 0 0 0 0 0 0 0 0 0 0 0 0 0 0 0 0 0 0 0 0 0 0 0 0
$$ ##$ShimPowRng2= (0..63)
$$ 1 1 1 1 1 1 1 1 1 1 1 1 1 1 1 1 1 1 1 1 0 0 0 0 0 0 0 0 0 0 0 0 0 0 0 0
$$ 0 0 0 0 0 0 0 0 0 0 0 0 0 0 0 0 0 0 0 0 0 0 0 0 0 0 0 0
$$ ##$ShimPowRng3= (0..63)
$$ 1 1 1 1 1 1 1 1 1 1 1 1 1 1 1 1 1 1 1 1 0 0 0 0 0 0 0 0 0 0 0 0 0 0 0 0
$$ 0 0 0 0 0 0 0 0 0 0 0 0 0 0 0 0 0 0 0 0 0 0 0 0 0 0 0 0
$$ ##$ShimSysFunc= (0..63)
$$ 1 2 3 4 5 7 9 11 15 16 8 10 12 14 6 17 13 18 19 20 0 0 0 0 0 0 0 0 0 0
$$ 0 0 0 0 0 0 0 0 0 0 0 0 0 0 0 0 0 0 0 0 0 0 0 0 0 0 0 0 0 0 0 0 0 0
$$ ##$ShimSysMatrix= 0
$$ ##$ShimSysType= 1
$$ ##$TFXNUM= 0
$$ ##$TRIPLO2= 0
$$ ##$VTU= 2
$$ ##$VTUETH= <149.236.99.20>
$$ ##$VTUTY= <no>
$$ ##$WBREFAM= (0..15)
$$ 135.5 97.7 100 100 100 100 100 100 100 100 100 100 100 100 100 100
$$ ##$WBREFLM= (0..15)
$$ 0 0 0 0 0 0 0 0 0 0 0 0 0 0 0 0
$$ ##$WBREFPH= (0..15)
$$ 72.26 -67.22 0 0 0 0 0 0 0 0 0 0 0 0 0 0
$$ ##$WBSGU= (0..15)
$$ 0 0 0 0 0 0 0 0 0 0 0 0 0 0 0 0
$$ ##$XFAC= 2
$$ ##END=
$$ 
##$DECIM=	704
##$DSPFVS=	20
##XUNITS=	HZ
##YUNITS=	ARBITRARY UNITS
##FIRSTX=	25273.966162542779784
##LASTX=	-3134.691258222480883
##DELTAX=	-0.43348832563920436378
##XFACTOR=	1
##YFACTOR=	0.053066739364139428603
##FIRSTY=	36.46726226806640625
##MINY=	21.273260116577148438
##MAXY=	1932.0650634765625
##NPOINTS=	65536
##XYDATA=	(X++(Y..Y))
$$ [...]
12486A134k0j0j0rj0l1l1k9k9L0N7J9l2o8m1J4M0K1K0K2K3popoM5M4J9J8k6k6nM8M7K0j4j4
12470A190kjkkJ1J0J1J0MLMLl3l4l4l4KJKKL4L5L4L5K0J9K0K0M9M9K6k6m2m1QQJ4J4l9l9n3
12453A256n3p6p7o1rj2j2J8J8M5M4mmnml5l5qrPOm6m6K0K0J9K0K4K3K3K3j2j3j3j2k1k0j7
12436I62j7k0L3O9M3j6m3m2j6NL2L4P%jkkL3L2L2L3rj0rj0JKJJm2m2m2m2onM6M7R2R2L4k0
12418A235l2l3l6l7m0m0J3J3%Jk6k5k2k2L1L0K2K2K2K1M4M4M4M4j0rM0M1jn4r2o5k0k0j8j9
12403A046PPPPPPPQPPQPk8k7k8k7K7K8K7K8K1K1K1K1m8m7m7m7rqrqK9K8K9K9J6J5J5J5k3k3
12385A123k3k3ooM7M7K8K9K8K8j3j4j3j3k9k9k8k9J1J1J1J1l1l2k9k8J1O3R6P0J7p0j11j11
12370I93m9m9LML3L3L3L4M0M1j2j1J7J8J8J8ppqpq4q4n9oK4N0N4K8JJ%jk0k0k0k0N2N3N2N3
$$ y = [1134, 1114, 1104, 1094, 1085, 1075, 1044, 1013, 984, 955, 985, 1042, 1061, 1029, 961, 920, 934, 974, 995, 1015, 1037, 1060, 1053, 1047, 1040, 1034, 1079, 1123, 1142, 1160, 1134, 1108, 1103, 1151, 1198, 1218, 1204, 1190, 1188, 1187, 1185, 1183, 1194, 1204, 1215, 1225, 1229, 1232, 1236, 1239, 1206, 1172, 1138, 1104, 1106, 1107, 1109, 1111, 1145, 1180, 1214, 1249, 1269, 1288, 1308, 1328, 1377, 1426, 1452, 1426, 1384, 1343, 1351, 1359, 1373, 1387, 1348, 1309, 1256, 1203, 1127, 1050, 989, 980, 968, 956, 974, 992, 1037, 1081, 1077, 1073, 1068, 1064, 1029, 994, 986, 977, 984, 990, 944, 898, 918, 938, 957, 977, 1001, 1024, 1047, 1070, 1058, 1045, 1032, 1020, 999, 979, 962, 945, 925, 958, 1027, 1070, 1054, 1011, 969, 953, 958, 990, 1024, 1031, 1031, 1030, 1028, 1026, 1059, 1091, 1123, 1156, 1147, 1137, 1128, 1118, 1119, 1121, 1122, 1123, 1081, 1039, 997, 955, 949, 944, 990, 1037, 1129, 1221, 1255, 1235, 1203, 1170, 1134, 1097, 1057, 1017, 1030, 1043, 1043, 1044, 1018, 993, 971, 949, 980, 1010, 1032, 1054, 1076, 1097, 1141, 1185, 1229, 1273, 1263, 1254, 1294, 1335, 1334, 1280, 1188, 1123, 1103, 1083, 1065, 1046, 1053, 1060, 1067, 1074, 1081, 1088, 1095, 1103, 1110, 1117, 1125, 1132, 1104, 1077, 1049, 1022, 1049, 1077, 1104, 1132, 1153, 1174, 1195, 1216, 1168, 1121, 1074, 1027, 1018, 1010, 1001, 993, 1022, 1050, 1079, 1108, 1124, 1139, 1154, 1169, 1146, 1123, 1100, 1077, 1071, 1065, 1112, 1159, 1187, 1216, 1244, 1272, 1259, 1245, 1232, 1219, 1190, 1161, 1133, 1104, 1115, 1126, 1137, 1148, 1117, 1085, 1056, 1028, 1039, 1102, 1198, 1268, 1285, 1215, 1104, 993, 944, 895, 898, 902, 935, 968, 1001, 1035, 1075, 1116, 1104, 1093, 1110, 1128, 1146, 1164, 1157, 1150, 1142, 1135, 1051, 967, 908, 902, 926, 976, 1030, 1058, 1059, 1060, 1060, 1059, 1039, 1019, 999, 979, 1031, 1084, 1136, 1189]
12353A189k0k0k0j9j4j3j3j3M7M7M7M7J3J4m0m0k7k7k6k7j5j5j5j5j1j1j2j1KJj4J3M3M3N9
12337A127L2j7j7j9j9m8m8j0J6K2K3K4K4M1M2M0M0K3nJ1J0j3j3j3j3l2l1m3j7M7R1O6O6Q2
12323A469N4rq8j32j33o4l9l8l9l5l6j7RM5M6M3J6k1k1mmm1o6o7m0lknK1M2P0N5K9M3M4K8
12307A110KJK6N5K8pqj6j6Jk5k2Mj2j3J1J1J1J1J7J7j1n5o6o7m1LL1L1L1L2J5j2LLJ7J7J7
12291A134J7j9j8j8j9J6J6J6J6K8K8jm4o3o4nL8N2K5Nk1k9k8K2K3M0M1J4J4j4j4j4j4OOPO
12275A185J5J5O5O5L2j2l9m0k0k1k0k1j3j4j3j3ppppK1K1K1K1QRm4m4j2j3j3j2m8m7K3N0L2
12258A096j1l8l7k2k2j9j9K8P2R7R7M1kOL2%k6j0j0qqqrJ9K0l4l4NMMMj9k0POm1m2QO9P3J2
12241A261n5q1n0oK0K0qqqqRRm3m3L0L0L0L0LLn0n0J6J7M2M3l1l0l1l0llllK1K2K1K1k2k1
$$ y = [1189, 1169, 1149, 1129, 1110, 1096, 1083, 1070, 1057, 1104, 1151, 1198, 1245, 1258, 1272, 1232, 1192, 1165, 1138, 1112, 1085, 1070, 1055, 1040, 1025, 1014, 1003, 991, 980, 982, 983, 969, 982, 1025, 1068, 1127, 1159, 1142, 1125, 1106, 1087, 1039, 991, 981, 997, 1019, 1042, 1066, 1090, 1131, 1173, 1213, 1253, 1276, 1271, 1282, 1292, 1279, 1266, 1253, 1240, 1208, 1177, 1134, 1117, 1164, 1255, 1321, 1387, 1469, 1523, 1514, 1426, 1294, 1161, 1097, 1058, 1020, 981, 946, 910, 893, 902, 947, 993, 1036, 1052, 1031, 1010, 1006, 1002, 961, 895, 828, 788, 785, 783, 778, 799, 841, 911, 966, 995, 1038, 1082, 1110, 1112, 1113, 1139, 1194, 1222, 1215, 1207, 1191, 1175, 1176, 1151, 1129, 1133, 1121, 1108, 1119, 1130, 1141, 1152, 1169, 1186, 1175, 1120, 1054, 987, 946, 949, 980, 1011, 1042, 1074, 1089, 1077, 1080, 1083, 1100, 1117, 1134, 1151, 1132, 1114, 1096, 1077, 1093, 1109, 1125, 1141, 1169, 1197, 1196, 1152, 1089, 1025, 1020, 1058, 1110, 1135, 1140, 1119, 1090, 1062, 1084, 1107, 1147, 1188, 1202, 1216, 1202, 1188, 1174, 1160, 1166, 1172, 1179, 1185, 1200, 1215, 1280, 1345, 1377, 1365, 1326, 1286, 1266, 1245, 1225, 1204, 1191, 1177, 1164, 1151, 1144, 1137, 1130, 1123, 1144, 1165, 1186, 1207, 1215, 1224, 1180, 1136, 1124, 1111, 1098, 1086, 1038, 991, 1014, 1064, 1096, 1085, 1047, 1010, 988, 966, 947, 928, 956, 1028, 1125, 1222, 1263, 1261, 1267, 1299, 1299, 1273, 1263, 1253, 1245, 1237, 1229, 1220, 1239, 1259, 1225, 1191, 1196, 1200, 1204, 1208, 1189, 1169, 1176, 1182, 1141, 1099, 1107, 1176, 1249, 1261, 1206, 1125, 1075, 1069, 1089, 1109, 1101, 1093, 1085, 1077, 1086, 1095, 1052, 1009, 1039, 1069, 1099, 1129, 1132, 1135, 1085, 1035, 1051, 1068, 1110, 1153, 1122, 1092, 1061, 1031, 1028, 1025, 1022, 1019, 1040, 1062, 1083, 1104, 1082, 1061]
12223A061k2k2J6J6J5J6J0J0RJ0jkjjk1k1k1k1QQQPRRQRK9K9k4k4OOL3L2k6k6K6K7K6K7K7
12206A264K6M6M5m3m2o5o5j3j2l3l4l3l3k8k8K5K5M6M5M6M6OOOPL0L0L1L0L8L7L8L7J5J5J5
12190A526J5K6K5N2N2R6R6J49J49J72J72K02L78N06O11Q49J235J369O99n62j581j653j124
12180C459o10m33l38k15j15j15j37j37n0m9m2m1m2m2j1j1j1j1m2m2J1J0j8j9j9j9k9k8k9k9
12167G96N2N1N2N1N8N8L6j8n6n6K8K9J2J2J2J3j9j8j9j8J4J4O6O7L2L1k7p9j06j05n1KJ6J5
12152I45P1P2M8M9M5M5j1o4l1l1oM6O7O6Lm9j9k0lmlml4l4l5l4J6J5J6J5n6n6q6l2J5J6J9
12136I57J9j2j2j2j1PPPQ%JJ%O7O7O4O4Pm5o8o8o8o8j6j5J8J7J8J8RRL9j4j2j2j5j5j5j6L8
12119I48L7L8L9L8L9LLLLL6L6k2p5o5o6o5o6j7L6R1R1P6K5JJ%%n0m9k3K9N3N3JJJJonooj6
$$ y = [1061, 1039, 1017, 1033, 1049, 1064, 1080, 1090, 1100, 1109, 1119, 1118, 1116, 1115, 1114, 1093, 1072, 1051, 1030, 1038, 1046, 1054, 1061, 1070, 1079, 1087, 1096, 1125, 1154, 1130, 1106, 1112, 1118, 1151, 1183, 1157, 1131, 1157, 1184, 1210, 1237, 1264, 1290, 1336, 1381, 1338, 1296, 1231, 1166, 1153, 1141, 1108, 1074, 1041, 1008, 980, 952, 977, 1002, 1048, 1093, 1139, 1185, 1191, 1197, 1203, 1210, 1240, 1270, 1301, 1331, 1369, 1406, 1444, 1481, 1496, 1511, 1526, 1541, 1567, 1592, 1644, 1696, 1792, 1888, 2037, 2186, 2358, 2530, 2732, 3110, 3616, 4227, 5076, 6311, 7680, 8379, 7817, 6236, 4583, 3459, 2849, 2416, 2078, 1863, 1748, 1633, 1496, 1359, 1309, 1260, 1218, 1177, 1135, 1093, 1082, 1071, 1060, 1049, 1007, 965, 976, 986, 968, 949, 930, 911, 882, 854, 825, 796, 848, 899, 951, 1002, 1060, 1118, 1154, 1136, 1080, 1024, 1052, 1081, 1093, 1105, 1117, 1130, 1111, 1093, 1074, 1056, 1070, 1084, 1150, 1217, 1249, 1280, 1253, 1174, 1068, 963, 912, 914, 930, 945, 1016, 1088, 1136, 1185, 1230, 1275, 1264, 1200, 1169, 1138, 1132, 1178, 1245, 1311, 1314, 1265, 1246, 1226, 1223, 1219, 1216, 1212, 1178, 1144, 1109, 1075, 1091, 1106, 1122, 1137, 1081, 1025, 939, 907, 922, 938, 957, 976, 964, 952, 940, 929, 936, 943, 950, 958, 958, 959, 960, 960, 1027, 1094, 1158, 1222, 1229, 1184, 1116, 1048, 980, 912, 896, 881, 899, 916, 934, 952, 961, 970, 1009, 995, 983, 971, 956, 941, 926, 910, 948, 985, 1023, 1062, 1100, 1139, 1142, 1145, 1148, 1151, 1187, 1223, 1201, 1126, 1061, 995, 930, 864, 847, 883, 974, 1065, 1141, 1166, 1167, 1168, 1168, 1168, 1118, 1069, 1046, 1075, 1128, 1181, 1182, 1183, 1184, 1185, 1179, 1174, 1168, 1162, 1146]
12101A146j7L6L6POm6m7j3j3j4j3j9k0j9k0k9k9l0k9l4l3J9J9QQO1O1M3M3M3M3M5M5pql6l5
12085A158l6l6j7j7O5O5M0m8n2n2%%%%J4J4J3J4k9k9k6k6n4jN7N7J1J1J2J1n6n5n6n5J0J0
12069I17J1J0L1L1L0L1RQRRk7k8k7k7poMN8O4J2l5o2n4k8j6J1L1L1OPJ9J9M3M2K7k6m1m0o
12052A040oooK0K1oom5m5jjJ3J3M0L9K7K7K8K7m4m4m3m4%Jm2m2p1m4NN7O3J0kjK8K8l4l4k5
12035H95k4L6L7M9M9K2K3L8L9L8L9%Jm4m3j4j5J2J3J3J4l0l0k2k2k4k4p4j01n4jM0M1J%K1
12019H99K2K1K1K2K1k2k3K3K4K4K3L4L4L4L4QPQQPQQPlllll4l4l4l3J0J1J1J1J0J1J1J1k8
12002A163k8k7k8k3k4m9n0ooL8L8J7J7M3M4K6K6%%J4J4J4J3pqn2n2m9m9m9m9POOOM4M4M4M4
11985A112J6J6j0j1M5M5J3l9l0l0J0J1O1O0N7N8J5l7q1q1m4M4Q6L4l2l2l5l6k5k5J8J9l8l7
$$ y = [1146, 1129, 1165, 1201, 1208, 1214, 1168, 1121, 1108, 1095, 1081, 1068, 1049, 1029, 1010, 990, 961, 932, 902, 873, 839, 806, 825, 844, 852, 860, 921, 982, 1025, 1068, 1111, 1154, 1199, 1244, 1237, 1229, 1193, 1158, 1122, 1086, 1069, 1052, 1117, 1182, 1222, 1174, 1122, 1070, 1070, 1070, 1070, 1070, 1084, 1098, 1111, 1125, 1096, 1067, 1041, 1015, 961, 960, 1017, 1074, 1085, 1096, 1108, 1119, 1063, 1008, 952, 897, 907, 917, 928, 938, 969, 1000, 1030, 1061, 1070, 1078, 1087, 1096, 1069, 1041, 1014, 987, 980, 974, 978, 1036, 1100, 1112, 1077, 1015, 961, 933, 917, 928, 959, 990, 996, 1003, 1022, 1041, 1084, 1126, 1153, 1127, 1086, 1046, 1040, 1034, 1028, 1022, 1042, 1063, 1057, 1051, 1006, 961, 960, 959, 972, 985, 1025, 1064, 1091, 1118, 1146, 1173, 1129, 1085, 1042, 998, 998, 999, 957, 915, 844, 800, 805, 862, 925, 935, 933, 932, 960, 988, 954, 920, 895, 871, 907, 944, 993, 1042, 1064, 1087, 1125, 1164, 1202, 1241, 1241, 1242, 1198, 1155, 1141, 1126, 1138, 1151, 1164, 1178, 1148, 1118, 1096, 1074, 1050, 1026, 952, 851, 797, 796, 836, 877, 878, 878, 899, 921, 942, 963, 985, 1006, 984, 961, 984, 1008, 1032, 1055, 1089, 1123, 1157, 1191, 1199, 1206, 1214, 1222, 1229, 1237, 1245, 1252, 1249, 1246, 1243, 1240, 1206, 1172, 1138, 1105, 1115, 1126, 1137, 1148, 1158, 1169, 1180, 1191, 1163, 1135, 1108, 1080, 1057, 1033, 984, 934, 928, 922, 960, 998, 1015, 1032, 1075, 1119, 1145, 1171, 1171, 1171, 1185, 1199, 1213, 1226, 1219, 1211, 1159, 1107, 1058, 1009, 960, 911, 918, 924, 930, 936, 980, 1024, 1068, 1112, 1128, 1144, 1134, 1123, 1168, 1213, 1226, 1187, 1157, 1127, 1137, 1148, 1209, 1269, 1326, 1384, 1399, 1362, 1281, 1200, 1156, 1200, 1286, 1320, 1288, 1256, 1221, 1185, 1160, 1135, 1153, 1172, 1134, 1097]
11970A097l8l8l9m0j3j2J9K0k5k4j8j8K7K6L2L2NOqqpqm7m7m4m4j6L7O9O9J7J7J7J7J9J9J9
11954A070J9NNk1k1m9n0J1N5K9j5l9m0OOL3L3K5K5K5K5j4j4j4j4J1J2m1m1k4k5K8K9onn6n6
11938I07m4%K8K8L4L3L1L1Ol9k8kK0K1K0K0ql5k1K4K1om1m2m5m6m5m6k3k4L0K9N6N6L0L0K
11922I62KKJJ5J5M2M1N0N0llj5j5L7L7M6M6ppm6m5PQJ5J4J5J5QQQRJ6J6l7l6m3m3o9o9nnn
11904A032nONN8N8ONONk4k4k5k4K2K1J7J8k8r0q0l5mlk7k7qqM5M5K5K4k5k6j1L3O1O1RRj8
11887A079j7L8L8J1J2l7l8o1o1m4jK7K8MMk3k2nmmnJ2J1J2J1J2J1J1J2J8J9J8J9J8J8J9J8
11871A158j0rj0j0M1M0M1M1j1j1j0j1k1k2k1k2lllmm0m1m0m1J1J0J0J1K1K1K2K1klkkk0j9
11854A057j8j7L1N7M2lm3m3PPmlM9M9J9J8M4M3O7M1K4P7J24R8M1m7q8j14j28j28p4k2KKk0
$$ y = [1097, 1059, 1021, 982, 942, 929, 917, 936, 956, 931, 907, 889, 871, 898, 924, 956, 988, 993, 999, 991, 983, 976, 968, 921, 874, 830, 786, 770, 807, 876, 945, 962, 979, 996, 1013, 1032, 1051, 1070, 1089, 1094, 1099, 1078, 1057, 1008, 958, 969, 1024, 1053, 1038, 999, 959, 965, 971, 1004, 1037, 1062, 1087, 1112, 1137, 1123, 1109, 1095, 1081, 1092, 1104, 1063, 1022, 998, 973, 1001, 1030, 1024, 1019, 963, 907, 863, 863, 891, 919, 953, 986, 1017, 1048, 1054, 1015, 987, 985, 1005, 1026, 1046, 1066, 1058, 1023, 1002, 1026, 1047, 1041, 1000, 958, 913, 867, 822, 776, 753, 729, 759, 788, 844, 900, 930, 960, 962, 964, 966, 967, 982, 997, 1039, 1080, 1130, 1180, 1177, 1174, 1159, 1144, 1181, 1218, 1264, 1310, 1303, 1296, 1250, 1205, 1212, 1220, 1235, 1249, 1264, 1279, 1287, 1295, 1303, 1312, 1328, 1344, 1307, 1271, 1228, 1185, 1116, 1047, 1042, 1037, 1032, 1027, 1033, 1038, 1096, 1154, 1160, 1165, 1171, 1176, 1152, 1128, 1103, 1079, 1101, 1122, 1139, 1157, 1129, 1039, 959, 924, 920, 917, 890, 863, 855, 847, 892, 937, 962, 986, 961, 935, 924, 957, 1018, 1079, 1088, 1097, 1079, 1062, 1100, 1138, 1149, 1161, 1124, 1086, 1025, 964, 920, 919, 946, 974, 978, 982, 959, 937, 932, 928, 924, 919, 931, 942, 954, 965, 977, 988, 999, 1011, 1029, 1048, 1066, 1085, 1103, 1121, 1140, 1158, 1148, 1139, 1129, 1119, 1160, 1200, 1241, 1282, 1271, 1260, 1250, 1239, 1218, 1196, 1175, 1153, 1150, 1147, 1144, 1140, 1100, 1059, 1019, 978, 989, 999, 1009, 1020, 1041, 1062, 1084, 1105, 1103, 1100, 1098, 1096, 1076, 1057, 1039, 1022, 1053, 1110, 1152, 1149, 1106, 1063, 1070, 1077, 1073, 1070, 1119, 1168, 1187, 1205, 1249, 1292, 1359, 1400, 1424, 1501, 1625, 1723, 1764, 1717, 1629, 1515, 1387, 1259, 1185, 1163, 1165, 1167, 1147]
11839A147k0k0j9k4k3k5k4jk8m2J0M8M9N1N2J8J8l5l4n1n1n3%O6R2Q0K8on9q6q5l9l9j3j3
11824H69K8K7Om7p5m8k7jL5O1N1kj9j9L0L1LLk4k3mmnmK0K0K5k8k2NL9L8L2L1k2k1m4m4QR
11806H88K3K3K3K3L3L3k0k0LLLLqqqqK1K0K0K1K6K7K6K6J%J%l4l4o1o0m4m3M4M5J5J4l8l8
11789I41l9l9l6l6l0K2Q1Q1P0P0M4M4K6K7Ln0r4r5j0j0k1k2ONM5M5K2l0n7n6l6J6L0L0N6N7
11773A060O6J4rrj3j3j3j3J8J8l5l5kjJJj2M0O4O3MMMMj0j0j0j0J8J9J8J9mllmj4j5j4j5n4
11756A114n5n4n4NMNNK5K4K4K4O0O0L4L3qqo2o1n1n1L7L7J2J2j5j4J5J5j5L8P2P2J7l5o7o7
11740A127J7J8MNk2k2jjn0n0m1J1j8j8PQL4L4k1k1%N3M0J4J8M3L4L4L4L4O7M1l4q7o3j0K2
11724A240ml5o1o3l7j2j1j0j0k5k6k5k5K5K4K5K5JJJ%J9J8J9J8noonPQPQrrJ0O4J06N4jkj7
$$ y = [1147, 1127, 1107, 1088, 1064, 1041, 1016, 992, 991, 963, 921, 931, 979, 1028, 1079, 1131, 1149, 1167, 1132, 1098, 1047, 996, 943, 943, 1009, 1101, 1181, 1209, 1203, 1144, 1058, 973, 934, 895, 882, 869, 897, 924, 930, 883, 808, 760, 733, 732, 767, 828, 879, 877, 858, 839, 869, 900, 903, 906, 882, 859, 855, 851, 846, 842, 862, 882, 907, 879, 857, 862, 901, 939, 971, 1002, 980, 959, 915, 871, 879, 888, 911, 934, 957, 980, 1013, 1046, 1026, 1006, 1009, 1012, 1015, 1018, 1010, 1002, 994, 986, 1007, 1027, 1047, 1068, 1094, 1121, 1147, 1173, 1174, 1174, 1175, 1175, 1141, 1107, 1046, 986, 942, 899, 943, 988, 1003, 1017, 979, 941, 902, 863, 827, 791, 761, 783, 864, 945, 1015, 1085, 1129, 1173, 1199, 1226, 1229, 1179, 1085, 990, 980, 970, 949, 927, 933, 938, 983, 1028, 1050, 1020, 963, 907, 871, 887, 917, 947, 1003, 1060, 1126, 1140, 1131, 1122, 1109, 1096, 1083, 1070, 1088, 1106, 1071, 1036, 1034, 1033, 1034, 1035, 1023, 1063, 1127, 1190, 1194, 1198, 1202, 1206, 1196, 1186, 1176, 1166, 1184, 1203, 1221, 1240, 1236, 1233, 1230, 1226, 1212, 1197, 1183, 1168, 1114, 1059, 1005, 951, 956, 960, 965, 970, 995, 1019, 1043, 1067, 1127, 1187, 1221, 1254, 1246, 1238, 1176, 1115, 1064, 1013, 1050, 1087, 1099, 1111, 1096, 1082, 1097, 1112, 1097, 1135, 1207, 1279, 1296, 1261, 1194, 1127, 1144, 1162, 1166, 1171, 1149, 1127, 1126, 1125, 1075, 1025, 984, 995, 977, 959, 966, 974, 1008, 1042, 1021, 1000, 1000, 1053, 1093, 1107, 1125, 1168, 1202, 1236, 1270, 1304, 1371, 1412, 1378, 1291, 1228, 1218, 1240, 1236, 1201, 1140, 1077, 1040, 1028, 1017, 1007, 997, 972, 946, 921, 896, 921, 945, 970, 995, 996, 997, 998, 998, 1017, 1035, 1054, 1072, 1067, 1061, 1055, 1050, 1057, 1065, 1072, 1080, 1071, 1062, 1072, 1136, 1242, 1296, 1295, 1293, 1276]
11705A276j8p1p0n0m9LMnmML0L4j8m0m1QQQP%%%%k6k5mM8R6O8J6j1J2L8K2K1jkjkLLn0m9n2
11686A120n2JKK4K4K4K4K7K6ql4j7L6M7J9m4m5m7m6J6J7l6l6m4m5RQM8M8M8M8j1j2j2j1J6
11671A132J7L9M0M8mk7k8j4j5j5j4KLLKj7j7j7j8j2j3j3j3PPPPkkkjj3j3j3j3M1M1M1M1QQ
11653A198PQnnnoJ0J1J0J0K9L0L0K9K8K7k5k5MNR1R1Q9O3Q2J71K06K33K96M54N84O38Q30J165
11638F358J291O76n09j476j637j126o44m49l45k21j15j15j51o3J1J1m2m3n1p7m6PN9Nm0m1
11627A227j7j7k9k9n1n2k3K9P9P9R4R4J24P1K3K4M3M3k5p8j07j06o0oPQrj0rrJJj2o6o5o5
11611A102J0J1M1M1O8O8K8K8NNN5J08Q4lj03j02p6k3l9l8l6l5llllJ7J6J7J6%j%jNNk2k1p
11594A211pN1N2J0m2n3n3k8K5K6k8o6o6k0L3M5M4L4k0l2l3M3M3J6J5J6J5l7l7o8j4KKONJ1
$$ y = [1276, 1258, 1187, 1117, 1067, 1018, 1021, 1025, 1020, 1016, 1020, 1050, 1084, 1066, 1026, 985, 993, 1001, 1009, 1016, 1016, 1016, 1016, 1016, 990, 965, 961, 1009, 1105, 1173, 1189, 1178, 1190, 1228, 1250, 1271, 1270, 1268, 1267, 1265, 1268, 1271, 1221, 1172, 1120, 1068, 1069, 1071, 1095, 1119, 1143, 1167, 1194, 1220, 1212, 1178, 1161, 1197, 1244, 1263, 1219, 1174, 1127, 1081, 1097, 1114, 1078, 1042, 998, 953, 962, 970, 1018, 1066, 1114, 1162, 1151, 1139, 1127, 1116, 1132, 1149, 1188, 1228, 1276, 1272, 1245, 1217, 1203, 1188, 1173, 1159, 1161, 1164, 1167, 1169, 1152, 1135, 1118, 1100, 1088, 1075, 1062, 1049, 1056, 1063, 1070, 1077, 1075, 1073, 1071, 1070, 1057, 1044, 1031, 1018, 1059, 1100, 1141, 1182, 1190, 1198, 1205, 1213, 1208, 1203, 1198, 1192, 1202, 1213, 1223, 1233, 1262, 1292, 1322, 1351, 1379, 1406, 1381, 1356, 1360, 1365, 1456, 1547, 1636, 1699, 1781, 1952, 2158, 2391, 2687, 3141, 3725, 4363, 5193, 6358, 7649, 8325, 7816, 6340, 4703, 3577, 2933, 2484, 2139, 1918, 1803, 1688, 1537, 1474, 1485, 1496, 1454, 1411, 1360, 1283, 1237, 1244, 1303, 1308, 1268, 1227, 1210, 1193, 1164, 1135, 1084, 1032, 1009, 1038, 1117, 1196, 1290, 1384, 1508, 1579, 1602, 1626, 1669, 1712, 1687, 1609, 1502, 1396, 1336, 1330, 1337, 1345, 1336, 1326, 1317, 1308, 1309, 1310, 1298, 1232, 1167, 1102, 1112, 1123, 1164, 1205, 1273, 1341, 1369, 1397, 1402, 1407, 1462, 1570, 1654, 1651, 1548, 1446, 1370, 1347, 1308, 1270, 1234, 1199, 1196, 1193, 1190, 1187, 1204, 1220, 1237, 1253, 1253, 1252, 1252, 1251, 1256, 1261, 1239, 1218, 1211, 1204, 1255, 1307, 1317, 1275, 1222, 1169, 1141, 1166, 1192, 1164, 1098, 1032, 1012, 1045, 1090, 1134, 1168, 1148, 1116, 1083, 1126, 1169, 1185, 1200, 1216, 1231, 1194, 1157, 1089, 1075, 1077, 1079, 1085, 1090, 1101]
11579A101J0J1J0k1k2NNl8l9k4K9N8N8N7N8J7l6o8o7l0l0l0l0K2K2K1K2l3l2l3l3qpN3Q0O8
11563A126J6m9n0m4m4j7j8K7K7%JllllJ5J6J7J7K5N1O5J2k7n3k7K5M3M2j6j6k5k6J8J8ONl8
11547A110l9%JM4M4lkk9k9qqJ9J8k0k0OL3J8l4m7m6j7j6l9l9nM8P6M9Ok1LK9J7j0rJ8K7K7
11530A152l3l3j6j6J0J0j9j9M3M3M0M0J4J3l4l4l5l4J8J7J8J7RRj7j7l5l5QRPPL3O0M4rk1
11514A214k1ONOOl1l0l0l0j2j2j3j2onooK7K7K7K7K2K1K2K1M4M3rp0q6o0oJ9J0j6%%K2K1m
11496A125m8n1pL8O3L0KK0J9J7J7J7J8J3J2m0l9p8p8k4k5pqppPOPPM4M4M4M5m6m5m5m5j2j2
11480I71j3j2M0M1M0M0J1J2J2J1J2J2J2J2n7n6k9J5J8J9K0K1K4K4K4K5l5l4l4l5j0j0j0j0
11465A071ONOOj0rj0rK2K2NL1O9K5k2m8l7l8l9l9j6j6L7L7M1M1m6m7k4k3k1k1j3L2N9N9MM
$$ y = [1101, 1111, 1122, 1132, 1111, 1089, 1094, 1099, 1061, 1022, 998, 1027, 1085, 1143, 1200, 1258, 1275, 1239, 1171, 1104, 1074, 1044, 1014, 984, 1006, 1028, 1049, 1071, 1038, 1006, 973, 940, 932, 925, 978, 1058, 1126, 1142, 1093, 1043, 999, 955, 938, 920, 947, 974, 974, 975, 972, 969, 966, 963, 978, 994, 1011, 1028, 1053, 1104, 1169, 1181, 1154, 1101, 1074, 1099, 1142, 1184, 1168, 1152, 1127, 1101, 1119, 1137, 1143, 1148, 1110, 1071, 1071, 1072, 1116, 1160, 1157, 1155, 1126, 1097, 1089, 1081, 1100, 1118, 1098, 1078, 1084, 1117, 1135, 1101, 1054, 1008, 991, 975, 936, 897, 892, 940, 1016, 1065, 1071, 1050, 1053, 1082, 1099, 1089, 1080, 1098, 1125, 1152, 1119, 1086, 1070, 1054, 1064, 1074, 1055, 1036, 1079, 1122, 1162, 1202, 1216, 1229, 1195, 1161, 1126, 1092, 1110, 1127, 1145, 1162, 1171, 1180, 1163, 1146, 1111, 1076, 1084, 1093, 1100, 1107, 1140, 1200, 1244, 1235, 1214, 1193, 1199, 1204, 1210, 1216, 1185, 1155, 1125, 1095, 1083, 1071, 1058, 1046, 1040, 1035, 1029, 1023, 1050, 1077, 1104, 1131, 1153, 1174, 1196, 1217, 1261, 1304, 1295, 1225, 1139, 1079, 1073, 1092, 1102, 1086, 1086, 1086, 1108, 1129, 1125, 1077, 1026, 1019, 1057, 1120, 1150, 1152, 1172, 1191, 1208, 1225, 1242, 1260, 1273, 1285, 1245, 1206, 1128, 1050, 1026, 1001, 994, 986, 979, 972, 979, 985, 992, 999, 1043, 1087, 1131, 1176, 1130, 1085, 1040, 995, 983, 971, 958, 946, 986, 1027, 1067, 1107, 1118, 1130, 1142, 1153, 1165, 1177, 1189, 1201, 1144, 1088, 1059, 1074, 1092, 1111, 1131, 1152, 1176, 1200, 1224, 1249, 1214, 1180, 1146, 1111, 1101, 1091, 1081, 1071, 1077, 1082, 1088, 1094, 1084, 1075, 1065, 1056, 1078, 1100, 1105, 1136, 1205, 1230, 1208, 1160, 1123, 1085, 1046, 1007, 991, 975, 1012, 1049, 1090, 1131, 1085, 1038, 1014, 991, 970, 949, 936, 968, 1027, 1086, 1090, 1094]
11448A094MMOOOOj4j3j4j4J2J2RRl9q2p0m3j6K7N7N7PPPQL2L2k1k1j1j0j1j1K0J9K0J9j3j3
11431A064L9L9L1L0k2k2m0m0m0l9mlllQQQPM7M6M6M7l3l2o7r4r0m5JK8J8J7K0J9l2l2l2l2
11414H18NNNNKKKKK3K3K3K2M4M4J6k9l7l8J3J2k2k1L1L1L4L4j8j9l6l7l7l7J9J8O2O2L6L5
11398A097qqj1j0J6J6J6J6m5m5m9m9nnk3k3k3k3lkM3R7J08N5RJ0MNNNl4l3l3l4K1K1K1K1K7
11381A147K7k2p6o4o3m1m1QPN2N1M8M7M5M4L4j8o8o8j0j0l7l7n1n2k6k6J8J7J7J8qpppll%
11365H35%j7L6O8O7M6M6KKooonK3K4M9N0RQn2n3k2k2K3K2qqpqJ5J6J5J5K4K4qo1m9m8n2n2
11347I29m6m5kkK6K5KKjN2Q0Q1M2j1k4k5j9j9k0j9jjmM8J02J01N5Lk1k0k4k4KKKKk2k2k2k2
11330A140nmmmo1o0l4l4QPn5n4l4l5RJ0L5L4O1O1N7N7J3J2k5k5m9m8RO2P4M7J0J0J6M3M2j1
$$ y = [1094, 1098, 1102, 1108, 1114, 1120, 1126, 1112, 1099, 1085, 1071, 1083, 1095, 1104, 1113, 1074, 992, 922, 879, 863, 890, 947, 1004, 1011, 1018, 1025, 1033, 1065, 1097, 1076, 1055, 1044, 1034, 1023, 1012, 1032, 1051, 1071, 1090, 1077, 1064, 1103, 1142, 1173, 1203, 1181, 1159, 1119, 1079, 1039, 1000, 996, 993, 990, 987, 995, 1003, 1011, 1018, 1065, 1111, 1157, 1204, 1171, 1139, 1072, 978, 888, 843, 844, 872, 890, 907, 927, 946, 914, 882, 850, 818, 823, 828, 833, 838, 840, 842, 844, 846, 869, 892, 915, 937, 981, 1025, 1041, 1012, 975, 937, 950, 962, 940, 919, 950, 981, 1015, 1049, 1031, 1012, 976, 939, 902, 865, 884, 902, 964, 1026, 1062, 1097, 1089, 1081, 1070, 1060, 1076, 1092, 1108, 1124, 1079, 1034, 985, 936, 931, 926, 903, 880, 857, 834, 831, 829, 872, 969, 1077, 1132, 1141, 1151, 1155, 1160, 1165, 1170, 1136, 1103, 1070, 1036, 1057, 1078, 1099, 1120, 1147, 1174, 1152, 1076, 1012, 949, 908, 867, 875, 882, 934, 985, 1033, 1080, 1125, 1169, 1203, 1185, 1117, 1049, 1039, 1029, 992, 955, 904, 852, 826, 800, 818, 835, 852, 870, 862, 855, 848, 841, 838, 835, 835, 835, 818, 854, 922, 989, 1035, 1081, 1083, 1085, 1079, 1073, 1067, 1062, 1085, 1109, 1158, 1208, 1217, 1225, 1173, 1120, 1098, 1076, 1099, 1121, 1113, 1105, 1098, 1090, 1105, 1121, 1136, 1151, 1175, 1199, 1191, 1130, 1081, 1033, 981, 929, 883, 838, 836, 834, 860, 885, 887, 889, 888, 940, 1020, 1101, 1143, 1132, 1108, 1083, 1064, 1045, 1025, 1006, 1005, 1004, 1000, 1048, 1150, 1251, 1306, 1309, 1288, 1268, 1244, 1220, 1222, 1224, 1226, 1228, 1206, 1184, 1162, 1140, 1135, 1131, 1127, 1123, 1062, 1002, 968, 934, 942, 949, 894, 840, 806, 771, 780, 790, 825, 859, 920, 981, 1038, 1095, 1108, 1120, 1095, 1070, 1021, 973, 982, 1044, 1118, 1165, 1175, 1185, 1201, 1244, 1286, 1275]
11313A275m1m2l0l1l0l0J3J3N3N4M8nn4n4k9k8J5J6K7K8K7K7k9k9k9k9k4k5k4k4M1M1M2M1
11298A174l3l2p1p1k9O0Q5N9Pk0n0p6j07n5lK2J5J6J6J7M1M1J4J5j0rM3M3j7j7j7j6O6O6O6
11283A233O6KKLKk4k4k5k4k7k8k7k8RRm1m1j1L3L4j0l2oK8K7pl4j8K7O2O3J3J3j3j3o3o3n1
11267A016oK2K1OPL2L3RJ0m3m3k9k9k7k7rJ8Mm1l3oK8K9nnnmJ8J8J9J8jjj%O5O6M7j4m0m1
11249A076QR%JJ%J9J8l4l4n0m9LLL0L1L0L1PPPPmlK3K3M4M4m4m4m4m4j8j8%%K7K6N5N4K8K9
11231A255PPPQnnonl3l4l4l4l3l4l2l2L5O1K0k3j3J4K0k3m6m7LMj0rl6l6j0rM2M3L3L3L3L3
11213A109J2J2J2J2NMMMl3l4l3l3l7l7l7l7qrqrJ5J5J5J5N2N3N2N2j2j3j3j2l7l7l5RL7L6
11197A051l1n7m0NM6K0k7k7klJ0RJ0Rk3k2NN0Q2Q3K2k2n1n1jjKKn1n1j1j2J4J5l2l3l2l2K5
$$ y = [1275, 1234, 1192, 1162, 1131, 1101, 1071, 1084, 1097, 1150, 1204, 1252, 1247, 1193, 1139, 1110, 1082, 1097, 1113, 1140, 1168, 1195, 1222, 1193, 1164, 1135, 1106, 1082, 1057, 1033, 1009, 1050, 1091, 1133, 1174, 1141, 1109, 1038, 967, 938, 998, 1083, 1142, 1149, 1129, 1079, 1003, 896, 841, 838, 860, 875, 891, 907, 924, 965, 1006, 1020, 1035, 1025, 1016, 1059, 1102, 1085, 1068, 1051, 1035, 1101, 1167, 1233, 1299, 1301, 1303, 1306, 1308, 1284, 1260, 1235, 1211, 1184, 1156, 1129, 1101, 1110, 1119, 1078, 1037, 1026, 1059, 1093, 1083, 1051, 1045, 1073, 1100, 1093, 1059, 1041, 1068, 1130, 1193, 1206, 1219, 1206, 1193, 1130, 1067, 1016, 1010, 1032, 1053, 1059, 1066, 1098, 1131, 1140, 1150, 1107, 1064, 1035, 1006, 979, 952, 943, 961, 965, 924, 891, 885, 913, 942, 937, 932, 927, 923, 941, 959, 978, 996, 995, 994, 993, 993, 1058, 1124, 1171, 1157, 1117, 1076, 1084, 1093, 1093, 1094, 1095, 1095, 1114, 1132, 1098, 1064, 1014, 965, 968, 971, 1001, 1032, 1062, 1093, 1100, 1107, 1114, 1121, 1117, 1114, 1137, 1160, 1204, 1248, 1204, 1160, 1116, 1072, 1054, 1036, 1036, 1036, 1063, 1089, 1144, 1198, 1226, 1255, 1262, 1269, 1276, 1284, 1279, 1274, 1268, 1263, 1230, 1196, 1162, 1128, 1095, 1061, 1029, 997, 1032, 1093, 1113, 1090, 1077, 1091, 1111, 1088, 1042, 995, 998, 1002, 992, 983, 947, 911, 901, 892, 934, 977, 1010, 1043, 1076, 1109, 1121, 1133, 1145, 1157, 1162, 1166, 1170, 1174, 1141, 1107, 1074, 1041, 1004, 967, 930, 893, 885, 876, 868, 859, 874, 889, 904, 919, 971, 1024, 1076, 1128, 1116, 1103, 1090, 1078, 1041, 1004, 969, 978, 1015, 1051, 1020, 963, 923, 928, 974, 994, 967, 940, 938, 935, 945, 954, 964, 973, 950, 928, 933, 983, 1065, 1148, 1170, 1148, 1097, 1046, 1045, 1044, 1046, 1048, 997, 946, 935, 923, 937, 952, 920, 887, 855, 823, 848]
11180H48K6K5K6J0J0J0J0J1J1M1j2m8m7p7k4L8R0R4M1J2J2N9N8%n2p5p6l1l1l2l1l3l3K0K1
11165H71K2K2K2K3k7k7K6K6lmmlj8j7j7j7J6J5J6J6j4j5j4j4NONOllllO9P0O9P0J1J2J1J2
11147A215m5m5m4m5j9k0L4L3PPPPRJ0m4m3n5n4MN6N9N8Pm7m3QO4O4N1N0kk%%%jj0j1j0j1o2
11130A137o3o2o2j6j5L7L7j7j6j4j3N3J06J03N0kn5m4j7MLONOOm6m6k2k1k2k1K6K5K6K6j3
11114A069j4j3j3j0j1j1j2k4n0j4L9Q4N8j3j2J2J2J2J3l1l1l1l1lmmlL8L8L8L8j1j0j1j1n2
11098A021n2m9m9j9L4MML2L1L2L2J8J8J8J8j0j0j1j0LMLLJ0J0J0J0qqqpJ2J2J2J2J2J2J2J2
11082A170lml3K0M4M4nnrqrqK0K0K0K1q2q2p9p8o4j1L1N7N2K5j1j1onnoK3K2K3K2K9K8L2k1
11064A158n5n5m3RK1K1kkoooojjM2M3%%k7k6OOOOpolmM6R9R5M3k0p3m6m7k2k3k3k2J4J5J4
$$ y = [848, 874, 899, 925, 935, 945, 955, 965, 976, 987, 1028, 1016, 968, 921, 844, 820, 858, 948, 1042, 1083, 1095, 1107, 1166, 1224, 1224, 1172, 1097, 1021, 990, 959, 927, 896, 863, 830, 850, 871, 893, 915, 937, 960, 933, 906, 932, 958, 955, 951, 947, 944, 926, 909, 892, 875, 891, 906, 922, 938, 924, 909, 895, 881, 886, 892, 897, 903, 900, 897, 894, 891, 960, 1030, 1099, 1169, 1180, 1192, 1203, 1215, 1170, 1125, 1081, 1036, 1017, 997, 1031, 1064, 1071, 1078, 1085, 1092, 1101, 1111, 1067, 1024, 969, 915, 919, 975, 1034, 1092, 1099, 1052, 1009, 1017, 1081, 1145, 1196, 1246, 1244, 1242, 1242, 1242, 1242, 1241, 1231, 1220, 1210, 1199, 1137, 1074, 1012, 950, 934, 919, 956, 993, 976, 960, 946, 933, 986, 1092, 1195, 1245, 1243, 1188, 1144, 1127, 1131, 1134, 1140, 1145, 1151, 1157, 1111, 1065, 1043, 1022, 1000, 979, 1005, 1030, 1056, 1082, 1069, 1055, 1042, 1029, 1019, 1008, 997, 985, 961, 911, 897, 936, 1020, 1078, 1065, 1053, 1065, 1077, 1089, 1102, 1071, 1040, 1009, 978, 975, 971, 967, 964, 1002, 1040, 1078, 1116, 1105, 1095, 1084, 1073, 1021, 969, 920, 871, 852, 886, 890, 894, 926, 957, 989, 1021, 1039, 1057, 1075, 1093, 1083, 1073, 1062, 1052, 1055, 1059, 1062, 1065, 1075, 1085, 1095, 1105, 1097, 1089, 1081, 1074, 1086, 1098, 1110, 1122, 1134, 1146, 1158, 1170, 1167, 1163, 1130, 1150, 1194, 1238, 1233, 1228, 1219, 1211, 1202, 1194, 1214, 1234, 1254, 1275, 1193, 1111, 1032, 954, 890, 879, 910, 967, 1019, 1044, 1033, 1022, 1016, 1011, 1006, 1000, 1023, 1045, 1068, 1090, 1119, 1147, 1179, 1158, 1103, 1048, 1005, 1014, 1035, 1056, 1054, 1052, 1046, 1040, 1034, 1028, 1027, 1026, 1068, 1111, 1111, 1111, 1084, 1058, 1064, 1070, 1076, 1082, 1075, 1069, 1066, 1062, 1108, 1207, 1302, 1345, 1325, 1252, 1206, 1159, 1137, 1114, 1091, 1069, 1083, 1098, 1112]
11046A112J5J6J6J6J6j0rj0j0j%k7k7jkO1O0O6O6j3j3m1m0o6o7k0j9j5j4M4J31J50R7rr8j07
11030A247n5j7j7j4j4p1p1o7o8j6L7N1N1L0L0LMK2K2mmllK4K3MNMMj5j5o0n9PPL4L3L9L9n
11013A142nj8j7QRJ7J7J7J7k7k7k8k7J8J8J8J8J2J1J2J1j9k0j9k0mmmnl7l7l7l7j0j0j0j1
10997I12J3J2j3j3m7k1L7Q0Q4Q5M3M3QPK3O7P4J3m8p4m2j7opj2j2l8l8j0j0rrm7k1J7O1Q5
10981A170N8K1k2k6k5jkRQQPl8o4m8lL0L0k9k9k0k0K4K4KKjjmm8l7j2J7J8J8J9NONNJ8J7r
10962A082rmml1n7n7j3K5N2N2N2KJONQPNL1J7k7k8J5M0M1k8k8k8k8k5k5k5k4K8K9K9K9M2M3
10945A200M2M3J0J0Rl5p4p4k5k4k5k5JJK7K8k5k6j7j8RRL7L6J1l4m1j3K1K1j5j6L8L7L3L3
10930A169L3L2J7J6J7J6KJKKJK%%m6p2q0l7J7M2N4N5M4Jk7k7k9k8k9k8n2n3k4J9N3N2K9K9
$$ y = [1112, 1127, 1143, 1159, 1175, 1191, 1181, 1172, 1162, 1152, 1151, 1151, 1124, 1097, 1096, 1094, 1155, 1215, 1281, 1347, 1334, 1321, 1280, 1240, 1174, 1107, 1087, 1068, 1053, 1039, 1083, 1214, 1364, 1461, 1452, 1354, 1247, 1192, 1175, 1158, 1144, 1130, 1059, 988, 921, 853, 837, 874, 925, 976, 1006, 1036, 1039, 1043, 1065, 1087, 1083, 1079, 1076, 1073, 1097, 1120, 1124, 1129, 1133, 1137, 1122, 1107, 1047, 988, 995, 1002, 1036, 1069, 1108, 1147, 1142, 1137, 1119, 1102, 1110, 1119, 1136, 1153, 1170, 1187, 1160, 1133, 1105, 1078, 1096, 1114, 1132, 1150, 1162, 1173, 1185, 1196, 1177, 1157, 1138, 1118, 1114, 1110, 1106, 1101, 1064, 1027, 990, 953, 943, 933, 923, 912, 925, 937, 924, 911, 864, 843, 880, 960, 1044, 1129, 1172, 1215, 1223, 1230, 1253, 1320, 1394, 1407, 1359, 1285, 1243, 1226, 1220, 1213, 1201, 1189, 1151, 1113, 1103, 1093, 1084, 1075, 1028, 1007, 1024, 1085, 1170, 1228, 1249, 1227, 1201, 1176, 1175, 1173, 1182, 1190, 1198, 1205, 1167, 1103, 1055, 1052, 1082, 1112, 1083, 1054, 1034, 1014, 1038, 1062, 1064, 1066, 1065, 1064, 1060, 1012, 975, 963, 980, 998, 1016, 1035, 1040, 1046, 1051, 1056, 1074, 1091, 1082, 1073, 1069, 1065, 1034, 977, 920, 907, 932, 984, 1036, 1088, 1090, 1091, 1097, 1102, 1110, 1117, 1122, 1153, 1170, 1143, 1115, 1130, 1170, 1211, 1183, 1155, 1127, 1099, 1074, 1049, 1024, 1000, 1028, 1057, 1086, 1115, 1157, 1200, 1242, 1285, 1295, 1305, 1314, 1279, 1205, 1131, 1106, 1082, 1057, 1032, 1033, 1034, 1061, 1089, 1064, 1038, 1021, 1003, 1012, 1021, 1058, 1094, 1105, 1071, 1030, 1017, 1038, 1059, 1044, 1028, 1066, 1103, 1136, 1169, 1202, 1234, 1251, 1267, 1284, 1300, 1302, 1303, 1305, 1307, 1308, 1310, 1310, 1310, 1264, 1192, 1112, 1075, 1092, 1134, 1188, 1243, 1287, 1288, 1261, 1234, 1205, 1177, 1148, 1120, 1068, 1015, 991, 1010, 1063, 1115, 1144, 1173]
10913A173NONOl4l3l4l3l6l7n9j5L7O3P6L2J4J4J1J1j3j3j3j2L4L4L5L4j3j4l9m0j8j7n2p9
10898I86o4j1M5M5L9L9M0L9M5M6K3l0p7p7l9j3J5O8Q0N3K9Lpo0r4r3o1K8O4L8l3q4r5m2L3
10883H78O0L2L1L3L3rj0j0rkjkjJ0RJ0RL0L0L0K9pqpqjkJ%L1N8M6pq5q5l0K3M0M1J8J8NNk1
10864A205k2l6l7l7l6j7j7j7j6k4k4K9K8L1L0MLK7K6k6k7n7n6l2K0R8J24Q6L3ro2p5m9l0m
10848A034kk9jjklK2K1K2K2K0K0K0K1L5L6L6L5K8K8K8K9l6l6l5l6p0o9o7o6m0J2L6L6llml
10832A035llmll3l2K0K0O1O1QQk9k9K4K4J%JJk3k4K9L0K6K5k6k7M9M8K6k7m4m4m7m7OPOOj9
10814A058j9j9k0j3j4L9L9N1N1N1N1mnmnn9n9o0n9j4j4m3RM0M0M3M3J7J6l3l3k2L1JJK1K1
10798A124K1K1l2l3K0K0popplmllj3j2j2j3k3k3k4k3k9k8k8k9L6L5L5L6L2L2L1L1Jk6l5RO3
$$ y = [1173, 1178, 1184, 1189, 1195, 1161, 1128, 1094, 1061, 1025, 988, 929, 914, 951, 1014, 1090, 1122, 1136, 1150, 1161, 1172, 1159, 1146, 1133, 1121, 1155, 1189, 1224, 1258, 1245, 1231, 1192, 1152, 1134, 1117, 1065, 986, 922, 911, 956, 1001, 1040, 1079, 1119, 1158, 1203, 1249, 1272, 1242, 1165, 1088, 1049, 1036, 1051, 1119, 1199, 1252, 1281, 1284, 1277, 1217, 1123, 1030, 969, 997, 1061, 1099, 1066, 982, 887, 845, 878, 938, 970, 1001, 1034, 1067, 1058, 1048, 1038, 1029, 1027, 1026, 1024, 1023, 1033, 1042, 1052, 1061, 1091, 1121, 1151, 1180, 1173, 1165, 1158, 1150, 1149, 1147, 1148, 1148, 1179, 1237, 1283, 1276, 1191, 1106, 1076, 1099, 1139, 1180, 1198, 1216, 1221, 1226, 1205, 1183, 1147, 1110, 1073, 1037, 1020, 1003, 986, 970, 946, 922, 951, 979, 1010, 1040, 1044, 1047, 1074, 1100, 1074, 1047, 990, 934, 902, 922, 1020, 1144, 1230, 1263, 1254, 1192, 1117, 1068, 1038, 1034, 1032, 1003, 1002, 1001, 999, 996, 1018, 1039, 1061, 1083, 1103, 1123, 1143, 1164, 1199, 1235, 1271, 1306, 1334, 1362, 1390, 1419, 1383, 1347, 1312, 1276, 1206, 1137, 1070, 1004, 964, 976, 1012, 1048, 1045, 1042, 1038, 1035, 1032, 1029, 1025, 1022, 989, 957, 977, 997, 1058, 1119, 1127, 1135, 1106, 1077, 1101, 1125, 1126, 1126, 1127, 1128, 1105, 1081, 1110, 1140, 1166, 1191, 1165, 1138, 1187, 1235, 1261, 1234, 1190, 1146, 1099, 1052, 1058, 1065, 1071, 1077, 1058, 1039, 1020, 1000, 987, 973, 1012, 1051, 1102, 1153, 1204, 1255, 1251, 1246, 1242, 1237, 1178, 1119, 1059, 1000, 986, 972, 929, 938, 978, 1018, 1061, 1104, 1121, 1137, 1104, 1071, 1049, 1080, 1081, 1082, 1103, 1124, 1145, 1166, 1134, 1101, 1121, 1141, 1134, 1128, 1121, 1114, 1111, 1107, 1104, 1101, 1088, 1076, 1064, 1051, 1028, 1005, 981, 958, 929, 901, 873, 844, 880, 915, 950, 986, 1018, 1050, 1081, 1112, 1113, 1087, 1052, 1061, 1124]
10781A124O4Lm1l9l8J2J2j9j9j9j9MMMMK2K2K2K2k9k9k8k9J9J9J9J9j4j4j4j4j1j1j1j1l3
10766I53l3n7j3M9N0N3N2L6L6j6j7JJJJm3m3j7K7K0nm1m1kkkkJ8J9l5l5k9k9k6k6K7P1N9L3
10749I93K7%lK3L7J1k6k5J9J9J9J9L2L3Nl8o0l3J1N4O1L3J5j1l0mL2L2J6J7l4l4j6K7O9M2
10733A332pl4m7m7n7n7L0L1L5L6RRL0K9L0K9k3k4k3k4k2k2k1k2ppJ9K0l1l0q1q0o0j5J2J3
10717I23J0J0L7L7K5K5k8k8qrqrl6l6J7J6jkkkJ7J6J7J7OOOOmmnmmmmmL2L2L2L2l2l1l2l2
10698I90J4J4J4J3L0K9K9K9KKKKNONNmmn4n4kM1M2km2m1QRL3L3Q3Q4K4k0k1k1k4k4KLM4M4
10680A328rqj2j1j2j1j6j7L7L6K8K8K8K8O3O3R0Q9J14J14K03K02L01L02M35M36M97O73R75
10668E974J079O87j22q56j172j048q01n83m08k91k92k27k28j32j31j05j05q4q4l1l1KJK8K8
$$ y = [1124, 1188, 1191, 1150, 1111, 1073, 1085, 1097, 1078, 1059, 1040, 1021, 1025, 1029, 1033, 1037, 1059, 1081, 1103, 1125, 1096, 1067, 1039, 1010, 1029, 1048, 1067, 1086, 1072, 1058, 1044, 1030, 1019, 1008, 997, 986, 953, 920, 863, 850, 899, 949, 1002, 1054, 1090, 1126, 1110, 1093, 1094, 1095, 1096, 1097, 1054, 1011, 994, 1021, 1041, 1036, 995, 954, 952, 950, 948, 946, 964, 983, 948, 913, 884, 855, 829, 803, 830, 901, 960, 993, 1020, 1020, 1017, 1040, 1077, 1088, 1062, 1037, 1056, 1075, 1094, 1113, 1145, 1178, 1183, 1145, 1085, 1052, 1063, 1117, 1178, 1211, 1226, 1215, 1185, 1181, 1213, 1245, 1261, 1278, 1244, 1210, 1194, 1221, 1290, 1332, 1325, 1291, 1244, 1197, 1140, 1083, 1113, 1144, 1179, 1215, 1224, 1233, 1263, 1292, 1322, 1351, 1328, 1304, 1281, 1257, 1235, 1213, 1192, 1170, 1163, 1156, 1175, 1195, 1164, 1134, 1053, 973, 913, 898, 910, 923, 933, 943, 980, 1017, 1042, 1067, 1039, 1011, 1003, 994, 986, 977, 941, 905, 922, 938, 937, 935, 933, 931, 948, 964, 981, 998, 1004, 1010, 1016, 1022, 1018, 1014, 1009, 1005, 1001, 997, 993, 989, 1021, 1053, 1085, 1117, 1085, 1054, 1022, 990, 1004, 1018, 1032, 1045, 1075, 1104, 1133, 1162, 1164, 1166, 1168, 1170, 1175, 1181, 1186, 1191, 1187, 1183, 1129, 1075, 1073, 1114, 1156, 1154, 1112, 1071, 1079, 1088, 1121, 1154, 1237, 1321, 1345, 1325, 1304, 1283, 1259, 1235, 1237, 1240, 1284, 1328, 1319, 1311, 1299, 1288, 1276, 1265, 1249, 1232, 1269, 1305, 1333, 1361, 1389, 1417, 1480, 1543, 1633, 1722, 1836, 1950, 2153, 2355, 2656, 2958, 3393, 3829, 4326, 4999, 5974, 7053, 7740, 7618, 6762, 5590, 4542, 3741, 3158, 2750, 2459, 2167, 1940, 1712, 1580, 1449, 1344, 1239, 1155, 1071, 1040, 1009, 1011, 1012, 1040, 1068]
10657A068M9M9K2K3o7o6j4j3LMm9m9j9j9j9j9rrM4M4J4J3l9l9K1K0ool3l3n9n9L7L7O3O4J6
10641I65J5J6J6l0l0mlM7M7ook7k7n3n4rrM3M4M3M3J6J7KJKKK7K6K7K6l0l1J9K0P1K8n4q1
10624A109o4l9kkk9l0k9l0j5j5j5j6NMNMrrM4M4P2P2J9J9J2J2J1J2L6L7j4j4lK5j6o0o4k1
10607A046NNl2l2l1l2RRJ0Rj5j5j4j5OOOOP0P0J7J7M4M5qqjkjkmnmnj7j7n2p9o1j7M5M5J4
10589A015J5J4J4J0RRRrj0rj0N9N9L0j3m5m4m8m7kllkM4M4J8k6j5J2Rj8l7l7l8l7K0M6N6J2
10572A051j4j3j6j6mlM9M9K3K3K3K2M3M3j0j0ooonK7K8o0o0m7m7ONNMMMK7K6k7k6qrqrj2j1
10554A029j2j2MLLML0K9Pm6l7l8m1m0j4j3M0L9O5O6J2J3onnnm4m4p3k1J7J8K1K1K1K0K1K1
10537A048M9M9M9M9k2k2k3k2ppppJ1J0M0j2o7o8j8j8j7j7j8j7J0J1J0J0M1M1M1M1j4j4j4j4
$$ y = [1068, 1117, 1166, 1188, 1211, 1144, 1078, 1064, 1051, 1054, 1058, 1009, 960, 941, 922, 903, 884, 875, 866, 910, 954, 968, 981, 942, 903, 924, 944, 938, 932, 899, 866, 807, 748, 785, 822, 885, 949, 965, 980, 996, 1012, 982, 952, 948, 945, 992, 1039, 1033, 1027, 1000, 973, 920, 866, 857, 848, 891, 935, 978, 1021, 1037, 1054, 1056, 1057, 1059, 1061, 1088, 1114, 1141, 1167, 1137, 1106, 1125, 1145, 1216, 1244, 1190, 1109, 1045, 1006, 1004, 1002, 973, 943, 914, 884, 869, 854, 839, 823, 828, 832, 837, 841, 832, 823, 867, 911, 983, 1055, 1074, 1093, 1105, 1117, 1128, 1140, 1176, 1213, 1199, 1185, 1182, 1207, 1191, 1131, 1067, 1046, 1051, 1056, 1024, 992, 961, 929, 938, 947, 957, 966, 951, 936, 922, 907, 913, 919, 925, 931, 1001, 1071, 1088, 1105, 1149, 1194, 1186, 1178, 1177, 1175, 1174, 1172, 1168, 1163, 1159, 1154, 1137, 1120, 1068, 989, 928, 911, 956, 1001, 1015, 1030, 1044, 1058, 1068, 1077, 1086, 1095, 1086, 1076, 1067, 1057, 1116, 1175, 1205, 1192, 1147, 1103, 1055, 1008, 1006, 1003, 1000, 998, 1042, 1086, 1104, 1078, 1063, 1075, 1084, 1066, 1029, 992, 954, 917, 937, 983, 1039, 1051, 1037, 1024, 1008, 992, 988, 985, 1034, 1083, 1106, 1129, 1152, 1174, 1217, 1260, 1250, 1240, 1234, 1228, 1222, 1217, 1244, 1272, 1212, 1152, 1105, 1058, 1064, 1069, 1074, 1078, 1082, 1086, 1113, 1139, 1112, 1086, 1078, 1069, 1061, 1052, 1040, 1029, 1017, 1005, 1009, 1012, 1015, 1019, 1049, 1078, 1085, 1039, 1002, 964, 923, 883, 869, 856, 896, 935, 1000, 1066, 1078, 1091, 1085, 1080, 1075, 1070, 1026, 982, 909, 888, 905, 923, 944, 965, 986, 1006, 1027, 1048, 1097, 1146, 1195, 1244, 1222, 1200, 1177, 1155, 1148, 1141, 1134, 1127, 1138, 1148, 1188, 1176, 1109, 1041, 1023, 1005, 988, 971, 953, 936, 946, 957, 967, 977, 1018, 1059, 1100, 1141, 1127, 1113, 1099, 1085]
10521A085J6J6J6J5J%J%PQPPlmmlj7j6j6j6J2J3J2J2k5k5k5k6K3K3K2K3K3K4k1k0J5J6J5J5
10504A206J%%%opK0K0N0M9OOl8l8j1j2l5l5l6l5J8J8M7nm4m5m8m8J1J2J1J2L5L6L5L6PPPP
10487A214POPPO5O6L3k0o6o6k5k5K7K8K7K8j5j5j5j4n7n7n3n3l2K1qrNMMMmml0l0m4m3l0K4
10469H62L5L5L8L8L4L4L5L4j9j8j9j8J0J0J0J0LKLKLKLKk8k9k8k8l9m0l9l9K9K9K9K9onoo
10452I54j7j7K7K7M6M5M6M5M1M1K6k6l6l6j3j2n0n0k4k4J2J2L9L8OOOOk3k3k6K6M6M6j2j3
10437A139k2k2m9m9m6m7lkK3K4k1k0l0l0L1L1NNNMj9k0j9k0J8J7J8J8L1L1L1L1N6N7onk3k2
10420A100LMJ9K0J9K0k3k3o7o6m6m6j9k0N3N3N4N3k2k2k2k2lkkkK2K3j8j8K4P8P7K5m4m4m8
10404A068m7n3n3q2l0RRJ2J2J2J3J2J2L5L6j8j7J9K0K0K0J6J7J6J7L0L1L0L1K0J9K0K0m9m8
$$ y = [1085, 1101, 1117, 1133, 1148, 1149, 1149, 1150, 1150, 1157, 1165, 1172, 1179, 1176, 1172, 1168, 1165, 1148, 1132, 1116, 1100, 1112, 1125, 1137, 1149, 1124, 1099, 1074, 1048, 1071, 1094, 1116, 1139, 1162, 1186, 1165, 1145, 1160, 1176, 1191, 1206, 1207, 1207, 1207, 1207, 1201, 1194, 1214, 1234, 1284, 1333, 1339, 1345, 1307, 1269, 1258, 1246, 1211, 1176, 1140, 1105, 1123, 1141, 1188, 1183, 1139, 1094, 1046, 998, 1009, 1021, 1032, 1044, 1079, 1115, 1150, 1186, 1193, 1200, 1207, 1214, 1221, 1227, 1234, 1241, 1306, 1372, 1405, 1385, 1319, 1253, 1228, 1203, 1230, 1258, 1285, 1313, 1298, 1283, 1268, 1254, 1197, 1140, 1087, 1034, 1002, 1023, 1015, 1006, 1011, 1015, 1019, 1023, 1019, 1015, 985, 955, 911, 868, 838, 862, 897, 932, 970, 1008, 1042, 1076, 1111, 1145, 1126, 1108, 1089, 1071, 1081, 1091, 1101, 1111, 1114, 1116, 1119, 1121, 1124, 1126, 1129, 1131, 1103, 1074, 1046, 1018, 979, 939, 900, 861, 890, 919, 948, 977, 971, 966, 960, 954, 937, 920, 947, 974, 1020, 1065, 1111, 1156, 1197, 1238, 1264, 1238, 1202, 1166, 1153, 1141, 1091, 1041, 1017, 993, 1005, 1017, 1056, 1094, 1100, 1106, 1112, 1118, 1095, 1072, 1046, 1072, 1118, 1164, 1152, 1139, 1117, 1095, 1046, 997, 951, 904, 901, 899, 922, 946, 925, 905, 875, 845, 876, 907, 912, 917, 922, 926, 907, 887, 868, 848, 866, 883, 901, 919, 950, 981, 1012, 1043, 1099, 1156, 1150, 1145, 1122, 1100, 1103, 1107, 1126, 1146, 1165, 1185, 1162, 1139, 1072, 1006, 960, 914, 895, 875, 928, 981, 1035, 1088, 1066, 1044, 1022, 1000, 997, 995, 993, 991, 1013, 1036, 1018, 1000, 1024, 1102, 1179, 1204, 1160, 1116, 1068, 1021, 968, 915, 833, 803, 812, 821, 833, 845, 857, 870, 882, 894, 929, 965, 947, 930, 949, 969, 989, 1009, 1025, 1042, 1058, 1075, 1105, 1136, 1166, 1197, 1217, 1236, 1256, 1276, 1227, 1179]
10389A179p8k5K2K2K5K5j9j9j9j8o4o4j2j1KLKKN8N7N4N4K0l2n5n6k2k3k2k2RRRJ0k4k4k4
10373I29k3K2K2K2K2PPPOpqqqj0j0o3o3o1o1K7K7K0J9J9J9NMN7N7K8K7K8K7l7l7l5l4k0L3
10356I56N6N6O4O4J0J1k9l0l0k9m3m2J0J1K8K8K8K8J9J9l4l3k4k3k4k4RRRRrj0j0rJ4J5l8
10340A012l8m6m7M1M1L5L6L1L2J1m2o4o5J4J5J5J4L0L0L0L0klM7M7L0k4m6m6m8m7OOqqpqL4
10323A038L4L3L4M8M8nnl0l0l0l0j8j8j7j6j8J0K4k9m7m7LKO4O5O4O4%j%jk2k1k2k2J6J6J5
10307A149J6j0j0j0j1lmlmj3j3j3j2j0j0rj0L0L0k2k1L5O1K6k8l0lk2k2l4l4l5l4l0k9l0k9
10291G99qpN4N4O9O9K6K5J6J6J6J6l6l7PL4K3k0n5n6j3j3j4j3L3L2J4l1o3o3k7J7N9Q6P1K6
10275A106Ok0k4MK7K8l2n8k9J5J7k8l6RM2M2J1J1J1J1rrJ7J7opm7m8l7PN9N8L6rj0j0J8J8
$$ y = [1179, 1101, 1076, 1098, 1120, 1145, 1170, 1151, 1132, 1113, 1095, 1031, 967, 955, 944, 946, 949, 951, 953, 1011, 1068, 1122, 1176, 1196, 1164, 1109, 1053, 1031, 1008, 986, 964, 973, 982, 991, 1001, 977, 953, 929, 906, 928, 950, 972, 994, 1001, 1008, 1015, 1021, 1014, 1006, 998, 990, 980, 970, 907, 844, 783, 722, 749, 776, 796, 815, 834, 853, 858, 862, 919, 976, 1004, 1031, 1059, 1086, 1049, 1012, 977, 943, 923, 956, 1012, 1068, 1132, 1196, 1206, 1217, 1188, 1158, 1128, 1099, 1056, 1014, 1024, 1035, 1063, 1091, 1119, 1147, 1166, 1185, 1151, 1118, 1094, 1071, 1047, 1023, 1032, 1041, 1050, 1059, 1050, 1040, 1030, 1021, 1035, 1050, 1012, 974, 928, 881, 922, 963, 998, 1034, 1065, 1097, 1108, 1066, 1002, 937, 951, 966, 981, 995, 1025, 1055, 1085, 1115, 1113, 1110, 1157, 1204, 1234, 1210, 1164, 1118, 1070, 1023, 1029, 1035, 1027, 1019, 1012, 1004, 1038, 1072, 1105, 1139, 1187, 1235, 1230, 1225, 1195, 1165, 1135, 1105, 1087, 1069, 1052, 1036, 1018, 1028, 1052, 1023, 976, 929, 932, 934, 998, 1063, 1127, 1191, 1191, 1190, 1190, 1189, 1167, 1146, 1124, 1102, 1118, 1134, 1149, 1165, 1155, 1145, 1135, 1124, 1121, 1117, 1114, 1110, 1097, 1084, 1071, 1059, 1049, 1039, 1030, 1020, 1050, 1080, 1058, 1037, 1072, 1133, 1159, 1131, 1101, 1098, 1076, 1054, 1020, 986, 951, 917, 887, 858, 828, 799, 791, 784, 838, 892, 961, 1030, 1056, 1081, 1097, 1113, 1129, 1145, 1109, 1072, 1079, 1113, 1136, 1116, 1061, 1005, 992, 979, 965, 952, 985, 1017, 1031, 1000, 937, 874, 847, 864, 923, 1009, 1080, 1106, 1112, 1092, 1068, 1072, 1099, 1127, 1095, 1037, 1008, 1023, 1040, 1012, 976, 985, 1027, 1069, 1080, 1091, 1102, 1113, 1104, 1095, 1112, 1129, 1123, 1116, 1069, 1021, 984, 991, 1050, 1108, 1144, 1135, 1125, 1115, 1133, 1151]
10259A151J8J8j1j1j2j1jkkko2o2j8j8j0j0j0j0rj0j0j0ppppnoL8L9L8L8onK9K8K9K9RJ0N0
10241A183N1J8k5m6m5mnnnj4j4j3j4j7j8j8j7k6k5J8J9O3O3J9J9j6j7m0m0k8J6N3N3L8L9L9
10225A239L8L1L1l0l1n4n5n5n4p1p1m4m4J1J2N5N5L8L8J1J2nnK1K2j5j5j5j5K5K5K4K3k8n5
10210A049l8NN0M9J5k9m0l9J9J9M5M4M2M3j7o1o0j7j6j6j3j4K9K8K9K8K4K4K4K4k2k2k1k2
10196A143K3K2k1m7n5j0K6N3M7K0rl6n0n0j6K7K7jrrK4K4K4K4M6M5Rl5o7o8m4m4k8k9k8k8
10180I00M0M1qo0p9n2J1L7M7M6J6l6m1m1J7J8ooonN5N5N5N5J4J3M0M0L5L4rj0qpo6o7lN0L5
10163A144Qk3k4k5k5j7j6j7j7k1k2L9O6N4Kk9k9j8j8QQOOOOm4m4%%J1J2l3l2j3j3L1L1K2K3
10146A003k2k2NOMMl2n8p3k1K2K1K5K5J1J2m7m7j0M2K8JJ1J1J0J0J2J3P5P4L2L2l0l0o9o8
$$ y = [1151, 1169, 1187, 1176, 1165, 1153, 1142, 1141, 1139, 1137, 1135, 1073, 1011, 993, 975, 965, 955, 945, 935, 926, 916, 906, 896, 889, 882, 875, 868, 863, 857, 895, 934, 972, 1010, 1004, 999, 1028, 1056, 1085, 1114, 1123, 1133, 1183, 1234, 1252, 1227, 1181, 1136, 1132, 1127, 1122, 1117, 1103, 1089, 1076, 1062, 1045, 1027, 1009, 992, 966, 941, 959, 978, 1041, 1104, 1123, 1142, 1126, 1109, 1069, 1029, 1001, 1017, 1070, 1123, 1161, 1200, 1239, 1277, 1308, 1339, 1309, 1278, 1224, 1169, 1114, 1060, 989, 918, 874, 830, 841, 853, 908, 963, 1001, 1039, 1050, 1062, 1057, 1052, 1073, 1095, 1080, 1065, 1050, 1035, 1060, 1085, 1109, 1132, 1104, 1049, 1011, 1016, 1066, 1115, 1130, 1101, 1061, 1022, 1041, 1060, 1105, 1149, 1191, 1234, 1217, 1156, 1096, 1079, 1063, 1047, 1034, 1020, 1049, 1077, 1106, 1134, 1158, 1182, 1206, 1230, 1208, 1186, 1165, 1143, 1166, 1188, 1167, 1120, 1065, 1055, 1081, 1134, 1181, 1201, 1192, 1156, 1106, 1056, 1040, 1067, 1094, 1093, 1084, 1075, 1099, 1123, 1147, 1171, 1217, 1262, 1271, 1236, 1169, 1101, 1057, 1013, 985, 956, 928, 900, 940, 981, 973, 913, 834, 782, 793, 830, 877, 923, 939, 903, 862, 821, 838, 856, 850, 844, 838, 833, 888, 943, 998, 1053, 1067, 1080, 1120, 1160, 1195, 1229, 1220, 1210, 1202, 1195, 1129, 1062, 1059, 1109, 1144, 1152, 1129, 1105, 1080, 1055, 1038, 1022, 1005, 988, 967, 945, 984, 1050, 1104, 1106, 1077, 1048, 1030, 1012, 1020, 1028, 1034, 1040, 1046, 1052, 1008, 964, 964, 964, 975, 987, 954, 922, 909, 896, 927, 958, 980, 1003, 981, 959, 964, 970, 974, 978, 946, 888, 815, 794, 816, 837, 862, 887, 898, 910, 863, 816, 806, 848, 876, 877, 888, 899, 909, 919, 931, 944, 1019, 1093, 1125, 1157, 1127, 1097, 1028, 960]
10130I60k4k5J0J0N3N4N8N8k1k1m5m4j9j8L1L1L0L1J%n8n8j8K7J9qlK2K1n%%jkJ%JJlkkkK1
10112A061K1Lm0p3m7QN2M7M8N0N1N2N3RQj4j4j4j5j6j7j7j7k2k2k2k2L1L1J2l2m9n0qrJ2J2
10096A041J2J2L3L3j1j1l2l2ooJ6J6k9k8j5j6K9K8J6J6J6J7j3j2j3j2j9j8QQQRl6l5%JK7K8
10079A030j9j9PPppJ9J9L3L4PPl5l6l3J0M1M1j8j7jjj%m6m5QPJ5J5J2J1j2o6q5q5j0M3O7O6
10062I56LMLMj2j2j2j2OOPOM9M9K3K3L4L4j8j9J6J6J6J6j2j2j1j2J5J5J5J5j8j8j8j8j9j8
10046A090j8j9L9L9j4j4l5l6J7J7qpl4l4rqqqK3K4K3K3kkkkkkkkk2k3k2k2K1K2P1P0O2Rj4
10028A179j4j7j8j7j8j4j5j5j5L5L6L6L5N9O0Q5L3o1j13j17o3l1l0k7k7KKk1k0RP1J04P8L8
10013A209L7L6L6jkn5n4l9l9J4J3m1m1m1m1qpJ8J9mnM8M8N0N1K2k2o8o8j8j8J6J7M3M3L9M0
$$ y = [960, 936, 911, 921, 931, 984, 1038, 1096, 1154, 1133, 1112, 1067, 1023, 1004, 986, 1017, 1048, 1078, 1109, 1110, 1110, 1052, 994, 976, 1003, 1022, 1014, 1011, 1033, 1054, 1049, 1049, 1049, 1048, 1046, 1047, 1047, 1048, 1049, 1046, 1044, 1042, 1040, 1061, 1082, 1085, 1045, 972, 925, 933, 985, 1032, 1080, 1130, 1181, 1233, 1286, 1295, 1303, 1289, 1275, 1261, 1246, 1230, 1213, 1196, 1179, 1157, 1135, 1113, 1091, 1122, 1153, 1165, 1133, 1084, 1034, 1026, 1017, 1029, 1041, 1053, 1065, 1098, 1131, 1120, 1109, 1077, 1045, 1039, 1033, 1049, 1065, 1036, 1008, 993, 977, 1006, 1034, 1050, 1066, 1082, 1099, 1086, 1074, 1061, 1049, 1030, 1012, 1020, 1028, 1036, 1045, 1009, 974, 974, 975, 1002, 1030, 1011, 992, 999, 1006, 999, 992, 1011, 1030, 1063, 1097, 1104, 1111, 1076, 1040, 1007, 1017, 1058, 1099, 1081, 1064, 1063, 1062, 1061, 1061, 1015, 970, 978, 985, 1000, 1015, 1027, 1038, 1026, 960, 875, 790, 780, 823, 890, 956, 959, 963, 966, 970, 958, 946, 934, 922, 928, 934, 941, 947, 996, 1045, 1068, 1091, 1125, 1159, 1141, 1122, 1138, 1154, 1170, 1186, 1174, 1162, 1151, 1139, 1154, 1169, 1184, 1199, 1181, 1163, 1145, 1127, 1108, 1090, 1072, 1053, 1092, 1131, 1117, 1103, 1068, 1032, 1049, 1066, 1058, 1051, 1017, 983, 974, 966, 958, 950, 973, 997, 1020, 1043, 1041, 1039, 1037, 1035, 1033, 1031, 1029, 1027, 1005, 982, 960, 938, 959, 981, 1052, 1122, 1184, 1193, 1179, 1165, 1148, 1130, 1113, 1095, 1081, 1066, 1051, 1036, 1071, 1107, 1143, 1178, 1237, 1297, 1382, 1415, 1354, 1241, 1124, 1061, 1030, 1000, 973, 946, 948, 950, 929, 909, 918, 989, 1093, 1171, 1209, 1246, 1282, 1318, 1317, 1315, 1260, 1206, 1167, 1128, 1142, 1155, 1114, 1073, 1032, 991, 983, 976, 994, 1013, 1009, 1004, 1052, 1100, 1150, 1201, 1223, 1201, 1133, 1065, 1047, 1029, 1045, 1062, 1105, 1148, 1187, 1227]
9997A227j4j3n4n5n4n5j2j3j1j0K2M8N7J3m8p5o2o3k7k6O1O1M9M9mmJ2J2J1J2JJJJJ6J6J6
9981A086J7KKLKl9m0l9m0nonnj6j5L8L7M3M3M1M0K5j9o7r3q4q3n7j3K2K2K4K5M3M4M4M3pp
9964A006ppRRRRKLm9m9p2m7J2L8K6K6KJKKJ3L9N9N9M9K3%Jjjm5m4m3m3j0J6JJM0M1L8L9L1
9945A188NLL0J7j0RRJ9M6M4J8m1o8n3n2j8Qopnnnmmmonl8o5o2l7J1L7M9M9P9N2j9j8J5N9L3
9927A248j2k5k5k6k6JK8J4J3nnmnj1j1Nk3k9l0m7k0lljjL1L2L0L0Jk5k5JJ5J4J7J6K9L0k4
9910A169k3l1l1k9k9J2L9K4K4pqmnJ7O1N9J5k2m9n1k5MLONklklm7m8NNK1K0P4P4J0J0j7j6
9892A205o4o3o3o3llM9N0K4K4lkJ9J9J9J9J8J7J7J8j1j1j1j1K7K6o2o1m4m4RRJ1J1J1J1%%
9876A094%%J%%%k1k1k2k1L2L2L3L2J1J1j5j5m3m3J0J0J6J6j0j1l3l4pL6M7K1j5j5M5M5M6M5
$$ y = [1227, 1213, 1200, 1146, 1091, 1037, 982, 970, 957, 946, 936, 958, 1006, 1063, 1076, 1028, 953, 891, 828, 801, 775, 836, 897, 946, 995, 991, 987, 999, 1011, 1022, 1034, 1035, 1036, 1037, 1038, 1054, 1070, 1086, 1103, 1105, 1107, 1110, 1112, 1073, 1033, 994, 954, 949, 943, 938, 933, 917, 902, 940, 977, 1020, 1063, 1104, 1144, 1169, 1150, 1083, 990, 906, 823, 766, 753, 775, 797, 821, 846, 889, 933, 977, 1020, 1013, 1006, 999, 992, 1001, 1010, 1019, 1028, 1030, 1033, 984, 935, 863, 816, 828, 866, 892, 918, 920, 921, 923, 925, 938, 977, 1036, 1095, 1144, 1167, 1167, 1168, 1167, 1166, 1121, 1077, 1034, 991, 981, 997, 998, 999, 1039, 1080, 1118, 1157, 1188, 1193, 1196, 1226, 1243, 1233, 1242, 1251, 1270, 1316, 1360, 1378, 1337, 1269, 1216, 1164, 1146, 1154, 1148, 1141, 1136, 1131, 1126, 1122, 1118, 1114, 1108, 1103, 1065, 1000, 938, 901, 912, 949, 998, 1047, 1126, 1178, 1159, 1141, 1156, 1215, 1248, 1236, 1211, 1186, 1160, 1134, 1135, 1163, 1177, 1190, 1185, 1180, 1176, 1171, 1160, 1149, 1154, 1131, 1102, 1072, 1025, 1005, 1002, 999, 998, 997, 1028, 1060, 1090, 1120, 1121, 1096, 1071, 1072, 1087, 1101, 1118, 1134, 1163, 1193, 1169, 1146, 1115, 1084, 1055, 1026, 1038, 1077, 1101, 1125, 1118, 1110, 1106, 1101, 1118, 1179, 1238, 1253, 1231, 1182, 1131, 1106, 1110, 1113, 1119, 1124, 1122, 1119, 1117, 1114, 1067, 1019, 1024, 1029, 1050, 1070, 1144, 1218, 1228, 1238, 1221, 1205, 1141, 1078, 1015, 952, 949, 946, 995, 1045, 1069, 1093, 1090, 1088, 1107, 1126, 1145, 1164, 1182, 1199, 1216, 1234, 1223, 1212, 1201, 1190, 1217, 1243, 1181, 1120, 1076, 1032, 1041, 1050, 1061, 1072, 1083, 1094, 1094, 1094, 1094, 1094, 1095, 1095, 1095, 1095, 1074, 1053, 1031, 1010, 1042, 1074, 1107, 1139, 1150, 1161, 1146, 1131, 1088, 1045, 1055, 1065, 1081, 1097, 1087, 1076, 1043, 1009, 1002, 1038, 1085, 1106, 1091, 1076, 1121, 1166, 1212, 1257]
9859A257j5j5j5j4NNNNj9j8j6j5QN1P8P7K9j4m3m3p0p0p0p0j3j3J3J3MNm5m5m1MO6O7K9L0
9843A087LMK3K3llm6m6QPlkk9k9k1k0L2L2mmmmL0L0K9L0QRL5L5J5J6l7l8m1m2J1J1K3K3l0
9825A118k9QRRRo1o1o1o1j8j8RRM1M0Ok1j8K6N2N3L3L3L4L3k6k6k5k6M5M5J9J8NNk2o6q6o0
9808I74k4k5MMLMQRRQK4K4N1N0LKN3N2J8k7n4n5pqJ9J8J7J8rrl0l0l0l0ONONJ9J9J9K0O8O9
9789A270M3M2qpo1o0k0k0k0k0k0k0k0k0n0n0KLqqM2M3J1l3m9k2J8J9K0K0L9L9k1o6o4j9J3
9773I38N7P5L2l6q0o9pM3M4RRj8j7KLLLj5j4j4j5j4j5j4j4K5K6K6K6k1k0j8j8K5O8O8K4l0
9756A057l1l1l0k8J5N6L0k5o9m4%K9K9L2L1J9J8J8J8PQQQj6j7j6j6J7J8J7J8L6L7Rl6n9n9
9740A058rj0k2k2k3k2nmnnJ1J1J1J0K5K5K5K5M1M0M1M0%j%jm8m7m8m8m9n0LLL4L4L4L4M5M5
$$ y = [1257, 1242, 1227, 1212, 1198, 1203, 1208, 1213, 1218, 1199, 1181, 1165, 1150, 1158, 1209, 1287, 1364, 1393, 1379, 1336, 1293, 1223, 1153, 1083, 1013, 1000, 987, 1000, 1013, 1017, 1022, 977, 932, 891, 895, 961, 1028, 1057, 1087, 1090, 1094, 1117, 1140, 1137, 1134, 1088, 1042, 1050, 1057, 1054, 1052, 1023, 994, 973, 953, 985, 1017, 1013, 1009, 1005, 1001, 1031, 1061, 1090, 1120, 1128, 1137, 1172, 1207, 1222, 1238, 1201, 1163, 1122, 1080, 1091, 1102, 1125, 1148, 1118, 1089, 1097, 1106, 1115, 1124, 1063, 1002, 941, 880, 862, 844, 853, 862, 903, 943, 949, 928, 910, 936, 988, 1041, 1074, 1107, 1141, 1174, 1148, 1122, 1097, 1071, 1116, 1161, 1180, 1198, 1203, 1208, 1186, 1120, 1034, 974, 950, 925, 929, 933, 936, 940, 948, 957, 966, 974, 998, 1022, 1073, 1123, 1126, 1128, 1181, 1233, 1251, 1224, 1170, 1115, 1108, 1100, 1119, 1137, 1154, 1172, 1163, 1154, 1124, 1094, 1064, 1034, 1040, 1045, 1051, 1056, 1075, 1094, 1113, 1133, 1201, 1270, 1313, 1355, 1347, 1340, 1279, 1219, 1199, 1179, 1159, 1139, 1119, 1099, 1079, 1059, 1009, 959, 961, 964, 956, 948, 990, 1033, 1044, 1011, 962, 940, 958, 977, 997, 1017, 1056, 1095, 1074, 1008, 944, 925, 938, 995, 1070, 1102, 1066, 986, 917, 910, 953, 997, 1006, 1015, 997, 980, 982, 985, 988, 991, 976, 962, 948, 933, 919, 904, 890, 876, 901, 927, 953, 979, 958, 938, 920, 902, 927, 995, 1063, 1087, 1057, 1026, 995, 965, 937, 952, 1008, 1038, 1013, 944, 900, 900, 929, 958, 990, 1021, 1040, 1058, 1076, 1094, 1101, 1109, 1117, 1125, 1109, 1092, 1076, 1060, 1077, 1095, 1112, 1130, 1166, 1203, 1212, 1176, 1117, 1058, 1049, 1039, 1017, 995, 972, 950, 945, 941, 936, 931, 942, 953, 964, 974, 999, 1024, 1049, 1074, 1115, 1155, 1196, 1236, 1236, 1235, 1235, 1234, 1186, 1139, 1091, 1043, 994, 944, 947, 950, 984, 1018, 1052, 1086, 1131, 1176]
9723A176qqlklkKKKKLL%%M4qo3o3m4J0L2L3k0k0k0k0L4L5L5L5K5K4k8k8j0rj0rk5k5k5k4R
9704A029J0O2O2J8J7J8J8J4J5p0p0n5jK2K1j9j9p2p1l4l3K0K0O2O3L9j3opM3M3J7J7J6J7%
9689A193%%jK0K0J9K0nnnol1l2K1K2OOm6m7m9m8MMK5K5o2o3n0n1LKL9L9L8L7Jk7l6QO2O3L7
9671A150pl5l5l8l8m2m2J2J3L7O4P2K8k4n0n3k6J6J7J7J8opopj3j3j3j3K9K9K9L0mmmmK5K6
9654A128K5K5K6K6k7k6%JJJk7k6k7k6NOOOk0k0j9k0m4m4QRK4K4K3K4O2O1J1n1o3j9NOk2k1
9636A011k1k1j8j8j8j8KLOOMO5R7P0L6RK2K2J5J5l8l7o2o1rq%%%%L1L0L1L0K1K0K1K0J3J2
9619A283j1o3n0n1n3n4j6j7j7j7jjkjL3L3L3L4K6K7K6K7k0j9j9k0l1l2l1l2k6k7K6K6QPPQ
9602I93J8J9J9J8k2k2JN4L1L1j9j8QPQQl0k9l0k9j3j3L9M0L1L0L1L0K1K0l2l2m0m0j8L6L8
$$ y = [1176, 1168, 1160, 1157, 1155, 1152, 1150, 1152, 1154, 1156, 1158, 1161, 1164, 1164, 1164, 1208, 1200, 1137, 1074, 1030, 1040, 1072, 1105, 1085, 1065, 1045, 1025, 1059, 1094, 1129, 1164, 1189, 1213, 1185, 1157, 1147, 1138, 1128, 1119, 1094, 1069, 1044, 1020, 1029, 1039, 1101, 1163, 1181, 1198, 1216, 1234, 1248, 1263, 1193, 1123, 1068, 1067, 1089, 1110, 1091, 1072, 1000, 929, 895, 862, 882, 902, 964, 1027, 1066, 1053, 1047, 1040, 1083, 1126, 1143, 1160, 1176, 1193, 1193, 1193, 1193, 1192, 1212, 1232, 1251, 1271, 1266, 1261, 1256, 1250, 1219, 1187, 1208, 1230, 1236, 1242, 1196, 1149, 1100, 1052, 1056, 1060, 1085, 1110, 1048, 985, 935, 884, 887, 889, 928, 967, 1005, 1042, 1043, 1016, 980, 988, 1050, 1113, 1150, 1143, 1108, 1073, 1035, 997, 955, 913, 925, 938, 975, 1039, 1111, 1139, 1115, 1065, 1012, 986, 1002, 1019, 1036, 1054, 1048, 1041, 1035, 1028, 1015, 1002, 989, 976, 1005, 1034, 1063, 1093, 1089, 1085, 1081, 1077, 1102, 1128, 1153, 1178, 1204, 1230, 1203, 1177, 1177, 1178, 1179, 1180, 1153, 1127, 1100, 1074, 1079, 1085, 1091, 1097, 1077, 1057, 1038, 1018, 974, 930, 938, 947, 971, 995, 1018, 1042, 1104, 1165, 1176, 1125, 1062, 1043, 1048, 1054, 1032, 1011, 990, 969, 951, 933, 915, 897, 899, 902, 908, 914, 918, 983, 1080, 1150, 1186, 1195, 1217, 1239, 1254, 1269, 1231, 1194, 1132, 1071, 1062, 1054, 1054, 1054, 1054, 1054, 1085, 1115, 1146, 1176, 1197, 1217, 1238, 1258, 1271, 1283, 1272, 1209, 1159, 1108, 1055, 1001, 985, 968, 951, 934, 933, 932, 930, 929, 962, 995, 1028, 1062, 1088, 1115, 1141, 1168, 1148, 1129, 1110, 1090, 1059, 1027, 996, 964, 938, 911, 937, 963, 971, 978, 985, 993, 1011, 1030, 1049, 1067, 1045, 1023, 1024, 1078, 1109, 1140, 1121, 1103, 1111, 1118, 1126, 1134, 1104, 1075, 1045, 1016, 1003, 990, 1029, 1069, 1100, 1130, 1161, 1191, 1212, 1232, 1200, 1168, 1128, 1088, 1070, 1106, 1144]
9586A144L8M1M1L3L3k0k0k2k2k2k2K5K4k8k9rj0j0rppopK2K2K2K2popoj4j4j4j4m1m1J2J2
9570A077m3m3m3m3j7j8L5L5P4P4M6KQPNNj8j9p1p1o4o5K3K3MLLMJ0RJ0J0Q9Q9J01P4qp0o1
9553A166j8POm3m3o0o0l3J2K7K7K9K9mmmmLKLKK5K5K6K5k1k1k1k1j0j0j0j0j0j1l6p9p4k9
9536G78J6M2K4K3K6K5j4j4j4j4K4K3K3K4J6J6L9om4p0q1l8K8N4M2M2O7O7L8pn8q4n5QM3M4
9520A033onj4j4L9L9N2N2jjl6l7q6q6o0pJ6J6lmlmL3L3L3L2%jjjk1k1k0k1pppp%%j%J9J9J9
9501I53K0J3J4J4J4k8k8K7Q0M9mn9o0PPL3L3QRm5m4m2m3J0J1J0J0J0J1N6N6N6N7qpqqm6m6
9484A092m6m6J4J3J3J4K5K5N5KML%%mllmJ2J2J2J2l1l2l2l2qqpqnnonJ5J4J5J4J1J1J1J1m
9465A121lmlJ9K0mn7l5l5J5J4QQ%k7l3J9M1M1j4j3j4j4m0m1j8L4O4L9MMJ1J1J1J1j1j0j0j0
$$ y = [1144, 1182, 1223, 1264, 1297, 1330, 1310, 1290, 1268, 1246, 1224, 1202, 1227, 1251, 1223, 1194, 1185, 1175, 1165, 1156, 1149, 1142, 1136, 1129, 1151, 1173, 1195, 1217, 1210, 1204, 1197, 1191, 1177, 1163, 1149, 1135, 1094, 1053, 1065, 1077, 1034, 991, 948, 905, 888, 870, 905, 940, 1014, 1088, 1134, 1136, 1144, 1151, 1156, 1161, 1143, 1124, 1053, 982, 918, 853, 876, 899, 903, 906, 909, 913, 923, 932, 942, 952, 1041, 1130, 1231, 1305, 1297, 1227, 1166, 1148, 1155, 1161, 1118, 1075, 1015, 955, 922, 934, 961, 988, 1017, 1046, 1042, 1038, 1034, 1030, 1033, 1035, 1038, 1040, 1065, 1090, 1116, 1141, 1120, 1099, 1078, 1057, 1047, 1037, 1027, 1017, 1007, 996, 960, 881, 807, 778, 794, 836, 860, 883, 909, 934, 920, 906, 892, 878, 902, 925, 948, 972, 988, 1004, 1043, 1037, 993, 923, 842, 804, 832, 886, 928, 970, 1037, 1104, 1142, 1135, 1077, 993, 938, 946, 989, 1033, 1027, 1022, 1008, 994, 1033, 1072, 1124, 1176, 1175, 1174, 1138, 1101, 1015, 929, 869, 862, 878, 894, 891, 887, 884, 880, 913, 946, 979, 1011, 1011, 1010, 1009, 1008, 987, 966, 946, 925, 918, 911, 904, 897, 897, 897, 896, 896, 915, 934, 953, 973, 986, 1000, 1014, 1028, 1000, 972, 999, 1079, 1128, 1124, 1065, 1005, 1012, 1019, 1052, 1085, 1093, 1102, 1057, 1013, 971, 928, 938, 949, 959, 969, 979, 990, 1046, 1102, 1158, 1215, 1207, 1200, 1192, 1184, 1138, 1092, 1046, 1000, 1014, 1027, 1040, 1054, 1079, 1104, 1159, 1161, 1165, 1168, 1168, 1168, 1164, 1161, 1158, 1154, 1166, 1178, 1190, 1202, 1171, 1139, 1107, 1075, 1067, 1059, 1052, 1044, 1039, 1034, 1028, 1023, 1038, 1052, 1067, 1081, 1092, 1103, 1114, 1125, 1121, 1118, 1114, 1111, 1130, 1150, 1146, 1089, 1054, 1019, 1034, 1048, 1056, 1064, 1064, 1037, 1004, 1023, 1064, 1105, 1091, 1078, 1064, 1050, 1010, 969, 951, 985, 1049, 1088, 1092, 1096, 1107, 1118, 1129, 1140, 1129, 1119, 1109, 1099]
9448A099MMm9m9PQPPppM6M6RJ0O2O2J6J5J6J6k8k7k8k7p7p8p5p5m9k2J9P2N9L2K1K0M4rl3
9431A061l2j1j1j0j1L2L2k1k0l0l0mlM1M1L9M0ll0m5QO4O4J5J4m1m1o4o4k5K7N1N0K5K6k8
9416A106k7k6k6JJk4k4k4k4jj%jJ0J0J0J0m2m1p2j8L3L3L6L7MMMMMMMNK0K0K0K0J8J9K0K0
9398A126M1O8N6Lm1m2jjNNl9l9m3m3JJJ9J8J8J8nno6r2n4jK9K8J1J0N4N4N0M9j2j2m0m0m1
9381A047m0l2l2J3J2K6K6%%JJJJMMNMK7K7L0k2o2o1n1LNOl5l4l0k9JN4Q5N9J1m3n1n0k8k8
9363H25L0K9N6N5O0N9J5J5ppl0l0k0L3N9Om4m4J4J4JJJJM0M0M1M0kjkjm5m4m5m5K8K8K8K8
9346A180m0m0m0m1K8K8K8K8jkjkJ4J4J4J4L0L1L0L1j6j6j5j6%J%%%J%%jjjjn5n5k3L0L3L3
9328A201qqk6k6k5k6L4L3L1L0mn7k7k7NONNnmmmL0L1j4j4n4n5n8oL4L4k4k5j3j4j4j4j4j5
$$ y = [1099, 1103, 1107, 1058, 1009, 1016, 1024, 1031, 1038, 1031, 1024, 1070, 1116, 1125, 1135, 1197, 1259, 1275, 1290, 1306, 1322, 1294, 1267, 1239, 1212, 1135, 1057, 982, 907, 858, 836, 855, 927, 986, 1018, 1039, 1059, 1103, 1094, 1061, 1029, 1018, 1007, 997, 986, 1018, 1050, 1029, 1009, 979, 949, 945, 942, 983, 1024, 1063, 1103, 1100, 1070, 1025, 1033, 1097, 1161, 1176, 1190, 1149, 1108, 1044, 980, 955, 982, 1033, 1083, 1108, 1134, 1106, 1079, 1053, 1027, 1028, 1029, 1005, 981, 957, 933, 932, 931, 931, 930, 940, 950, 960, 970, 928, 887, 815, 797, 830, 863, 899, 936, 940, 944, 948, 952, 956, 960, 964, 969, 989, 1009, 1029, 1049, 1067, 1086, 1106, 1126, 1167, 1235, 1291, 1294, 1253, 1211, 1210, 1209, 1214, 1219, 1180, 1141, 1098, 1055, 1056, 1057, 1076, 1094, 1112, 1130, 1125, 1120, 1054, 962, 908, 907, 936, 964, 975, 985, 1039, 1093, 1143, 1192, 1180, 1168, 1128, 1088, 1047, 1007, 975, 943, 956, 968, 994, 1020, 1020, 1020, 1021, 1022, 1023, 1024, 1028, 1032, 1037, 1041, 1068, 1095, 1125, 1103, 1041, 980, 929, 932, 937, 943, 908, 874, 844, 815, 816, 870, 955, 1014, 1025, 982, 931, 881, 853, 825, 855, 884, 940, 995, 1055, 1114, 1129, 1144, 1137, 1130, 1100, 1070, 1050, 1083, 1142, 1148, 1104, 1060, 1074, 1088, 1089, 1090, 1091, 1092, 1132, 1172, 1213, 1253, 1251, 1250, 1248, 1247, 1202, 1158, 1113, 1068, 1096, 1124, 1152, 1180, 1140, 1100, 1060, 1019, 1047, 1075, 1103, 1131, 1130, 1128, 1127, 1125, 1139, 1153, 1167, 1181, 1211, 1242, 1272, 1303, 1287, 1271, 1256, 1240, 1240, 1241, 1241, 1241, 1241, 1242, 1242, 1242, 1241, 1240, 1239, 1238, 1183, 1128, 1105, 1135, 1168, 1201, 1193, 1185, 1159, 1133, 1108, 1082, 1116, 1149, 1180, 1210, 1206, 1149, 1122, 1095, 1100, 1106, 1111, 1116, 1111, 1107, 1103, 1099, 1129, 1160, 1146, 1132, 1078, 1023, 965, 959, 993, 1027, 1003, 978, 965, 951, 937, 923, 909, 894]
9310H94L0L0J0J1N5N4M6M7KLrql5l5m4m3j7j8J5J4L8L8M9ln3n3m7m8KN5M7M7POJ7J6J7J6K8
9293A181K9K8K9J7J7J8J7m2m1m2m2m0m0J3J3J7J7rrk9k8k9k8K6K6K6K6K7K7k6k5K1K1K2K1
9278A209L4L5L1L1ln6p5p6p6k3J%poppl6l6l6l7L2L2L1L2LLLLL4L5L5L4ppppk2k2k2k2L0K9
9260A080L0L0N5N5L2k0j9j9k3k2k3k3MLL4L4j9j9k8k7k7k7L6L7J3l9o0n9j0j0ononK5K5K4
9244A021K5j7j7L5L5J0Rj6j7L0L0K9L0K5K5K5K4m3m3m4m3l5l4l4l5LLMLk1k1k1k0k4k4k1k1
9228H15j2M0O3O4nnnnm7m7m4m4J8P0P0J8J3J3J0J0J0J0J0RPOOOQPQQl9l9j3j2l3l3K0K0QP
9210I71QQL0L1N3N3N6Mk0k0l0l0q0q0j5L8QQJ1J1J2J1rqM4M4J0J0L6L6J8J8o7o6p5k2JJl7
9193I72l6l7l6j4j4J2J3L7L6j5j6PQQQj0j0M3M3L5L6j7j7n5n5OOL4L5P5P5O5J3j9j8J5J5J5
$$ y = [894, 924, 954, 964, 975, 1030, 1084, 1130, 1177, 1179, 1182, 1173, 1165, 1130, 1095, 1051, 1008, 991, 973, 988, 1002, 1040, 1078, 1127, 1124, 1071, 1018, 971, 923, 925, 980, 1027, 1074, 1081, 1087, 1104, 1120, 1137, 1153, 1181, 1210, 1238, 1267, 1284, 1301, 1319, 1336, 1294, 1253, 1211, 1169, 1129, 1089, 1102, 1115, 1132, 1149, 1140, 1131, 1102, 1074, 1045, 1017, 1043, 1069, 1095, 1121, 1148, 1175, 1149, 1124, 1145, 1166, 1188, 1209, 1243, 1278, 1309, 1340, 1337, 1281, 1206, 1130, 1054, 1031, 1032, 1032, 1025, 1019, 1012, 1005, 969, 933, 897, 860, 892, 924, 955, 987, 990, 993, 996, 999, 1033, 1068, 1103, 1137, 1130, 1123, 1116, 1109, 1087, 1065, 1043, 1021, 1051, 1080, 1110, 1140, 1195, 1250, 1282, 1262, 1243, 1224, 1201, 1179, 1156, 1133, 1137, 1140, 1174, 1208, 1189, 1170, 1142, 1115, 1088, 1061, 1097, 1134, 1147, 1108, 1048, 989, 979, 969, 963, 958, 952, 947, 972, 997, 1021, 1046, 1029, 1012, 1047, 1082, 1092, 1101, 1085, 1068, 1098, 1128, 1157, 1187, 1212, 1237, 1262, 1286, 1243, 1200, 1156, 1113, 1078, 1044, 1010, 975, 978, 981, 985, 988, 967, 946, 925, 905, 881, 857, 836, 815, 803, 843, 906, 970, 965, 960, 955, 950, 903, 856, 812, 768, 786, 856, 926, 944, 957, 970, 980, 990, 1000, 1010, 1020, 1029, 1036, 1042, 1048, 1054, 1062, 1069, 1077, 1085, 1046, 1007, 994, 982, 949, 916, 936, 956, 964, 971, 979, 987, 1017, 1048, 1101, 1154, 1210, 1214, 1194, 1174, 1144, 1114, 1034, 954, 939, 977, 985, 993, 1004, 1015, 1027, 1038, 1029, 1021, 1065, 1109, 1119, 1129, 1165, 1201, 1219, 1237, 1170, 1104, 1029, 1007, 1008, 1009, 972, 936, 899, 863, 849, 835, 847, 860, 897, 933, 918, 902, 909, 917, 925, 933, 923, 913, 956, 999, 1034, 1070, 1053, 1036, 981, 926, 932, 938, 972, 1007, 1082, 1157, 1222, 1235, 1216, 1198, 1213, 1228, 1243]
9176A243J5j1j1j1j1j6j6K8K8jkjknonnm8m8m8m8J0J0RJ0j1j0K9L0Qm5m1m2j1j1j2j1J8J7
9159I66J7J8L3L3N7N6K9k3p3p2o0o0k8K5M0L9jjLKKKl4l4l3l4MLMLJ5J4J5J4j8j7j8j8L0L0
9142I30N6N6O3O4%n3n5kqrn1n0l7J7O4O3N3%j6j5PPRQN0M9J4l9n3n3p3p3n8oN9O0J9J9K0K1
9125A057M7M7nonnJ6J7J6J6JJJJL6L6Mm9p3p4j5j5J8J9J9J9jj%jm5m4JN5N6Lpql9l9l9l9q
9106I68qj1M1P7P7M5pl2q4r5p0rM3R1R1K9k4n0KM5M4J6l6l1l1l4l5n3n4rj0L3L3OPl1l1J3
9090I16J3RRj7j7m9m9JN3P5P5M8M9L5j8m9n0k4k5KKK0J9poL5L5K2l0m2j6J2L9K1K1mmj8j8
9073A068j8j8KKKKl5l4J9J8K9L0K9L0j8j8j8j7lklkj9j9j9j9j8j7L5L6K6K7K3K3L1k1m5m5
9056A024lllmJ9J9J9J9J9J9J9K0mlllm1m1m0m1L7L7L7L6k4k5p8p7k9k9K3K4Q1Q1Q1Q1MNMN
$$ y = [1243, 1258, 1247, 1236, 1225, 1214, 1198, 1182, 1210, 1238, 1237, 1235, 1234, 1232, 1227, 1221, 1216, 1211, 1163, 1115, 1067, 1019, 1029, 1039, 1048, 1058, 1047, 1037, 1066, 1096, 1104, 1059, 1018, 976, 965, 954, 942, 931, 949, 966, 983, 1001, 1034, 1067, 1124, 1180, 1209, 1186, 1113, 1041, 981, 921, 893, 918, 958, 997, 996, 995, 998, 1000, 1002, 1004, 970, 936, 903, 869, 873, 876, 880, 883, 898, 912, 927, 941, 923, 906, 888, 870, 900, 930, 986, 1042, 1105, 1169, 1169, 1116, 1061, 1059, 1051, 1042, 991, 941, 904, 921, 985, 1048, 1101, 1101, 1085, 1070, 1077, 1084, 1093, 1101, 1151, 1200, 1214, 1175, 1122, 1069, 996, 923, 865, 859, 918, 978, 997, 1016, 1036, 1057, 1104, 1151, 1146, 1140, 1135, 1130, 1146, 1163, 1179, 1195, 1196, 1197, 1198, 1199, 1235, 1271, 1275, 1226, 1153, 1079, 1064, 1049, 1067, 1086, 1105, 1124, 1123, 1122, 1122, 1121, 1076, 1032, 1033, 1088, 1144, 1147, 1140, 1132, 1093, 1054, 1015, 976, 968, 960, 949, 990, 1067, 1144, 1189, 1182, 1150, 1066, 971, 901, 892, 935, 1026, 1117, 1146, 1122, 1072, 1074, 1119, 1163, 1179, 1143, 1112, 1081, 1047, 1012, 959, 905, 896, 886, 919, 952, 958, 965, 934, 903, 916, 929, 938, 947, 930, 913, 864, 815, 816, 869, 944, 1019, 1067, 1116, 1151, 1133, 1084, 1034, 1010, 985, 987, 989, 1009, 1028, 1021, 1015, 1050, 1085, 1107, 1077, 1035, 1019, 1031, 1070, 1091, 1112, 1108, 1104, 1086, 1068, 1050, 1032, 1034, 1036, 1038, 1040, 1005, 971, 990, 1008, 1037, 1067, 1096, 1126, 1108, 1090, 1072, 1055, 1052, 1050, 1047, 1045, 1026, 1007, 988, 969, 951, 934, 969, 1005, 1031, 1058, 1081, 1104, 1135, 1114, 1069, 1024, 1021, 1018, 1015, 1011, 1030, 1049, 1068, 1087, 1106, 1125, 1144, 1164, 1160, 1157, 1154, 1151, 1110, 1069, 1029, 988, 1025, 1062, 1099, 1135, 1111, 1086, 1008, 931, 902, 873, 896, 920, 1001, 1082, 1163, 1244, 1248, 1253, 1257, 1262]
9039A262NMNMj2j2j3j2n0n0n0n0j7j8j8j8jjkjN2N3K9k3l7l6m0m0rrrrL7L7L8L7J4J5J5J5
9022A085L4L5L4L5l5l6l5l5l9l8l9l8k0k0L3L3M5M5M5M5J5J5J5J5j0rrrk5k6k5k5m8m9NML6
9006A004L5L6L6N4N5L1k1j7j6k0k0J0J0J0J0mmnmqpqqj5j6L6L7J4J4J0J1k4p7p7k4k4k5k0
8989I69k1oopoJ%J%l3l3k9l0rM4R9R9O8J6ppj7j8j7j7PQPPj2j3M0M1N0N0l8l8n4n3n3n3nn
8970I20nmm1m1J2J2M9N0M9N0N3N3kn5k9K4rrj4j5j1j1k1L1N5N4j8j8j8j8J0J0J4J3MN8N7M
8954A243j6j6k0k0kkM7M7K8k5m9m8j2j2j2j2NNONj7j7L3L3K5k7n1n0m5m5p5k2M6M7llOPPP
8937I96QPQPL1L1k2k2j6j5j5j6%%%%m1m1J2J2L3L3O3J0l5l5J5J5qqqrnmnnK8K8K5K4l5q7n8
8918H96n8KLKLL2L2L2L3onnnJ5J5J6J5j4j3j3j4L7L7L7L7LLn0n0K3K2K3K2j8j9j8j8J9J9J8
$$ y = [1262, 1267, 1271, 1276, 1280, 1268, 1256, 1243, 1231, 1181, 1131, 1081, 1031, 1014, 996, 978, 960, 959, 958, 956, 955, 1007, 1060, 1089, 1066, 1029, 993, 953, 913, 904, 895, 886, 877, 914, 951, 989, 1026, 1040, 1055, 1070, 1085, 1119, 1154, 1188, 1223, 1188, 1152, 1117, 1082, 1043, 1005, 966, 928, 908, 888, 921, 954, 999, 1044, 1089, 1134, 1149, 1164, 1179, 1194, 1184, 1175, 1166, 1157, 1132, 1106, 1081, 1056, 1008, 959, 964, 968, 1004, 1039, 1075, 1111, 1165, 1220, 1251, 1230, 1213, 1197, 1177, 1157, 1167, 1177, 1187, 1197, 1193, 1189, 1184, 1180, 1172, 1165, 1157, 1149, 1134, 1118, 1154, 1191, 1205, 1219, 1229, 1240, 1216, 1139, 1062, 1038, 1014, 989, 969, 948, 942, 936, 929, 923, 924, 924, 925, 925, 892, 859, 830, 800, 791, 835, 934, 1033, 1101, 1117, 1110, 1103, 1086, 1068, 1051, 1034, 1041, 1049, 1056, 1063, 1051, 1038, 1078, 1119, 1169, 1219, 1181, 1143, 1089, 1036, 983, 930, 925, 920, 915, 911, 870, 829, 841, 853, 902, 952, 1001, 1051, 1104, 1157, 1155, 1100, 1071, 1095, 1086, 1077, 1063, 1048, 1037, 1026, 1005, 1036, 1091, 1145, 1127, 1109, 1091, 1073, 1083, 1093, 1107, 1120, 1124, 1182, 1239, 1243, 1227, 1211, 1191, 1171, 1169, 1167, 1214, 1261, 1289, 1264, 1215, 1167, 1155, 1143, 1131, 1119, 1124, 1129, 1135, 1140, 1123, 1106, 1139, 1172, 1197, 1170, 1119, 1069, 1024, 979, 904, 882, 928, 975, 972, 969, 975, 982, 989, 996, 1004, 1011, 1019, 1026, 1057, 1088, 1066, 1044, 1028, 1013, 998, 982, 982, 982, 982, 982, 941, 900, 912, 924, 957, 990, 1053, 1063, 1028, 993, 1008, 1023, 1015, 1007, 999, 990, 985, 981, 976, 971, 999, 1027, 1052, 1076, 1041, 954, 896, 838, 840, 843, 845, 848, 880, 912, 944, 977, 971, 966, 961, 956, 971, 986, 1002, 1017, 1003, 990, 977, 963, 1000, 1037, 1074, 1111, 1114, 1117, 1067, 1017, 1040, 1062, 1085, 1107, 1089, 1070, 1052, 1034, 1053, 1072, 1090]
8901A090J7M1J4l3p6p5m9j4j4J2J2J2J2%J%JJ1J1J2J1mnnnM1M1M2M1k7k6k7k6LLm8m8k3MJ6
8883I43k8n4rJ5J6l1l2L1P4Q5O0Kk4m9p5q4m0L4P9Q1L8PQNMl4l5J8J8N5N6KLl8l8l8l8onM4
8866A020M4M5Jk8k7qqrqj%j%M0M1L8L8Ql6p6m9J5N9L6L6L3L4Ol8o3o3o2o3l4J1N6Q2N4Rqq
8848A116%%%jj5j5j5j5lklkL0K9Lk3NN0L6J0m1o8n1n2NM9M9Nk2k1k2k2K0O4N2K6nl1j9j8j6
8830A067j6j6j7n4n5OPmmmlpoooJ1J2N5N6Q7Q8K6K6rrl5l5j%k7k6l9l8OOL6L7L7L7K6K6j8
8812A217m5l0J3M6M6K5j9l8l9k5k6J6J6qn2o8m2%%JKL8L7L7L8J5J5J4J5rrj0r%j%jj3j3j3
8795A121j3j8j7K7K6L4L4PQl2l1onqqJ9J8k8k8k8k9KKLKMNNNl3l2l3l2MNNNL1L1L0L1pqn1
8776A017n2o8o8ooQRQRk0k1jM2P2P1Q6N9j2p3o5k0mmjjQQl5l6%j%%L0L0L0L0k3k2k2k2L3L2
$$ y = [1090, 1107, 1148, 1162, 1129, 1053, 978, 929, 915, 901, 913, 925, 937, 949, 949, 950, 950, 951, 962, 973, 985, 996, 992, 987, 982, 977, 1018, 1059, 1101, 1142, 1115, 1089, 1062, 1036, 1039, 1042, 994, 946, 923, 927, 943, 915, 861, 852, 867, 883, 852, 820, 851, 925, 1010, 1070, 1072, 1048, 999, 924, 840, 800, 834, 913, 994, 1032, 1039, 1047, 1052, 1056, 1022, 987, 1005, 1023, 1078, 1134, 1136, 1139, 1101, 1063, 1025, 987, 981, 976, 1020, 1064, 1109, 1110, 1082, 1055, 1047, 1039, 1030, 1022, 1021, 1021, 1020, 1020, 1060, 1101, 1139, 1177, 1185, 1149, 1073, 1024, 1039, 1098, 1134, 1170, 1203, 1237, 1243, 1205, 1142, 1079, 1017, 954, 920, 931, 987, 1069, 1123, 1132, 1124, 1116, 1116, 1116, 1116, 1115, 1100, 1085, 1070, 1055, 1052, 1050, 1047, 1045, 1075, 1104, 1107, 1084, 1089, 1139, 1175, 1185, 1144, 1076, 1025, 973, 978, 1027, 1076, 1081, 1059, 1038, 1016, 994, 1014, 1078, 1130, 1156, 1151, 1120, 1101, 1083, 1067, 1051, 1035, 1018, 964, 909, 915, 922, 918, 914, 910, 907, 900, 894, 888, 882, 893, 905, 960, 1016, 1103, 1191, 1217, 1243, 1234, 1225, 1190, 1155, 1154, 1154, 1127, 1101, 1062, 1024, 1030, 1036, 1072, 1109, 1146, 1183, 1209, 1235, 1217, 1172, 1142, 1155, 1201, 1247, 1272, 1253, 1215, 1176, 1151, 1125, 1141, 1157, 1149, 1097, 1029, 987, 987, 987, 988, 990, 1028, 1065, 1102, 1140, 1155, 1170, 1184, 1199, 1190, 1181, 1171, 1162, 1162, 1161, 1161, 1160, 1147, 1134, 1121, 1108, 1090, 1073, 1100, 1126, 1160, 1194, 1201, 1209, 1177, 1146, 1140, 1135, 1127, 1119, 1138, 1156, 1128, 1100, 1072, 1043, 1045, 1047, 1050, 1052, 1056, 1061, 1066, 1071, 1038, 1006, 973, 941, 945, 950, 955, 960, 991, 1022, 1052, 1083, 1076, 1068, 1017, 965, 897, 829, 823, 817, 825, 834, 842, 851, 831, 810, 809, 851, 923, 994, 1080, 1139, 1127, 1054, 989, 969, 965, 961, 960, 959, 967, 975, 940, 904, 904, 903, 903, 903, 933, 963, 993, 1023, 1000, 978, 956, 934, 967, 999]
8757I99O0N9J8J8k6k5n2n1l3J2O4O5O3J8l0p5o6l9l0lJ2L9L1L2OPK5K6K6K6j8j7j8j8j7j8
8742A070j8j7ppopJ%J%k9k9k9l0l0l1nM0Q4N8Kk5l9m0j6K8L3j0l6l6j1j0j1j1L3L2L2L3L6
8725I93L6L7L6M1M1J3l1o7o7m3m3J9J9J8J9l6l6J6J6L3L3L3L3K4K4K4K4m0m0l9m0JJJJJ6J7
8709A087J6J7J2J3RJ0pn1p5p5l0L0L8J1k2k1K9L0L2L1k1k1J9J8J9J8j3j3j3j4M5M5M5M5k1
8693A222k1J4M0K5j9m6m6k9k9K4K4J9J8l2l2j2J4%m4n9l3JO2P4L0m7p3m0LL0K9K1K1K0J9n7
8678A091q2m2KK2ml9m0jkjkK5K5K5K5J3J4J4J4k3k2k3k3j2j1j2j2J3J3J2J3K8K8K8K9KLK8
8661A116j7m7m7KLJ7J6j0j0KKJKj1j1j1j1K9K9P7P8L2k9m7m7jjk8p1q8o1nK1J8J9op%jk8k7
8644H42n3n2l5K8Q2Q2O0N9ONk1k2K6K5jjPOPOk8k8O0O0L1L2k1k1J7J8rql8l8J5J5j5j5j2j2
$$ y = [999, 1059, 1118, 1136, 1154, 1128, 1103, 1051, 1000, 967, 979, 1043, 1108, 1171, 1189, 1159, 1084, 1018, 979, 949, 946, 958, 997, 1028, 1060, 1066, 1073, 1098, 1124, 1150, 1176, 1158, 1141, 1123, 1105, 1088, 1070, 1052, 1035, 1028, 1021, 1015, 1008, 1009, 1009, 1010, 1010, 981, 952, 923, 893, 863, 832, 827, 867, 951, 1009, 1011, 986, 947, 907, 891, 919, 952, 942, 906, 870, 859, 849, 838, 827, 860, 892, 924, 957, 993, 1029, 1066, 1102, 1143, 1184, 1197, 1166, 1099, 1032, 989, 946, 965, 984, 1002, 1021, 985, 949, 965, 981, 1014, 1047, 1080, 1113, 1137, 1161, 1185, 1209, 1169, 1129, 1090, 1050, 1051, 1052, 1053, 1054, 1070, 1087, 1103, 1120, 1132, 1145, 1154, 1164, 1157, 1106, 1031, 956, 926, 956, 994, 1005, 983, 962, 991, 1021, 1053, 1084, 1063, 1042, 1061, 1079, 1098, 1116, 1103, 1090, 1077, 1063, 1108, 1153, 1198, 1243, 1222, 1201, 1215, 1255, 1280, 1261, 1215, 1169, 1140, 1111, 1135, 1159, 1178, 1196, 1164, 1132, 1120, 1134, 1134, 1090, 1031, 998, 999, 1061, 1135, 1165, 1118, 1045, 1005, 1008, 1038, 1067, 1088, 1109, 1129, 1148, 1091, 1009, 967, 969, 991, 987, 948, 908, 907, 905, 904, 902, 927, 952, 977, 1002, 1015, 1029, 1043, 1057, 1034, 1012, 989, 966, 954, 943, 931, 919, 932, 945, 957, 970, 998, 1026, 1054, 1083, 1085, 1088, 1116, 1099, 1052, 1005, 1007, 1010, 1027, 1043, 1033, 1023, 1025, 1027, 1028, 1030, 1019, 1008, 997, 986, 1015, 1044, 1121, 1199, 1231, 1202, 1155, 1108, 1107, 1106, 1078, 1007, 919, 858, 853, 874, 892, 911, 905, 898, 898, 897, 869, 842, 789, 737, 702, 730, 812, 894, 954, 1013, 1019, 1024, 1003, 981, 1007, 1032, 1031, 1030, 1037, 1043, 1050, 1056, 1028, 1000, 1060, 1120, 1151, 1183, 1162, 1141, 1158, 1176, 1167, 1159, 1121, 1083, 1098, 1113, 1098, 1083, 1071, 1059]
8626A059K8P3O1L4nl1l3pl0l1l0k9o8o8m1ML8L9j2j2J2J2J1J2lkllqrrrJ9J9J9J8OON6N7K0
8609A160k4n1n2k5k6K9K9K5N1N9J6m4p1q3l9j1j0qqL6L6L5L6J3J4M7P4M2k0p1p1n5n6n5n5
8593H67LKLLK3K2K3K2j6j6j6j6j%jjJ6J5J6J5J5J6J5J6QRQRQRRQJ0J0RJ0l9l8J4J4RQm4m4
8574A012m1m1m1m0j9j8L5L4NNNNJ4J4J4J4L0K9L0L0n5n5n5n5J3J3J3J4NNNONNONK1K1K2K1
8557A036J8J8J5J5J5l0n8n7l1l0l1l1KKLKkjjjN3N2%%k6k7k6k7o6o5j3j3J3J4J3J3N8N8NO
8540H75k1k0k0k0L5L4L5L4J2J1J2J1M2M2j1j1J9J9J9J8l6l7l5l4J3M0%m4j0L4N9N9J%KKK8
8524A157N5O4K0j8j8k1k1j5j4L8L8k0k0k0k0OOOOj5j5j5j5n0n0LLJ0J1J0J1M0L9M0L9opop
8507A229l5l6l5l6k4k5k4k4j0j0j0j0opopK4K4km7m8k2J3J3J8J9O9O9O0J6l1n7k2MKk3j9j8
$$ y = [1059, 1087, 1160, 1221, 1255, 1250, 1219, 1186, 1179, 1149, 1118, 1088, 1059, 991, 923, 882, 886, 924, 963, 951, 939, 951, 963, 974, 986, 983, 981, 978, 975, 967, 958, 949, 940, 959, 978, 997, 1015, 1021, 1027, 1083, 1140, 1160, 1136, 1085, 1033, 1008, 982, 1011, 1040, 1065, 1116, 1175, 1191, 1147, 1076, 993, 954, 943, 933, 925, 917, 953, 989, 1024, 1060, 1073, 1087, 1134, 1208, 1250, 1230, 1159, 1088, 1033, 977, 922, 867, 870, 872, 875, 878, 901, 923, 946, 968, 952, 936, 920, 904, 903, 903, 902, 901, 917, 932, 948, 963, 978, 994, 1009, 1025, 1033, 1042, 1050, 1059, 1067, 1076, 1085, 1093, 1103, 1113, 1122, 1132, 1093, 1055, 1069, 1083, 1092, 1100, 1056, 1012, 971, 930, 889, 849, 830, 812, 847, 881, 886, 891, 896, 901, 915, 929, 943, 957, 987, 1016, 1046, 1076, 1021, 966, 911, 856, 869, 882, 895, 909, 914, 919, 924, 930, 935, 940, 946, 951, 972, 993, 1015, 1036, 1054, 1072, 1087, 1102, 1117, 1087, 1029, 972, 941, 911, 880, 849, 851, 853, 856, 858, 856, 855, 854, 853, 906, 958, 958, 958, 932, 905, 879, 852, 786, 721, 708, 695, 708, 722, 735, 748, 806, 864, 869, 875, 854, 834, 814, 794, 829, 863, 898, 932, 944, 955, 967, 978, 1020, 1062, 1051, 1040, 1059, 1078, 1097, 1115, 1079, 1042, 1007, 973, 986, 1026, 1026, 982, 972, 1006, 1065, 1124, 1125, 1125, 1127, 1129, 1157, 1212, 1276, 1296, 1278, 1260, 1239, 1218, 1203, 1189, 1227, 1265, 1245, 1225, 1205, 1185, 1191, 1197, 1203, 1209, 1194, 1179, 1164, 1149, 1099, 1049, 1052, 1055, 1065, 1076, 1086, 1097, 1137, 1176, 1216, 1255, 1249, 1242, 1236, 1229, 1194, 1158, 1123, 1087, 1063, 1038, 1014, 990, 980, 970, 960, 950, 944, 937, 931, 924, 948, 972, 970, 923, 875, 853, 866, 879, 897, 916, 985, 1054, 1114, 1130, 1099, 1042, 1020, 1024, 1026, 1003, 984, 966]
8490I66L2L3j5j5j5j5j1j2j1j2k1k2k2k1K3K2L5Rl4p9o8m2J1L7K5K4J9K0J9J9K8K7K7K7L6
8475A024L6j7j6m7m6m6m7PPPOK5K5PL4K6j9m1m2k9J4O1Q7O2J9k8n5l8l8l9m0M4M3M4M4K4K4
8459A082K3K4k9k8k9k9k6k5k3k2j4L8O2O2L1L2L2L2J5J5po1p7p8k7k8K0J9K0K0J2J2J2J2O
8444A078NOOLLKLm2m2J0J1J4J4J3J4k7k7k8k7l4l4l4l4kklkM0M1M0M0M9M8mnJ5J4J1J1Mm9
8426A099j9k0j6j6j6j6j4j5j5j5J4J3J4J4K6K7K7K6O3O3J0J0OOONoon6n6o7j4QRQPQPmnnn
8408A090L7L7L7L7l0k9l0l0p6p6n3%K7K7L0L0j7j7j7j8J4J4J4J3k3k4k4k3ooooM8M9M9M9K1
8392A112K2K1K1k6k6k6k6m7m6OOJ0RJ0RJ%JJk9l0K4K4L8L9L9L8K1K1l1l2m6m5m6m6m1m1J1
8375I00J2j3j2j3j3j4j5L8L7K3K2K3K2Q6Q6L0k3n1k4J0J0j0j0n9o0m1J1M6K0l5q8q9l6LMJ0
$$ y = [966, 998, 1031, 1016, 1001, 986, 971, 960, 948, 937, 925, 904, 882, 860, 839, 862, 884, 919, 928, 894, 815, 747, 705, 716, 753, 778, 802, 821, 841, 860, 879, 907, 934, 961, 988, 1024, 1060, 1043, 1027, 980, 934, 888, 841, 848, 855, 862, 868, 893, 918, 925, 959, 985, 966, 925, 883, 854, 868, 929, 1016, 1078, 1097, 1069, 1014, 976, 938, 899, 859, 903, 946, 990, 1034, 1058, 1082, 1105, 1129, 1100, 1072, 1043, 1014, 988, 963, 940, 918, 904, 942, 1004, 1066, 1097, 1129, 1161, 1193, 1208, 1223, 1216, 1155, 1078, 1000, 973, 945, 965, 984, 1004, 1024, 1036, 1048, 1060, 1072, 1078, 1083, 1089, 1095, 1098, 1101, 1103, 1106, 1064, 1022, 1032, 1043, 1057, 1071, 1084, 1098, 1071, 1044, 1016, 989, 955, 921, 887, 853, 851, 849, 846, 844, 884, 925, 965, 1005, 1054, 1102, 1098, 1093, 1108, 1122, 1133, 1144, 1148, 1099, 1080, 1060, 1044, 1028, 1012, 996, 982, 967, 952, 937, 951, 964, 978, 992, 1018, 1045, 1072, 1098, 1161, 1224, 1234, 1244, 1250, 1256, 1262, 1267, 1261, 1255, 1199, 1143, 1076, 1062, 1070, 1079, 1087, 1094, 1102, 1109, 1105, 1100, 1095, 1090, 1127, 1164, 1201, 1238, 1208, 1179, 1149, 1119, 1043, 967, 914, 914, 941, 968, 998, 1028, 1011, 994, 977, 959, 973, 987, 1001, 1014, 991, 967, 943, 920, 914, 908, 902, 896, 944, 993, 1042, 1091, 1112, 1134, 1155, 1176, 1150, 1124, 1098, 1072, 1025, 979, 985, 991, 1001, 1010, 1020, 1029, 1030, 1030, 1031, 1032, 1003, 973, 997, 1021, 1059, 1098, 1137, 1175, 1196, 1217, 1186, 1154, 1108, 1063, 1017, 971, 930, 889, 900, 912, 899, 887, 874, 861, 847, 832, 870, 907, 930, 952, 975, 997, 1083, 1169, 1199, 1176, 1125, 1101, 1111, 1121, 1111, 1101, 1042, 982, 941, 952, 998, 1018, 983, 895, 806, 770, 773, 777, 787]
8360G87J0O2J16Q2Q3N9Oj6j7kjjkqqqrLLLKJ0J1J0J0K9L0Pm6n8n7o0o1o3o3mM8O1O2J2J1k2
8341A011k2k2k2mnJ9P2O3O3O6O7K0K1J8J7k3p6r9r9o8o7m4QJ6J6l3l4m0m1J3J2L8L9L9L8K8
8326I85K7K7K8J2J2J2J2j2j2j1j2n2n3J%J2J1J2J2K1K2K1K2K5K5K5K6nnn7n7KKLKqpqpj3j2
8308A028j2j2j8j8L5L5J0J0RJ0ppopK8K7K8K7QQm5m5o3o4K5K4J9J9K0J9L8L8j5j5M5M5M9n
8292A265m4m3NOk5k5n1n1j2j2J5J4L3L2L3L2j9k0k2L0O3O4Rm5n8n9j0rM0M0J3J4n5n5k9k8
8276A036j3j2j2j2J1J1J1J1K0K1l2l2rj0j0j0J1J1J1J1L1L1L1L1k0j9k0k0k7k8k8k8RRL6L5
8260A036K5K5k7k8qqrqj5j4L8L9N1N2M8M8K7k6m9m9j4j4L5L6J1m1o4o4j3j3m0l9QQQPK5K4
8244A008K5K4J9J9qqPPN7N7K8k5m7m8LLL0K9k2k3m9n0QQQQj5j5L7L8L1L1k2k2poppl8l9l8
$$ y = [787, 797, 859, 975, 1057, 1140, 1199, 1205, 1189, 1172, 1170, 1169, 1168, 1166, 1158, 1150, 1142, 1133, 1136, 1139, 1142, 1144, 1154, 1165, 1175, 1185, 1214, 1244, 1251, 1205, 1147, 1090, 1030, 969, 906, 843, 839, 887, 948, 1010, 1022, 1033, 1011, 989, 967, 945, 941, 936, 955, 1027, 1090, 1153, 1219, 1286, 1306, 1327, 1345, 1362, 1339, 1263, 1164, 1065, 997, 930, 886, 894, 910, 926, 893, 859, 819, 778, 791, 803, 841, 880, 919, 957, 985, 1012, 1039, 1067, 1079, 1091, 1103, 1115, 1103, 1091, 1080, 1068, 1016, 963, 964, 964, 976, 987, 999, 1011, 1032, 1054, 1075, 1097, 1122, 1147, 1172, 1198, 1193, 1188, 1131, 1074, 1076, 1078, 1081, 1083, 1075, 1068, 1060, 1053, 1040, 1028, 1016, 1004, 986, 968, 1003, 1038, 1048, 1058, 1067, 1077, 1070, 1063, 1057, 1050, 1078, 1105, 1133, 1160, 1168, 1176, 1131, 1086, 1023, 959, 984, 1008, 1027, 1046, 1066, 1085, 1123, 1161, 1146, 1131, 1176, 1221, 1270, 1265, 1221, 1178, 1183, 1189, 1164, 1139, 1088, 1037, 1025, 1013, 1028, 1042, 1075, 1107, 1140, 1172, 1153, 1133, 1111, 1141, 1204, 1268, 1277, 1232, 1174, 1115, 1105, 1096, 1136, 1176, 1189, 1203, 1148, 1093, 1064, 1036, 1023, 1011, 999, 987, 998, 1009, 1020, 1031, 1051, 1072, 1040, 1008, 999, 989, 979, 969, 980, 991, 1002, 1013, 1044, 1075, 1106, 1137, 1117, 1098, 1078, 1058, 1031, 1003, 975, 947, 956, 965, 1001, 1036, 1061, 1086, 1059, 1031, 1023, 1015, 1006, 998, 983, 969, 1007, 1046, 1097, 1149, 1197, 1245, 1272, 1246, 1197, 1148, 1134, 1120, 1155, 1191, 1202, 1161, 1097, 1033, 1020, 1007, 967, 928, 936, 944, 952, 959, 984, 1008, 1033, 1057, 1076, 1095, 1087, 1079, 1086, 1093, 1150, 1207, 1235, 1210, 1163, 1115, 1118, 1121, 1151, 1180, 1158, 1135, 1086, 1036, 1044, 1052, 1060, 1068, 1053, 1038, 1075, 1113, 1144, 1175, 1153, 1131, 1124, 1118, 1111, 1104, 1066, 1027, 989]
8226I89l9NMMNMMNMMMMMj%n4n3j9k0L4L3M2M1O5O5P3K1kkk1k1p4p5m5m6m3m2j5L8O1O0QPP
8207A023PL8L9J5l7l2l1qqRJ0L6L6%JJ%LKKKJ7J6J2J3j2o5o4j2k3k2k3L0M4M4nommmmm5m4
8188I47m5m5K6K6K6K5J5J5J5J4OOOOONMLk0o4n4k8RRJ0J1K6K7O1Q8O3Jn0n0j9k0j9j9J2J3
8171A048J2J3j4j3j4j3L6L7L7L7m7m6m7m7j4j4j4j4j3j3j0j1RN3O7M0jm4p1p0n8LN7N7K3K3
8156I64K2K3nnnnl1l1l2l1OOPOJ6J7J7J7J2J1J2J2k4k3KLL3L3k0j9j5j4j4j4L8L9L8L9J2J2
8138A109j5n8p6m9OL3J9K0L0N6M3%k7k8J3J2j4j3m7m7m7m7k1k2ONL5L5j7j8J4J4J3J4nnnn
8122I11oonoj2j2j2j2M7M8M7M7M5M4K1l2n7n7ppllllK9L0L0K9J6J5J6J5K8K8k5k4k3k3MMJ3
8104A129J4j4j3l3l3K0K0k8k7k7k7M0M1L8L7N7Lj9k0L7L7j7j6k4k5k5k5lmmmlmllM2M3M3M3
$$ y = [989, 950, 955, 959, 963, 968, 972, 976, 981, 985, 989, 993, 997, 1001, 1000, 1000, 946, 893, 874, 854, 888, 921, 963, 1004, 1069, 1134, 1207, 1228, 1226, 1224, 1203, 1182, 1108, 1033, 988, 942, 899, 857, 842, 880, 941, 1001, 1009, 1016, 1023, 1030, 1068, 1107, 1122, 1085, 1053, 1022, 1014, 1006, 1015, 1025, 1061, 1097, 1097, 1098, 1099, 1099, 1102, 1104, 1106, 1108, 1125, 1141, 1153, 1166, 1154, 1089, 1025, 1013, 990, 968, 945, 975, 1019, 1063, 1058, 1052, 1048, 1044, 1040, 1036, 991, 947, 902, 857, 883, 909, 935, 960, 975, 990, 1005, 1019, 1025, 1031, 1037, 1043, 1049, 1054, 1058, 1061, 1041, 977, 923, 895, 904, 913, 923, 934, 960, 987, 1048, 1136, 1199, 1200, 1150, 1100, 1081, 1061, 1042, 1023, 1035, 1048, 1060, 1073, 1059, 1046, 1032, 1019, 1055, 1092, 1129, 1166, 1119, 1073, 1026, 979, 965, 951, 937, 923, 910, 897, 887, 876, 885, 938, 1005, 1045, 1044, 1000, 929, 859, 801, 804, 861, 918, 941, 964, 986, 1009, 1004, 999, 994, 989, 958, 927, 895, 864, 870, 876, 883, 889, 905, 922, 939, 956, 968, 979, 991, 1003, 979, 956, 958, 961, 994, 1027, 1007, 988, 973, 959, 945, 931, 969, 1008, 1046, 1085, 1097, 1109, 1094, 1036, 960, 911, 917, 950, 969, 989, 1019, 1075, 1118, 1118, 1091, 1063, 1076, 1088, 1074, 1061, 1014, 967, 920, 873, 852, 830, 836, 841, 876, 911, 894, 876, 890, 904, 917, 931, 926, 921, 916, 911, 905, 899, 894, 888, 876, 864, 852, 840, 887, 935, 982, 1029, 1074, 1118, 1139, 1107, 1050, 993, 986, 979, 976, 973, 970, 967, 996, 1026, 1056, 1085, 1101, 1116, 1132, 1147, 1175, 1203, 1178, 1154, 1131, 1108, 1112, 1116, 1129, 1143, 1129, 1116, 1083, 1050, 1070, 1090, 1062, 1035, 1008, 981, 1021, 1062, 1100, 1137, 1194, 1197, 1178, 1158, 1195, 1232, 1215, 1199, 1175, 1150, 1125, 1100, 1097, 1093, 1089, 1085, 1082, 1078, 1075, 1072, 1114, 1157, 1200, 1243]
8087A243n3n3n2n3KLKKklklj7j7j7j7QRm2m1MN7N4N4non8n8l3l2K0K1OOOOJ0RJ0RJ0J0RJ0
8068A016j9j9j6j6mM8L3Pj%kkl1l0K2K3k3k2k5k4k5n1o6j3L6L7O6O6N3N3%%m9n0n0m9J2J2
8051H97J3J2ppl3l4k9k9K4K3O2O2L6L6L7L7L7L7k5k6k5k6l0l0n5n5K1M8J2m0n6mJ6J5N0N0
8036A014N0N0KJJJJ7J7J7J6L0L0L1L0PPPPl1l1q1q1k0L3M4J8jjllONOOj0j0rj0j0rj0j0k0
8017A103k1k1k1K5K4K4K5P6P6K3l9o6o6j6j7l2l2l1l0j2J4J7j0j8RM3M4ol2l0mJ4M0M1J5j1
8002A098j0J3J4K2K2pn0o0n9k5KK6K7K8K8J2J1J0J0j1l8l8j1MLnl3l8l9kK4L1L1M6K0l2n7
7986I67o0l3lm%%K5N1L7L6K8K9K8K8J7J7k0m6p0m4pqkjkjqqpqPPJ8M5O4O5K8Kk6k5lll8o5
7967A007o5l9k5k5L0K9L3L3L2L3J8J7J7J8k3k2k3k3J3J3L6L5M2j0l4l4poM6M6J7J7l5l6j0
$$ y = [1243, 1190, 1137, 1085, 1032, 1034, 1037, 1039, 1041, 1039, 1036, 1034, 1031, 1014, 997, 980, 963, 971, 980, 938, 897, 901, 958, 1012, 1066, 1061, 1055, 997, 939, 906, 874, 894, 915, 921, 927, 933, 939, 949, 958, 968, 977, 987, 997, 1006, 1016, 997, 978, 962, 946, 942, 990, 1023, 1030, 1029, 1029, 1027, 1025, 994, 964, 986, 1009, 986, 964, 939, 915, 890, 839, 773, 760, 796, 833, 899, 965, 1018, 1071, 1071, 1071, 1022, 972, 922, 873, 885, 897, 910, 922, 915, 908, 875, 841, 812, 783, 807, 830, 892, 954, 990, 1026, 1063, 1100, 1137, 1174, 1149, 1123, 1098, 1072, 1042, 1012, 957, 902, 923, 971, 983, 943, 887, 883, 899, 914, 964, 1014, 1064, 1114, 1116, 1117, 1118, 1119, 1136, 1153, 1170, 1186, 1216, 1246, 1277, 1307, 1314, 1321, 1328, 1335, 1304, 1273, 1192, 1111, 1091, 1124, 1168, 1186, 1185, 1184, 1181, 1178, 1184, 1189, 1195, 1201, 1191, 1181, 1172, 1162, 1152, 1143, 1133, 1123, 1103, 1082, 1061, 1040, 1065, 1089, 1113, 1138, 1214, 1290, 1313, 1274, 1208, 1142, 1126, 1109, 1077, 1045, 1014, 984, 972, 986, 1003, 993, 975, 984, 1027, 1071, 1065, 1033, 1003, 999, 1013, 1053, 1094, 1109, 1098, 1088, 1101, 1115, 1137, 1159, 1152, 1102, 1042, 983, 958, 960, 986, 1013, 1041, 1069, 1081, 1092, 1102, 1112, 1101, 1063, 1025, 1014, 1018, 1021, 1016, 983, 945, 906, 904, 928, 959, 990, 1036, 1056, 1024, 967, 907, 874, 871, 867, 867, 867, 892, 943, 980, 1016, 1044, 1073, 1101, 1129, 1146, 1163, 1143, 1097, 1027, 983, 976, 968, 966, 965, 963, 962, 954, 946, 939, 931, 938, 945, 963, 1008, 1072, 1137, 1165, 1167, 1141, 1116, 1113, 1110, 1072, 1007, 942, 903, 878, 853, 883, 912, 945, 978, 1010, 1043, 1061, 1078, 1095, 1113, 1090, 1068, 1045, 1022, 1035, 1048, 1084, 1119, 1161, 1151, 1117, 1083, 1076, 1070, 1116, 1162, 1179, 1196, 1161, 1125, 1115]
7951A115j0oo0m8m8KKM1M1M1M1kkkkrj0j0j0K9K9K8K9K5K6k8k7KLKKJ2J1J2J1l0l0l1l0m8
7934A061m7m8m7ppppLMN2N3M2j0l4l3ppK0J9L2L1ONnmmnp6p5l8N1J01J01P8P7K7k6m9m8n8
7917A114n8n7n8K1K1nnm2m3j9L4N7N8PQQQQQj%%jJ4J4M1M0L1L2k2k2k9k9k9k9k5k4K6K7Lk4
7899A058l3J1N9N9RRJ%J%rrj0rl8l8l8l9ppoL8Q2Q3N7J2k9l0l3l3m2m3m3m3L1L1K8K8J0l4
7882A034o0n9k8J7M4M4PPPPJ9K0K0J9K7K8%JL0L0k2k3k6k7k6k6l7l7J6J6N8N7M3J7l3p7r2
7866I95o6pL6M1M0L4L5QQj1j1j1j1l6l6J7J7J6J6J6J5J9K0J9J9j6j6j5j6%%j%L1L0L1L0J4
7849A254J4l8l9jjjjm6m6m7m6l6l7o4j2M5P2P5M9K9K9K8K7K0J9ppk5k4p4p3m8OK8K9L2L3O
7833A122Pj3j3j3j3J9K0K0K0L9M0L9M0k4k4k5k4m7m7NOM0M1M0M1ppopo6o6o6o6j1j2j1j1L4
$$ y = [1115, 1105, 1099, 1039, 991, 943, 945, 947, 988, 1029, 1070, 1111, 1109, 1107, 1105, 1103, 1094, 1084, 1074, 1064, 1093, 1122, 1150, 1179, 1204, 1230, 1202, 1175, 1177, 1180, 1182, 1184, 1196, 1207, 1219, 1230, 1200, 1170, 1139, 1109, 1061, 1014, 966, 919, 912, 905, 898, 891, 894, 898, 950, 1003, 1045, 1035, 1001, 968, 961, 954, 974, 993, 1025, 1056, 1062, 1067, 1062, 1058, 1054, 1049, 973, 898, 860, 911, 1012, 1113, 1191, 1268, 1295, 1269, 1220, 1172, 1114, 1056, 999, 941, 962, 983, 978, 973, 931, 888, 869, 903, 960, 1018, 1025, 1033, 1041, 1049, 1057, 1065, 1064, 1064, 1064, 1063, 1077, 1091, 1132, 1172, 1203, 1235, 1213, 1191, 1162, 1133, 1104, 1075, 1050, 1026, 1052, 1079, 1082, 1058, 1025, 1036, 1095, 1154, 1163, 1172, 1173, 1173, 1174, 1174, 1165, 1156, 1146, 1137, 1099, 1061, 1023, 984, 977, 970, 964, 1002, 1084, 1167, 1224, 1236, 1207, 1177, 1144, 1111, 1069, 1026, 983, 940, 971, 1002, 1030, 1058, 1068, 1034, 974, 915, 887, 904, 948, 992, 999, 1006, 1013, 1020, 1039, 1059, 1079, 1098, 1125, 1153, 1153, 1154, 1184, 1214, 1192, 1169, 1143, 1116, 1090, 1064, 1027, 990, 1006, 1022, 1080, 1137, 1180, 1197, 1164, 1087, 995, 929, 922, 958, 999, 1039, 1073, 1108, 1116, 1124, 1113, 1102, 1091, 1080, 1044, 1008, 1025, 1042, 1058, 1074, 1090, 1105, 1124, 1144, 1163, 1182, 1166, 1150, 1135, 1119, 1119, 1119, 1118, 1118, 1149, 1179, 1210, 1240, 1254, 1268, 1230, 1191, 1190, 1189, 1188, 1187, 1141, 1095, 1048, 1002, 966, 929, 865, 853, 898, 970, 1045, 1094, 1123, 1152, 1180, 1207, 1227, 1246, 1239, 1232, 1207, 1183, 1109, 1036, 988, 994, 1022, 1051, 1083, 1116, 1122, 1129, 1116, 1103, 1090, 1077, 1096, 1116, 1136, 1156, 1195, 1235, 1274, 1314, 1290, 1266, 1241, 1217, 1170, 1123, 1128, 1134, 1174, 1215, 1255, 1296, 1289, 1282, 1276, 1269, 1203, 1137, 1071, 1005, 994, 982, 971, 960, 994]
7816I94L3L3L4OPOPJKK8K7O4O4M0j2l4l4l4l4m5PN1P7O8O9M6ol2l3j0j0j8j9j9j9lml8o4l1
7799A165K2P8P9O3O4M1M0M4R7R6M4N7N6J12J64J93J94K52K53K57L10L66M54N68P62R36J164
7787G931J522K103K809L670M657N343M878K608r02m049n492n263m230l193k403j752j300j001
7779E936p79n50m13l61l03k14j24j24j22o9mmN4J07J08N6n6j43k26k26j93j05n7n7n1n1j1
7768B018j1QO2P0J7l7l8K6K5K6K6Q9Q9R0Q9Q2Q2J39J93J76J77K23L12L99M87O14Q08J006J269
7755H516J705K320L102L998N016N526M563J662k063m823n689n038l954k987k242j627j222
7748F763r58p32n38m13l26k42j90j79k32k09j21q6q5q4q3q4q4n1n1n1n1lkllJ3J3J4J3N2N3
7734B060N3N2%J%%K2K2K2K3Q5Q6Q6Q6J67J68K26K27K73L79M30N35O87Q63J108J426J874K543
$$ y = [994, 1027, 1060, 1094, 1100, 1107, 1113, 1120, 1121, 1123, 1151, 1178, 1242, 1306, 1346, 1334, 1300, 1266, 1232, 1198, 1153, 1160, 1211, 1288, 1356, 1425, 1471, 1465, 1433, 1400, 1390, 1380, 1362, 1343, 1324, 1305, 1302, 1298, 1260, 1196, 1165, 1187, 1265, 1344, 1407, 1471, 1512, 1552, 1596, 1693, 1789, 1833, 1890, 1946, 2058, 2222, 2415, 2609, 2861, 3114, 3371, 3681, 4047, 4501, 5069, 5831, 6767, 7931, 9453, 11556, 14365, 18035, 22692, 28035, 32913, 35521, 34619, 30570, 25078, 19815, 15585, 12392, 9989, 8237, 6937, 5936, 5157, 4607, 4194, 3833, 3530, 3316, 3192, 3068, 2946, 2877, 2873, 2869, 2923, 3030, 3138, 3194, 3138, 2995, 2769, 2543, 2350, 2245, 2188, 2131, 2080, 2029, 2018, 2007, 2015, 2077, 2147, 2164, 2127, 2089, 2115, 2140, 2166, 2192, 2281, 2370, 2460, 2549, 2631, 2713, 2852, 3045, 3221, 3398, 3621, 3933, 4332, 4819, 5433, 6241, 7247, 8516, 10221, 12541, 15643, 19641, 24657, 30183, 34746, 36408, 34345, 29522, 23833, 18795, 14841, 11854, 9612, 7985, 6763, 5805, 5073, 4535, 4122, 3796, 3554, 3364, 3185, 2953, 2744, 2623, 2537, 2452, 2368, 2285, 2201, 2117, 2066, 2015, 1964, 1913, 1910, 1908, 1905, 1902, 1915, 1928, 1942, 1955, 2007, 2060, 2113, 2165, 2165, 2166, 2166, 2166, 2188, 2210, 2232, 2255, 2340, 2426, 2512, 2598, 2765, 2933, 3159, 3386, 3659, 4038, 4468, 5003, 5690, 6553, 7661, 9087, 10961, 13504]
7722A3504L329M280N209N314L728N27k985n130n490m682l615k736k037j509j103q57o88n13
7714D546m09l56l14k61k57k04j37q4q2q2p9p8n7n7n7n7l4l5l5l5K2K2K2K2p1p0p1p0n8n8n8
7701A468n8k7k7k7k7J3J2J3J3j9j8j8j8OOOOl3l4l3l4L2L2L2L2n7n8L1L1nmmnK3K3K3K3l9
7684A280l9l9l9k6k6k6k6K8K8K6K6l9o5q1k7M0L9M4M3J2J3RRQm5m4QM1M1M4M5NOOOppqprr
7667A238rrj6j6j5j6qpqpqppqJ6J5J6J6j5j5j5j5k5k4k5k5J5J5J5J5K0K0K0J9kkkkQRRRKL
7647A172KKl3l4l3l3l4l3l0l0ON9K9K9L3L2L3L2l5l5l5l6L1L1L1L0J2J1J1J1m6m6m6m5m0l9
7632I34m0l9RRRRJ9J8L7J1J6O8N2K6NNMLppk5JL7j5p3p2k0k1QPL0N7M4qm9m9m9n0nM7P0P0
7614A076N0N0L0k3l0K3L1Ml8l8j7L6L1L1jk6l7J6L8L8j3j4nK2jn4q7o0nM7L5Qj6j6m4m4l8
$$ y = [13504, 16833, 21113, 26322, 31636, 35364, 35891, 32906, 27776, 22286, 17604, 13989, 11253, 9216, 7707, 6604, 5747, 5059, 4546, 4137, 3781, 3467, 3206, 2949, 2745, 2608, 2524, 2442, 2360, 2281, 2203, 2146, 2089, 2032, 1975, 1941, 1906, 1871, 1836, 1858, 1880, 1902, 1924, 1853, 1783, 1712, 1642, 1584, 1526, 1468, 1410, 1383, 1356, 1329, 1302, 1315, 1327, 1340, 1353, 1334, 1316, 1298, 1280, 1286, 1292, 1298, 1304, 1271, 1237, 1204, 1170, 1202, 1234, 1266, 1298, 1241, 1183, 1214, 1245, 1240, 1236, 1232, 1227, 1250, 1273, 1296, 1319, 1280, 1241, 1202, 1163, 1137, 1111, 1085, 1059, 1087, 1115, 1141, 1167, 1128, 1063, 982, 955, 995, 1034, 1078, 1121, 1133, 1146, 1155, 1164, 1172, 1127, 1083, 1091, 1132, 1173, 1217, 1262, 1267, 1273, 1279, 1285, 1278, 1271, 1263, 1256, 1247, 1238, 1229, 1220, 1204, 1188, 1173, 1157, 1149, 1142, 1134, 1127, 1119, 1112, 1105, 1097, 1113, 1128, 1144, 1160, 1145, 1130, 1115, 1100, 1075, 1051, 1026, 1001, 1016, 1031, 1046, 1061, 1081, 1101, 1121, 1140, 1138, 1136, 1134, 1132, 1140, 1149, 1158, 1167, 1169, 1172, 1174, 1176, 1143, 1109, 1076, 1043, 1009, 976, 946, 916, 922, 981, 1010, 1039, 1072, 1104, 1137, 1169, 1134, 1099, 1064, 1028, 1059, 1090, 1121, 1151, 1163, 1174, 1185, 1196, 1150, 1104, 1058, 1013, 973, 934, 894, 855, 864, 873, 882, 891, 910, 928, 965, 976, 992, 1060, 1112, 1138, 1143, 1148, 1152, 1155, 1148, 1141, 1116, 1117, 1154, 1139, 1066, 994, 974, 953, 961, 968, 998, 1055, 1099, 1091, 1042, 993, 944, 894, 889, 936, 1006, 1076, 1126, 1176, 1206, 1183, 1153, 1176, 1207, 1211, 1173, 1135, 1118, 1154, 1185, 1216, 1215, 1189, 1152, 1168, 1206, 1244, 1231, 1217, 1212, 1234, 1233, 1179, 1092, 1032, 1027, 1074, 1109, 1117, 1101, 1085, 1041, 997, 959]
7598I59l7J5J6OOOOM6M6M7M6klK4K4K9K9k3k4QQPQn4n4n3n2J5M2L4j9l8J4O9O9K5K4K5K5J9
7580A338J9l4l3n6n5llKLKKj3j3J0O3N8N8k6k6l9l8j2j2kkk8k8m2m1J1J1K4K4K1K1k7q0p7
7564I77p7n5n5KN6R8R8P5P4K0J9pppqppj6j6j6j5l0k9k9k9K6K5K6K5k1k1k1k2J1J1L7L7K1
7547A143K1l2l1K0K1K1K0j0j1l7l7p5p4j6L7K9K9L2L2J4J4j3j3M3M3K3l0l5J8J04J05M2j2
7533A385n4q1r7r7p5k3NNRQL9L9L9L9J2J1J0J0p7j04o5j3L7L6J4J4k8k7K6K5MMk2k2K6K7N3
7517A092N3N7N8J3J3ooo8o8n5n5OON2N2O5L7Ol9n9o0l6l5QQKKLKL2L2J5k9m9k2M0O6L3Pno
7499A162j3n8p6p7n0n0L0K9N1N2PPL3L3OOm4m5j8j7PQj9j8k8k8j4J3P0J14R9L7JKK3K4l3l3
7483A193ppl2l3l2l3J4J4j3j3n1n1l2J2M6M7NOl7l7j0j1J%%JMLMMj2j2J4J5rqn3n2k8k7k8
$$ y = [959, 922, 937, 953, 959, 965, 971, 977, 1023, 1069, 1116, 1162, 1160, 1157, 1181, 1205, 1234, 1263, 1240, 1216, 1224, 1232, 1239, 1247, 1193, 1139, 1086, 1034, 1049, 1091, 1125, 1106, 1068, 1082, 1151, 1220, 1245, 1269, 1294, 1319, 1338, 1357, 1323, 1290, 1234, 1179, 1176, 1173, 1175, 1178, 1180, 1182, 1169, 1156, 1166, 1229, 1287, 1345, 1319, 1293, 1254, 1216, 1204, 1192, 1190, 1188, 1160, 1132, 1090, 1049, 1060, 1071, 1095, 1119, 1140, 1161, 1134, 1054, 977, 900, 845, 790, 792, 848, 946, 1044, 1119, 1193, 1213, 1232, 1225, 1218, 1211, 1203, 1196, 1189, 1173, 1157, 1141, 1126, 1096, 1067, 1038, 1009, 1035, 1060, 1086, 1111, 1090, 1069, 1048, 1026, 1037, 1048, 1085, 1122, 1143, 1164, 1132, 1101, 1121, 1142, 1163, 1183, 1173, 1162, 1125, 1088, 1013, 939, 923, 960, 989, 1018, 1050, 1082, 1096, 1110, 1097, 1084, 1127, 1170, 1193, 1163, 1128, 1146, 1250, 1355, 1397, 1385, 1331, 1250, 1153, 1056, 981, 958, 963, 968, 977, 985, 1024, 1063, 1102, 1141, 1153, 1164, 1174, 1184, 1107, 1003, 938, 925, 962, 998, 1012, 1026, 998, 971, 997, 1022, 1026, 1030, 1008, 986, 1012, 1039, 1092, 1145, 1202, 1260, 1273, 1286, 1280, 1274, 1206, 1138, 1083, 1028, 1034, 1040, 1092, 1144, 1209, 1246, 1252, 1213, 1154, 1094, 1058, 1023, 1031, 1039, 1041, 1043, 1046, 1048, 1080, 1112, 1127, 1098, 1049, 1027, 1067, 1133, 1166, 1173, 1168, 1162, 1149, 1091, 1015, 938, 888, 838, 868, 897, 948, 1000, 1007, 1014, 1047, 1080, 1086, 1092, 1048, 1003, 985, 968, 975, 983, 964, 946, 918, 890, 876, 889, 959, 1073, 1172, 1209, 1210, 1212, 1235, 1259, 1226, 1193, 1186, 1179, 1147, 1114, 1082, 1049, 1063, 1077, 1064, 1051, 1000, 949, 917, 929, 975, 1022, 1027, 1033, 996, 959, 949, 938, 939, 939, 939, 940, 944, 947, 951, 955, 943, 931, 945, 960, 951, 943, 890, 838, 810, 783, 755]
7465G55k7j4j3L1L1J1J0J1J1L3L4L3L3M3M2M3M2l4l5l4l5ONNOl0l1m1j6K3P6N9L3Jn1n4%J5
7448I77J4qqO5O5L3k0l5l4OPL4L4L5L4J3J2l1l1mmqpj8p1j03j03q0q0j9j9K8K7N4N3K6K6K5
7432H85K6L6L5RJ0KKm2m2j7j7M4M5M8M8l2l1n6n7j2j2N0M9N0N0K0K0k4k4l1l0n7n7j3j4j3
7416H48j3J%J%M7M7M8M7J2J1J2J1qqJ8J9K5K5j9j9qqM5M5J8J8l5l4K0K1K1K1j6j5j6j6m4m5
7400A077m5m5llllrrqrJ7J7J6J7M5M6K7l4r4r5m5m5K4K3K4K4M5M5J0j7k8J6P8P7L3L3k0k0
7383A159m7m6m7m7ooM7M6M3M3j0j0k2k2k2k2m3m2M5M6M2M2M3M2m7m8m7m7PQQQJ0J0J1J0J0
7367A099J1J0J0J4J5J4J4M0L9M0M0rro2o2j03j04n0n1QRQRM4M5M5M4K6K5K2K3l7q1o8m1mM8
7351A021K1K0j0j0j1j0p8p9n5lK8K9L1L1NMMMO2O2J0J0JKJKo0o0l7J6O0O0M1j3J3J3J0Rj6
$$ y = [755, 728, 714, 701, 732, 763, 774, 784, 795, 806, 839, 873, 906, 939, 982, 1024, 1067, 1109, 1075, 1040, 1006, 971, 977, 982, 987, 993, 963, 932, 891, 875, 898, 974, 1033, 1066, 1067, 1016, 962, 962, 977, 991, 983, 975, 1040, 1105, 1138, 1118, 1083, 1049, 1055, 1062, 1096, 1130, 1165, 1199, 1212, 1224, 1193, 1162, 1158, 1154, 1146, 1139, 1121, 1050, 947, 844, 764, 684, 665, 646, 674, 701, 755, 808, 834, 860, 885, 911, 947, 982, 991, 1001, 1003, 1005, 963, 921, 904, 887, 931, 976, 1024, 1072, 1040, 1009, 953, 896, 884, 872, 922, 971, 1021, 1071, 1091, 1111, 1087, 1063, 1032, 1002, 945, 888, 875, 861, 848, 835, 836, 836, 837, 837, 884, 931, 979, 1026, 1038, 1049, 1061, 1072, 1064, 1056, 1074, 1093, 1118, 1143, 1124, 1105, 1097, 1089, 1134, 1179, 1197, 1215, 1180, 1146, 1166, 1187, 1208, 1229, 1213, 1198, 1182, 1166, 1122, 1077, 1032, 987, 984, 981, 978, 975, 966, 957, 949, 940, 957, 974, 990, 1007, 1052, 1098, 1125, 1091, 997, 902, 857, 812, 836, 859, 883, 907, 952, 997, 1007, 990, 962, 978, 1056, 1133, 1166, 1199, 1179, 1159, 1112, 1066, 1019, 972, 966, 960, 1007, 1053, 1096, 1139, 1129, 1119, 1097, 1075, 1053, 1031, 988, 946, 991, 1037, 1079, 1121, 1164, 1206, 1159, 1111, 1064, 1017, 1024, 1032, 1040, 1048, 1058, 1068, 1079, 1089, 1099, 1110, 1120, 1130, 1144, 1159, 1173, 1187, 1227, 1266, 1306, 1346, 1337, 1328, 1266, 1204, 1101, 997, 947, 896, 904, 913, 921, 930, 974, 1019, 1064, 1108, 1134, 1159, 1181, 1204, 1167, 1086, 1018, 977, 973, 1021, 1042, 1062, 1052, 1042, 1031, 1021, 943, 864, 809, 806, 834, 863, 894, 925, 930, 934, 938, 942, 1004, 1066, 1076, 1086, 1087, 1089, 1090, 1092, 1032, 972, 935, 951, 1011, 1071, 1112, 1099, 1112, 1125, 1135, 1144, 1128]
7334A128j5j6j6rqqqL0L0k2k2l3l2K0K1L6L6j4j4J0O2L3L2LLMLn5n6kkK4K3K4K4q0p9p7p6
7317I02p8k6L2L3J0J1J0J0RRRRK4K4K4K4k2k3k3k3MNMNk3k2L0L0O0O0O0O0k3k3k3k3m7m7m7
7300I85m7J1J1J2J1j3j3j3j2MMMNK8K9K8K9K7K8K8K8POk0k0rrn9n8k9K4L5Rk1k0MNj5j4J2
7283A002J2K6K6%jklkkN8N8ONk7k8K6K5qqpqK0K0l2l3QPL3L4J2J2m1m1l0l0l0l1L5L5L1L1
7265A158po1m4j7J6M3Rm5o4l7llKLk1k1J5O9O5O5L9M0J9l5m9k2lK4OPO0O1O5O5k3k3l7l6l7
7248A243l7o8o8m2m1n4n3j%rrrrJ2J1O5O5M8M9mlJ7J7J7J7n6n5lkj8j7m4m4j6j7j7j6J0J1
7231H70J0J0MLLLLMLLj7j7j7j6k8k8k8k8K5K5K6K5M1M2K2l1n1JN7N6M0M0j2j3m1m0J2J2KL
7214I78K9K9K9K9k4k4k5k6K8K7J8J8l4l5m1m0j4j5L8L7L8L7l6l6l6l6j2j2J4J4L0L0Q0P9N3
$$ y = [1128, 1113, 1097, 1081, 1072, 1064, 1056, 1048, 1078, 1108, 1086, 1064, 1031, 999, 1019, 1040, 1076, 1112, 1098, 1084, 1094, 1156, 1189, 1221, 1224, 1227, 1231, 1234, 1179, 1123, 1121, 1119, 1143, 1166, 1190, 1214, 1134, 1055, 978, 902, 824, 798, 830, 863, 873, 884, 894, 904, 913, 922, 931, 940, 964, 988, 1012, 1036, 1014, 991, 968, 945, 949, 954, 958, 963, 940, 918, 948, 978, 1038, 1098, 1158, 1218, 1195, 1172, 1149, 1126, 1079, 1032, 985, 938, 949, 960, 972, 983, 970, 957, 944, 932, 936, 940, 944, 949, 977, 1006, 1034, 1063, 1090, 1118, 1146, 1174, 1181, 1187, 1167, 1147, 1138, 1129, 1070, 1012, 983, 1007, 1042, 1051, 1030, 1010, 1014, 1019, 1004, 990, 1002, 1014, 1040, 1066, 1066, 1065, 1063, 1060, 1058, 1056, 1114, 1172, 1178, 1183, 1156, 1128, 1154, 1179, 1171, 1163, 1156, 1148, 1168, 1188, 1156, 1123, 1131, 1138, 1171, 1205, 1217, 1229, 1188, 1147, 1117, 1087, 1057, 1026, 1061, 1096, 1127, 1158, 1151, 1090, 1046, 1029, 1045, 1088, 1097, 1052, 988, 951, 948, 945, 947, 950, 929, 908, 923, 992, 1057, 1122, 1161, 1201, 1220, 1185, 1136, 1114, 1111, 1135, 1141, 1148, 1208, 1269, 1334, 1399, 1376, 1353, 1316, 1280, 1243, 1206, 1138, 1070, 1028, 987, 933, 880, 879, 879, 870, 861, 852, 843, 855, 866, 931, 996, 1044, 1093, 1089, 1086, 1103, 1120, 1137, 1154, 1098, 1043, 1040, 1038, 1020, 1003, 959, 915, 899, 882, 865, 849, 859, 870, 880, 890, 894, 897, 900, 903, 906, 910, 913, 916, 899, 882, 865, 849, 821, 793, 765, 737, 762, 787, 813, 838, 879, 921, 943, 912, 861, 862, 919, 975, 1015, 1055, 1043, 1030, 989, 949, 961, 973, 975, 978, 1007, 1036, 1065, 1094, 1070, 1046, 1021, 995, 1023, 1050, 1068, 1086, 1052, 1017, 976, 936, 922, 907, 945, 982, 1020, 1057, 1021, 985, 949, 913, 901, 889, 903, 917, 947, 977, 1057, 1136, 1189]
7199A189%k4k3j2j2j3j2J6J6l7l7m5m4k2L1P8P9P6P6L1n7r6r5nnnnJ0J1J0J1L5L5j7j8K4K3
7183A167K3K3KKJKl6l6l6l6RQQRj6j6j6j6K2K3K2K2l8l7l7l7k9k9k9k8J7J7J8J7K7K8K7K7
7166A049J2J2J2J2j6j6j5j6lmM9N0j5j4j4j4l8l8l8l8k2k2MML9L9J7l5l4pJ3L9O0O0M0j3l5
7150A064rK6K6k9k8k9k8m1m1J7P0N9N9L6L6j1j1l8l7k4k4LKK4K4K4K4P2P2M7ol7o4o8m0LL
7134A126NNK6K7K7K7j4j4j4j4k3k4p3p3l5J0L6L6J7j0k0K3L7J2rl5l6l7j1j2OOk0k0K6K7j
7118I84m6n5n5k9J6N8Q5R9R9N1N2K5K5mnm3j6M2Q6P7N0L0Nk0m7n4n5n6n6k8k9k9k9J8J7J7
7103A180J8j9j9k0j9J0RJ0RK7K6K7K6QQo3q8m6jkjj2j2J3l2q5q5l5l5klK6O9J16J17N6J2j0
7086A178j1J4J4L3L3Nl9o3o3j3j3k6k5k3k4J2L8M7Mo4o4j4j4j8j8m5m4OOOOQPQQL3L3Q4Q3
$$ y = [1189, 1189, 1165, 1142, 1130, 1118, 1105, 1093, 1109, 1125, 1088, 1051, 1006, 962, 940, 971, 1049, 1128, 1204, 1280, 1311, 1254, 1158, 1063, 1058, 1053, 1048, 1043, 1053, 1064, 1074, 1085, 1120, 1155, 1138, 1120, 1144, 1167, 1190, 1213, 1215, 1217, 1218, 1220, 1184, 1148, 1112, 1076, 1085, 1093, 1101, 1110, 1094, 1078, 1062, 1046, 1068, 1091, 1113, 1135, 1097, 1060, 1023, 986, 957, 928, 899, 871, 888, 905, 923, 940, 967, 995, 1022, 1049, 1061, 1073, 1085, 1097, 1081, 1065, 1050, 1034, 1031, 1027, 1076, 1126, 1111, 1097, 1083, 1069, 1031, 993, 955, 917, 895, 873, 877, 881, 920, 959, 976, 941, 907, 900, 913, 952, 1012, 1072, 1112, 1099, 1064, 1055, 1081, 1107, 1078, 1050, 1021, 993, 952, 911, 928, 998, 1057, 1116, 1152, 1188, 1177, 1166, 1128, 1091, 1067, 1043, 1046, 1048, 1072, 1096, 1120, 1144, 1216, 1288, 1335, 1329, 1292, 1228, 1160, 1120, 1123, 1126, 1131, 1136, 1162, 1189, 1216, 1243, 1229, 1215, 1201, 1187, 1164, 1140, 1067, 994, 959, 969, 1005, 1041, 1058, 1048, 1028, 1051, 1088, 1100, 1091, 1056, 1020, 983, 972, 960, 966, 972, 952, 932, 958, 985, 984, 938, 883, 828, 799, 815, 873, 958, 1057, 1156, 1207, 1259, 1284, 1309, 1305, 1300, 1257, 1241, 1283, 1369, 1446, 1496, 1526, 1531, 1511, 1464, 1410, 1355, 1299, 1243, 1215, 1186, 1157, 1128, 1146, 1163, 1180, 1198, 1179, 1160, 1140, 1121, 1131, 1140, 1150, 1159, 1186, 1212, 1239, 1265, 1273, 1281, 1218, 1130, 1084, 1083, 1081, 1080, 1068, 1056, 1069, 1037, 952, 867, 832, 797, 795, 792, 818, 887, 1003, 1120, 1176, 1188, 1178, 1167, 1181, 1195, 1228, 1261, 1266, 1227, 1164, 1101, 1088, 1075, 1049, 1024, 1001, 977, 989, 1027, 1074, 1078, 1014, 950, 936, 922, 904, 886, 841, 797, 803, 809, 815, 821, 829, 836, 844, 852, 885, 918, 1002, 1085]
7069A085L9nl4l3k1k1L2L2L6L7J0J1RRN9O0O6K2m0m1j3j3J3J4j0j0o3o3j1j1j1j0k4k3l5r
7054A033M1Q5P7N0J6J6J5J4m7m7p1p0o0j5M8M8J8J7rrk0k0N0P7N0Ok1k0j2j2j3j2POPOn2n3
7037A124k4J9K6K6k5k4m0l9J3J3QRm5m4k3k2J2L9N8J4o6r1p5l0J6M3O4O5M0M0qqn8n8l5QO9
7021I91O9N8J5j4j4J1J1J2J1k9l0k9k9J4J4J4J4MMNMm8m8K3M8K0k5n1n2J6J6J5J6k9k9m1j5
7005I22RN3Q0P9L4j0j1j2J5J4l6l6oL7K7Kk3k3K9K8k1k1k1k1l5l6l5l6KKKKl3l2l2l3k9k9
6989G66K4K4N2N3N0N0Ql6l4RK6N3N3K7nl2j9j8j4j3j3j4j1j2J5J4N0M9llj3j2j3j3J5J5j1
6973A064n6o5l9mmL0L0L0L0K7K6K7K6onoon1n1KKK2K2K2K3L2L2j2j2o3o2l7l6M1M0M1M0K8
6956A122K8K8K8oonoK4K4l7o2k8L5N5K9k3m9n0k4j9j8j6j7K5K4K5K5KKKKk2k2k0K4O0O1K2
$$ y = [1085, 1124, 1119, 1085, 1052, 1031, 1010, 1042, 1074, 1110, 1147, 1157, 1168, 1177, 1186, 1245, 1305, 1371, 1393, 1353, 1312, 1299, 1286, 1299, 1313, 1303, 1293, 1230, 1167, 1156, 1145, 1134, 1124, 1100, 1077, 1042, 1033, 1074, 1159, 1236, 1286, 1302, 1318, 1333, 1347, 1300, 1253, 1182, 1112, 1052, 1037, 1085, 1133, 1151, 1168, 1159, 1150, 1130, 1110, 1160, 1237, 1287, 1293, 1272, 1252, 1240, 1228, 1215, 1203, 1210, 1216, 1223, 1229, 1177, 1124, 1100, 1119, 1145, 1171, 1146, 1122, 1082, 1043, 1056, 1069, 1077, 1086, 1041, 997, 974, 952, 964, 1003, 1061, 1075, 1009, 918, 843, 813, 829, 872, 936, 1001, 1041, 1081, 1073, 1065, 1007, 949, 914, 922, 991, 1060, 1118, 1133, 1119, 1105, 1116, 1127, 1139, 1150, 1121, 1091, 1062, 1033, 1047, 1061, 1075, 1089, 1093, 1097, 1102, 1106, 1058, 1010, 1033, 1081, 1101, 1076, 1025, 973, 989, 1005, 1020, 1036, 1007, 978, 937, 922, 931, 984, 1064, 1143, 1177, 1167, 1156, 1144, 1159, 1173, 1137, 1101, 1095, 1132, 1159, 1161, 1138, 1115, 1144, 1172, 1151, 1130, 1109, 1088, 1053, 1017, 982, 946, 948, 950, 952, 954, 921, 889, 857, 824, 795, 766, 790, 814, 866, 919, 969, 1019, 1027, 991, 957, 966, 992, 1045, 1098, 1125, 1120, 1088, 1069, 1051, 1037, 1024, 1011, 997, 986, 974, 989, 1003, 1053, 1102, 1099, 1096, 1083, 1071, 1058, 1045, 1060, 1075, 1064, 1008, 943, 904, 900, 896, 926, 956, 986, 1016, 1043, 1069, 1096, 1122, 1116, 1111, 1105, 1099, 1048, 997, 999, 1001, 1023, 1045, 1067, 1090, 1122, 1154, 1142, 1130, 1067, 1005, 968, 932, 973, 1013, 1054, 1094, 1122, 1150, 1178, 1206, 1200, 1194, 1189, 1183, 1207, 1231, 1194, 1132, 1104, 1139, 1194, 1223, 1200, 1151, 1101, 1077, 1058, 1040, 1024, 1007, 1032, 1056, 1081, 1106, 1108, 1110, 1112, 1114, 1092, 1070, 1050, 1074, 1134, 1195, 1217]
6940A217l9p0rO7O8L0L0K8K7jm4l5rlmkkl6l6j8K6J8qj5K9M6M6j3j2n5n5n5n5K9L0L0L0k3
6923A152k4k3k3k1k1o2o2j2L1M8M8Ol8n7n8m0m0MLO0O0M0lk6k5kkK2K1K2K2M5M5M2M2K4j9
6907A179m0l9kkk9k9l8l8l7l8QQQRN2N2QQM4M4M4M4qqno%K7J1l3o9o8k8k7m6m5kjK6K6K7K6
6889A013RRRJ0J3J3J4J3J6J5j1j0j5j5K9K9K8K8j7j6j7j7j7j6k6k6k7k6L1L0L1L0j5j6j5j6
6873A052OOOPj2j1J5J5k8k8p2p2l3l3J1J1N5N6N5N6k9k8J5J5K3K2k1k2k7k7k7k7K5K4K4K5
6858A027l1l1l1l2ONM9P4O0jp0j13q0k7J3M0L1L1L3L2M2M1j1j1qpm2o9o1qM9M9J9J8J9J9J0
6842A034J0J0J0j0j0j0j0LKLLoon9n9%JM9N0K9k4m8m7j9k0L2L1O3L6nn8n0k4lK4N8Q4Q7N9
6825A210J8J9J6J7OOk8n5m1J2M8K1l0l1l2l2k5k6k5k6k5k6k5k6K3K2K3K2K2K3K2K2k1k1k2
$$ y = [1217, 1178, 1108, 1099, 1166, 1234, 1264, 1294, 1322, 1349, 1348, 1304, 1269, 1260, 1257, 1253, 1251, 1249, 1213, 1177, 1159, 1185, 1203, 1195, 1180, 1209, 1255, 1301, 1288, 1276, 1221, 1166, 1111, 1056, 1085, 1115, 1145, 1175, 1152, 1128, 1105, 1082, 1061, 1040, 978, 916, 904, 935, 983, 1031, 1037, 999, 942, 884, 844, 804, 808, 811, 871, 931, 971, 968, 942, 917, 915, 913, 935, 956, 978, 1000, 1045, 1090, 1132, 1174, 1198, 1179, 1139, 1100, 1098, 1096, 1067, 1038, 1000, 962, 925, 887, 895, 903, 911, 920, 972, 1024, 1032, 1040, 1084, 1128, 1172, 1216, 1208, 1200, 1195, 1189, 1189, 1216, 1227, 1194, 1125, 1057, 1029, 1002, 956, 911, 909, 908, 934, 960, 987, 1013, 1022, 1031, 1040, 1050, 1063, 1076, 1090, 1103, 1119, 1134, 1123, 1113, 1098, 1083, 1112, 1141, 1169, 1197, 1180, 1164, 1147, 1130, 1113, 1097, 1071, 1045, 1018, 992, 1023, 1053, 1084, 1114, 1099, 1083, 1068, 1052, 1058, 1064, 1070, 1077, 1065, 1054, 1069, 1084, 1056, 1028, 956, 884, 851, 818, 829, 840, 895, 951, 1006, 1062, 1033, 1005, 1020, 1035, 1058, 1080, 1059, 1037, 1010, 983, 956, 929, 954, 978, 1002, 1027, 996, 965, 934, 902, 908, 913, 962, 1036, 1096, 1095, 1025, 912, 832, 805, 818, 858, 889, 920, 953, 985, 1027, 1068, 1057, 1046, 1038, 1031, 989, 920, 859, 851, 900, 949, 968, 986, 1005, 1024, 1034, 1044, 1054, 1064, 1054, 1044, 1034, 1024, 1027, 1029, 1032, 1035, 1029, 1023, 964, 905, 905, 906, 955, 1005, 1034, 1010, 962, 915, 896, 876, 908, 939, 1002, 1038, 1033, 975, 925, 901, 898, 922, 980, 1064, 1151, 1210, 1228, 1247, 1263, 1280, 1286, 1292, 1264, 1209, 1168, 1180, 1228, 1249, 1219, 1188, 1156, 1124, 1099, 1073, 1048, 1022, 997, 971, 946, 920, 943, 965, 988, 1010, 1032, 1055, 1077, 1099, 1078, 1057, 1035]
6810A035k1J%N0N0K8k6m8m8l0l0l0k9K4K5K4K5L1L1N9Pn6q2m8OJ2J3J5J6pppoJ7J7J7J8L0
6793A076L0L0L1K5K6k7k7q3q4n8oL1N8O1L5jjllk1k1j8j8m0J3N4P9P2J9llLKLLk5k5k5k5j2
6776A122j2j3j2L5L6L5L5L1L2k2k1n0n0KLoopoj0rj0rl2l1l1l2KKJKJJKJj7j6L6L7P5P5N2
6758A216jl2l1l5l5J8J7mn6q0n3%K6pl4j7j7nonoN5N5L2k1o1o2pM7N7N8QQK2K3%n3p5p5m7
6740H17OJ8J7K0K1L1L1N4N4L8j6m8m7j3j2J4J4J0J0j6j7opopK1K0K0K1L2L2L2L3J9K0k5k4
6724A161l1l0l1l0k3k2K2K1LLM7M7M9M8MMl8l9o5o5j8j8K5K6lkllJ9J8M5M5N9N9K8k6p6p6
6708A134q0p9n8n7n8n7L4L4O3J1%%llLKO4O5J2J2j5j4j0j0L4L4L2L3m6m7k0k0K4K3N1N0L6
6692A174j7m5m5m9m8J6J7J6J7lmllMMOPJ1N6M4J7J0j7l0l0l3l4J1J1KKm1m2k2k2N7N7N9N8
$$ y = [1035, 1014, 1015, 1015, 1065, 1115, 1143, 1117, 1069, 1021, 991, 961, 931, 902, 926, 951, 975, 1000, 1031, 1062, 1121, 1128, 1072, 990, 942, 948, 960, 973, 988, 1004, 997, 990, 983, 977, 994, 1011, 1028, 1046, 1076, 1106, 1136, 1167, 1192, 1218, 1191, 1164, 1081, 997, 939, 933, 964, 1022, 1083, 1118, 1117, 1116, 1113, 1110, 1089, 1068, 1050, 1032, 992, 1005, 1059, 1138, 1210, 1229, 1226, 1223, 1226, 1228, 1231, 1234, 1209, 1184, 1159, 1134, 1122, 1110, 1097, 1085, 1120, 1156, 1191, 1226, 1257, 1289, 1267, 1246, 1196, 1146, 1148, 1151, 1145, 1139, 1132, 1126, 1116, 1107, 1097, 1088, 1056, 1025, 994, 962, 964, 966, 967, 969, 970, 971, 973, 974, 957, 941, 977, 1014, 1089, 1164, 1216, 1215, 1183, 1152, 1117, 1082, 1100, 1117, 1113, 1057, 977, 924, 924, 950, 943, 909, 892, 875, 870, 864, 859, 853, 908, 963, 995, 974, 913, 851, 844, 891, 948, 1006, 1014, 1022, 1044, 1067, 1067, 1014, 939, 864, 817, 823, 841, 858, 878, 899, 930, 961, 1015, 1069, 1107, 1091, 1043, 996, 983, 971, 985, 999, 1009, 1019, 1003, 986, 980, 973, 967, 960, 981, 1001, 1021, 1042, 1074, 1106, 1138, 1171, 1190, 1210, 1185, 1161, 1130, 1100, 1069, 1039, 1016, 994, 1016, 1037, 1040, 1043, 1090, 1137, 1186, 1234, 1238, 1242, 1204, 1165, 1100, 1035, 1017, 999, 1024, 1050, 1047, 1045, 1042, 1039, 1058, 1076, 1121, 1166, 1225, 1284, 1312, 1286, 1210, 1134, 1054, 975, 917, 860, 802, 745, 779, 813, 876, 887, 887, 887, 884, 881, 884, 886, 950, 1015, 1027, 1039, 1024, 1010, 1000, 990, 1024, 1058, 1090, 1123, 1077, 1030, 1010, 990, 1014, 1037, 1088, 1138, 1174, 1157, 1112, 1067, 1018, 970, 986, 1003, 1019, 1036, 1033, 1029, 1026, 1023, 1027, 1031, 1037, 1044, 1055, 1111, 1155, 1172, 1182, 1165, 1135, 1105, 1072, 1038, 1049, 1060, 1062, 1064, 1023, 981, 959, 937, 994, 1051, 1110, 1168]
6675A168k1k1k2k2L8L8N6K9rn3o3l6j0j1k2k3k3k2llM1O8P2K8rl4k7%K8K7k6k5n3n2k7k8L4
6659I82L4J9J8J8J9L6L7m3m3l8l8OOPOk0k0l3l3l2l1J8M6N5J1l3l2j0rk0k0K4K4J3J2J3J3
6643I62%%%JK6K6K6K5qrn2n3k0k0k0k0k8k9J5M2J0l3m9k2nommMMLMJ9J8M6P3Q1N5K5kk4k3
6624A034k6k5j8j7l3oJ6J6K0K0M3P0P0M3M2M2K9Kj4j3m3o9o2l6PPKk5l7l7l0l0jK6K7K7Rl5
6608I95o0o1l4ql2l2l1l0k0j9K4K5L9L9L9L9M0M0N4K7k7n4n5k9j5j5l6l7l1J4O6O6L0Lqqj0
6592H88j0JK6K8KJ8J9K0K0qqm1o6n3K7R1R2M2kj9j8j0J7K3K4ml0l5l6l7l6%Jj4J2M7M6OOJ2
6575A041L9M8Nk7k7k9k9J3J3J3J3k6k6k5k6J5J5j1j1j5j5L0K9K6K6K5K6L5L5L5L4OOMLj5m2
6559A211n1qJ8J8m1m1m1m1m1m1k4k4K0K0L1L2l0l0onK0K1J8J9O2O3L5L5m3m2p2m6qL6M5J9
$$ y = [1168, 1147, 1126, 1104, 1082, 1120, 1158, 1214, 1243, 1234, 1181, 1118, 1082, 1072, 1061, 1039, 1016, 993, 971, 968, 965, 1006, 1074, 1146, 1174, 1165, 1131, 1104, 1104, 1132, 1159, 1133, 1108, 1055, 1003, 976, 948, 982, 1016, 1035, 1053, 1071, 1090, 1126, 1163, 1120, 1077, 1039, 1001, 1007, 1013, 1020, 1026, 1006, 986, 953, 920, 888, 857, 875, 921, 976, 987, 954, 922, 912, 903, 883, 863, 887, 911, 924, 936, 949, 962, 962, 962, 962, 963, 989, 1015, 1041, 1066, 1058, 1049, 997, 944, 924, 904, 884, 864, 836, 807, 822, 864, 874, 841, 792, 770, 765, 759, 755, 751, 755, 759, 762, 766, 785, 803, 849, 922, 1003, 1058, 1083, 1081, 1057, 1034, 1008, 983, 965, 948, 915, 909, 925, 941, 961, 981, 1024, 1094, 1164, 1207, 1249, 1291, 1320, 1322, 1308, 1295, 1252, 1183, 1121, 1085, 1092, 1099, 1101, 1076, 1039, 1002, 972, 942, 941, 967, 994, 1021, 1030, 995, 935, 874, 840, 832, 800, 768, 737, 707, 687, 668, 692, 717, 756, 795, 834, 873, 913, 953, 1007, 1034, 1007, 953, 898, 869, 854, 839, 803, 766, 735, 749, 815, 881, 911, 914, 906, 898, 888, 878, 879, 905, 933, 935, 953, 972, 992, 1012, 1004, 996, 955, 889, 836, 863, 954, 1046, 1088, 1086, 1067, 1049, 1039, 1056, 1079, 1103, 1099, 1069, 1034, 998, 961, 925, 925, 926, 912, 924, 971, 1017, 1023, 1029, 1041, 1080, 1128, 1133, 1106, 1079, 1050, 1021, 1034, 1047, 1060, 1073, 1047, 1021, 996, 970, 985, 1000, 989, 978, 963, 948, 978, 1007, 1033, 1059, 1084, 1110, 1145, 1180, 1215, 1249, 1255, 1261, 1265, 1268, 1253, 1211, 1160, 1152, 1170, 1188, 1147, 1106, 1065, 1024, 983, 942, 918, 894, 914, 934, 965, 997, 967, 937, 931, 926, 946, 967, 985, 1004, 1066, 1129, 1164, 1199, 1156, 1114, 1042, 996, 988, 1024, 1069, 1088]
6543A088k6n2m0LK1K1J1J0j3j3j7K7M7M6k0k1k1k1lkllONNOK1K1K0K1l6l7l7l6k1k2k1k1l8
6526H55l7n0k3J3N7R5R6L4L4QQJJm3m3J8J9J8J8mmn4n3n1JN7N7L7j6J4J3qqrqnnnnM0M1j2
6508A092j3j5j6j6j5J0J1J0J1l5l5J9J8LLMLn8n9JN2L7L6j2j3J1J1J2J1k8k8k8k7k5k4k5k5
6492H58J6J6O8O9N7N8MNl1l2l1l1p7p6p6p7K0K0K0J9K0K0K0J9M7M6M7M6N9N9N8N9K5K5k8k7
6476A294l6l5l5l6J5J5J4J5nnnnn1n1n0n1ppn6n6k6K7N1N0%JJ%O2O1P3M6k1p4p6k3RQm1m1
6459I49l4l4J8J8O0O0O0O0J5J4l8l7n5n4kkL4L3L4L3k4k4k4k4mnmmJ3J3J3J4j1j1j1j1j0j1
6442A007j0j0RRJ0RmnmmKKKLqpqpMLMMJ6J6J6J7K1K2k8k7QO1O2Qm5m6NMNNm4m4m2J1L4L4q
6422A062pqqmmmnLLk7K6Q3Q3K8k5p5p5k6k5K9K9P9P9N7Nl7o4o0l4k1p3o2o2j0rK4P7Q9O2J1
$$ y = [1088, 1062, 1010, 970, 973, 994, 1015, 1026, 1036, 1023, 1010, 993, 1020, 1067, 1113, 1093, 1072, 1051, 1030, 1027, 1025, 1022, 1019, 1025, 1030, 1035, 1041, 1062, 1083, 1103, 1124, 1088, 1051, 1014, 978, 957, 935, 914, 893, 855, 818, 768, 745, 758, 815, 910, 1006, 1040, 1074, 1082, 1090, 1091, 1092, 1049, 1006, 1024, 1043, 1061, 1079, 1075, 1071, 1017, 964, 913, 914, 971, 1028, 1065, 1049, 1063, 1076, 1068, 1060, 1051, 1043, 1038, 1033, 1028, 1023, 1063, 1104, 1092, 1079, 1064, 1048, 1032, 1017, 1027, 1038, 1048, 1059, 1024, 989, 1008, 1026, 1029, 1032, 1036, 1039, 981, 922, 923, 975, 1012, 1048, 1036, 1023, 1034, 1045, 1057, 1068, 1040, 1012, 984, 957, 932, 908, 883, 858, 874, 890, 958, 1027, 1084, 1142, 1146, 1151, 1120, 1088, 1057, 1026, 949, 873, 797, 720, 740, 760, 780, 799, 819, 839, 859, 878, 925, 971, 1018, 1064, 1123, 1182, 1240, 1299, 1324, 1349, 1321, 1294, 1258, 1223, 1188, 1152, 1167, 1182, 1196, 1211, 1206, 1201, 1196, 1191, 1140, 1089, 1039, 988, 981, 974, 918, 862, 836, 863, 914, 964, 964, 965, 966, 966, 1028, 1089, 1162, 1208, 1187, 1113, 1037, 1014, 1023, 1031, 990, 949, 915, 881, 899, 917, 977, 1037, 1097, 1157, 1172, 1186, 1148, 1111, 1056, 1002, 1000, 998, 1032, 1065, 1099, 1132, 1108, 1084, 1060, 1036, 1032, 1027, 1023, 1019, 1032, 1045, 1058, 1072, 1061, 1050, 1039, 1028, 1018, 1007, 997, 987, 996, 1005, 1015, 1024, 1020, 1015, 1011, 1007, 1009, 1011, 1013, 1016, 1008, 1001, 993, 986, 990, 993, 997, 1001, 1017, 1033, 1049, 1066, 1087, 1109, 1081, 1054, 1062, 1123, 1185, 1193, 1148, 1102, 1107, 1111, 1116, 1121, 1077, 1033, 991, 1002, 1036, 1070, 1062, 1055, 1047, 1039, 1035, 1031, 1027, 1022, 1025, 1028, 1001, 1027, 1110, 1193, 1221, 1196, 1121, 1046, 1020, 995, 1024, 1053, 1132, 1211, 1268, 1273, 1236, 1172, 1112, 1078, 1057, 984, 922, 860, 850, 841, 865, 942, 1031, 1093, 1104]
6405A104J0L6L5M4M4m4m4n2n1L6L6M3M3j0j0onM7M7j1j1l7l8l1l1nn%j%jK5K5k8k8m3m3RR
6388A058j6j6j7j6L3L3L3L3K6K6K7K7oK0L5j8l8l9k4n0p1j8N8Q4N0K4J5J4j8j8m5m4l1l1k8
6373A052k8k6K7K9k5o5l8L3Q6P0J7k3m9m6m6NNO5O5O4O5k3k2k3k3k9l0lmJ2J2m0m1k7k7K6
6357I95K6ppn9o0k5k5K7K8J8J9rqnmK1K2j9j9j9j9J0J0J0J0J7J8P0P0N6N6N6N6k4k4k4k4l2
6340A182l2K1K1%%RL5jn4n5jM4J7n2n3j6j6J8M5O6J3o2q9q0n4m1m1nM7L2PJ4J5J4J3M1M2M1
6324A085M1PQPPJJN0N1J0m2o5o5n9o0l6J6P6P6K7K6nnl1l2j9k0k0k0l2l2l2l2MMj9k0k2L0
6307H59Q9Q8M1M0M1M1K0J9K0K0NNk2k1p0p0j7j7n6n5q1q2m7m7l4K0M9N0N2N3J9J9J8J9M8M7
6292A063kn5o0o1k0k0JJJJJ8J8J8J8popoJKJJM0M1M0M0N0N0NOK0K0K0K0QRn3n3k5k4k2k2q
$$ y = [1104, 1114, 1150, 1185, 1229, 1273, 1229, 1185, 1133, 1082, 1118, 1154, 1197, 1240, 1230, 1220, 1214, 1209, 1256, 1303, 1292, 1281, 1244, 1206, 1175, 1144, 1139, 1134, 1134, 1133, 1133, 1132, 1157, 1182, 1154, 1126, 1083, 1040, 1049, 1058, 1042, 1026, 1009, 993, 1026, 1059, 1092, 1125, 1151, 1177, 1204, 1231, 1225, 1245, 1280, 1262, 1224, 1185, 1161, 1111, 1040, 1022, 1080, 1164, 1214, 1238, 1253, 1267, 1249, 1231, 1186, 1142, 1111, 1080, 1052, 1024, 998, 1025, 1054, 1029, 964, 926, 959, 1045, 1115, 1132, 1109, 1060, 1014, 968, 973, 978, 1043, 1108, 1172, 1237, 1214, 1192, 1169, 1146, 1117, 1087, 1084, 1080, 1092, 1104, 1064, 1023, 996, 969, 995, 1021, 1014, 1007, 948, 888, 863, 838, 865, 893, 911, 930, 921, 913, 908, 904, 925, 947, 928, 909, 890, 871, 881, 891, 901, 911, 928, 946, 1016, 1086, 1142, 1198, 1254, 1310, 1286, 1262, 1238, 1214, 1182, 1150, 1171, 1192, 1192, 1192, 1201, 1236, 1235, 1181, 1126, 1125, 1169, 1186, 1134, 1081, 1065, 1049, 1067, 1112, 1178, 1191, 1129, 1040, 960, 906, 865, 824, 819, 866, 898, 905, 919, 934, 948, 961, 1002, 1044, 1085, 1126, 1133, 1141, 1148, 1155, 1156, 1157, 1207, 1258, 1268, 1226, 1161, 1096, 1037, 977, 941, 957, 1033, 1109, 1136, 1162, 1157, 1152, 1121, 1089, 1070, 1050, 1030, 1010, 978, 946, 914, 882, 886, 890, 871, 851, 829, 859, 948, 1036, 1077, 1117, 1158, 1199, 1219, 1238, 1258, 1278, 1283, 1288, 1266, 1245, 1175, 1105, 1088, 1071, 1015, 960, 879, 797, 750, 703, 669, 689, 738, 788, 840, 893, 912, 931, 949, 968, 1016, 1063, 1061, 1006, 946, 885, 865, 845, 846, 847, 848, 849, 867, 885, 903, 921, 914, 908, 901, 895, 896, 898, 899, 900, 940, 981, 1021, 1061, 1111, 1161, 1166, 1172, 1192, 1212, 1232, 1252, 1260, 1269, 1216, 1163, 1138, 1114, 1092, 1070, 1062]
6273A062M5J4J5j1j0j1j0k7k7k7k7j0rj0j0J9J9k5k4j4j3J3J3l3l2poJ6J6M2M3M3M4M3M4J6
6257A164J6m6m6m2m3m2m3l2l2J2J2N2N1QPj1j1M7M7M7nn2n2n5lK9K9opopM3M4M3M4j0j0k8
6241A106kK1l1p9j05p6k3M2M2OOOPJ5J6M2M2M4M3%%J7J8rrk2k1K2K2llllj1j2qqkN1N1kn8
6223A129n7l0K3rl6m3m4lkM1M2K9K9LLQQQQQRj8j8j2j1J4M1L4j9o3o3k8K6L9M0jkjjL6L7k6
6204A128k5m0m0m0m0popoJ4J5J4J5k3k3k3k3K8K9K8K8MML1L0L3L3j1j1k7k6k7k6j1j1j3j3
6188I55k2m9o3j1L1L0j9j9k0k0k0k0M5M4M5M5J4J4J5J4M3M3M3M4J9J9l4l4k1k1L2L1j1j1j2
6173A119j1k2k2p2p1j1M1J2J2k2k3JN3Q7Q6O7J3k5k5k9k8PQQQm9m9m8m9rrrrkkkkN2N1Q2K9
6155A136j0j0j3j3j6j6j7j6j0j1o3o3J5J5J4J5J0J0J0J0m2m1j9L4P9P9N9Pk9k9k8k9k1L2N5
$$ y = [1062, 1107, 1121, 1136, 1125, 1115, 1104, 1094, 1067, 1040, 1013, 986, 976, 967, 957, 947, 966, 985, 960, 936, 922, 909, 922, 935, 902, 870, 863, 857, 873, 889, 931, 974, 1017, 1061, 1104, 1148, 1164, 1180, 1134, 1088, 1046, 1003, 961, 918, 886, 854, 866, 878, 930, 981, 989, 996, 985, 974, 1021, 1068, 1115, 1110, 1058, 1006, 951, 948, 977, 1006, 1000, 993, 987, 980, 1023, 1067, 1110, 1154, 1144, 1134, 1106, 1104, 1125, 1094, 1015, 910, 834, 811, 853, 895, 901, 907, 913, 920, 935, 951, 993, 1035, 1079, 1122, 1122, 1122, 1139, 1157, 1148, 1139, 1117, 1096, 1118, 1140, 1137, 1134, 1131, 1128, 1117, 1105, 1097, 1089, 1087, 1138, 1189, 1187, 1129, 1072, 1042, 1065, 1056, 1020, 977, 933, 930, 928, 969, 1011, 1040, 1069, 1072, 1075, 1083, 1091, 1099, 1107, 1115, 1124, 1106, 1088, 1076, 1065, 1079, 1120, 1154, 1135, 1072, 1009, 981, 1007, 1046, 1086, 1085, 1083, 1082, 1081, 1117, 1154, 1128, 1103, 1063, 1023, 983, 943, 936, 930, 923, 917, 931, 946, 960, 975, 952, 929, 906, 883, 911, 940, 968, 996, 1000, 1004, 1035, 1065, 1098, 1131, 1120, 1109, 1082, 1056, 1029, 1003, 992, 981, 968, 955, 933, 884, 821, 810, 841, 871, 852, 833, 813, 793, 773, 753, 798, 842, 887, 932, 946, 960, 975, 989, 1032, 1075, 1118, 1162, 1181, 1200, 1166, 1132, 1111, 1090, 1122, 1153, 1142, 1131, 1119, 1108, 1086, 1064, 992, 921, 910, 951, 963, 975, 953, 930, 931, 984, 1071, 1157, 1224, 1237, 1212, 1187, 1158, 1130, 1137, 1145, 1153, 1161, 1112, 1063, 1015, 966, 957, 948, 939, 930, 928, 926, 924, 922, 974, 1025, 1107, 1136, 1126, 1116, 1103, 1090, 1074, 1058, 1041, 1025, 1015, 1004, 941, 878, 893, 908, 922, 937, 947, 957, 967, 977, 935, 894, 875, 909, 988, 1067, 1126, 1133, 1104, 1075, 1047, 1018, 997, 1029, 1084]
6140A084N4K9K8K9K8OOOOl4l4l4l3j7j7j7j7L1L1L2L1j7j8j7j8j7j8j7j8l0l0m5j8%JKLj6
6124I25j5K3M9L7L8J0l3p9q0l0L1M5J9j3j4NL2L1Nl0l0l2l1ook2MOk1j9QL0K9M8K2K6N3N0
6107A065K3j7m4k9k8LL0J4J5mmmmJ6J6L1NJKj%%%kkl5o1o1l4l0k9k6k5K3N0L4L3N8L1opNN
6089A007NNj4j4o5o5n2k5lK4J7J8J9J8J1J0J0J0N2N1J5j1J7M2M2J5llmnL3L3L3L3n1n1n1n1
6072A052k4k4k1k1K0O4O5K0j0j0M0M0k0k0k1k0mmmnk6k6k6k6j%jjJ3J2J3J2LKKKM2M2M2M2
6055A213k1k1k2k1rj0l6l5m2m3J3J2K9N6O4K0k6n2n5k9k4k3k2k1j9k0j9j9k1k2j9K4N3N4L1
6040I18j3k4J9M5M5L5L5L5L5j1j0j0j0llllk1k1NNJ2J3m1m0k6k5K7K7K2K1K1K2j5j5j5j5M
6023A022LMMk7k7k8k7J1J1J1J1J4J4J4J5N1N2K8k4n4n4l2l1k9k9k8k9LMMLRRRRK4K4P7P7O1
$$ y = [1084, 1138, 1167, 1195, 1224, 1252, 1258, 1264, 1270, 1276, 1242, 1208, 1174, 1141, 1124, 1107, 1090, 1073, 1104, 1135, 1167, 1198, 1181, 1163, 1146, 1128, 1111, 1093, 1076, 1058, 1028, 998, 953, 935, 935, 936, 938, 941, 925, 910, 933, 982, 1019, 1057, 1067, 1034, 955, 875, 845, 876, 921, 940, 927, 913, 918, 950, 981, 986, 956, 926, 894, 863, 857, 851, 829, 833, 839, 818, 799, 807, 837, 866, 914, 936, 962, 1015, 1065, 1088, 1071, 1027, 998, 970, 973, 1003, 1017, 1032, 1028, 1024, 1020, 1016, 1032, 1048, 1079, 1084, 1085, 1087, 1086, 1086, 1086, 1086, 1084, 1082, 1047, 986, 925, 891, 861, 832, 806, 781, 804, 854, 888, 921, 979, 1010, 1004, 997, 1002, 1007, 1012, 1017, 1003, 989, 924, 859, 807, 782, 779, 803, 820, 838, 857, 875, 886, 896, 906, 916, 968, 1019, 1034, 1023, 1040, 1082, 1124, 1139, 1136, 1133, 1129, 1124, 1157, 1190, 1223, 1256, 1205, 1154, 1103, 1052, 1028, 1004, 983, 962, 982, 1046, 1111, 1131, 1121, 1111, 1151, 1191, 1171, 1151, 1130, 1110, 1106, 1102, 1098, 1093, 1067, 1041, 1015, 989, 988, 988, 987, 986, 999, 1011, 1024, 1036, 1039, 1041, 1043, 1045, 1087, 1129, 1171, 1213, 1192, 1171, 1149, 1128, 1119, 1109, 1073, 1038, 996, 953, 966, 978, 1007, 1063, 1127, 1147, 1121, 1069, 1014, 985, 961, 938, 916, 895, 876, 856, 837, 818, 797, 775, 756, 780, 833, 887, 918, 905, 881, 900, 945, 990, 1025, 1060, 1095, 1130, 1119, 1109, 1099, 1089, 1086, 1083, 1080, 1077, 1056, 1035, 1040, 1045, 1057, 1070, 1029, 989, 963, 938, 965, 992, 1014, 1035, 1056, 1078, 1063, 1048, 1033, 1018, 1022, 1025, 1029, 1033, 1006, 979, 951, 924, 935, 946, 957, 968, 982, 996, 1010, 1025, 1076, 1128, 1156, 1132, 1078, 1024, 992, 961, 932, 903, 875, 846, 849, 853, 857, 860, 869, 878, 887, 896, 920, 944, 1021, 1098, 1159]
6006A159O2L8j4n1n0k7k7j0rj0j0J4J4J4J3L3L2L3L2J7J7l6l5m3m3J0J1K3K3k9l0k1k0K8K9
5991A137M4ro7o7k4k3k4k3l7l6J6J6j0rj0j0OPPOM0L9O9J7j1j1j5j4L1L1L1L1L4L4L5L4OO
5974A277m7m7l4l3J9J9OPOPk1k1k1k2l4l4l4l4J5J4J4J4K4K3K2K1k4n1o1j6K8K8L1L2L6L7
5959A146j6j6n1n1n1n1j6j7j7j7J5J4J5J4nnnoM6M5M5M5K4K3o5o4o4o5K6K5M3P0P6L3l3p8
5943A012p0m4k7k8K7K7K0J9K0J9K4K4k9k8mmmmRQQQj1j2j2j2N2N2N2N2k2k2k3k2M5M5qql2
5926A097l1k9k8%M4L4Pk7k7jM4P0P1M5Kj3j2j5j6j8j9j8j9j8j8j8j8j1j0j1j0j5j4o3o4JO3
5910I35P7P8K4k9JKJJJJLLLLOOPOk7k8K5K5M7M6M3M2J1m2j2j2l1l1l1l1l7l7l7l6L2L2L3L2
5892A105K0J9l4l3o7o6j4j4K2K2K2K2J4J4J4J5nmmmk4k4k5k4m0m1m1m1NNNOK4K4N4Jj5j4L5
$$ y = [1159, 1221, 1259, 1245, 1194, 1144, 1117, 1090, 1080, 1071, 1061, 1051, 1065, 1079, 1093, 1106, 1139, 1171, 1204, 1236, 1253, 1270, 1234, 1199, 1156, 1113, 1123, 1134, 1157, 1180, 1151, 1121, 1100, 1080, 1108, 1137, 1181, 1172, 1105, 1038, 1014, 991, 967, 944, 907, 871, 887, 903, 893, 884, 874, 864, 870, 877, 884, 890, 930, 969, 1038, 1055, 1044, 1033, 1018, 1004, 1035, 1066, 1097, 1128, 1162, 1196, 1231, 1265, 1271, 1277, 1230, 1183, 1149, 1116, 1135, 1154, 1160, 1167, 1173, 1180, 1159, 1138, 1117, 1095, 1061, 1027, 993, 959, 974, 988, 1002, 1016, 1040, 1063, 1085, 1106, 1082, 1031, 970, 954, 982, 1010, 1041, 1073, 1109, 1146, 1130, 1114, 1063, 1012, 961, 910, 894, 877, 860, 843, 858, 872, 887, 901, 896, 891, 886, 880, 926, 971, 1016, 1061, 1085, 1108, 1043, 979, 915, 850, 876, 901, 944, 1014, 1090, 1123, 1090, 1012, 942, 898, 871, 843, 870, 897, 917, 936, 956, 975, 999, 1023, 994, 966, 962, 958, 954, 950, 959, 967, 975, 983, 972, 960, 948, 936, 988, 1040, 1092, 1144, 1122, 1100, 1077, 1055, 1100, 1145, 1137, 1129, 1097, 1066, 1037, 1009, 1009, 1053, 1087, 1094, 1067, 1040, 1039, 1083, 1153, 1224, 1269, 1271, 1258, 1246, 1231, 1215, 1197, 1178, 1160, 1141, 1123, 1105, 1087, 1069, 1058, 1048, 1037, 1027, 1012, 998, 935, 871, 872, 935, 1012, 1090, 1114, 1085, 1086, 1088, 1089, 1090, 1091, 1092, 1095, 1098, 1101, 1104, 1110, 1116, 1123, 1129, 1102, 1074, 1099, 1124, 1171, 1217, 1260, 1302, 1313, 1271, 1259, 1247, 1216, 1185, 1154, 1123, 1086, 1049, 1012, 976, 1008, 1040, 1073, 1105, 1125, 1144, 1110, 1077, 1010, 944, 930, 916, 938, 960, 982, 1004, 1018, 1032, 1046, 1061, 1056, 1052, 1048, 1044, 1020, 996, 971, 947, 907, 866, 825, 784, 789, 794, 799, 805, 829, 853, 907, 908, 893, 879, 914]
5875I14L6j1j1j1j1N2N2N2N2ppqp%j%jl5l5l5l5j3j3M0L9O1O1RQk7k7k7k7J4J3J4J3k0j9L3
5858A075L3M1M0J8l5p6p6n6lOOJ0Rj7j7j7j7ppM6M6O5O6k3k2l7l7l8l7j0j0rj0K5K5K5K5N
5841A005Nm8m7p3p2j5L9Q1Q2O1Rrrj3j2l8l7j4L9O2O3L9M0N4N4N2N1j9p1r2r1m4Rk1k0pqp
5825I78p%j%jLLMLk0k0L3L3j0j1j0j0poppK3K4K4K3QQRQkkkjrqrqrrrrK4K5K4K4PQQPl4l4
5803A049l4l4j5j5j6j5j5j5j6j5L5L5L5L5ppopj9j8j9j9l3l4l6J6P6P6K7K6poo0o0J4J4J4
5786I24J3j2j3rrqM6J04J03N2N2M9M9K8k5q0q0kN2L6J0k4k4k6k5n1n1n1n1j8j7L6L5KJN4N5
5770A125K2K3l0l0n4n4l4J9K7k5l4qJ0RPQPm5o8o8j8j8L5L5N3N3l6l5k6k6J%N4N4N4N4k5k6
5754I90k2k3J9P1N3K6j3o6m1J2L8L7j2j2L6L6L6L5k6k6p8p9o4o5j2j1J0J0L6Q1R4O8j1n4o3
$$ y = [914, 950, 939, 928, 917, 906, 958, 1010, 1062, 1114, 1107, 1100, 1092, 1085, 1085, 1084, 1084, 1083, 1048, 1013, 978, 943, 930, 917, 957, 996, 1057, 1118, 1127, 1135, 1108, 1081, 1054, 1027, 1041, 1054, 1068, 1081, 1061, 1042, 1075, 1108, 1149, 1189, 1207, 1172, 1096, 1020, 964, 961, 967, 973, 983, 992, 975, 958, 941, 924, 917, 910, 956, 1002, 1067, 1133, 1110, 1088, 1051, 1014, 976, 939, 929, 919, 910, 900, 925, 950, 975, 1000, 1005, 1010, 962, 915, 842, 770, 755, 794, 875, 957, 1018, 1027, 1018, 1009, 996, 984, 946, 909, 895, 934, 996, 1059, 1098, 1138, 1192, 1246, 1298, 1349, 1330, 1259, 1167, 1076, 1032, 1041, 1020, 1000, 993, 985, 978, 971, 971, 970, 970, 969, 972, 975, 979, 982, 962, 942, 975, 1008, 998, 987, 977, 967, 960, 954, 947, 940, 963, 987, 1011, 1034, 1042, 1050, 1059, 1067, 1065, 1063, 1061, 1060, 1051, 1043, 1034, 1026, 1017, 1008, 999, 990, 1014, 1039, 1063, 1087, 1094, 1102, 1110, 1117, 1083, 1049, 1015, 981, 966, 951, 935, 920, 905, 890, 874, 859, 894, 929, 964, 999, 992, 985, 979, 972, 953, 935, 916, 897, 864, 830, 794, 810, 886, 962, 989, 1015, 1008, 1002, 942, 882, 896, 910, 924, 937, 925, 912, 903, 894, 886, 932, 1036, 1139, 1191, 1243, 1292, 1341, 1369, 1344, 1264, 1184, 1182, 1234, 1270, 1280, 1256, 1232, 1206, 1181, 1130, 1079, 1028, 977, 959, 942, 978, 1013, 1015, 1016, 1070, 1125, 1147, 1170, 1140, 1110, 1056, 1002, 968, 987, 1014, 989, 955, 947, 957, 966, 973, 981, 988, 943, 875, 807, 789, 771, 806, 841, 894, 947, 911, 876, 850, 824, 825, 825, 879, 933, 987, 1041, 1016, 990, 968, 945, 964, 1035, 1088, 1114, 1101, 1035, 994, 1006, 1044, 1081, 1069, 1057, 1093, 1129, 1165, 1200, 1174, 1148, 1070, 991, 927, 862, 850, 839, 849, 859, 895, 976, 1070, 1138, 1127, 1073, 1010]
5739A010k0ONm7m8m4jM6P1O0O0L2L3OP%Jl5o1n3rJ8J8m7m7m7m7LLKLJJ%JM7M7M7M7j9j8j9
5721A013j8J5J6J6J5j2j2o5o4m7m7k0k0J0J0O3O2K5K4j1l7k5J9M6M6MLL1L0M9N0llk9k8kM2
5705A146O0L5k1m8k7k8k9l0LKLKj2j2l9l9k1k1L2L1K5K4K5K4rrrj0POOOJ4J3J3J4l7l8l7l7
5687I78mnmmn1n0k8K6K2K1K5K6K6K7k6k6JKK7K8J5J5j1j2m5m5j8j9PPPPJ0J1J0J1rrj0rL9
5669I63L8L8L9N9O0PPk6k6n2n2mnk7k8kN0M7M7M6M5ro1m9LK4K4J0J1po0m1M8P7K4j8j8j9j8
5653A145j4L8R7R7L6L5L5L6O1O0O5O4J48K00J07n1r4nJ03J03J79L37M86O09R83J668J930J069
5640I527n58j737j785j134o53n30m27j98p2j24j28nO8k0j21j22n1n1n1n2m2m2m2m2l9l9l9
5629A491l9J2J2L2Q5R4M1j9p2j42j41j45r2m1J2L9L8J8J8rql3l2l2l2KKLKJ6J6l4l4l5J7M1
$$ y = [1010, 990, 996, 1001, 954, 906, 862, 861, 907, 978, 1038, 1098, 1130, 1163, 1169, 1176, 1176, 1177, 1142, 1081, 1028, 1019, 1037, 1055, 1008, 961, 914, 867, 870, 873, 875, 878, 879, 880, 880, 881, 928, 975, 1022, 1069, 1050, 1032, 1013, 995, 1010, 1026, 1042, 1057, 1045, 1033, 968, 904, 857, 810, 790, 770, 780, 790, 853, 915, 940, 964, 953, 916, 891, 910, 956, 1002, 1006, 1009, 1040, 1070, 1119, 1169, 1166, 1163, 1134, 1106, 1104, 1146, 1206, 1241, 1220, 1172, 1145, 1117, 1088, 1058, 1061, 1063, 1066, 1068, 1056, 1044, 1005, 966, 945, 924, 956, 987, 1012, 1036, 1061, 1085, 1076, 1067, 1058, 1048, 1055, 1061, 1067, 1073, 1087, 1100, 1113, 1127, 1090, 1052, 1015, 978, 974, 969, 965, 961, 910, 860, 832, 858, 880, 901, 926, 952, 978, 1005, 979, 953, 954, 956, 983, 1011, 1026, 1041, 1030, 1018, 973, 928, 910, 891, 898, 905, 912, 919, 929, 940, 950, 961, 952, 943, 933, 924, 963, 1001, 1039, 1078, 1137, 1197, 1204, 1211, 1185, 1159, 1107, 1055, 1051, 1046, 1019, 991, 989, 1039, 1086, 1133, 1179, 1224, 1215, 1154, 1105, 1108, 1132, 1156, 1166, 1177, 1170, 1110, 1069, 1117, 1194, 1218, 1200, 1182, 1163, 1145, 1131, 1169, 1266, 1363, 1399, 1434, 1469, 1505, 1566, 1626, 1691, 1755, 1903, 2103, 2210, 2159, 2065, 2060, 2163, 2266, 2445, 2782, 3268, 3877, 4860, 6528, 8458, 9527, 8969, 7232, 5447, 4313, 3660, 3130, 2703, 2505, 2433, 2309, 2181, 2176, 2244, 2224, 2103, 1981, 1930, 1879, 1828, 1776, 1734, 1692, 1650, 1608, 1569, 1530, 1491, 1452, 1464, 1476, 1508, 1593, 1687, 1728, 1709, 1637, 1495, 1354, 1209, 1117, 1076, 1088, 1127, 1165, 1183, 1201, 1192, 1184, 1151, 1119, 1087, 1055, 1057, 1059, 1062, 1064, 1080, 1096, 1062, 1028, 993, 1010, 1051]
5613A051M0K2K2J9J9kn5k6k5k5k5k5k6lmn7n6l3l2rM3R2R1M3M2RRm3m4l6l6J7J6K6K5K6K5
5597A075J3J3J3J3ppopk1k1k1k1J4J4J4J4J9J9M2M2M9lk7k7KJJKl2l2j2M1L3k1m0m0%%J%R
5579A099QRQj1j1j2j1NONNmln7n6l5l6J8J7J3J3J3J3mlllk8k7kjL4L5j8j8kkkkj5j5j6j5J7
5560I06J8J7J8k3k3k3k2M5M5M6M5J7J8J7J8J0J1J1J1j9j9k0j9j2j3j2j3L5L5L5L5m2m1o8o8
5545I56qpM4M5N3N3J%n8n8l0J4N5N5mm8m1j5nmNL2M1kl8l8m0m1J4J5J4J4K2K1K0K0j0l5k1
5528I91K3N5K9poL9L9j3j4k7k7%jJJJJOPOOm0m0m0m0L3L4L3L3M6M6M6M6j0j0n4n4p4p3k1K3
5510I94N2K6j%K8K8j6j6j9j9j6j6RN2N1Pl2n9o0l3mK3RJ0J0J0l4l4n9n9KLL1L2L2L2J6J5J6
5493A011J6K4K3K4K3j4j4j4j4k1k1k2k1K9L0K9K9l8l7l8l8m6m7p0p0k3K2N9Q6P7N0OOL9L9
$$ y = [1051, 1091, 1113, 1135, 1154, 1173, 1171, 1116, 1090, 1065, 1040, 1015, 990, 964, 961, 957, 900, 844, 811, 779, 770, 813, 905, 996, 1039, 1081, 1090, 1099, 1056, 1012, 976, 940, 957, 973, 999, 1024, 1050, 1075, 1088, 1101, 1114, 1127, 1120, 1113, 1107, 1100, 1079, 1058, 1037, 1016, 1030, 1044, 1058, 1072, 1091, 1110, 1152, 1194, 1243, 1240, 1213, 1186, 1188, 1189, 1190, 1192, 1160, 1128, 1116, 1157, 1190, 1169, 1129, 1089, 1089, 1089, 1090, 1090, 1099, 1107, 1116, 1124, 1113, 1102, 1090, 1079, 1084, 1090, 1095, 1100, 1096, 1093, 1036, 980, 945, 909, 927, 944, 957, 970, 983, 996, 992, 989, 986, 983, 955, 928, 926, 925, 959, 994, 976, 958, 956, 954, 952, 950, 935, 920, 904, 889, 906, 924, 941, 959, 936, 913, 890, 868, 913, 958, 1004, 1049, 1066, 1084, 1101, 1119, 1129, 1140, 1151, 1162, 1143, 1124, 1104, 1085, 1073, 1060, 1048, 1035, 1070, 1105, 1140, 1175, 1133, 1092, 1024, 956, 948, 941, 985, 1030, 1083, 1136, 1137, 1137, 1079, 1021, 991, 1005, 1060, 1115, 1111, 1063, 1022, 1007, 1002, 998, 1003, 1035, 1076, 1074, 1036, 998, 958, 917, 931, 946, 960, 974, 996, 1017, 1037, 1057, 1047, 1012, 991, 1014, 1069, 1098, 1091, 1085, 1124, 1163, 1150, 1136, 1109, 1082, 1082, 1081, 1082, 1083, 1084, 1085, 1091, 1098, 1104, 1110, 1070, 1030, 990, 950, 983, 1017, 1050, 1083, 1129, 1175, 1221, 1267, 1257, 1247, 1193, 1139, 1065, 992, 971, 994, 1046, 1072, 1071, 1071, 1099, 1127, 1111, 1095, 1076, 1057, 1041, 1025, 1034, 1086, 1137, 1144, 1112, 1053, 993, 960, 956, 979, 988, 998, 1008, 1018, 984, 950, 891, 832, 834, 837, 868, 900, 932, 964, 980, 995, 1011, 1027, 1051, 1074, 1098, 1121, 1107, 1093, 1079, 1065, 1044, 1023, 1001, 980, 1009, 1039, 1068, 1097, 1059, 1022, 984, 946, 900, 853, 783, 713, 690, 712, 771, 857, 934, 984, 990, 996, 1035, 1074]
5478A074L9L9k4k4k4k4MMMMj7j8j7j8jjk7k8k3k3N6Q3O7K3j3j2J0J1J0J0MLMLl3l4n8n7l4
5461I42J0K9L0poK0K0K1K1m1m0l3l2K9K9J1J1J1J1M0M0mnoopoj3j2K9K8j3n7p4p4o5k0M9J11
5444I71J02N9Nk1kkmml0l1J4L9M0nn8n7n6n6j9K4O5O5L1j3k2k2k5k5m5m5jjK2K3M8M9K8K9
5428A070j6j6j4j3j4j4l5l5J7O0Q2L8j4j3M3M4M4M4L8L7L7L8J7J8J7J8j8j9j8j8o0o0o0o0
5413A165l0l0l0k9K0K1K1K1K4K4K4K4J4J3l1l0n1n1k5k4nnnmononJ3J3j3j4m5m4J6J7L1L1
5397A004L0L1l9l9l9l9J6J5J6J6kklkkkklJ0J0RJ0L8L8O1O1L6j8l1l2k2k2m5m6KN4K5K4kk
5379A112klK1K1K2K1j7j6M2M2Qm6n9o0n7n7j3j4mnK2K2L0L0L0L1NOn2n3n5lL0K9L6L7RJ0k2
5363A078k2NMj4j3J2J3RJ0j7j7j1j1J6J5k6k7%jKKJKLLKKmk9k8kM3O9P0M4ooPk0l3l3l5l4
$$ y = [1074, 1113, 1152, 1128, 1104, 1080, 1056, 1060, 1064, 1068, 1072, 1055, 1037, 1020, 1002, 1001, 1000, 973, 945, 922, 899, 955, 1038, 1105, 1128, 1115, 1103, 1113, 1124, 1134, 1144, 1148, 1151, 1155, 1158, 1125, 1091, 1033, 976, 942, 952, 981, 1011, 1004, 998, 1018, 1038, 1059, 1080, 1039, 999, 966, 934, 963, 992, 1003, 1014, 1025, 1036, 1076, 1116, 1112, 1107, 1101, 1095, 1088, 1082, 1069, 1057, 1086, 1114, 1101, 1044, 970, 896, 831, 811, 860, 971, 1073, 1132, 1137, 1116, 1114, 1112, 1108, 1104, 1074, 1043, 1057, 1096, 1136, 1131, 1073, 1016, 960, 904, 885, 909, 974, 1039, 1070, 1057, 1035, 1013, 988, 963, 918, 873, 872, 871, 893, 916, 964, 1013, 1041, 1070, 1054, 1038, 1024, 1011, 997, 983, 948, 913, 930, 990, 1072, 1110, 1096, 1083, 1126, 1170, 1214, 1258, 1296, 1333, 1370, 1408, 1425, 1443, 1460, 1478, 1460, 1441, 1423, 1405, 1345, 1285, 1225, 1165, 1135, 1105, 1075, 1046, 1066, 1087, 1108, 1129, 1153, 1177, 1201, 1225, 1239, 1252, 1221, 1191, 1140, 1089, 1064, 1040, 1035, 1030, 1025, 1021, 1015, 1010, 1004, 999, 1012, 1025, 1012, 998, 953, 909, 925, 942, 973, 1004, 1034, 1065, 1026, 987, 948, 909, 925, 940, 956, 972, 970, 968, 965, 963, 961, 959, 957, 954, 964, 974, 983, 993, 1031, 1069, 1130, 1191, 1227, 1209, 1178, 1146, 1124, 1102, 1057, 1011, 1013, 1067, 1092, 1116, 1114, 1112, 1110, 1107, 1128, 1149, 1171, 1192, 1175, 1159, 1201, 1243, 1251, 1205, 1146, 1086, 1029, 972, 959, 945, 941, 936, 958, 980, 1010, 1040, 1070, 1101, 1106, 1112, 1060, 1007, 952, 949, 979, 1008, 1044, 1081, 1090, 1100, 1078, 1056, 1061, 1065, 1051, 1038, 1050, 1063, 1072, 1082, 1065, 1048, 1037, 1026, 1042, 1057, 1031, 1004, 1004, 1003, 1005, 1007, 1008, 1010, 1013, 1016, 1018, 1020, 1016, 987, 959, 957, 1000, 1069, 1139, 1183, 1177, 1171, 1178, 1158, 1125, 1092, 1057, 1023]
5344A023j3j2j1j1j9QN3N3K6%kK5M7K1rl6m0m0n1p8p9n2k1MJ3J3K7N2O4O5O4O4L5RK4K4l1
5328A209l2j9Pmlm5m5o3o3j8Qj8m5m3j6J9J8K0K1jjQL4K1k3m1m0nnj9OL8L9N4K8k4k5m1j5
5311H76K4K4M0J4MMj2J4J4J5J6J6nok0PM1M2kk9j4J2K1K2L7L8K6jL4L4L3L2k8k8k8k9LKk4
5294A219k4o5o5k1k1RRRRj7j7o1o1l6l5K6K6M6M6M3M2J4m0rj0RJ0RRJ8J9J9J9j9j9m5m5l1
5278I69l1M5M4M3j0m2m3J6J6M2M3K2K2l9l9l4l5lN0Q0P9N1lm5m6m9m9k0k0N5N6O3J0n3n4m3
5262A048J0M2M2J9J9k6k5k7k6%%K0K0poLLK7K6K3l1p6p7k6K7M1M1J5J5m3m3m5QJ1m1q5l2M9
5246H93N0onnnM6M5M6M6j2j1j2j1k6k6k6k6nnJ8J8K6k7n9n9J3J4j3j3k6k6J8J7J7J6J6J6j5
5229H96j4K9K9K3K4mlO0O1J6J6%j%%J9K0M9mj3j4j7j7k2k2k2k2LKLLk1k0K4K3K9K9KKm9m9
$$ y = [1023, 1010, 998, 987, 976, 957, 965, 1018, 1071, 1097, 1097, 1095, 1120, 1167, 1188, 1179, 1143, 1103, 1063, 1012, 934, 855, 803, 782, 786, 799, 812, 839, 891, 955, 1020, 1084, 1148, 1183, 1192, 1216, 1240, 1209, 1177, 1158, 1165, 1161, 1158, 1113, 1068, 1005, 942, 924, 932, 914, 869, 826, 810, 829, 847, 867, 888, 887, 886, 894, 928, 949, 926, 885, 845, 840, 835, 816, 822, 860, 899, 953, 981, 957, 932, 891, 876, 900, 924, 964, 978, 982, 986, 974, 988, 1002, 1017, 1033, 1049, 1044, 1038, 1018, 1025, 1066, 1108, 1106, 1077, 1063, 1075, 1096, 1118, 1155, 1193, 1219, 1218, 1252, 1286, 1319, 1351, 1323, 1295, 1267, 1238, 1241, 1243, 1219, 1195, 1130, 1065, 1044, 1023, 1032, 1041, 1050, 1059, 1042, 1025, 964, 903, 867, 832, 858, 884, 930, 976, 1019, 1061, 1075, 1035, 1026, 1016, 1025, 1035, 1044, 1053, 1071, 1090, 1109, 1128, 1109, 1090, 1045, 1000, 969, 938, 983, 1027, 1070, 1060, 1018, 975, 991, 1007, 1049, 1092, 1114, 1136, 1097, 1058, 1024, 989, 986, 1036, 1116, 1195, 1246, 1243, 1198, 1152, 1103, 1054, 1034, 1014, 1069, 1125, 1188, 1198, 1145, 1091, 1048, 1058, 1100, 1142, 1161, 1180, 1154, 1129, 1102, 1076, 1076, 1076, 1096, 1116, 1109, 1103, 1106, 1109, 1136, 1162, 1185, 1154, 1078, 1001, 975, 1002, 1043, 1084, 1099, 1114, 1071, 1028, 983, 991, 1002, 961, 876, 844, 893, 943, 937, 932, 927, 922, 968, 1013, 1059, 1105, 1093, 1082, 1070, 1059, 1033, 1007, 981, 955, 950, 945, 963, 981, 1007, 980, 921, 862, 875, 889, 876, 863, 837, 811, 829, 846, 863, 879, 895, 911, 896, 882, 911, 940, 963, 987, 983, 980, 1040, 1101, 1117, 1133, 1133, 1132, 1132, 1132, 1151, 1171, 1220, 1216, 1203, 1189, 1172, 1155, 1133, 1111, 1089, 1067, 1070, 1072, 1075, 1078, 1057, 1037, 1061, 1084, 1113, 1142, 1144, 1146, 1097, 1048]
5211A048k3k3QQj8j8lkK4K4LMk4k3l1l1J3J4QRRQL7L6L6L7L8L9K4k9m9m9rqk2k2L9L9K7K6
5194A174K7K7m9m8m8m8o3o2j4M0L7L8J4J4K4K4K1K1pn9l0k9JJK7K8K0K1l3l2k9k8k9k9L4L4
5178I90L4L4K9K9K9K9l4l4l4l4l1l2K1K1J4J3J4J4QRRRL8L8n0n0l9l9j2j2j8j7L5L6L6L6j7
5162A072j6m7m7k0k0L4L4L4L5NOk1k1j6j7L6L7O5O5J3J2l6l6l6l7m3m4k1L2L5L6L9L9%%n2
5147A099n2p7p7n3jK9K9L2L2POPOK9K8K9K9k7k8k7k7K8K8k5k5m3m4J0RM9M9lmj5j5L9L8J2
5130A081J3m0m0MMLMooooJ9J9J9J9k1k1k0k1K1K1K2K1k8k7kjK6K7ql4l2K9P9P8Pl7k7jJ0R
5112A151J1J1k7k8k7k8l2l3ook0j9L2L3L6L7j7j7o4o4l8l8K8K9N5N5L3L3OPk2k1nN7Q9O3J8
5096A272k5k5k4k8k7l0l0l0l1L0L0LLJ3J2k2m9l9NL2L2j6j7j6j6l3l3K0K0K9K8pl3j2L2N8
$$ y = [1048, 1025, 1002, 1010, 1018, 1000, 982, 979, 977, 1001, 1025, 1028, 1032, 1008, 985, 954, 923, 936, 950, 958, 967, 976, 984, 1021, 1057, 1093, 1130, 1168, 1207, 1231, 1202, 1153, 1104, 1095, 1087, 1065, 1043, 1082, 1121, 1148, 1174, 1201, 1228, 1179, 1131, 1083, 1035, 972, 910, 896, 936, 973, 1011, 1025, 1039, 1063, 1087, 1108, 1129, 1122, 1063, 1033, 1004, 1005, 1006, 1033, 1061, 1081, 1102, 1069, 1037, 1008, 980, 951, 922, 956, 990, 1024, 1058, 1087, 1116, 1145, 1174, 1140, 1106, 1072, 1038, 1007, 975, 996, 1017, 1031, 1044, 1058, 1072, 1080, 1089, 1098, 1107, 1145, 1183, 1133, 1083, 1044, 1005, 993, 981, 963, 946, 981, 1017, 1053, 1089, 1072, 1056, 1009, 962, 942, 922, 956, 990, 1024, 1059, 1064, 1070, 1049, 1028, 1012, 995, 1031, 1068, 1133, 1198, 1211, 1223, 1187, 1151, 1115, 1078, 1035, 991, 970, 1002, 1037, 1073, 1112, 1151, 1151, 1151, 1099, 1047, 970, 893, 840, 839, 868, 897, 929, 961, 968, 974, 981, 987, 1016, 1044, 1073, 1102, 1075, 1047, 1020, 993, 1021, 1049, 1024, 999, 956, 912, 922, 931, 980, 1029, 1026, 1022, 1007, 992, 1031, 1069, 1081, 1094, 1054, 1014, 1018, 1022, 1025, 1029, 1023, 1017, 1011, 1005, 1024, 1043, 1062, 1081, 1060, 1039, 1019, 998, 1019, 1040, 1062, 1083, 1055, 1028, 1026, 1025, 1051, 1078, 1070, 1036, 1004, 1033, 1112, 1190, 1197, 1160, 1133, 1132, 1142, 1151, 1162, 1173, 1146, 1118, 1091, 1063, 1031, 998, 992, 986, 966, 947, 979, 1012, 1048, 1085, 1068, 1051, 987, 923, 885, 847, 875, 904, 959, 1014, 1047, 1080, 1086, 1093, 1071, 1050, 1045, 1102, 1191, 1254, 1272, 1247, 1222, 1198, 1170, 1143, 1113, 1083, 1053, 1022, 1052, 1082, 1085, 1088, 1101, 1113, 1091, 1042, 1003, 1008, 1040, 1072, 1056, 1039, 1023, 1007, 974, 941, 961, 981, 1010, 1038, 1031, 998, 986, 1018, 1076]
5081A076N9M0M1j3j2l4l3qpj3j3j3j3k3k2k3k2qrqqq0p9qQ0J07Q0Rm4m0j5K3P5N4Kj9j8MM
5064A069L8O5O8J6k6n3l9l9m0m1llmlL6L5L5L5J2J2m1m1NOONj9j9QPL3L3J0m2n5n5noPPOP
5046A027nnM7M8N2N2j8m4l2K1J6J5rj0J7J7JJJJl4l5l5l4k2k2k2k2n3n4%jL3L3POLKN3N2L6
5028A084j6m0l9%JN3N4K5K5kjk6k6n2n3qpJ8J9L2L2OOj6j5j6j6J1J1J2J1jjjjk5k6K7K8NO
5010A078k1k1j9j9PQK7K8JJKJJKo2o1l3J1O9O9J9J9ooK1K1J5J6l7l7n4n4jjOOPOrj0M3M3J2
4991A088J3j2j2K7N3O2J9j2j2K1M6L2j2l8l8j9j9p1p0n9l4J4N8N8L2K4K3K2K2mm8o4l8llo
4976A040opoJ9J8J9J8nnK2K1K6K5k9k9m9p6q3m0J0L7K4K5j4j4j4j4K3K3N0N0M6M6L2k1n1n1
4960A060k7k8NNl6l5k8K4K2K1l3l3l7J7K8K9L1L2%j%j%j%jopopL9M0L9M0J1J1J2J1k9k9J5
$$ y = [1076, 1135, 1175, 1216, 1203, 1191, 1157, 1124, 1116, 1109, 1096, 1083, 1070, 1057, 1034, 1012, 989, 967, 959, 950, 942, 934, 854, 775, 767, 847, 954, 1034, 1043, 999, 959, 944, 967, 1042, 1096, 1098, 1079, 1061, 1065, 1069, 1107, 1172, 1240, 1256, 1230, 1177, 1138, 1099, 1059, 1018, 1015, 1012, 1008, 1005, 1041, 1076, 1111, 1146, 1158, 1170, 1129, 1088, 1093, 1099, 1105, 1110, 1091, 1072, 1080, 1087, 1120, 1153, 1163, 1121, 1066, 1011, 1006, 1000, 1007, 1014, 1020, 1027, 1022, 1017, 1064, 1112, 1164, 1216, 1198, 1154, 1122, 1143, 1159, 1174, 1165, 1155, 1172, 1189, 1190, 1191, 1192, 1193, 1159, 1124, 1089, 1055, 1033, 1011, 989, 967, 914, 860, 860, 859, 892, 925, 932, 938, 941, 943, 996, 1048, 1084, 1068, 1028, 989, 989, 990, 1043, 1097, 1122, 1147, 1145, 1144, 1118, 1092, 1040, 987, 979, 972, 990, 1009, 1041, 1073, 1079, 1085, 1069, 1054, 1038, 1022, 1033, 1044, 1056, 1067, 1066, 1065, 1064, 1063, 1038, 1012, 1039, 1067, 1072, 1078, 1057, 1036, 1017, 998, 1005, 1013, 1040, 1068, 1069, 1070, 1072, 1073, 1074, 1076, 1014, 953, 920, 931, 1000, 1069, 1088, 1107, 1101, 1095, 1116, 1137, 1152, 1168, 1131, 1094, 1040, 986, 985, 984, 990, 996, 1003, 1009, 1000, 990, 1033, 1076, 1088, 1101, 1089, 1077, 1104, 1157, 1219, 1238, 1226, 1214, 1235, 1281, 1313, 1301, 1263, 1225, 1206, 1187, 1116, 1046, 987, 953, 967, 1025, 1083, 1115, 1139, 1162, 1184, 1206, 1202, 1154, 1090, 1052, 1049, 1046, 1040, 1034, 1027, 1021, 1040, 1058, 1077, 1095, 1090, 1085, 1107, 1128, 1154, 1179, 1150, 1121, 1072, 996, 913, 873, 883, 920, 944, 969, 955, 941, 927, 913, 936, 959, 1009, 1059, 1105, 1151, 1183, 1162, 1111, 1060, 1033, 1005, 1010, 1015, 979, 944, 916, 940, 962, 983, 950, 917, 880, 897, 925, 954, 985, 1017, 1017, 1016, 1016, 1015, 1015, 1014, 1014, 1013, 1007, 1000, 994, 987, 1026, 1066, 1105, 1145, 1156, 1167, 1179, 1190, 1161, 1132, 1147]
4942A147J5K1K0K1K1J9J9m2m3m2m1KKKKK9K8NNl8l9m6m5kjL5L5QRJ1J0J1J1j0j0j0j0k8k8
4925A053jjM6M7L2k1q2q2p2j8kkM6M5M5M5J8J9k5k6k5k5l2l2J2J2k8k8k9k8mmM1M0N6N7no
4909A036J3J2L9L9K0K1n6n6o1qK4K3pqn1n1k0k0PPl8l8ONK2K2K1K2M2M1J%j1M2N7N6QPj8j9
4891A131K5K5K5K5K0K1Om6n1n1QPl2l2l2l2oppoOOl8l8K9K9K8K9ppppppppM9M9N0M9LLm1m1
4872A107l5l5rrl8l9OOM3M4%%k6k7%%L8L9J2J2j5j5j5j5j6j5K8K9kjjjj0rJ7J7J5J6k8k8j
4854A039jjjNNl9l9n3n3RRM1M1O7O7K5K6jjk8k7j3M0N7N8L5L5k5k5n0n1l9l9NNPQPPK9K8K9
4836A198K8l5l5l7l7k2m8o3j0K8K9K8K8K4k9n7l0K5N1L6L6L3Ok7p9o5l8j3j2J7J7M3M4L1L1
4821A096L1L2j8j9j8j8j2j1j2j2M5M4M1M1j8p0n6l0%jKJK5K5n4n3m5m5J7J6J5J5J4J5M5M5
$$ y = [1147, 1162, 1183, 1203, 1224, 1245, 1264, 1283, 1241, 1198, 1156, 1115, 1117, 1119, 1121, 1123, 1152, 1180, 1185, 1190, 1152, 1113, 1067, 1022, 1020, 1019, 1054, 1089, 1097, 1106, 1117, 1127, 1138, 1149, 1139, 1129, 1119, 1109, 1081, 1053, 1052, 1051, 1097, 1144, 1176, 1155, 1073, 991, 919, 901, 899, 897, 943, 988, 1033, 1078, 1096, 1115, 1090, 1064, 1039, 1014, 982, 950, 962, 974, 946, 918, 889, 861, 857, 853, 894, 934, 990, 1047, 1042, 1036, 1049, 1061, 1100, 1139, 1159, 1180, 1124, 1068, 1007, 999, 1023, 1046, 1039, 1031, 980, 929, 909, 889, 896, 903, 865, 827, 833, 838, 860, 882, 903, 925, 967, 1008, 1009, 1009, 998, 1040, 1097, 1153, 1161, 1168, 1150, 1131, 1156, 1181, 1206, 1231, 1251, 1272, 1278, 1232, 1181, 1130, 1138, 1145, 1113, 1081, 1049, 1017, 1011, 1004, 997, 991, 997, 1003, 965, 927, 956, 985, 1013, 1042, 1035, 1028, 1021, 1014, 1007, 1000, 993, 986, 1035, 1084, 1134, 1183, 1186, 1189, 1148, 1107, 1072, 1037, 1028, 1019, 981, 942, 948, 954, 997, 1041, 1041, 1041, 1015, 988, 988, 988, 1026, 1065, 1077, 1089, 1074, 1059, 1044, 1029, 1013, 998, 1026, 1055, 1053, 1052, 1051, 1050, 1040, 1031, 1048, 1065, 1080, 1096, 1068, 1040, 1039, 1038, 1037, 1036, 1041, 1046, 1007, 968, 915, 862, 871, 880, 921, 962, 1029, 1096, 1121, 1147, 1146, 1145, 1117, 1090, 1077, 1117, 1174, 1232, 1267, 1302, 1277, 1252, 1202, 1151, 1112, 1073, 1078, 1083, 1090, 1098, 1105, 1112, 1141, 1169, 1198, 1226, 1191, 1156, 1119, 1082, 1060, 1012, 949, 939, 967, 996, 1024, 1052, 1076, 1047, 990, 960, 985, 1036, 1072, 1108, 1141, 1147, 1120, 1041, 976, 938, 925, 913, 930, 947, 990, 1034, 1065, 1096, 1127, 1159, 1141, 1122, 1104, 1086, 1074, 1063, 1051, 1039, 1084, 1128, 1169, 1210, 1192, 1122, 1066, 1036, 1036, 1035, 1037, 1038, 1063, 1088, 1034, 981, 936, 891, 908, 924, 939, 954, 968, 983, 1028, 1073]
4806A073M6M5KKKKk3k3n0m9m4m3J8J8LLm1m1noL8L8K7K7J%J7J6J7J6J3J3j4j3L8L9k3k3k6
4789A090k6J8J7KJm3m2o0o0m5PK1K2k0k0L5L4L5L4J2J2J2J2KKLKK0K0opk6k7J7J8N0N1N1N1
4772A269RRn2n3n2n2n3n2k3k3K1K2M1M2J5J5m1m1q1q2l9J4M6M6Q9Q9K5k8n1KM8M8L1L1l0l1
4756A128n5n5j0j1K4K4kkrrrrLKLKNNk2k1l4l3J0J0J5J6k7k8j7J0Rj7k2k1M8P5N5K9qpllk
4737A037lmnmnj1j1j1j1K8K9K9K9NNNNk3k3k1k1jK5O2O2O3L6kjj4j4Jk5n5n4n6n6kjjjjjJ4
4718I97j2m6m7o1l5K0M5L3L3L1L1K9K9N0K4Jk5o3o2p6n0K9P2O3L6K6jl7l8J0N3K7K7Ok0k0
4703A079PL6L6Kk5j9Pj0rj5j5j5j5j4j3k8kK5K5K6K7J6J5J6J6kjjjJ8J7l5l5nmnnpqj0rl3
4685A027n9p4k0J5J6J9K0l0k9m2j4qM5P0P0K6K6K6K6n2n2n2n2K5K4K5K5L6L6L6L5j5j6j5j6
$$ y = [1073, 1119, 1164, 1166, 1168, 1170, 1172, 1149, 1126, 1076, 1027, 983, 940, 958, 976, 979, 982, 941, 900, 895, 889, 927, 965, 992, 1019, 1020, 1020, 1037, 1053, 1070, 1086, 1099, 1112, 1098, 1085, 1123, 1162, 1139, 1116, 1090, 1064, 1082, 1099, 1101, 1102, 1059, 1017, 957, 897, 852, 859, 880, 902, 882, 862, 897, 931, 966, 1000, 1012, 1024, 1036, 1048, 1050, 1052, 1055, 1057, 1077, 1097, 1091, 1084, 1058, 1031, 1048, 1066, 1116, 1167, 1218, 1269, 1278, 1287, 1235, 1182, 1130, 1078, 1025, 973, 950, 927, 948, 970, 1011, 1053, 1068, 1083, 1042, 1001, 920, 838, 799, 813, 859, 905, 994, 1083, 1108, 1080, 1029, 1031, 1079, 1127, 1158, 1189, 1159, 1128, 1073, 1018, 1008, 997, 1021, 1045, 1043, 1041, 1032, 1023, 1014, 1005, 1008, 1010, 1013, 1015, 1020, 1025, 1003, 982, 948, 915, 925, 935, 950, 966, 939, 911, 894, 904, 913, 896, 874, 853, 901, 976, 1031, 1060, 1052, 1045, 1042, 1039, 1037, 1034, 1030, 1025, 1021, 1016, 1005, 994, 983, 972, 1000, 1029, 1058, 1087, 1092, 1097, 1102, 1107, 1084, 1061, 1040, 1019, 1018, 1043, 1105, 1167, 1230, 1266, 1264, 1263, 1249, 1235, 1236, 1211, 1156, 1102, 1046, 990, 988, 987, 986, 985, 984, 983, 997, 985, 939, 892, 831, 796, 816, 861, 894, 927, 958, 989, 1018, 1047, 1097, 1121, 1122, 1097, 1034, 972, 896, 846, 875, 947, 1010, 1046, 1072, 1071, 1034, 996, 1006, 1059, 1086, 1113, 1119, 1099, 1079, 1086, 1122, 1158, 1160, 1135, 1116, 1123, 1113, 1104, 1089, 1074, 1059, 1044, 1030, 1017, 989, 987, 1012, 1037, 1063, 1090, 1106, 1121, 1137, 1153, 1151, 1150, 1149, 1148, 1166, 1183, 1148, 1113, 1108, 1104, 1099, 1094, 1087, 1079, 1069, 1060, 1027, 968, 894, 874, 889, 905, 924, 944, 914, 885, 843, 829, 821, 866, 936, 1006, 1032, 1058, 1084, 1110, 1058, 1006, 954, 902, 927, 951, 976, 1001, 1037, 1073, 1109, 1144, 1129, 1113, 1098, 1082]
4669A082K6K6K7K6j1j1j1j1qqqpK2K3k8k9L7O4K5k7k2k2k6k5J4J4on8m3J0O5O5K5K6k8k7j9
4653A142j8j9j8popoKKKKl1l1K1K2M5M5ppk6k5k5k5k8k8k8k8NNNNl0l1l0l1N3N4O5L8Mn0k2
4635I53k1QQQQpoonK3N0O0J6J3J4J1J1mnl0l1qrL6L6J0J1j6j6o2o2o1j6J6J7J9J9L8L8O2O3
4617A183M8K3j6o0p8n1qqm8m9l1J3K4kl6q1p8l3LK9N1N1N3N3j1j0J5J6K4K3k1k1o4o5j0L4
4602H62L1L2L2L2K5j9l8l8opL8L7M7M6K0K0%%m4m3nnnmm2m2J1N5P9N2QQj4j4n8n9k4k4KKm
4584I44mL3P7Q8Q7J9k5m7m7k3k4j5j6j5j6m5m5m5m5J3J3J3J2M1M1Q2Q2N7Nk7k7o7o7o7o8r
4568H63rL4L5J5J5m3m3k7K6L7L6J1m3m3J1L5L4L9L8K0K0K1K0qqrqJ5J5J5J5K8K9K9K8NMk6
4552A226k5l5q8r8r9m6OK0K1L3L4L4L3J0RRRj4j5j4j4j9j9p6p7k0L3M8M7M3M2M2M3L2L2l2
$$ y = [1082, 1108, 1134, 1161, 1187, 1176, 1165, 1154, 1143, 1135, 1127, 1119, 1112, 1134, 1157, 1129, 1100, 1137, 1201, 1226, 1199, 1177, 1155, 1129, 1104, 1118, 1132, 1126, 1068, 1025, 1035, 1100, 1165, 1190, 1216, 1188, 1161, 1142, 1124, 1105, 1087, 1080, 1074, 1067, 1061, 1063, 1065, 1067, 1069, 1038, 1007, 1028, 1050, 1095, 1140, 1133, 1126, 1100, 1075, 1050, 1025, 997, 969, 941, 913, 918, 923, 928, 933, 903, 872, 842, 811, 864, 918, 983, 1021, 1025, 975, 953, 932, 940, 948, 956, 964, 957, 951, 945, 940, 963, 1013, 1073, 1089, 1102, 1116, 1127, 1138, 1134, 1129, 1099, 1068, 1060, 1051, 1087, 1123, 1133, 1144, 1128, 1112, 1050, 988, 927, 911, 927, 944, 963, 982, 1020, 1058, 1120, 1183, 1231, 1254, 1238, 1178, 1100, 1049, 1041, 1033, 985, 936, 905, 918, 942, 940, 904, 823, 745, 712, 715, 744, 795, 846, 899, 952, 941, 931, 946, 962, 986, 1009, 988, 967, 903, 838, 828, 862, 893, 925, 957, 989, 1014, 995, 957, 919, 913, 906, 944, 981, 1028, 1074, 1094, 1114, 1114, 1114, 1070, 1027, 1022, 1017, 1012, 1008, 966, 924, 935, 990, 1069, 1121, 1129, 1137, 1123, 1109, 1051, 992, 968, 944, 946, 948, 944, 940, 973, 1050, 1138, 1225, 1244, 1219, 1172, 1125, 1102, 1078, 1063, 1047, 1032, 1016, 971, 926, 881, 836, 849, 862, 875, 887, 928, 969, 1051, 1133, 1190, 1195, 1168, 1141, 1074, 1007, 940, 872, 863, 854, 888, 923, 938, 953, 910, 867, 840, 866, 903, 939, 950, 907, 864, 875, 910, 944, 983, 1021, 1041, 1061, 1082, 1102, 1094, 1086, 1077, 1069, 1084, 1099, 1114, 1129, 1157, 1186, 1215, 1243, 1248, 1252, 1226, 1201, 1166, 1078, 980, 881, 835, 841, 861, 882, 915, 949, 983, 1016, 1026, 1035, 1044, 1053, 1039, 1024, 1010, 996, 977, 958, 882, 805, 785, 818, 866, 913, 956, 998, 1040, 1083, 1115, 1147, 1115]
4536A115q4p4k0QQK4K5kkONL2L2mnl0l1llk9k9m7m7J5J4K7K7j7j8k9l0M9M9P1P1J8J8j6j5
4519A079j6j5k8k8k8k7nmK3K2K9K9k4k4k2k2L1L1J9K0K0K0L6L6J0l3l3J1P1P2POj9k0m3m3
4504A138j5K9J5J4J5J5om9m9nJ8J8K0K1j1j1j1j1m4m4m4m3nnonNNNNl3l3mL9N3N4LMj1j0J5
4486A036J6k1k1j9k0L4O1J9k5k7jL2L2j6o0m5J7M1J4k0j9J2J3J2J3K6K7k6k6k5k6K7K7j6j7
4471A029m2m3m4m4QRN2N1P8P8N4N5l4l4n2n2k8k7j9m6n5j1L4L5L8L7K5K5kkJ8J7l5l5n9n8
4455I21ooK5K5K5K5M3M3M3M3J3J4l9m0QRQQNNPPM0O6P5L0l6o2n0n0m1m0m0m0OPk0k0lmM9M9
4437A102J9J9pqj4j3J2J3PPPPK5K5K6K5l0l0l0k9mmmmmlmmqqqqO2O3L4rk9k9nmk0j9PPj8j9
4417A091L5L4LLLLj3j3o6o6k4k4K8K9K2K2K2K2RRm4m3j4j4j3j2L9O5K8k6o3o3K1K2J7J7l6
$$ y = [1115, 1031, 957, 937, 945, 953, 977, 1002, 1000, 998, 1004, 1009, 1041, 1073, 1069, 1064, 1034, 1003, 1000, 997, 968, 939, 892, 845, 860, 874, 901, 928, 911, 893, 864, 834, 883, 932, 1003, 1074, 1092, 1110, 1094, 1079, 1063, 1048, 1020, 992, 964, 937, 932, 928, 951, 973, 1002, 1031, 1007, 983, 961, 939, 970, 1001, 1020, 1040, 1060, 1080, 1116, 1152, 1162, 1129, 1096, 1107, 1178, 1250, 1257, 1263, 1244, 1224, 1181, 1138, 1123, 1152, 1167, 1181, 1196, 1211, 1205, 1156, 1107, 1102, 1120, 1138, 1158, 1179, 1168, 1157, 1146, 1135, 1091, 1047, 1003, 960, 955, 950, 944, 939, 944, 949, 954, 959, 926, 893, 889, 928, 981, 1035, 1038, 1042, 1031, 1021, 1036, 1052, 1031, 1010, 991, 971, 1005, 1066, 1085, 1060, 1033, 1032, 1064, 1096, 1080, 1020, 975, 992, 1033, 1047, 1027, 1008, 1020, 1033, 1045, 1058, 1084, 1111, 1085, 1059, 1034, 1008, 1035, 1062, 1046, 1029, 987, 944, 900, 856, 864, 873, 925, 976, 1054, 1132, 1186, 1241, 1207, 1173, 1121, 1069, 1041, 1014, 995, 949, 894, 883, 917, 952, 990, 1027, 1052, 1077, 1075, 1073, 1091, 1108, 1073, 1038, 979, 921, 915, 909, 934, 959, 984, 1009, 1052, 1095, 1138, 1181, 1194, 1208, 1169, 1129, 1137, 1146, 1154, 1162, 1167, 1172, 1179, 1186, 1226, 1292, 1367, 1397, 1361, 1299, 1249, 1199, 1158, 1118, 1078, 1038, 1044, 1051, 1031, 1011, 1008, 1004, 1053, 1102, 1121, 1140, 1133, 1125, 1111, 1098, 1110, 1123, 1130, 1137, 1144, 1151, 1176, 1201, 1227, 1252, 1222, 1192, 1162, 1133, 1129, 1125, 1121, 1117, 1113, 1110, 1106, 1102, 1094, 1086, 1078, 1070, 1132, 1195, 1229, 1220, 1191, 1162, 1157, 1153, 1133, 1114, 1121, 1128, 1110, 1091, 1126, 1160, 1163, 1166, 1169, 1172, 1159, 1146, 1080, 1014, 990, 966, 994, 1023, 1045, 1067, 1089, 1111, 1120, 1129, 1085, 1042, 1028, 1014, 1001, 989, 1028, 1093, 1121, 1095, 1032, 969, 990, 1012, 1029, 1046, 1010]
4401A010l6rrM4M4M3M2M2M2L9L8J2J2j7j7p0p0m0m1J3J2rj0rj0k4k4k5k4L5L5L4L5k5k5k4
4385A014k5K1K1K1K1J9J8J9J8llllNNk2k1m8m7NNj8j8j8j8k1k2k1k1k2k2k2k2J7J6J7J7P2
4369I11P3K0J9K3K2lmj8j7j8j7m5m4m2m1J1O3J00P4Qj8mnLKLLj3j2j3j3ONONJ7J6J7J6K7K7
4351A150K6K7k4k4k4k4l4l4l3l4k1k2NOk7k6K7K6L0L0MLK5K5k8k8m3m3n5k8J2O4O3O3K4K5
4336A083P4P4N5Jk1k2j0j0l6l7j7j8j7j7rqqqM2M1M1M2L6L6k1p4j01p5J1L9J1m1l9J3K1K1
4320A052K5K4%%J%llllllllj7j7j7j7J1J2J2J1j2j2j2j2NONNlkK4K3J7J7nn7n8l1K3N0O0O0
4301A147RQJ1J0QQk0o4n3k8k7k8k5k6m4m5j8j8L2L2P3P4N4J1k7n2m5%L5O1L5qm1j5nolmK2
4284A028K3K2K2l2l2l2l3K2K1K1K1J4J4j2j3n1n0JM6O7L9nl1l6rJ8J9K5K5k0j9j3j3J4J3J
$$ y = [1010, 974, 965, 956, 1000, 1044, 1087, 1129, 1171, 1213, 1252, 1290, 1302, 1314, 1297, 1280, 1210, 1140, 1100, 1059, 1072, 1084, 1075, 1065, 1056, 1046, 1022, 998, 973, 949, 984, 1019, 1053, 1088, 1063, 1038, 1014, 989, 1010, 1031, 1052, 1073, 1092, 1110, 1129, 1147, 1144, 1141, 1138, 1135, 1140, 1145, 1123, 1102, 1054, 1007, 1012, 1017, 999, 981, 963, 945, 924, 902, 881, 860, 838, 816, 794, 772, 789, 805, 822, 839, 911, 984, 1004, 1023, 1046, 1068, 1065, 1061, 1043, 1026, 1008, 991, 946, 902, 860, 819, 830, 893, 993, 1067, 1075, 1057, 1053, 1048, 1051, 1053, 1056, 1059, 1046, 1034, 1021, 1008, 1014, 1019, 1025, 1030, 1047, 1063, 1080, 1096, 1123, 1150, 1176, 1203, 1179, 1155, 1131, 1107, 1073, 1039, 1006, 972, 951, 929, 934, 940, 913, 887, 914, 940, 970, 1000, 1004, 1007, 1032, 1057, 1029, 1001, 958, 915, 860, 832, 844, 908, 971, 1034, 1058, 1083, 1157, 1231, 1286, 1287, 1266, 1244, 1234, 1224, 1188, 1151, 1134, 1116, 1099, 1082, 1073, 1065, 1057, 1049, 1091, 1132, 1173, 1215, 1251, 1287, 1266, 1192, 1091, 1016, 1027, 1066, 1077, 1036, 997, 1010, 1031, 1052, 1077, 1101, 1101, 1101, 1102, 1102, 1099, 1096, 1093, 1090, 1087, 1084, 1081, 1078, 1061, 1044, 1027, 1010, 1021, 1033, 1045, 1056, 1044, 1032, 1020, 1008, 1013, 1019, 1024, 1029, 1026, 1024, 1048, 1071, 1088, 1105, 1100, 1043, 985, 954, 977, 1027, 1087, 1147, 1156, 1164, 1175, 1185, 1193, 1201, 1181, 1117, 1064, 1036, 1009, 981, 956, 930, 886, 841, 823, 805, 837, 869, 942, 1016, 1070, 1081, 1054, 1002, 957, 957, 992, 1053, 1088, 1080, 1039, 1024, 1019, 1013, 1010, 1006, 1028, 1051, 1073, 1095, 1063, 1031, 999, 966, 988, 1009, 1030, 1051, 1065, 1079, 1067, 1054, 1003, 953, 954, 1000, 1067, 1106, 1101, 1070, 1034, 1025, 1043, 1062, 1087, 1112, 1092, 1073, 1060, 1047, 1061, 1074, 1075]
4268A075KJJl9l9l8l9qpqpK7K7K7K7QPl6l7k9l0J4J4K0K0K0K0J6J6J8J8J3M1N0Ok7k6l0l0
4252A058L8L7L8L7J8J7J5J5j4n9m8k2K4K3l6l6l0l1k7k7l6J7M9M9mmmmN4N4M0j3m3m4m7m7
4236A007k9k8k8k9jkK5K5K4K4k0k0RQRRj4j4j5j4l0l0L1L2M5M5j6j6k7k7J7J7NMk1k2j0j1
4219I12J6J6qppqK0J9K0K0j%%%kjkjJ4J3J4J4M4M5M4M4j0j1j0j1l2l2l3l2NNNNM0M0L9M0j6
4201A210j5j5j6l4l4l4l5onooK1K0K0K1mmmlk0j9j9k0rrj0rK1K2o6o6ppM6M6J9J9J8J9k6k6
4183I68k7k6mllmLLMLK8K8K9K8J5J5J5J5RQRQJ6J6l7l6klkkoonoPPPOn9n9n9n9k4k3k4k4M
4163G48MN6N7N1N1N1N1OOOPJ0J0J1J0j1j2j1j2NNNMqqrqj2j1j2j2nnnol0k9l0l0RJ0J0Rmm
4143I18mlO1O2O2O2j7j8j8j8jkjjqpM5M5qro1o1m0l9mK2Jm3o9o9j9k0L3L3N8N7N7N7J1J0p
$$ y = [1075, 1077, 1078, 1079, 1040, 1001, 963, 924, 916, 909, 901, 894, 921, 948, 975, 1002, 1010, 1017, 981, 944, 915, 885, 899, 913, 933, 953, 973, 993, 1009, 1025, 1043, 1061, 1074, 1115, 1165, 1171, 1144, 1118, 1088, 1058, 1096, 1133, 1171, 1208, 1226, 1243, 1258, 1273, 1259, 1200, 1152, 1130, 1154, 1177, 1141, 1105, 1075, 1044, 1017, 990, 954, 971, 1020, 1069, 1065, 1061, 1057, 1053, 1107, 1161, 1201, 1188, 1145, 1101, 1054, 1007, 978, 950, 922, 893, 892, 890, 915, 940, 964, 988, 968, 948, 957, 965, 974, 983, 969, 955, 940, 926, 896, 866, 897, 929, 974, 1019, 1003, 987, 960, 933, 950, 967, 972, 976, 955, 933, 923, 912, 928, 944, 936, 929, 922, 914, 934, 953, 973, 993, 992, 992, 992, 992, 990, 989, 987, 986, 1000, 1013, 1027, 1041, 1085, 1130, 1174, 1218, 1208, 1197, 1187, 1176, 1144, 1112, 1079, 1047, 1052, 1057, 1062, 1067, 1107, 1147, 1186, 1226, 1210, 1195, 1180, 1164, 1130, 1096, 1062, 1027, 1021, 1016, 1010, 1004, 1025, 1045, 1065, 1086, 1082, 1078, 1074, 1071, 1051, 1032, 1013, 993, 984, 975, 965, 956, 977, 999, 933, 867, 860, 853, 899, 945, 964, 983, 1001, 1020, 994, 968, 941, 915, 911, 908, 905, 901, 904, 907, 911, 914, 942, 970, 999, 1027, 1042, 1057, 1072, 1087, 1096, 1104, 1113, 1121, 1137, 1153, 1116, 1080, 1078, 1075, 1073, 1071, 1065, 1059, 1054, 1048, 1055, 1062, 1069, 1075, 1016, 957, 898, 839, 815, 792, 768, 744, 748, 752, 808, 865, 916, 967, 1018, 1069, 1075, 1081, 1087, 1094, 1104, 1114, 1125, 1135, 1124, 1112, 1101, 1089, 1094, 1099, 1104, 1108, 1100, 1092, 1083, 1075, 1063, 1052, 1040, 1028, 1023, 1018, 1013, 1007, 977, 948, 918, 888, 897, 907, 917, 926, 922, 918, 914, 911, 972, 1034, 1096, 1158, 1141, 1123, 1105, 1087, 1086, 1084, 1083, 1082, 1074, 1067, 1112, 1157, 1149, 1140, 1079, 1018, 978, 939, 935, 957, 958, 915, 846, 777, 758, 738, 771, 804, 862, 919, 976, 1033, 1044, 1054, 1047]
4125A047J9K1k2q2q1l0J3j1j1ONP5J01Q1J9n1p8m6j9l7l6J1J1J1J1L3L3L3L3rqrqj5j5j5j5
4109I65l5l6l3l3OM9P4P4Lm0m3Kjk8j0j0K6K6K6K6N3N2K5j9j6j6j8j9rqrrK6K5K5K5k1k1K9
4092A103K9J0l5o2o2j0j0j0j0K1K1K2K1k3k4k4k3j8j7L5L5J2J2J2J2k2k2k2k2QRQRL3L2M5
4077A073J8k0o5n5k8pJ9M3O9O0L4j2n5o3l7kkl5l4rL6L7J1k5k4J0J0J0J0mmN0M9J8J8l4l5
4061A025m4m3m4m3J0J0J1J0KKKLJ5J5J6J5L4L4L4L4J2J2J2J2l1l2l2l1jjjjJ5J5J5J4KKJK
4043A082qqpqK5K6k8k7m1m0j2L1O7O6J6J6M8M8onj8j8j9j8m2m3m2m3j1j2j2j2k5k6k3k3K6
4027H74O9N8L2J6j1j4J3N4K8rrQQQPKJJKj9j9L0L1J7l5n9n8K1K1ln5n0n1jjQQQPK1K1kn5o7
4008H56o8j3M0M5M4M8M7Q8Q7j%j7j8j7j7rrj0rOOL6j7n5n4L0L0K4K4K3K4L6L6n1n2n1n0KK
$$ y = [1047, 1066, 1087, 1065, 983, 902, 872, 885, 874, 863, 869, 874, 949, 1050, 1131, 1150, 1099, 1021, 975, 956, 919, 883, 894, 905, 916, 927, 960, 993, 1026, 1059, 1050, 1042, 1033, 1025, 1010, 995, 980, 965, 930, 894, 861, 828, 834, 883, 957, 1031, 1034, 994, 951, 953, 952, 924, 914, 904, 930, 956, 982, 1008, 1061, 1113, 1138, 1119, 1103, 1087, 1069, 1050, 1041, 1033, 1024, 1015, 1041, 1066, 1091, 1116, 1095, 1074, 1103, 1132, 1142, 1107, 1045, 983, 973, 963, 953, 943, 964, 985, 1007, 1028, 1005, 981, 957, 934, 916, 899, 934, 969, 981, 993, 1005, 1017, 995, 973, 951, 929, 937, 946, 954, 963, 996, 1028, 1073, 1091, 1071, 1006, 951, 923, 916, 935, 978, 1047, 1107, 1141, 1129, 1074, 1011, 974, 972, 970, 935, 901, 892, 928, 965, 976, 951, 927, 937, 947, 957, 967, 963, 959, 1009, 1058, 1076, 1094, 1060, 1025, 981, 938, 894, 851, 861, 871, 882, 892, 894, 896, 898, 901, 916, 931, 947, 962, 996, 1030, 1064, 1098, 1110, 1122, 1134, 1146, 1115, 1083, 1051, 1020, 1019, 1018, 1017, 1016, 1031, 1046, 1061, 1075, 1077, 1079, 1080, 1082, 1074, 1066, 1059, 1051, 1076, 1102, 1074, 1047, 1006, 966, 954, 985, 1052, 1118, 1134, 1150, 1198, 1246, 1240, 1235, 1217, 1199, 1180, 1162, 1120, 1077, 1035, 992, 981, 969, 957, 945, 920, 894, 871, 848, 874, 943, 1001, 1033, 1049, 1038, 1024, 1037, 1091, 1119, 1110, 1101, 1109, 1117, 1125, 1132, 1134, 1135, 1136, 1138, 1119, 1100, 1130, 1161, 1178, 1143, 1084, 1026, 1047, 1068, 1065, 1010, 960, 909, 908, 907, 915, 923, 931, 938, 959, 980, 978, 923, 856, 788, 775, 815, 860, 904, 952, 999, 1087, 1174, 1173, 1173, 1156, 1138, 1121, 1104, 1095, 1086, 1076, 1067, 1073, 1079, 1115, 1098, 1043, 989, 1019, 1049, 1073, 1097, 1120, 1144, 1180, 1216, 1165, 1113, 1062, 1012, 1014, 1016]
3991A016m3m3RJ0J4J4J4J3NNMNMNMNPPPPooM3M3O5J3m6m5p1p1m8NJ8J8K1K2jj%jK9K9k4k4
3972A031K5K5k7k7k3k3L0L0QQRQk6k6n2n3l5l5J8J8L7L7O3O3J2J3J2J2lllkl4l4l0l0J4O7
3956A074L8L7j6j6j6j7l6l7l7l6L4L5L5L5L3L3k0k0k1k1k1k1k8k7k4k4oM7J06J05O4O4J2J1
3941A319j1j0j1j1LLMLj6j5j6j5o6o6j3j3mln3n2lN0P3P3L4L4k0j9j0rj0j0j3j3j3j3J1J0
3925A109J1J0O8O7O8O7noool1l1l1l1j%k1p3r0l7J8J8k5k5nM8K6k7m7m7qpM5M6K8K9K7K8m1
3908A112o6k4K0M8M8M8M8Ol8j3j3kllkOOMNLk3l6RK1k2q0q0o5k0J6N9P2K8n1p8n7l0k1k0J2
3890H24J2M7P2O2%l1nK1K2l0l0N1N0N0N1M3M4j0rk5k5k4k5o3o2j0rJ5J5j2j1qqqqM6M6M3M4
3874A145M3jk1PRl4o1o1j1j1j1j1K3K2nn0n7n8pqL1L1L1L1R6R5M3M3NOk1k1j4j4J2J2MLm9
$$ y = [1016, 973, 930, 939, 949, 963, 977, 991, 1004, 1009, 1014, 1018, 1023, 1027, 1032, 1036, 1041, 1048, 1055, 1062, 1069, 1063, 1057, 1100, 1143, 1208, 1221, 1175, 1130, 1059, 988, 940, 945, 963, 981, 1002, 1024, 1023, 1022, 1022, 1021, 1050, 1079, 1055, 1031, 1056, 1081, 1054, 1027, 1004, 981, 1011, 1041, 1049, 1057, 1066, 1074, 1048, 1022, 970, 917, 882, 847, 865, 883, 920, 957, 1020, 1083, 1095, 1108, 1120, 1132, 1129, 1126, 1123, 1121, 1087, 1053, 1023, 993, 1007, 1074, 1112, 1149, 1133, 1117, 1101, 1084, 1048, 1011, 974, 938, 972, 1007, 1042, 1077, 1110, 1143, 1123, 1103, 1082, 1061, 1040, 1019, 991, 964, 940, 916, 910, 957, 1063, 1168, 1232, 1296, 1308, 1319, 1308, 1298, 1287, 1276, 1279, 1282, 1286, 1289, 1273, 1258, 1242, 1227, 1161, 1095, 1082, 1069, 1065, 1062, 1009, 957, 954, 1004, 1077, 1150, 1184, 1218, 1198, 1179, 1169, 1160, 1150, 1140, 1127, 1114, 1101, 1088, 1099, 1109, 1120, 1130, 1198, 1265, 1333, 1400, 1395, 1389, 1383, 1377, 1346, 1315, 1284, 1253, 1252, 1252, 1231, 1158, 1068, 1031, 1049, 1067, 1042, 1017, 1012, 1060, 1086, 1059, 1012, 965, 957, 950, 995, 1041, 1069, 1098, 1125, 1153, 1112, 1046, 1022, 1042, 1090, 1138, 1186, 1234, 1240, 1202, 1189, 1176, 1174, 1171, 1168, 1166, 1172, 1178, 1182, 1187, 1190, 1167, 1131, 1140, 1161, 1139, 1059, 979, 914, 894, 910, 969, 1041, 1069, 1018, 940, 883, 853, 832, 812, 824, 836, 883, 955, 1017, 1017, 986, 981, 1002, 1024, 994, 964, 1015, 1065, 1115, 1166, 1209, 1253, 1243, 1234, 1209, 1184, 1160, 1135, 1072, 1010, 1000, 991, 1006, 1021, 1009, 998, 990, 982, 974, 966, 1012, 1058, 1101, 1145, 1188, 1187, 1166, 1173, 1182, 1148, 1087, 1026, 1015, 1004, 993, 982, 1005, 1027, 1022, 972, 915, 857, 850, 842, 873, 904, 935, 966, 1062, 1157, 1200, 1243, 1248, 1254, 1233, 1212, 1198, 1184, 1196, 1208, 1212, 1215, 1166]
3857A166m9ooonl1l1l1l1L0L0L0L1mllmKJm3m3k2k3K2K1J0J1j6j6QRL5L5k0k0k0k0j2j1j2
3839I53j2poppM7M6M7M7N8N9L5k7m2KN0N0Lm1n7l2KKLMmlmmj0j0j0j1j4j4j4j4o2o2j%j1j0
3821I12j0j1L3L3L3L3l5l5l3l3OL3M4%oK0KKk0k0OOJ4J3l1l1n8n8j4j5rrJ7J7L6L6L6L6JK
3803I43JKM1M1M1M1L3L2L2L2LKk4k4n5n6NMrl6k4K9M7M8PPj6j5j5j5l7l8l7l7k3k3rM4P3P3
3786A088J5J5K1K0ook4k3KLPPJ9P3Q4N8J1m2o4l8j2j2j4j5m1m2n1n2k5k6K2K1K1K1JJJJK3
3769A042K3K3K3J9J9qqj5j5K5K5j2o5p5m8%K6J3J3JJKJMML0L0J4J3m8m9k1k2K2K3j3j2n6n7
3752H72PPQPrrrrK1K1K1K2J2J2k7k8k3L8R9R9P5M9M4%o6o5l4J1j5m2l8j2QPn2n2k2k2MNno
3734I04N7N6N3N2J6k8l3l2K6K6J4J4J3J4RJ0l5l5rj0J7J7qqqqk2k2k2k2k0k1k0k0OPPOk6k6
$$ y = [1166, 1117, 1111, 1105, 1099, 1094, 1063, 1032, 1001, 970, 1000, 1030, 1060, 1091, 1087, 1084, 1081, 1077, 1079, 1080, 1037, 994, 972, 949, 971, 992, 1002, 1013, 997, 981, 989, 998, 1033, 1068, 1048, 1028, 1008, 988, 976, 965, 953, 941, 934, 928, 921, 914, 961, 1007, 1054, 1101, 1159, 1218, 1253, 1226, 1184, 1186, 1236, 1286, 1289, 1248, 1191, 1159, 1161, 1163, 1166, 1170, 1166, 1163, 1159, 1155, 1145, 1135, 1125, 1114, 1100, 1086, 1072, 1058, 996, 934, 933, 933, 922, 912, 902, 891, 924, 957, 990, 1023, 988, 953, 920, 887, 893, 926, 970, 970, 964, 984, 986, 988, 968, 948, 954, 960, 974, 987, 956, 925, 867, 809, 795, 780, 771, 762, 779, 796, 832, 868, 904, 940, 941, 943, 944, 946, 987, 1028, 1069, 1110, 1143, 1175, 1207, 1239, 1242, 1244, 1220, 1196, 1141, 1085, 1090, 1094, 1085, 1049, 1025, 1054, 1101, 1149, 1156, 1163, 1147, 1132, 1117, 1102, 1065, 1027, 990, 953, 930, 907, 898, 942, 1015, 1088, 1103, 1118, 1139, 1159, 1153, 1147, 1123, 1100, 1102, 1105, 1112, 1119, 1138, 1211, 1295, 1353, 1364, 1322, 1258, 1220, 1208, 1196, 1182, 1167, 1126, 1084, 1033, 981, 956, 930, 952, 973, 994, 1015, 1016, 1017, 1018, 1019, 1042, 1065, 1088, 1111, 1130, 1149, 1141, 1133, 1118, 1103, 1128, 1153, 1141, 1076, 1001, 953, 953, 979, 992, 1005, 1006, 1007, 1009, 1010, 1014, 1018, 1048, 1078, 1092, 1105, 1057, 1008, 987, 965, 987, 1010, 997, 985, 929, 872, 879, 886, 894, 901, 892, 883, 874, 865, 886, 907, 928, 950, 962, 974, 947, 919, 896, 934, 1033, 1132, 1207, 1256, 1300, 1300, 1234, 1169, 1135, 1146, 1131, 1089, 1051, 1039, 1047, 1054, 1002, 950, 928, 906, 910, 915, 910, 904, 961, 1017, 1070, 1122, 1138, 1110, 1077, 1045, 1071, 1097, 1111, 1125, 1138, 1152, 1161, 1171, 1136, 1101, 1092, 1082, 1099, 1116, 1108, 1100, 1092, 1084, 1062, 1040, 1018, 996, 976, 955, 935, 915, 921, 928, 935, 941, 915, 889]
3717H89j7M5R4R5O1J7kknnOPOPk0k0k0k0l9m0MN%Jk6k6j2j1L2L2O9O8K4K5m3m2o9o9j8j8K7
3699I90K6K0K0K1K0J6J5m6m6j6j6K7K8kjkjQQPQj2j2j3j2LLM7M7M7M7M5Jm1m2k6J7J7j0n3
3681A137n4n0n1m7m8m1KN7N7L6L7L6L7kjK2K2qn3p2p1l5l5RRK0K1ooL1L2K8K8k8p3p1k7J6
3665H58M3N7Q3Q2L9j7m3l6l6j1j1J9J8qpl4l3j4L0N7N6J6J5K8K7%JJ9K0J9K0k9k8k8k9m8m8
3649A047m8m8POPOPPOPrrrrL6L5ql5l5QM6P2Q3Q2L0j4m8m8n1n1J2J3J2J2rj0j0rK5K5l7q0
3631A014p1m4k4KK6K5k6k5j9j8j9j8l3l3N2N3L2j2m0m0k0j9L4L4P1P1M5M5J0J1N9N9Pn4p2
3616A063p3o6o6j4j3OPPPnnnnL7L7L6L7M2M2M2M2k6k6n2n2l0l0K3K3K6K7K6K6qqqqk5k5k5
3598I81k5kkkkNNN8N8K2K2l1l1j1j1J6J5j3j2j3j3K2K1l0l0KK8K2l8q1n4J5J5l2l1l0J5M4
$$ y = [889, 872, 917, 1011, 1106, 1167, 1184, 1182, 1180, 1175, 1170, 1176, 1183, 1189, 1196, 1176, 1156, 1136, 1116, 1077, 1037, 1041, 1046, 1046, 1047, 1021, 995, 983, 972, 1004, 1036, 1105, 1173, 1197, 1222, 1179, 1137, 1068, 999, 981, 963, 990, 1016, 1036, 1056, 1077, 1097, 1113, 1128, 1082, 1036, 1020, 1004, 1031, 1059, 1057, 1056, 1054, 1053, 1061, 1069, 1076, 1084, 1072, 1060, 1047, 1035, 1038, 1041, 1088, 1135, 1182, 1229, 1274, 1275, 1234, 1192, 1166, 1183, 1200, 1190, 1137, 1083, 1033, 982, 935, 887, 846, 848, 905, 962, 998, 1035, 1071, 1108, 1106, 1105, 1127, 1149, 1141, 1088, 1016, 945, 910, 875, 884, 893, 913, 934, 928, 922, 953, 985, 1013, 1041, 1013, 940, 869, 842, 858, 901, 958, 1041, 1123, 1162, 1145, 1102, 1066, 1030, 1019, 1008, 1027, 1045, 1037, 1030, 996, 963, 949, 979, 1036, 1092, 1108, 1123, 1151, 1178, 1178, 1179, 1198, 1218, 1237, 1257, 1228, 1200, 1172, 1143, 1095, 1047, 999, 951, 958, 964, 971, 977, 984, 991, 997, 1004, 995, 986, 977, 968, 1004, 1039, 1031, 996, 961, 969, 1015, 1087, 1170, 1252, 1282, 1268, 1220, 1172, 1121, 1070, 1082, 1095, 1107, 1119, 1110, 1100, 1090, 1081, 1106, 1131, 1094, 1014, 943, 899, 875, 877, 903, 928, 902, 877, 858, 840, 821, 803, 770, 737, 789, 842, 874, 862, 822, 782, 762, 743, 777, 811, 882, 953, 998, 1043, 1053, 1064, 1123, 1182, 1189, 1135, 1063, 990, 924, 858, 844, 831, 837, 844, 851, 858, 853, 848, 843, 838, 875, 912, 948, 985, 1027, 1069, 1111, 1153, 1127, 1101, 1049, 997, 967, 937, 960, 983, 1009, 1036, 1062, 1088, 1080, 1072, 1064, 1056, 1031, 1006, 981, 956, 954, 952, 950, 948, 953, 958, 1016, 1074, 1096, 1118, 1087, 1056, 1045, 1034, 1050, 1065, 1052, 1040, 1027, 1014, 1036, 1057, 1027, 997, 999, 1027, 1049, 1011, 930, 876, 891, 906, 874, 843, 813, 828, 872]
3582H72M5M7M7k8k8k8k8j8j9j8j8L6L7L6L7K2K2K2K2J8J9J9J8RQm4m4k9k9K4K4JJ%JK8K8K5
3565A137K5m5r8o5o4j8L5ONK1K0P0P0O8J5pqqqJ6J5po0q4q3opopk5k5k5k5J8J8J8J9k8k8k8
3548H11k8JJJJJ7J6J7J6J3J3J3J3J7J6J6J7K8K8Rm4n9oM8M9j7j8m4m4mmmml8l8l4l5L3Q5J08
3531I66J08N5N5L2k2q5q5o6j2mlk6k6K9K9L0K9k5k4k4k5jjkjQPO1O0M4M4m3m4n6n7J4M0J3
3514I92m0k4LJKLML2L1L2L2M4M4M1M1L6j6l9m0m7m8m7m7n7n6lml2l3l3l2K9K9K8K9J9J9O8
3498I61O8N2jk4k4PQL6j7m9p6r2m0K4N0L9L8K1K0K1K0J7J7J7J7l8l8l8l8J0J0J0J0j8j7j6
3482I47j6QL5jn5r1o5MNj4j3L9M0N7N6N7N7ooool5l6J7J7j2j1j2j2k7k7k3k4l1K1O5R2R3R3
3465A174O8J5l5q8l8J5N1N2L2k1k8k9l1l2m1m0J2J2j2j1j2j1L3L4L4L3J3J2J3J2k9l0k9k9
$$ y = [872, 917, 964, 1011, 983, 955, 927, 899, 881, 862, 844, 826, 862, 899, 935, 972, 994, 1016, 1038, 1060, 1078, 1097, 1116, 1134, 1143, 1151, 1107, 1063, 1034, 1005, 1029, 1053, 1054, 1055, 1055, 1056, 1084, 1112, 1137, 1162, 1117, 1019, 954, 890, 872, 907, 913, 918, 939, 959, 1029, 1099, 1167, 1182, 1175, 1167, 1159, 1151, 1167, 1182, 1175, 1115, 1031, 948, 942, 935, 929, 922, 897, 872, 847, 822, 840, 858, 876, 895, 867, 839, 811, 783, 784, 785, 786, 787, 804, 820, 837, 853, 866, 879, 892, 905, 922, 938, 954, 971, 999, 1027, 1036, 992, 933, 927, 975, 1024, 1007, 989, 945, 901, 897, 893, 889, 885, 847, 809, 775, 740, 773, 858, 966, 1074, 1129, 1184, 1216, 1194, 1109, 1024, 958, 946, 942, 939, 913, 887, 916, 945, 975, 1004, 979, 955, 931, 906, 905, 904, 902, 901, 909, 916, 977, 1037, 1081, 1125, 1082, 1038, 982, 925, 939, 979, 992, 952, 928, 931, 932, 934, 937, 941, 973, 1004, 1036, 1068, 1112, 1156, 1197, 1238, 1274, 1258, 1219, 1179, 1132, 1084, 1037, 990, 933, 877, 874, 870, 838, 805, 772, 740, 769, 798, 826, 855, 874, 893, 961, 1029, 1081, 1080, 1056, 1032, 1039, 1047, 1083, 1066, 1017, 941, 849, 809, 833, 883, 922, 960, 981, 1001, 1022, 1042, 1059, 1076, 1093, 1110, 1072, 1034, 996, 958, 968, 978, 988, 998, 980, 963, 947, 931, 939, 974, 973, 918, 827, 762, 766, 771, 757, 744, 783, 823, 880, 936, 993, 1050, 1044, 1038, 1032, 1026, 991, 955, 972, 989, 977, 966, 954, 942, 915, 888, 865, 841, 810, 831, 896, 988, 1081, 1174, 1242, 1257, 1222, 1134, 1096, 1111, 1162, 1214, 1246, 1225, 1197, 1168, 1137, 1105, 1064, 1024, 1036, 1048, 1036, 1025, 1013, 1002, 1035, 1069, 1103, 1136, 1149, 1161, 1174, 1186, 1157, 1127, 1098, 1069]
3450A069j0rrrj6j6j6j6L6L7L6L6j9j8j9j9j9k0k0j9k0j9k0k0K0K0K0K0NMNMK6K6K3K2Jn2
3434A025p6p5j2j3j2j3j3j3RO2N6N6N7N8K2lk2L1M0j4o8o8j1j1j1j1j0j1j0j0K8K8N0J02J17
3419A254Q9N2N2j2o5m8k2j6J0O7J55J62J10N6N7K7K6J54M18O32Q26J263J808J803Q35o79j682
3407G332j618j072o75n52m45k87k02k03j41j8L0k2r2r3o9o9m8m9m5r8q6q7l8l7mlk4p6p2j8
3394A119L6L6L7L6J0J0j4j4J2J3L9M0J3J3J3J4M3j0p5p4k6k5j1j0j1j0rrl5l6o1o2rqOOOO
3378I99kkjkL0L0K6K7k5p7p0p1j5L8O1O1M1M2L8L8K1l2n5n5j2j2o1o1l5J9P7P6L3L2NOk8k7
3361A057k8k8NMm8m8m7m7j8j8K9P4Q8O2J8qk2k2llL2N8N8J4m8m7mlllm5m5QQQQRQK9K9Km2
3343A028n8l1J4N8N0N0K7K7PQj9j8klkkk4k4p8p7m5m6PPM0M0J3J3M3M2M3M2j2j2j2j2K5K5
$$ y = [1069, 1059, 1050, 1041, 1032, 1016, 1000, 984, 968, 1004, 1041, 1077, 1113, 1094, 1076, 1057, 1038, 1019, 999, 979, 960, 940, 921, 901, 881, 901, 921, 941, 961, 966, 970, 975, 979, 1005, 1031, 1054, 1076, 1077, 1025, 949, 874, 862, 849, 837, 824, 811, 798, 807, 869, 925, 981, 1038, 1096, 1118, 1115, 1093, 1124, 1164, 1150, 1082, 1014, 1003, 992, 981, 970, 960, 949, 939, 929, 957, 985, 1035, 1137, 1254, 1343, 1395, 1447, 1435, 1370, 1322, 1300, 1284, 1294, 1361, 1516, 1678, 1788, 1844, 1901, 1928, 1954, 2108, 2526, 3158, 3984, 5247, 7055, 8858, 9693, 9014, 7332, 5714, 4642, 3967, 3415, 2970, 2683, 2481, 2278, 2137, 2119, 2149, 2127, 2035, 1942, 1873, 1804, 1756, 1707, 1662, 1564, 1478, 1391, 1353, 1316, 1312, 1309, 1285, 1209, 1137, 1119, 1155, 1191, 1228, 1264, 1274, 1284, 1270, 1256, 1268, 1281, 1320, 1360, 1373, 1386, 1399, 1413, 1456, 1446, 1371, 1297, 1271, 1246, 1235, 1225, 1214, 1204, 1195, 1186, 1151, 1115, 1054, 992, 983, 975, 981, 987, 993, 999, 997, 995, 994, 992, 1022, 1052, 1078, 1105, 1080, 1003, 933, 862, 847, 885, 946, 1007, 1048, 1090, 1128, 1166, 1187, 1155, 1100, 1045, 1033, 1021, 960, 899, 864, 883, 960, 1036, 1069, 1101, 1106, 1112, 1084, 1057, 1029, 1001, 1006, 1010, 962, 914, 867, 820, 802, 784, 813, 887, 975, 1037, 1055, 1047, 1025, 1003, 1000, 997, 1029, 1087, 1145, 1159, 1111, 1064, 1060, 1057, 1054, 1051, 1006, 961, 969, 977, 985, 993, 1002, 1010, 1039, 1068, 1070, 1028, 970, 939, 953, 1011, 1061, 1111, 1138, 1165, 1172, 1180, 1161, 1143, 1141, 1138, 1136, 1134, 1110, 1086, 1008, 931, 886, 840, 847, 854, 894, 934, 947, 960, 1003, 1045, 1088, 1130, 1118, 1106, 1094, 1082, 1107, 1132]
3326A132K5K6j5j4j4j5j0j0o3o2m3m4J0J0J8J8qpL8L8K9LON1M9No8o9j9j9j3j4j4j4k7k7%
3310H69JM3O9L1j4nN7R5N1k4n1j1L3J7J7K0K0n0m9m7m8k4K0N5N5N2K6j4n9r2r3j7j6NNL1L1
3294I89J8J7J7J7J%K4K3J7k8o4o5J1J1J0J1J4J5J4J4m0m0K1K1J5J4J5J4J7J6km7o9o8j7K6
3279I42K4K3K5K6PPPPPPPP%%%%J1J1J2J1j3j3j2j3JJJJl9l9NNmnmnN1N1O3L7l4p8p0m4qro
3258I61pJ1J1j6j6j2j2L1L2K5K5K5K5J8J8J8J8nnm9m8j4j3L1L1M9N0K3K3RQj7j8J5J5J6J5
3242A271k2k3k2k2k3k2k2k2PQQQm7m8m7m7j8j8j8j7qqJ8J8L1L1l1l1l9l9l9l9J1J2L7L8N8
3226H84N7J4j2pM5N6K9j6j5m0m1l9J4O0O0K3l0o0l3j4j4j2j1L6O3P6K3k0m5o3rN8Q3R6R5P0
3211A361J6j9p2n3k7jkmmmmrrn3n3n1n0K9K8M6M5J9J8LLOm7o3o3mnJ6J6J5J6K0K1M7M7M9M8
$$ y = [1132, 1157, 1183, 1168, 1154, 1140, 1125, 1115, 1105, 1042, 980, 937, 893, 903, 913, 931, 949, 941, 934, 972, 1010, 1039, 1042, 1048, 1099, 1148, 1153, 1085, 1016, 997, 978, 965, 951, 937, 923, 896, 869, 869, 870, 913, 982, 1013, 999, 994, 1051, 1146, 1197, 1173, 1122, 1111, 1144, 1161, 1178, 1198, 1218, 1168, 1119, 1072, 1024, 1000, 1020, 1075, 1130, 1182, 1208, 1194, 1135, 1043, 950, 933, 917, 922, 927, 958, 989, 1007, 1024, 1041, 1058, 1059, 1059, 1083, 1106, 1123, 1095, 1031, 966, 977, 988, 998, 1009, 1023, 1038, 1052, 1066, 1026, 986, 1007, 1028, 1043, 1057, 1072, 1086, 1103, 1119, 1117, 1070, 1001, 933, 916, 942, 966, 989, 1014, 1040, 1047, 1054, 1061, 1068, 1075, 1082, 1089, 1096, 1096, 1096, 1096, 1096, 1107, 1118, 1130, 1141, 1128, 1115, 1103, 1090, 1091, 1092, 1093, 1094, 1055, 1016, 1021, 1026, 1022, 1017, 1013, 1008, 1059, 1110, 1173, 1210, 1176, 1098, 1028, 984, 976, 967, 961, 954, 965, 976, 960, 944, 932, 920, 951, 983, 1008, 1033, 1058, 1083, 1101, 1119, 1137, 1155, 1150, 1145, 1096, 1048, 1034, 1021, 1052, 1083, 1132, 1182, 1205, 1228, 1237, 1245, 1228, 1210, 1225, 1240, 1256, 1271, 1249, 1226, 1204, 1182, 1159, 1137, 1115, 1093, 1100, 1108, 1116, 1124, 1077, 1029, 982, 935, 917, 899, 881, 864, 856, 848, 866, 884, 915, 946, 915, 884, 845, 806, 767, 728, 739, 751, 788, 826, 884, 941, 955, 943, 936, 981, 1037, 1066, 1050, 1035, 995, 954, 915, 929, 989, 1049, 1072, 1042, 982, 949, 935, 921, 909, 898, 934, 997, 1073, 1096, 1076, 1031, 968, 959, 1017, 1100, 1196, 1291, 1361, 1377, 1358, 1286, 1233, 1206, 1205, 1203, 1199, 1195, 1191, 1187, 1178, 1169, 1116, 1063, 1012, 962, 991, 1019, 1065, 1110, 1129, 1147, 1150, 1153, 1159, 1112, 1049, 986, 982, 977, 993, 1009, 1024, 1040, 1060, 1081, 1128, 1175, 1224, 1272]
3193A272j3j3o3o4JN4O4K1m9p5o7m0NNj0j0j0j0K7K6K7K7n6n6o8m1J1N6M7K1J8J7J6J6L3L4
3177A153PPJ6J6k8n5m4jL2L2mm7o6o7j5j6M7M6N1N1j0j0popoOOM9N0lmlmJ3J3J2J3n2n2n1
3160A062n2m0m1K2K1J5J5k9k8j9j8M3M4K7K7JJrj0rj0M7M7K9j5l4pJ9J9k2k3k2k2k1k0k1k0
3144I47K7K7K7K8K5K6j8j8k8k8k8k8p0o9n0pK3K3K6K5J0J1K0M6M3J7j3m0l2l2m3o9n5j2M1
3128G52M1K2K2L2N8O2L6QRJ6J6L1NJ0J1POMk4k3LJ9J9ql5k9l0jK4M5M4J7j0m4m4m5%K8K9L1
3111A114L1OOnl2l3l3PPj3m1m0j3k0j9l1mM7P4P3M8lk9j6j6%J%JJ0J0l6o1o6l9RL5K0K0K1
3094I90K1KJJJK5K5K4K3ql6l5rJ1J1lK2L4Qk0k0J1J1j8m4n7n7n7n6OL4J8J9K8K8K9K8J0RJ0
3076A020J0N3N4JJj2j1j1j1j8j7j7j7qpqpk0j9L3L3L3L3k0j9L9L9L9L9P1P1J3m0j3j2j6j6
$$ y = [1272, 1259, 1246, 1183, 1119, 1120, 1174, 1238, 1259, 1210, 1135, 1068, 1028, 1033, 1038, 1028, 1018, 1008, 998, 1025, 1051, 1078, 1105, 1049, 993, 925, 884, 895, 951, 998, 1019, 1037, 1054, 1070, 1086, 1119, 1153, 1160, 1167, 1183, 1199, 1171, 1116, 1072, 1071, 1103, 1135, 1131, 1084, 1018, 951, 936, 920, 967, 1013, 1064, 1115, 1105, 1095, 1088, 1082, 1075, 1069, 1075, 1081, 1130, 1180, 1177, 1173, 1170, 1166, 1179, 1192, 1204, 1217, 1165, 1113, 1062, 1010, 970, 929, 951, 972, 987, 1002, 973, 945, 926, 908, 951, 995, 1022, 1049, 1050, 1051, 1042, 1032, 1023, 1013, 1060, 1107, 1136, 1121, 1087, 1080, 1099, 1118, 1096, 1073, 1051, 1029, 1008, 988, 967, 947, 974, 1001, 1028, 1056, 1081, 1107, 1089, 1071, 1043, 1015, 987, 959, 889, 820, 770, 763, 786, 809, 835, 860, 870, 881, 901, 947, 990, 1007, 994, 954, 922, 890, 847, 778, 723, 711, 752, 793, 815, 837, 869, 927, 989, 1025, 1033, 1042, 1058, 1074, 1105, 1110, 1120, 1131, 1138, 1144, 1148, 1124, 1101, 1104, 1123, 1142, 1134, 1099, 1070, 1040, 1039, 1063, 1108, 1152, 1169, 1159, 1115, 1071, 1026, 1026, 1054, 1083, 1114, 1145, 1151, 1157, 1152, 1120, 1087, 1054, 1061, 1068, 1055, 1014, 974, 961, 941, 922, 891, 887, 934, 1008, 1081, 1129, 1126, 1097, 1081, 1065, 1065, 1066, 1066, 1067, 1077, 1087, 1051, 990, 924, 885, 894, 929, 949, 969, 990, 1011, 1013, 1014, 1015, 1016, 1041, 1066, 1090, 1113, 1105, 1069, 1034, 1025, 1036, 1047, 1044, 1066, 1100, 1108, 1088, 1068, 1079, 1090, 1072, 1028, 971, 914, 857, 801, 807, 841, 859, 878, 906, 934, 963, 991, 1001, 1010, 1020, 1030, 1083, 1137, 1138, 1139, 1127, 1116, 1105, 1094, 1076, 1059, 1042, 1025, 1017, 1010, 1002, 995, 975, 956, 989, 1022, 1055, 1088, 1068, 1049, 1088, 1127, 1166, 1205, 1276, 1347, 1360, 1320, 1307, 1295, 1279, 1263]
3060A263m6m6m5m6j1j1j1j1m4m4m0m1K8Q0Q0K8j2j2j6j5k1k2k1k2QPPPJ0RJ0J0L0L1L0L1M
3044A136Nm8m8k5k5k5k5J%%Jj1j1j0j1K0J9K0J9Q2Q3Q2Q2O9O8j9j9l6l5nn7r0o4k3K9N4N4
3028A237MNqrqqK5K5Jn1n2n2klL3L3L3L2PPPPJ6J7K8Kl4p7q0l5j2j3rj0J3J3J4J3j2j1j1j1
3010A064J4J4J4J4kjjkK4K4K5K4K1K0l2l1l2l3l2l2opppJ9J9J8J7M1J4l2p5p3k9N1P9M9N0
2994A181N1N1MLN7N6M6M5pqk3k4k4k3J7J6l5l6m5m5RQk5k5k5k5LLLLK2K2l1l2ONNNJ6J6l7
2976A183l6QPQQl7l7l8l7KLKKlmllL3L3l7o3k6J8L3Ok3k3K8K8ononk1k0M0Q4P1K6KJJ1J1P
2957A222Qm9r3r4m9j7j8j5j4L6L7J0J0j9j8L4L4N1N2K3k1l2l1qqK1K2llNL2M1mo1q7m7lL8
2940I82L7J5J4m5m6j7K7L2L2L5L4L7L6j6j7n0n1k5k4LKk4k4J0J0L6L6J1J1J1J2J9K0pol5l4
$$ y = [1263, 1217, 1171, 1126, 1080, 1069, 1058, 1047, 1036, 992, 948, 908, 867, 895, 975, 1055, 1083, 1071, 1059, 1043, 1028, 1007, 985, 964, 942, 950, 957, 964, 971, 981, 990, 1000, 1010, 1040, 1071, 1101, 1132, 1136, 1141, 1093, 1045, 1020, 995, 970, 945, 946, 946, 946, 947, 936, 925, 915, 904, 924, 943, 963, 982, 1064, 1147, 1229, 1311, 1380, 1448, 1429, 1410, 1374, 1339, 1334, 1277, 1187, 1123, 1100, 1129, 1183, 1237, 1241, 1246, 1238, 1229, 1221, 1213, 1238, 1263, 1264, 1213, 1161, 1109, 1107, 1104, 1137, 1170, 1203, 1235, 1242, 1249, 1256, 1263, 1279, 1296, 1324, 1326, 1292, 1215, 1135, 1100, 1088, 1075, 1066, 1056, 1069, 1082, 1096, 1109, 1097, 1086, 1075, 1064, 1078, 1092, 1106, 1120, 1118, 1117, 1116, 1114, 1138, 1162, 1187, 1211, 1232, 1252, 1220, 1189, 1157, 1124, 1092, 1060, 1054, 1047, 1040, 1033, 1052, 1071, 1089, 1106, 1147, 1161, 1129, 1054, 981, 952, 1003, 1082, 1131, 1181, 1232, 1283, 1287, 1290, 1347, 1403, 1449, 1494, 1487, 1479, 1456, 1432, 1408, 1385, 1402, 1418, 1383, 1347, 1302, 1257, 1266, 1274, 1249, 1224, 1199, 1174, 1177, 1180, 1183, 1186, 1208, 1230, 1199, 1167, 1173, 1178, 1183, 1188, 1204, 1220, 1183, 1147, 1155, 1162, 1170, 1178, 1141, 1104, 1066, 1029, 1031, 1034, 1036, 1038, 1035, 1031, 1028, 1025, 1058, 1091, 1054, 991, 965, 983, 1016, 1022, 999, 976, 1004, 1032, 1026, 1021, 1015, 1010, 989, 969, 1009, 1093, 1164, 1190, 1192, 1193, 1204, 1215, 1222, 1230, 1181, 1088, 994, 945, 928, 910, 895, 881, 917, 954, 964, 974, 955, 937, 971, 1005, 1056, 1108, 1131, 1110, 1078, 1047, 1039, 1031, 1052, 1074, 1071, 1068, 1073, 1105, 1146, 1142, 1081, 994, 947, 944, 982, 1019, 1034, 1048, 1003, 957, 940, 967, 999, 1031, 1066, 1100, 1137, 1173, 1157, 1140, 1090, 1039, 1014, 990, 993, 995, 971, 947, 957, 967, 1003, 1039, 1050, 1061, 1072, 1084, 1103, 1123, 1116, 1110, 1075, 1041]
2924A041JK7Pl7o0o1m0ML1L2J8J9poK3N0L3j0p1p1k1k1k1k2K8K8K9k4n8l2RO2O0O0J3J3j4
$$ y = [1041, 1042, 1069, 1076, 1039, 979, 918, 878, 882, 913, 945, 963, 982, 975, 969, 992, 1042, 1075, 1065, 994, 923, 902, 881, 860, 838, 866, 894, 923, 899, 841, 809, 818, 880, 940, 1000, 1013, 1026, 1012]
$$ [...]
-3135I06
##END=	
##END=	
