##TITLE=	Mar14-2018.60.fid
TH008 column 2-3 1H

##JCAMP-DX=	6.0	$$ MestReNova 14.1.1-24571
##DATA TYPE=	LINK
##BLOCK_ID=	1
##BLOCKS=	1    
##ORIGIN=	Mestrelab Research S.L.
##OWNER=	hrzepa
##$MNOVA/LINK_BLOCK_TYPE=	ITEM	$$ NMR Spectrum
##$MNOVA/ITEM/POLYGON=	(XY..XY)
5321,5835
8722,5835
8722,8208
5321,8208
5321,5835
##$MNOVA/ITEM/Z=	0
##$MNOVA/ITEM/ANGLE=	0
##TITLE=	Mar14-2018.60.fid
##JCAMP-DX=	6.0	$$ MestReNova 14.1.1-24571
##BLOCK_ID=	2
##DATA TYPE=	NMR SPECTRUM
##DATA CLASS=	XYDATA
##NUMDIM=	1
##ORIGIN=	Bruker BioSpin GmbH
##OWNER=	nmr
##.OBSERVE FREQUENCY=	400.4124024600000098
##.OBSERVE NUCLEUS=	^1H
##.SOLVENT NAME=	CDCl3
##.PULSE SEQUENCE=	zg30
##LONGDATE=	2018/03/14 17:27:00.000
##.ACQUISITIONMODE=	SIMULTANEOUS (DQD)
##$ORIGINAL FORMAT=	Bruker XWIN-NMR
##$MNOVA/SCALES_VERSION=	9
##$PARAMETER FILE=	(acqus, ASCII, /Users/hrzepa/Downloads/Polysiphenol%20SI%20NMR%20Original%20Data/3/3d%20-%201H%20-%20400A.18.03.14.060/60/acqus, 0)
$$ ##TITLE= Parameter file, TOPSPIN		Version 3.2
$$ ##JCAMPDX= 5.0
$$ ##DATATYPE= Parameter Values
$$ ##NPOINTS= 11	$$ modification sequence number
$$ ##ORIGIN= Bruker BioSpin GmbH
$$ ##OWNER= nmr
$$ $$ 2018-03-14 17:27:53.098 +0000  nmr@CZC2439F6W
$$ $$ /opt/topspin/data/brad/nmr/Mar14-2018/60/acqus
$$ $$ process /opt/topspin3.2.2/prog/mod/shimcntl
$$ ##$ACQT0= -2.28991588624586
$$ ##$AMP= (0..31)
$$ 100 100 100 100 100 100 100 100 100 100 100 100 100 100 100 100 100 100
$$ 100 100 100 100 100 100 100 100 100 100 100 100 100 100
$$ ##$AMPCOIL= (0..19)
$$ 0 0 0 0 0 0 0 0 0 0 0 0 0 0 0 0 0 0 0 0
$$ ##$ANAVPT= -1
$$ ##$AQSEQ= 0
$$ ##$AQ_mod= 3
$$ ##$AUNM= <au_zg>
$$ ##$AUTOPOS= <56 >
$$ ##$BF1= 400.41
$$ ##$BF2= 400.41
$$ ##$BF3= 400.41
$$ ##$BF4= 400.41
$$ ##$BF5= 400.41
$$ ##$BF6= 400.41
$$ ##$BF7= 400.41
$$ ##$BF8= 400.41
$$ ##$BYTORDA= 0
$$ ##$CAGPARS= (0..11)
$$ 0 0 0 0 0 0 0 0 0 0 0 0
$$ ##$CFDGTYP= 0
$$ ##$CFRGTYP= 9
$$ ##$CHEMSTR= <none>
$$ ##$CNST= (0..63)
$$ 1 1 145 1 1 1 1 1 1 1 1 1 1 1 1 1 1 1 1 1 1 1 1 1 1 1 1 1 1 1 1 1 1 1 1
$$ 1 1 1 1 1 1 1 1 1 1 1 1 1 1 1 1 1 1 1 1 1 1 1 1 1 1 1 1 1
$$ ##$CPDPRG= (0..8)
$$ <> <> <> <> <mlev> <mlev> <mlev> <mlev> <mlev>
$$ ##$D= (0..63)
$$ 0 1 0 0 0 0 0 0 0 0.06 0 0 0 0 0 0 0.0002 0 0 0 0 0 0 0 0 0 0 0 0 0 0 0
$$ 0 0 0 0 0 0 0 0 0 0 0 0 0 0 0 0 0 0 0 0 0 0 0 0 0 0 0 0 0 0 0 0
$$ ##$DATE= 1521048472
$$ ##$DE= 6.5
$$ ##$DECBNUC= <off>
$$ ##$DECIM= 2496
$$ ##$DECNUC= <off>
$$ ##$DECSTAT= 4
$$ ##$DIGMOD= 1
$$ ##$DIGTYP= 12
$$ ##$DQDMODE= 0
$$ ##$DR= 22
$$ ##$DS= 2
$$ ##$DSPFIRM= 0
$$ ##$DSPFVS= 20
$$ ##$DTYPA= 0
$$ ##$EXP= <proton>
$$ ##$F1LIST= <111111111111111>
$$ ##$F2LIST= <222222222222222>
$$ ##$F3LIST= <333333333333333>
$$ ##$FCUCHAN= (0..9)
$$ 0 2 0 0 0 0 0 0 0 0
$$ ##$FL1= 90
$$ ##$FL2= 90
$$ ##$FL3= 90
$$ ##$FL4= 90
$$ ##$FOV= 20
$$ ##$FQ1LIST= <freqlist>
$$ ##$FQ2LIST= <freqlist>
$$ ##$FQ3LIST= <freqlist>
$$ ##$FQ4LIST= <freqlist>
$$ ##$FQ5LIST= <freqlist>
$$ ##$FQ6LIST= <freqlist>
$$ ##$FQ7LIST= <freqlist>
$$ ##$FQ8LIST= <freqlist>
$$ ##$FRQLO3= 17285.0399999619
$$ [...]
$$ 90 74 58 42 26 10 0 0
$$ ##$Sgu3PowerLevels= (0..7)
$$ 0 0 0 0 0 0 0 0
$$ ##$Sgu4PowerLevels= (0..7)
$$ 0 0 0 0 0 0 0 0
$$ ##$Sgu5PowerLevels= (0..7)
$$ 0 0 0 0 0 0 0 0
$$ ##$Sgu6PowerLevels= (0..7)
$$ 0 0 0 0 0 0 0 0
$$ ##$Sgu7PowerLevels= (0..7)
$$ 0 0 0 0 0 0 0 0
$$ ##$Sgu8PowerLevels= (0..7)
$$ 0 0 0 0 0 0 0 0
$$ ##$SguType= 3
$$ ##$ShimPowMaxUA= (0..63)
$$ 130000 130000 130000 130000 130000 130000 130000 130000 130000 130000 130000
$$ 130000 130000 130000 130000 130000 130000 130000 130000 130000 0 0 0 0
$$ 0 0 0 0 0 0 0 0 0 0 0 0 0 0 0 0 0 0 0 0 0 0 0 0 0 0 0 0 0 0 0 0 0 0 0 0
$$ 0 0 0 0
$$ ##$ShimPowMaxUC= (0..63)
$$ 130000 130000 130000 130000 130000 130000 130000 130000 130000 130000 130000
$$ 130000 130000 130000 130000 130000 130000 130000 130000 130000 0 0 0 0
$$ 0 0 0 0 0 0 0 0 0 0 0 0 0 0 0 0 0 0 0 0 0 0 0 0 0 0 0 0 0 0 0 0 0 0 0 0
$$ 0 0 0 0
$$ ##$ShimPowMaxUG= (0..63)
$$ 524287 524287 524287 524287 524287 524287 524287 524287 524287 524287 524287
$$ 524287 524287 524287 524287 524287 524287 524287 524287 524287 0 0 0 0
$$ 0 0 0 0 0 0 0 0 0 0 0 0 0 0 0 0 0 0 0 0 0 0 0 0 0 0 0 0 0 0 0 0 0 0 0 0
$$ 0 0 0 0
$$ ##$ShimPowRcbType= 3
$$ ##$ShimPowRes= (0..63)
$$ 1e-20 1e-20 1e-20 1e-20 1e-20 1e-20 1e-20 1e-20 1e-20 1e-20 1e-20 1e-20
$$ 1e-20 1e-20 1e-20 1e-20 1e-20 1e-20 1e-20 1e-20 0 0 0 0 0 0 0 0 0 0 0 0
$$ 0 0 0 0 0 0 0 0 0 0 0 0 0 0 0 0 0 0 0 0 0 0 0 0 0 0 0 0 0 0 0 0
$$ ##$ShimPowRng0= (0..63)
$$ 1 1 1 1 1 1 1 1 1 1 1 1 1 1 1 1 1 1 1 1 0 0 0 0 0 0 0 0 0 0 0 0 0 0 0 0
$$ 0 0 0 0 0 0 0 0 0 0 0 0 0 0 0 0 0 0 0 0 0 0 0 0 0 0 0 0
$$ ##$ShimPowRng1= (0..63)
$$ 1 1 1 1 1 1 1 1 1 1 1 1 1 1 1 1 1 1 1 1 0 0 0 0 0 0 0 0 0 0 0 0 0 0 0 0
$$ 0 0 0 0 0 0 0 0 0 0 0 0 0 0 0 0 0 0 0 0 0 0 0 0 0 0 0 0
$$ ##$ShimPowRng2= (0..63)
$$ 1 1 1 1 1 1 1 1 1 1 1 1 1 1 1 1 1 1 1 1 0 0 0 0 0 0 0 0 0 0 0 0 0 0 0 0
$$ 0 0 0 0 0 0 0 0 0 0 0 0 0 0 0 0 0 0 0 0 0 0 0 0 0 0 0 0
$$ ##$ShimPowRng3= (0..63)
$$ 1 1 1 1 1 1 1 1 1 1 1 1 1 1 1 1 1 1 1 1 0 0 0 0 0 0 0 0 0 0 0 0 0 0 0 0
$$ 0 0 0 0 0 0 0 0 0 0 0 0 0 0 0 0 0 0 0 0 0 0 0 0 0 0 0 0
$$ ##$ShimSysFunc= (0..63)
$$ 1 2 3 4 5 7 9 11 15 16 8 10 12 14 6 17 13 18 19 20 0 0 0 0 0 0 0 0 0 0
$$ 0 0 0 0 0 0 0 0 0 0 0 0 0 0 0 0 0 0 0 0 0 0 0 0 0 0 0 0 0 0 0 0 0 0
$$ ##$ShimSysMatrix= 0
$$ ##$ShimSysType= 1
$$ ##$TFXNUM= 0
$$ ##$TRIPLO2= 0
$$ ##$VTU= 2
$$ ##$VTUETH= <149.236.99.20>
$$ ##$VTUTY= <no>
$$ ##$WBREFAM= (0..15)
$$ 135 116 100 100 100 100 100 100 100 100 100 100 100 100 100 100
$$ ##$WBREFLM= (0..15)
$$ 0 0 0 0 0 0 0 0 0 0 0 0 0 0 0 0
$$ ##$WBREFPH= (0..15)
$$ 71.66 -68.25 0 0 0 0 0 0 0 0 0 0 0 0 0 0
$$ ##$WBSGU= (0..15)
$$ 0 0 0 0 0 0 0 0 0 0 0 0 0 0 0 0
$$ ##$XFAC= 2
$$ ##END=
$$ 
##$DECIM=	2496
##$DSPFVS=	20
##XUNITS=	HZ
##YUNITS=	ARBITRARY UNITS
##FIRSTX=	6408.8702563950400872
##LASTX=	-1603.827990487469151
##DELTAX=	-0.12226593800080123864
##XFACTOR=	1
##YFACTOR=	0.009084778384965363357
##FIRSTY=	10.274202346801757812
##MINY=	5.9410176277160644531
##MAXY=	4242.01513671875
##NPOINTS=	65536
##XYDATA=	(X++(Y..Y))
$$ [...]
4232A351j6k2k3K1K0K1K2K2K1K4K3k2k2m8r2q8m6j0L3N1N1M8Mm2m2k6k6J6J7RJ0J0Rk7k7k6
$$ 1351 1335 1313 1290 1311 1331 1352 1374 1396 1417 1441 1464 1442 1420 1372 1280 1192 1146 1136 1169 1220 1271 1319 1323 1281 1239 1213 1187 1203 1220 1229 1239 1249 1258 1231 1204 1178
4228A178k7RRRRJ5J6k8k7m2m3m2m3j8j7K9P3O5O5K3K3J0l3m8m9MM8M7Mm6m7l0J2M5M4M7M7
$$ 1178 1151 1160 1169 1178 1187 1202 1218 1190 1163 1121 1078 1036 993 975 958 987 1060 1125 1190 1213 1236 1246 1213 1165 1116 1120 1168 1215 1219 1173 1126 1096 1108 1153 1197 1244 1291
4223A291mmmlj2j2j2j2j1j1L2L2K2K2K2K2k6k6pL6P3P4L0j4l5l6l8l8ppJ7k6n9o0J1N3M4K
$$ 1291 1287 1283 1279 1276 1264 1252 1240 1228 1217 1206 1238 1270 1292 1314 1336 1358 1332 1306 1299 1335 1408 1482 1512 1498 1463 1427 1389 1351 1344 1337 1354 1328 1269 1209 1220 1273 1317 1319
4219A319m3m4J%J%NMNMLMl9l9LLLMl2l1l2l1J9K0J9J9P5P4K8j6l0l1om9p8l5J4N7L9L9%jN
$$ 1319 1276 1232 1233 1233 1234 1234 1239 1243 1248 1252 1255 1259 1220 1181 1184 1187 1190 1194 1162 1131 1099 1068 1087 1107 1126 1145 1220 1294 1322 1306 1276 1245 1239 1190 1112 1077 1091 1148 1187 1226 1226 1225 1230
4213A230MNNMNNMJ3J2J3J3J4J5k8k8n0n1l1J1K8K9L1L1M6M6jm3n3n3n3n3n8j5L4P7P6L3j1
$$ 1230 1234 1239 1244 1248 1253 1258 1262 1275 1287 1300 1313 1327 1342 1314 1286 1236 1185 1154 1165 1193 1222 1253 1284 1330 1376 1375 1332 1279 1226 1173 1120 1062 1047 1081 1158 1234 1267 1256
4209A256j1j4j4j4j4M2M2M0M0K7j6RQL3L3l5l5pL6N4N5J6J6k4k4k2K2K1k1q5q4o8k6QRJ1J1
$$ 1256 1245 1231 1217 1203 1189 1231 1273 1313 1353 1380 1364 1373 1381 1414 1447 1412 1377 1370 1406 1460 1515 1531 1547 1523 1499 1477 1499 1520 1499 1414 1330 1262 1236 1244 1253 1264 1275
4204A275J4J4J4J4opooM2M2K4k0l9m0m0l9o8k5K7O9M5M5k3k3k9k9J3J4J7J8J7J7j9j8j9j9
$$ 1275 1289 1303 1317 1331 1325 1318 1312 1306 1348 1390 1414 1394 1355 1315 1275 1236 1168 1143 1170 1239 1284 1329 1306 1283 1254 1225 1238 1252 1269 1287 1304 1321 1302 1284 1265 1246
4200A246J6J6k4k4J6N9L6L5mmnmk3k3k3k3J6J6J3J4mm6k2k3J5J4J4J4J0J0L4rj7j7j9k0K5
$$ 1246 1262 1278 1254 1230 1246 1305 1341 1376 1372 1368 1363 1359 1336 1313 1290 1267 1283 1299 1312 1326 1322 1276 1254 1231 1246 1260 1274 1288 1298 1308 1342 1333 1316 1299 1280 1260 1285
4195A285K5M9Oo1o1m5lM3M4K7j5J5J5J3J2j3j4k9p2n5j1MMJ0J0RJ0k2k3k2k3k4k4K3O6O0O0
$$ 1285 1310 1359 1365 1304 1243 1198 1195 1238 1282 1309 1294 1309 1324 1337 1349 1336 1322 1293 1221 1166 1155 1159 1163 1173 1183 1192 1202 1180 1157 1135 1112 1088 1064 1087 1153 1213 1273
4191A273K1K0K0K0O0O0k9p1p2k9jjJKK6K5j7j7j3j3j1j0pL6P9P8M0l0o2o2m6m6mlJKJJJ2J2
$$ 1273 1294 1314 1334 1354 1414 1474 1445 1374 1302 1273 1272 1271 1272 1274 1300 1325 1308 1291 1278 1265 1254 1244 1237 1273 1352 1430 1470 1440 1378 1316 1270 1224 1220 1217 1218 1220 1221 1222 1234 1246
4186A246J2J2NOl7l7JKKKJ7J6k7k6k7k8k4k5rL3RRK0K0K0J9J9J8k4k4m8m8jM1L5L5L8L8mn
$$ 1246 1258 1270 1275 1281 1244 1207 1208 1210 1212 1214 1231 1247 1220 1194 1167 1139 1115 1090 1081 1114 1123 1132 1152 1172 1192 1211 1230 1248 1224 1200 1152 1104 1103 1144 1179 1214 1252 1290 1286 1281
4181A281mmk2k2k1k2J0J0N0N0P5L3j5j5pqn2r5j09o6k2k1llM0L9K7K7P0O9J6J6J7J6j8j8j8
$$ 1281 1277 1273 1251 1229 1208 1186 1196 1206 1256 1306 1381 1414 1399 1384 1377 1369 1317 1222 1113 1047 1025 1004 1001 998 1038 1077 1104 1131 1201 1270 1286 1302 1319 1335 1317 1299 1281
4176A281j8rrm9m9l7NK4K4J8J8J7J8K2K1J9J9lm6k2k2lllmj8j8%M3O9P0K5j8m0m0m3m2RRR
$$ 1281 1263 1254 1245 1196 1147 1110 1115 1139 1163 1181 1199 1216 1234 1256 1277 1296 1315 1312 1266 1244 1222 1219 1216 1213 1209 1191 1173 1173 1216 1285 1355 1380 1362 1322 1282 1239 1197 1206 1215 1224
4172A224R%%K4j9q9q8n8J4P4J16J19P6Ll9j8j8llllj5j4j5j5mmO7O7L5L6qpn8n8n8n7nmL9
$$ 1224 1233 1233 1233 1257 1238 1149 1061 1003 1017 1091 1207 1326 1402 1405 1366 1348 1330 1327 1324 1321 1318 1303 1289 1274 1259 1255 1251 1318 1385 1420 1456 1448 1441 1383 1325 1267 1210 1205 1201 1240
4167A240L8jkM1M1M3M2%%j3j3j2j3l5l5l5l5j9k0j7j7n5j1L5L6J3J4N3N3Pl5l9NK5j6l3l3
$$ 1240 1278 1277 1275 1316 1357 1400 1442 1442 1442 1429 1416 1404 1391 1356 1321 1286 1251 1232 1212 1195 1178 1123 1112 1147 1183 1196 1210 1263 1316 1323 1288 1249 1254 1279 1263 1230 1197
4162A197K2K2k1k0kkkkL7L7J9k5l2l3QQllklL2L2L2L2k0j9k0k0k0k0k0j9K8K9K9K9J8J8J8
$$ 1197 1219 1241 1220 1200 1198 1196 1194 1192 1229 1266 1285 1260 1228 1195 1203 1211 1208 1205 1203 1200 1232 1264 1296 1328 1308 1289 1269 1249 1229 1209 1189 1170 1198 1227 1256 1285 1303 1321 1339
4157A339J9MNMNk0k1k0k0K7K7K7K7K2K3K0K0J8k5n7p8o8k5J8J8j7n9n7j5L7N9P1L0j5l7l9
$$ 1339 1358 1362 1367 1371 1376 1356 1335 1315 1295 1322 1349 1376 1403 1425 1448 1468 1488 1506 1481 1424 1346 1278 1253 1271 1289 1272 1213 1156 1141 1178 1237 1308 1338 1323 1286 1247
4153A247j8L0K9L1L1J0RJ0RPPPPL2L2J3l0l7l8LK%jj%MNNMm5m5klJ3J3J2J3K2K2J9J9j6n8
$$ 1247 1229 1259 1288 1319 1350 1360 1369 1379 1388 1395 1402 1409 1416 1448 1480 1493 1463 1426 1388 1391 1393 1393 1392 1391 1391 1395 1400 1405 1409 1364 1319 1317 1314 1327 1340 1352 1365 1387 1409 1428 1447 1431 1373
4148A373m6k4LK4K3Lk5m5m6k4NK7J6J7j5j4j5j4J7J8J7J7%%j%NNNNL9M0llLKLKk2k2k2k3k8
$$ 1373 1327 1303 1306 1330 1353 1356 1331 1286 1240 1216 1221 1248 1264 1281 1266 1252 1237 1223 1240 1258 1275 1292 1292 1292 1291 1291 1296 1301 1306 1311 1350 1390 1387 1384 1387 1389 1392 1394 1372 1350 1328 1305 1277
4142A277k8J4J5J4J4k8k8mlllK6K6K4K5l1n2o1j9MM7O8O8J1J1J1J1m5m6n5l4mL2K5Mppqrm
$$ 1277 1249 1263 1278 1292 1306 1278 1250 1246 1243 1240 1237 1263 1289 1313 1338 1307 1255 1194 1175 1179 1226 1294 1362 1373 1384 1395 1406 1361 1315 1260 1226 1222 1254 1279 1283 1276 1269 1261 1252 1248
4138A248nnnmnppk2n7n4k0PM2M5Qj9j9K1K1K2K2K2K2j6j6j6j5J8J9k4k3KLKLJ3J3J3J4j7j6
$$ 1248 1243 1238 1233 1229 1224 1217 1210 1188 1131 1077 1057 1064 1106 1151 1159 1140 1121 1142 1163 1185 1207 1229 1251 1235 1219 1203 1188 1206 1225 1201 1178 1180 1183 1185 1188 1201 1214 1227 1241 1224 1208
4133A208K6K6%%j%J6J6k7k7J5J5J5J5J4J3J3J4k3k3k3k3m8m8nnK1K2O4O4J2J2J2J3j8j7j7
$$ 1208 1234 1260 1260 1260 1259 1259 1275 1291 1264 1237 1252 1267 1282 1297 1311 1324 1337 1351 1328 1305 1282 1259 1211 1163 1158 1153 1174 1196 1260 1324 1336 1348 1360 1373 1355 1338 1321
4128A321j7LLLLj4j5j5j5m0m1m1m1J0RN3N2J2J2J2J2rqk9OK2%J5J5J6J5k7k8l4l5PQM2M3M1
$$ 1321 1304 1307 1310 1313 1316 1302 1287 1272 1257 1217 1176 1135 1094 1104 1113 1166 1218 1230 1242 1254 1266 1257 1249 1220 1226 1248 1248 1263 1278 1294 1309 1282 1254 1220 1185 1192 1200 1242 1285 1326
4123A326M1O7M5j6o0o4m3k6mK6M7J8k4k5k4J6J5J9J8Lm1n3j1L5P8N5J2pm9p5n4NM8P1K8J2
$$ 1326 1367 1434 1479 1463 1403 1339 1296 1270 1266 1292 1339 1357 1333 1308 1284 1300 1315 1334 1352 1355 1314 1261 1250 1285 1363 1418 1430 1423 1374 1299 1245 1250 1298 1369 1397 1409
4119A409J2oopoj7j6j7j6JJKJj7j7j7j7lmmllmK5M6L4j0k7k6j6j7m0LM1M1k8k8k1k2j9j9L
$$ 1409 1421 1415 1409 1402 1396 1379 1363 1346 1330 1331 1332 1334 1335 1318 1301 1284 1267 1264 1260 1256 1253 1250 1246 1271 1317 1351 1341 1314 1288 1272 1255 1215 1218 1259 1300 1272 1244 1223 1201 1182 1163 1166
4114A166M6M6LooqrrqrqJ5J5J5J5NMNNN4N5N2N1L3j0m2o4m7mj7l8m8k7KKJ5J5km4m8nK7M9
$$ 1166 1212 1258 1261 1255 1249 1241 1232 1223 1215 1206 1198 1213 1228 1243 1258 1263 1267 1272 1277 1331 1386 1438 1489 1522 1512 1470 1406 1359 1355 1338 1300 1252 1225 1227 1229 1244 1259 1257 1213 1165 1160 1187 1236
4108A236L9L8klQQQRj1j2j1j1qqrqJ2J1N5N4K8K8K5K5J4k8m7m7j0j1j0j1LLm0m0p3p4r5n2
$$ 1236 1275 1313 1311 1308 1316 1324 1332 1341 1330 1318 1307 1296 1288 1280 1271 1263 1275 1286 1341 1395 1423 1451 1476 1501 1515 1487 1440 1393 1383 1372 1362 1351 1354 1357 1317 1277 1204 1130 1035 983
4103I83qL5L8nK2K2J9J9K5K6K5K6%J%JrrrrK8K8K7K8J7J7k6k6j5j6j5j5L0L0J2l1m4m4m3m4
$$ 983 975 1010 1048 1043 1065 1087 1106 1125 1150 1176 1201 1227 1227 1228 1228 1229 1220 1211 1202 1193 1221 1249 1276 1304 1321 1338 1312 1286 1271 1255 1240 1225 1255 1285 1297 1266 1222 1178 1135 1091
4099A091K3O5O6K3k3k2k5k5j7j8K6K6K6K6K7K6J3J3J3J3K7K6j6j6k0j9k0j9k1k2J9J9j1n4
$$ 1091 1114 1179 1245 1268 1245 1223 1198 1173 1156 1138 1164 1190 1216 1242 1269 1295 1308 1321 1334 1347 1374 1400 1384 1368 1348 1329 1309 1290 1269 1247 1266 1285 1274 1220
4094A220k9l0K9K8K5K6L3rk5k6J4N7Oo6q1j0M5M5J4J4J4J4l0k9k7k7o6k3K4K4L7L8N9J6l7
$$ 1220 1191 1161 1190 1218 1243 1269 1302 1293 1268 1242 1256 1313 1319 1253 1172 1162 1207 1252 1266 1280 1294 1308 1278 1249 1222 1195 1129 1106 1130 1154 1191 1229 1288 1304 1267
4090A267q0n9n8m4m4LM6R0Q9M5Lm0l9JJM7M7M7M7J3J3J0J1l5p7p8l5j7j8MM7P3P3N7J4l1l1
$$ 1267 1187 1128 1070 1026 982 985 1031 1121 1210 1255 1258 1218 1179 1180 1181 1228 1275 1322 1369 1382 1395 1405 1416 1381 1304 1226 1191 1174 1156 1160 1207 1280 1353 1410 1424 1393 1362
4086A362l4l4K1K1J9J8L1j2l0l1L3L3j0j0j9j9j9j9l1l0J2J2L0K9J1l3l9l9K9L0J8J9J6J6
$$ 1362 1328 1294 1315 1336 1355 1373 1404 1392 1362 1331 1364 1397 1387 1377 1358 1339 1320 1301 1270 1240 1252 1264 1294 1323 1334 1301 1262 1223 1252 1282 1300 1319 1335 1351
4081A351k1o3p9p9J3N6N6J3QQNNk7k7J6J6LKLKQQQRj7j7j7j7PPQPK7K8K5K5L8mn1n2l0l0J2
$$ 1351 1330 1267 1188 1109 1122 1178 1234 1247 1255 1263 1268 1273 1246 1219 1235 1251 1254 1256 1259 1261 1269 1277 1285 1294 1277 1260 1243 1226 1233 1240 1248 1255 1282 1310 1335 1360 1398 1394 1343 1291 1261 1231 1243
4076A243J3J4J4k6k6j3L0OOqrqqK6K7K6K7M0M0on0o5o4LMK3K2K2K2rj0j0j0l2l2J0J1J5J5
$$ 1243 1256 1270 1284 1258 1232 1219 1249 1255 1261 1253 1244 1236 1228 1254 1281 1307 1334 1374 1414 1408 1358 1293 1229 1232 1236 1259 1281 1303 1325 1316 1306 1296 1286 1254 1222 1232 1243 1258 1273
4071A273k5k6k7J5N9N9M3jj9j8k2k1k2k1QQQQl4l4l5l4l0l1J2J2J8J9n0n1k3J9L8L8KLj9K3
$$ 1273 1248 1222 1195 1210 1269 1328 1371 1370 1351 1333 1311 1290 1268 1247 1255 1263 1271 1279 1245 1211 1176 1142 1112 1081 1093 1105 1123 1142 1092 1041 1018 1037 1075 1113 1115 1118 1099 1122
4067A122P0J13Q9Q8L6on4n4n6n5n6n5K3K4K4K4M5M5K7j6j7j6j9j9l2l3l2l3l9l9l9l9NMNN
$$ 1122 1192 1305 1394 1482 1518 1512 1458 1404 1348 1293 1237 1182 1205 1229 1253 1277 1322 1367 1394 1378 1361 1345 1326 1307 1275 1242 1210 1177 1138 1099 1060 1021 1026 1030 1035 1040
4062A040N4N3L8mj6K7M1M1rn1k7k7NMNNRRJ0RJ1J2J2J2l4l4RJ0J8J8J6J6Rl3j2L1P1P2KLj5
$$ 1040 1094 1147 1185 1181 1165 1192 1233 1274 1265 1214 1187 1160 1165 1169 1174 1179 1188 1197 1207 1216 1227 1239 1251 1263 1229 1195 1204 1214 1232 1250 1266 1282 1291 1258 1246 1277 1348 1420 1422 1425 1410
4057A410j5j5j5MMj4n7n8n7j8j7l2l2J1J1PPl3l4nL7Q2Q2N6J4nnLLLLk8k8k5k5PM8M9On2n2
$$ 1410 1395 1380 1365 1369 1373 1359 1302 1244 1187 1169 1152 1120 1088 1099 1110 1117 1124 1091 1057 1052 1089 1171 1253 1309 1323 1318 1313 1316 1319 1322 1325 1297 1269 1244 1219 1226 1274 1323 1329 1277 1225
4052A225qL5K7K7QPnnm7m8j4j5j4j4QQPQJ9J9J8J9JJJJl1l1l1l1j4j4j4j5J5J4k6k6j4K9P3
$$ 1225 1217 1252 1279 1306 1314 1321 1316 1311 1264 1216 1202 1187 1173 1159 1167 1175 1182 1190 1209 1228 1246 1265 1266 1267 1268 1269 1238 1207 1176 1145 1131 1117 1103 1088 1103 1117 1091 1065 1051 1080 1153
4047A153P3O9K7k0k1QPqn2l9LM7M8N1N1N1N1K8K7j5j5l3l3j1j2o6o7k4k4rrJ2J2jkk3k2J7
$$ 1153 1226 1295 1322 1302 1281 1289 1296 1288 1236 1197 1200 1247 1295 1346 1397 1448 1499 1527 1554 1539 1524 1491 1458 1447 1435 1369 1302 1278 1254 1245 1236 1248 1260 1259 1257 1234 1212 1229
4043A229J8L9L9L5L5J3J4J2J3l0l0l4l4RQJ0Rl4l3l4l4j1j0J4N0Q2O1L1mk8k8j5j4K8K8JK
$$ 1229 1247 1286 1325 1360 1395 1408 1422 1434 1447 1417 1387 1353 1319 1328 1336 1346 1355 1321 1288 1254 1220 1209 1199 1213 1263 1345 1406 1437 1433 1405 1377 1362 1348 1376 1404 1405 1407
4038A407JKrrqrk4k4k4k3KLM3M3j3m8m1j9OOQPK5K5K6K5LKLLm1m1m1m0nmK4M6N4J8mlMMLK
$$ 1407 1408 1410 1401 1392 1384 1375 1351 1327 1303 1280 1282 1285 1328 1371 1358 1310 1269 1250 1256 1262 1270 1277 1302 1327 1353 1378 1381 1383 1386 1389 1348 1307 1266 1226 1221 1217 1241 1287 1341 1359 1355 1352 1356 1360 1363 1365
4033A365j8l9k8QK6Mk5k4j5j6j5j5l7l7k2K8O9P0N1N2J6J5J6J6MMo5o5n1rJ1J0KKKKL7L6O1
$$ 1365 1347 1308 1280 1288 1314 1318 1293 1269 1254 1238 1223 1208 1171 1134 1112 1140 1209 1279 1330 1382 1398 1413 1429 1445 1449 1453 1388 1323 1272 1263 1274 1284 1286 1288 1290 1292 1329 1365 1426
4028A426J8LL%%k6k5k6k5J0J1J1J1k7k8J7O0P6L3m1q5q2m1j9K2N7N7M1kk3k2k5k6m4m5KM6
$$ 1426 1444 1447 1450 1450 1450 1424 1399 1373 1348 1358 1369 1380 1391 1364 1336 1353 1413 1489 1522 1481 1396 1314 1273 1254 1276 1333 1390 1431 1429 1406 1384 1359 1333 1289 1244 1246 1292
4023A292M6M6k3k2L7L7J8k4n5n6J4J3PPPPK6K6j6j7l1l2k9k8j2L1L1j2k5k5J7O0N3J0onM5
$$ 1292 1338 1384 1361 1339 1376 1413 1431 1407 1352 1296 1310 1323 1330 1337 1344 1351 1377 1403 1387 1370 1339 1307 1278 1250 1238 1269 1300 1288 1263 1238 1255 1315 1368 1378 1372 1367 1412
4019A412M5M5M5l1l0l0l1j9k0j9k0k5k6m9pK7K7L0L0N8N9M0lm6m6l0J2K5K5j5j5k8k7k8k8
$$ 1412 1457 1502 1547 1516 1486 1456 1425 1406 1386 1367 1347 1322 1296 1247 1240 1267 1294 1324 1354 1412 1471 1511 1508 1462 1416 1386 1398 1423 1448 1433 1418 1390 1363 1335 1307
4014A307J4J3J3J4kkJ4N7N6J4l1l2l0l0l0l0l3l2l2l2L8L8L5L5M6Lm4m5l6l6OPNOONJ%%%L8
$$ 1307 1321 1334 1347 1361 1359 1357 1371 1428 1484 1498 1467 1435 1405 1375 1345 1315 1282 1250 1218 1186 1224 1262 1297 1332 1378 1381 1337 1292 1256 1220 1226 1233 1238 1244 1250 1255 1256 1256 1256 1256 1294
4009A294L7onl2l2n7j3L7L6M0L9%J%%KKKKRQj1n3p8p8o2j9L3L3L6L6J3J3J3J3K1K2K1K1qq
$$ 1294 1331 1325 1320 1288 1256 1199 1186 1223 1259 1299 1338 1338 1339 1339 1339 1341 1343 1345 1347 1356 1364 1353 1300 1222 1144 1082 1063 1096 1129 1165 1201 1214 1227 1240 1253 1274 1296 1317 1338 1330 1322
4004A322n1n1l5l5l5l4m9m8noN2N3N2N2K7K6K6K6L2L2j0j0l5l5l5l5J6J6J6J5j1j1j2j1K8
$$ 1322 1271 1220 1185 1150 1115 1081 1032 984 979 973 1025 1078 1130 1182 1209 1235 1261 1287 1319 1351 1341 1331 1296 1261 1226 1191 1207 1223 1239 1254 1243 1232 1220 1209 1237
4000A237K8K8K7j7j8j7j8J4J5J4J5MNj0J1M3%m3m3lM0jm3n5j3LLLKLKononmlmlk3k2K1K0J2
$$ 1237 1265 1293 1320 1303 1285 1268 1250 1264 1279 1293 1308 1312 1317 1307 1318 1361 1361 1318 1275 1272 1312 1311 1268 1213 1200 1203 1206 1209 1211 1214 1216 1210 1205 1199 1194 1190 1187 1183 1180 1157 1135 1156 1176 1188
3995A188J1J2J3L3N4O3K1m0q3p3n0l4j3J9K0nmnnL5L5L4L5K1K1j9j9oL5K3Jl1n1k3K0N4N5
$$ 1188 1199 1211 1224 1257 1311 1374 1395 1355 1272 1199 1149 1115 1102 1121 1141 1136 1132 1127 1122 1157 1192 1226 1261 1282 1303 1284 1265 1259 1294 1317 1318 1287 1236 1213 1233 1287 1342
3990A342J2l0j6K7J3j0KJ%%l1l0l0l0nonnK0K0K0K1K2K3K3K3L2L2j1j1k3k3k4k3l2l3J0J1
$$ 1342 1354 1324 1308 1335 1348 1338 1340 1341 1341 1341 1310 1280 1250 1220 1215 1209 1204 1199 1219 1239 1259 1280 1302 1325 1348 1371 1403 1435 1424 1413 1390 1367 1343 1320 1288 1255 1265 1276
3986A276J1J1J1J1j4j4j7j7l5p8o3m2kM0N8N8N7J4nmOOl7l7J0RJ0RQQQPj4j4j5j4llM0M0M5
$$ 1276 1287 1298 1309 1320 1306 1292 1275 1258 1223 1145 1082 1040 1038 1078 1136 1194 1251 1265 1260 1256 1262 1268 1231 1194 1204 1213 1223 1232 1240 1248 1256 1263 1249 1235 1220 1206 1203 1200 1240 1280 1325
3981A325M5LKl1l2l1l2kkkkk7k8k7k8mmk9J5M2M2j1l3RN2P8N7j0n3l9j8K6O7O8K6k7m8l9l9
$$ 1325 1370 1373 1375 1344 1312 1281 1249 1247 1245 1243 1241 1214 1186 1159 1131 1127 1123 1094 1109 1151 1193 1182 1149 1158 1210 1288 1345 1335 1282 1243 1225 1251 1318 1386 1412 1385 1337 1298 1259
3976A259opL7L6M0M0klopQj3l3J0K7K8nnnmm5m4m4m4nnklK0O3O4K1J0L1K8Pj9k0k0k1k6k6
$$ 1259 1253 1246 1283 1319 1359 1399 1397 1394 1388 1381 1389 1376 1343 1353 1380 1408 1403 1398 1393 1389 1344 1300 1256 1212 1207 1202 1200 1197 1217 1280 1344 1365 1375 1406 1434 1441 1422 1402 1382 1361 1335 1309
3971A309LK3km6l0rL0N1K2k1o0n9k0k0k8k9j0L3L3L4L6L6mlllJ9K0k3k4j0rj0j0K6K7N1QK8
$$ 1309 1312 1335 1333 1287 1257 1248 1278 1329 1351 1330 1270 1211 1191 1171 1143 1114 1104 1137 1170 1204 1240 1276 1272 1269 1266 1263 1282 1302 1279 1255 1245 1236 1226 1216 1242 1269 1320 1328 1356
3966A356K7K5K5L1L1j7n9o7o7JJ%J%%NMNNJ0J1J0J1J0J1J1J0oonoJ6J7J6J6L6L6J6k5n7n7
$$ 1356 1383 1408 1433 1464 1495 1478 1419 1352 1285 1286 1287 1287 1288 1288 1288 1293 1297 1302 1307 1317 1328 1338 1349 1359 1370 1381 1391 1385 1379 1374 1368 1384 1401 1417 1433 1469 1505 1521 1496 1439 1382
3961A382j2L0L9L9j%PPPPj3j3n6n5o1o1q5m3KJNMO8O7O5O5M5Lm4m4n1n0m8m8MM7O5O5N5N6
$$ 1382 1370 1400 1439 1478 1477 1477 1484 1491 1498 1505 1492 1479 1423 1368 1307 1246 1161 1118 1120 1121 1126 1130 1198 1265 1330 1395 1440 1443 1399 1355 1304 1254 1206 1158 1162 1209 1274 1339 1394 1450
3956A450kp3p7l5L6L6onooJ3J3J3J3K0J9k4k3k3k3k4k3K8K7K8K7L1L0L1L1k0k0k0k1l2l2J0
$$ 1450 1448 1375 1298 1263 1299 1335 1329 1324 1318 1312 1325 1338 1351 1364 1384 1403 1379 1356 1333 1310 1286 1263 1291 1318 1346 1373 1404 1434 1465 1496 1476 1456 1436 1415 1383 1351 1361
3951A361J1K9L0L0L0k0k0o3o3J8J9J9J9L3L3j0rk1k0K2K3j2j2j2j2K3K3m8m9j7j8K5K5l8l9
$$ 1361 1372 1401 1431 1461 1491 1471 1451 1388 1325 1343 1362 1381 1400 1433 1466 1456 1447 1426 1406 1428 1451 1439 1427 1415 1403 1426 1449 1401 1352 1335 1317 1342 1367 1329 1290
3947A290NMRRRRl0l0J2J3j9k0j9j9KJM4M4O4O4ppooopM1M1lkL0L0L0L0lkm6m5l2l2l2l2L0
$$ 1290 1295 1299 1308 1317 1326 1335 1305 1275 1287 1300 1281 1261 1242 1223 1225 1226 1270 1314 1378 1442 1435 1428 1422 1416 1410 1403 1444 1485 1482 1480 1510 1540 1570 1600 1597 1595 1549 1504 1472 1440 1408 1376 1406
3942A406K9K9K9j2j3j2j3j1j2N9O0J09J10J76K18K10O7p2j57j25j25j30j30j47j47r9r8p0
$$ 1406 1435 1464 1493 1481 1468 1456 1443 1432 1420 1479 1539 1648 1758 1934 2152 2362 2429 2357 2200 2075 1950 1820 1690 1543 1396 1297 1199 1129
3938A129J6O7O8M9M9PPMNNNn5n4n5n5M9M8M9M8POPPkjkjn2n2j0rjkjjllllK2K2K2K2K6K6K6
$$ 1129 1145 1212 1280 1329 1378 1385 1392 1396 1401 1406 1411 1356 1302 1247 1192 1241 1289 1338 1386 1393 1399 1406 1413 1411 1410 1408 1407 1355 1303 1293 1284 1283 1281 1280 1279 1276 1273 1270 1267 1289 1311 1333 1355 1381 1407 1433
3933A433K6j3j3j3j3k9k9k8k9lmmlK0K0OK7N8J5o2j06r1p1n2l0K7P0P3L0k3kK7K6K2K1K2K1
$$ 1433 1459 1446 1433 1420 1407 1378 1349 1321 1292 1289 1285 1281 1278 1298 1318 1324 1351 1409 1424 1362 1256 1165 1094 1042 1012 1039 1109 1182 1212 1189 1187 1214 1240 1262 1283 1305 1326
3928A326K4K5K4K4k9k9k9k9k9k9k8k9n0n1l1J1L0L0L3L3K0K0K0K1k6k6j0L3K4j9QQopn0m9
$$ 1326 1350 1375 1399 1423 1394 1365 1336 1307 1278 1249 1221 1192 1142 1091 1060 1071 1101 1131 1164 1197 1217 1237 1257 1278 1252 1226 1216 1249 1273 1254 1262 1270 1264 1257 1207 1158
3924A158J4J3J4J4RRRJ0k1k0j7j8pL6N2N1Pl7l8NL4J1m2m2k4J9Rj2k6J7M8P0O8K5rl0m8m7
$$ 1158 1172 1185 1199 1213 1222 1231 1240 1250 1229 1209 1192 1174 1167 1203 1255 1306 1313 1276 1238 1243 1277 1288 1246 1204 1180 1199 1208 1196 1170 1187 1235 1305 1373 1398 1389 1359 1311 1264
3919A264k9J4K2M4M6K4j0l2l2j2rj0qqJ1J1om8m8nJ1J1nnmnK3K3K3K3l8l8l8l8KJJKJ5J6J5
$$ 1264 1235 1249 1271 1315 1361 1385 1375 1343 1311 1299 1290 1280 1272 1264 1275 1286 1280 1232 1184 1179 1190 1201 1196 1191 1187 1182 1205 1228 1251 1274 1236 1198 1160 1122 1124 1125 1126 1128 1143 1159 1174
3914A174J5L9L9M9K7j4n6m2k2RN2M0J8qk9lM0M2jj8j7j5j4JM4L2j1MK5M1M2k8k8l0l0J2J3
$$ 1174 1189 1228 1267 1316 1343 1329 1273 1231 1209 1218 1270 1310 1328 1320 1291 1288 1328 1370 1369 1351 1334 1319 1305 1306 1350 1382 1371 1375 1400 1441 1483 1455 1427 1397 1367 1379 1392
3910A392nnnok4k5k5k4m8m7k9J3L7L6M9K7om8p8n6rL4N4N4J5J5k8k8jjkjL6L6L7L6j0j1j0
$$ 1392 1387 1382 1377 1371 1347 1322 1297 1273 1225 1178 1149 1162 1199 1235 1284 1311 1305 1257 1179 1123 1114 1148 1202 1256 1271 1286 1258 1230 1229 1228 1226 1225 1261 1297 1334 1370 1360 1349 1339
3905A339j0JKJJKJJJkkkkJ6J6J3J3Ml9l9ML3L3opj9j8j9j8k2k1k1k1J2J2J2J2JJJKK1K1K1
$$ 1339 1329 1330 1332 1333 1334 1336 1337 1338 1339 1337 1335 1333 1331 1347 1363 1376 1389 1393 1354 1315 1319 1352 1385 1379 1372 1353 1335 1316 1298 1276 1255 1234 1213 1225 1237 1249 1261 1262 1263 1264 1266 1287 1308 1329
3900A329K1j8j8j8j8J1J1J1J1J%%JMNMMJ5J6J2J2k2o5o6k2L0L0L0L0J7k6m4m4K0K1M2jk9p2
$$ 1329 1350 1332 1314 1296 1278 1289 1300 1311 1322 1323 1323 1323 1324 1328 1333 1337 1341 1356 1372 1384 1396 1374 1309 1243 1221 1251 1281 1311 1341 1358 1332 1288 1244 1264 1285 1327 1326 1297 1225
3895A225p4l2KLMNk9l0k7k6K8P1P1K8K0K0J7J7j7j8j7j8K4K3j9j9jkM2M1j3j3j4j3j0j1j0
$$ 1225 1151 1119 1121 1124 1128 1133 1104 1074 1047 1021 1049 1120 1191 1219 1239 1259 1276 1293 1276 1258 1241 1223 1247 1270 1251 1232 1231 1229 1271 1312 1299 1286 1272 1259 1249 1238 1228
3890A228j1K3K4K3K4kjm1m2m1KN0M9N7N7j4j4LLj6n9m1m2jkM0L9llK6K6K7K6kkL8L9K3k0l5
$$ 1228 1217 1240 1264 1287 1311 1309 1308 1267 1225 1184 1186 1236 1285 1342 1399 1385 1371 1374 1377 1361 1302 1261 1219 1218 1216 1256 1295 1292 1289 1315 1341 1368 1394 1392 1390 1428 1467 1490 1470 1435
3885A435l6j7K5K5j8m2m2m5m5l6l5L6L6K1K0K1K1J3J3J0J1pm9o5o5l1J2L0L1K8K9K4K4lp4
$$ 1435 1399 1382 1407 1432 1414 1372 1330 1285 1240 1204 1169 1205 1241 1262 1282 1303 1324 1337 1350 1360 1371 1364 1315 1250 1185 1154 1166 1196 1227 1255 1284 1308 1332 1329 1255
3881A255j01n8L6L6mmOOOOM5M5Jm3n9j7K7K7M2M2jjnnnnOOONk7k8rL4O0N9j0n4o1j9j%l2J1
$$ 1255 1154 1096 1132 1168 1164 1160 1166 1172 1178 1184 1229 1274 1275 1232 1173 1156 1183 1210 1252 1294 1293 1292 1287 1282 1277 1272 1278 1284 1290 1295 1268 1240 1231 1265 1325 1384 1374 1320 1259 1240 1239 1239 1207 1218
3876A218N8N9K1K1J8J9N5J2l5l5k0k1k1k0j5j4j5j4llklK2K2K2K3QQRQk8k8j0L4P8P9L4rl5
$$ 1218 1276 1335 1356 1377 1395 1414 1469 1481 1446 1411 1391 1370 1349 1329 1314 1300 1285 1271 1268 1265 1263 1260 1282 1304 1326 1349 1357 1365 1374 1382 1354 1326 1316 1350 1428 1507 1541 1532 1497
3871A497l5l8l8n4n4j1j2MMMMj9j9m3jL7L7J7J8J%M4M3RJ0j2j2J6J7km5r0r0o1J0L1L1qpr
$$ 1497 1462 1424 1386 1332 1278 1267 1255 1259 1263 1267 1271 1252 1233 1190 1189 1226 1263 1280 1298 1299 1299 1343 1386 1395 1405 1393 1381 1397 1414 1412 1367 1277 1187 1126 1136 1167 1198 1190 1183 1174
3866A174rJ2J3jjkjL8L7lkLM5O4O4J8J8k5k4mmlml1l1l2l1k3k3k1k1QN0N0Ql7l6j7j8o8o9
$$ 1174 1165 1177 1190 1189 1188 1186 1185 1223 1260 1257 1255 1258 1303 1367 1431 1449 1467 1442 1418 1414 1410 1407 1403 1372 1341 1309 1278 1255 1232 1211 1190 1198 1248 1298 1306 1269 1233 1216 1198 1130 1061
3861A061n0pN3N4N6N6M1M1M1M1J4J3J4J3J4J4J3J4k0k0k0j9k6k5llk8pN5R7M8Oj0j0jkk2k3
$$ 1061 1011 1004 1057 1111 1167 1223 1264 1305 1346 1387 1401 1414 1428 1441 1455 1469 1482 1496 1476 1456 1436 1417 1391 1366 1363 1360 1332 1325 1380 1477 1525 1531 1521 1511 1510 1508 1486 1463
3856A463o3o3p2n1j1L2O2M1j3l5k8J5K2JooJ4J5J4J4L1L0j2j3l9l9n8n9j9K4O8O9K5j7m7k5
$$ 1463 1400 1337 1265 1214 1203 1235 1297 1338 1325 1290 1262 1277 1299 1300 1294 1288 1302 1317 1331 1345 1376 1406 1394 1381 1342 1303 1245 1186 1167 1191 1259 1328 1353 1336 1289 1264
3852A264kK0QRM1M1K2k1k7k7rrnonoJ1J0J1J0j2j1j2j2m6m7mlK0K1M2M2K1K1J8J8j0n3m0k0
$$ 1264 1262 1282 1290 1299 1340 1381 1403 1382 1355 1328 1319 1310 1305 1299 1294 1288 1299 1309 1320 1330 1318 1307 1295 1283 1237 1190 1186 1183 1203 1224 1266 1308 1329 1350 1368 1386 1376 1323 1283 1263
3847A263J1J0rj0k2k2m8o9n2J9O6Q6P9P8M9k3q7q8m7npn0m5kK7P0O0L9K9K9K8K7kkkkkkkk
$$ 1263 1274 1284 1275 1265 1243 1221 1173 1104 1052 1071 1137 1223 1302 1380 1429 1406 1319 1231 1184 1179 1172 1122 1077 1075 1102 1172 1232 1271 1300 1329 1357 1384 1382 1380 1378 1376 1374 1372 1370 1368
3842A368l6l6l7l6KJKKJ2J3rrj9j9M9N0lm6m6lPPJ0Rj4j4j4j4J2J2J2J3j6j5OON7N7J4J5l
$$ 1368 1332 1296 1259 1223 1225 1226 1228 1230 1242 1255 1246 1237 1218 1199 1248 1298 1295 1249 1203 1200 1207 1214 1224 1233 1219 1205 1191 1177 1189 1201 1213 1226 1210 1195 1201 1207 1264 1321 1335 1350 1347
3837A347lllKKm1m1lmJ8J7KKk0k0J3J2l0l0l1l2j3L0P8P7O2J9j0j0QRk6k6k5k6k2k1k2k2j
$$ 1347 1344 1341 1338 1340 1342 1301 1260 1257 1253 1271 1288 1290 1292 1272 1252 1265 1277 1247 1217 1186 1154 1141 1171 1249 1326 1388 1407 1397 1387 1395 1404 1378 1352 1327 1301 1279 1258 1236 1214 1213
3832A213jJ8O0O1O2K1K1J5J5J5J5L5L5N9J6m1m0m3m3l6l5QPMMLMK1K1k2k2k8k7poJ6J6onl1
$$ 1213 1212 1230 1290 1351 1413 1434 1455 1470 1485 1500 1515 1550 1585 1644 1660 1619 1579 1536 1493 1457 1422 1430 1437 1441 1445 1448 1452 1473 1494 1472 1450 1422 1395 1388 1382 1398 1414 1408 1403 1372
3827A372l1k8k8J8O2O1J8k3k4k7k6l8l9MNK6K7M7M8K1K1K0K1j2j2j2j2l8l8l8l9RQj3j2k5
$$ 1372 1341 1313 1285 1303 1365 1426 1444 1421 1397 1370 1344 1306 1267 1271 1276 1302 1329 1376 1424 1445 1466 1486 1507 1495 1483 1471 1459 1421 1383 1345 1306 1315 1323 1310 1298 1273
3823A273k5J8J7NNNMj6j7K6K7popok6k6k3k3kM1N9O0J1J1j1j0j5j6j5j5mmL6L5Ll9n9n8J2
$$ 1273 1248 1266 1283 1288 1293 1298 1302 1286 1269 1295 1322 1315 1309 1302 1296 1270 1244 1221 1198 1196 1237 1296 1356 1367 1378 1367 1357 1342 1326 1311 1296 1292 1288 1324 1359 1362 1323 1264 1206 1218
3818A218J2J2J1J0RJ0RRJ0RJ0K1K1K2K1J1J0J1J1k0j9k0j9ONONJ6J7J6J6l0k9m9m8j7K5M4
$$ 1218 1230 1242 1253 1263 1272 1282 1291 1300 1310 1319 1329 1350 1371 1393 1414 1425 1435 1446 1457 1437 1418 1398 1379 1385 1390 1396 1401 1417 1434 1450 1466 1436 1407 1358 1310 1293 1318 1362
3814A362M4M6M7MMl0l0rqk6k6qpk7o9q8m5LM7M9Oj8j9k1k1J2J2L0P2R9P8L4l8n6n5n9o0o0
$$ 1362 1406 1452 1499 1503 1507 1477 1447 1438 1430 1404 1378 1370 1363 1336 1267 1179 1134 1137 1184 1233 1239 1221 1202 1181 1160 1172 1184 1214 1286 1385 1463 1497 1459 1403 1348 1289 1229 1169
3809A169n9j7j7J3J2J3J2j4j4j4j5MMLMN0N1N1N0K2K1K0K0m6o7l7PJ4J5J7J8K2K2k0k1j4j4
$$ 1169 1110 1093 1076 1089 1101 1114 1126 1112 1098 1084 1069 1073 1077 1080 1084 1134 1185 1236 1286 1308 1329 1349 1369 1323 1256 1219 1226 1240 1255 1272 1290 1312 1334 1314 1293 1279 1265
3804A265K8K8L9L9pn0o7m6J0J1k9l0k9k9nmJ2N6P1M9Nj7j2j2j3j3L4L4qrk6k6J7J8J3L5M7
$$ 1265 1293 1321 1360 1399 1392 1342 1275 1229 1239 1250 1221 1191 1162 1133 1128 1124 1136 1192 1263 1312 1317 1300 1288 1276 1263 1250 1284 1318 1310 1301 1275 1249 1266 1284 1297 1332 1379
3800A379Mo4o3rO3N4J1l2l1k7k7k7k7j0j0rj0K7K6K7K7L7L8J9k4k3k2k5k5J3J2J2J2K5K5P
$$ 1379 1383 1319 1256 1247 1310 1364 1375 1343 1312 1285 1258 1231 1204 1194 1184 1175 1165 1192 1218 1245 1272 1309 1347 1366 1342 1319 1297 1272 1247 1260 1272 1284 1296 1321 1346 1353
3795A353l6o6o6n0qJ4J4J6J7M2M3K4j9k5k4M5M4L6L6opk0k0K5O7N3J1l4l3m4m3jjK1K0k2k3
$$ 1353 1317 1251 1185 1135 1127 1141 1155 1171 1188 1230 1273 1297 1278 1253 1229 1274 1318 1354 1390 1384 1377 1357 1337 1362 1429 1482 1493 1459 1426 1382 1339 1338 1337 1358 1378 1356 1333
3791A333KKKJRQl2l2m1KK1K1j1j1n1n0m8mJ4J4J9K0J9K0N7N7N4j7o1o1j9K5lm%jk8k9n3j1
$$ 1333 1335 1337 1339 1340 1349 1357 1325 1293 1252 1254 1275 1296 1285 1274 1223 1173 1125 1121 1135 1149 1168 1188 1207 1227 1284 1341 1395 1378 1317 1256 1237 1262 1259 1255 1255 1254 1226 1197 1144 1133
3786A133opJ4N8P1P1KKL0L0j2j3OPPOMMMM%j%%L4L4J6k7o9p0k9l0lkllK0K0K0K0l4l3p4p3
$$ 1133 1127 1120 1134 1192 1263 1334 1336 1338 1368 1398 1386 1373 1379 1386 1393 1399 1403 1407 1411 1415 1415 1414 1414 1414 1448 1482 1498 1471 1402 1332 1303 1273 1270 1268 1265 1262 1282 1302 1322 1342 1308 1275 1201 1128
3781A128o1j8K6K7L4qk5k4K7P0O9K7J2J2RJ0m7m6m3m4RN2N2Ro3o3j8K4J6J6nL8N1N1N1N1N7
$$ 1128 1067 1049 1075 1102 1136 1128 1103 1079 1106 1176 1245 1272 1284 1296 1305 1315 1268 1222 1179 1135 1144 1196 1248 1257 1194 1131 1113 1137 1153 1169 1164 1202 1253 1304 1355 1406 1463
3776A463J5nmK4K3Nl8n8n7q5m1K2K2K5K5k8k8k9k8K2K3K2K2J7J7J7J7jjjjj9j9j9j9K0K1K0
$$ 1463 1478 1473 1469 1493 1516 1521 1483 1425 1368 1283 1242 1264 1286 1311 1336 1308 1280 1251 1223 1245 1268 1290 1312 1329 1346 1363 1380 1379 1378 1377 1376 1357 1338 1319 1300 1320 1341 1361
3771A361K1PPPPM1M2K2k0l9m0m2m2j9j9j8j9n0n1n0n1J3J2J3J3J9J9J9J9l8l8L3P6R8K6n7
$$ 1361 1382 1389 1396 1403 1410 1451 1493 1515 1495 1456 1416 1374 1332 1313 1294 1276 1257 1207 1156 1106 1055 1068 1080 1093 1106 1125 1144 1163 1182 1144 1106 1139 1215 1313 1339 1282
3767A282n6l1J1j2j2j7j7K6K6L3L3L0L0qn0n1qL8L7M0M0J5J5J6J5j3j2j2j3O0N9J3l0m6m5
$$ 1282 1226 1195 1206 1194 1182 1165 1148 1174 1200 1233 1266 1296 1326 1318 1268 1217 1209 1247 1284 1324 1364 1379 1394 1410 1425 1412 1400 1388 1375 1435 1494 1507 1477 1431 1386
3763A386noJ3J2J3J2J5J4J2J1j5n7p4p4j3L0NOJ6J6J6J6J3J2J2J3J8J9%m3n0n0j0j0J0J0R
$$ 1386 1381 1375 1388 1400 1413 1425 1440 1454 1466 1477 1462 1405 1331 1257 1244 1274 1279 1285 1301 1317 1333 1349 1362 1374 1386 1399 1417 1436 1436 1393 1343 1293 1283 1273 1283 1293 1302
3758A302J0K7K7K7K7nmnnkjjjppopJ1J0J0J1K1K1K1K1l1l0l0l0l3l3n6j5%%KKL7L7llJ0N3
$$ 1302 1312 1339 1366 1393 1420 1415 1411 1406 1401 1399 1398 1397 1396 1389 1382 1376 1369 1380 1390 1400 1411 1432 1453 1474 1495 1464 1434 1404 1374 1341 1308 1252 1237 1237 1237 1239 1241 1278 1315 1312 1309 1319 1372
3753A372K6K6m3q6j03j02qL5J1J0J1J1J1J0L6L7L6L6P9P8L2j1l9m0m2m2m6m5llQPJ1J0J2N4
$$ 1372 1398 1424 1381 1295 1192 1090 1082 1117 1128 1138 1149 1160 1171 1181 1217 1254 1290 1326 1405 1483 1515 1504 1465 1425 1383 1341 1295 1250 1247 1244 1252 1259 1270 1280 1292 1346
3749A346N1Rj4n7o0j6nmkjk5k5k5k5KLLK%%M3M3J9J8J9J9M9M9M7M6K0k3m1m2j9k0k0k0M2M3
$$ 1346 1397 1406 1392 1335 1275 1259 1254 1250 1248 1247 1222 1197 1172 1147 1149 1152 1155 1157 1157 1157 1200 1243 1262 1280 1299 1318 1367 1416 1463 1509 1529 1506 1465 1423 1404 1384 1364 1344 1386 1429
3744A429J2n8p8n6j4QJKLKk7k7J6J5lmK5M6M7Mk6m8n5j2NOM1M0M1M1J9J8J9J8l2l2l2l2K9
$$ 1429 1441 1383 1305 1249 1235 1243 1244 1246 1249 1251 1224 1197 1213 1228 1225 1221 1246 1292 1339 1343 1317 1269 1214 1202 1207 1213 1254 1294 1335 1376 1395 1413 1432 1450 1418 1386 1354 1322 1351
3739A351K8K8K9nnmnMNl9l8m4m4jjJ6J6J6J6P0P0N1Rj1j0j4j3k5k4k5k5j9j9K4K3L2L3j0j0
$$ 1351 1379 1407 1436 1431 1426 1422 1417 1421 1426 1387 1349 1305 1261 1260 1259 1275 1291 1307 1323 1393 1463 1514 1523 1512 1502 1488 1475 1450 1426 1401 1376 1357 1338 1362 1385 1417 1450 1440 1430
3734A430j9j8K5K4j9j9j9j9K9L0L0L0NMNNk8k7k8k7l2l2n7j3JKJKj1n4k9l0J4J4J4J4K6K6
$$ 1430 1411 1393 1418 1442 1423 1404 1385 1366 1395 1425 1455 1485 1490 1494 1499 1504 1476 1449 1421 1394 1362 1330 1273 1260 1261 1263 1264 1266 1255 1201 1172 1142 1156 1170 1184 1198 1224 1250
3730A250K7K6L3L2j0j0QQQPj2j3j2j3J7J8J7J7K8K8K8K8kjjkj9j9j9j9mlmmj1j2j2j2k6k5
$$ 1250 1277 1303 1336 1368 1358 1348 1356 1364 1372 1379 1367 1354 1342 1329 1346 1364 1381 1398 1426 1454 1482 1510 1508 1507 1506 1504 1485 1466 1447 1428 1424 1421 1417 1413 1402 1390 1378 1366 1340 1315
3725A315J7J6j5j5j5j5nmL8L8MLMLLLKLj8j7j8j8M8M8ON%%%%n1n2l3J0K5K4j5j5%J%%L0L0
$$ 1315 1332 1348 1333 1318 1303 1288 1283 1279 1317 1355 1359 1362 1366 1369 1372 1375 1377 1380 1362 1345 1327 1309 1357 1405 1411 1416 1416 1416 1416 1416 1365 1313 1280 1290 1315 1339 1324 1309 1309 1310 1310 1310 1340 1370
3719A370L0K9j9k0j7j6pL5N5N4M0M1kkRJ0j0n2p9q0l7l7LM6O2O1J1l2m8m8PN0M5M5Rl4j0j1
$$ 1370 1400 1429 1410 1390 1373 1357 1350 1385 1440 1494 1534 1575 1573 1571 1580 1590 1580 1528 1449 1369 1332 1295 1298 1344 1406 1467 1478 1446 1398 1350 1357 1407 1452 1497 1506 1472 1462 1451
3715A451M2M2K4k0m4m4m7m7j1j0j1j0RRRRpppqJ6J6L5L4J3l0m6m6j3K9M8M8L0L0j2j3l9l9
$$ 1451 1493 1535 1559 1539 1495 1451 1404 1357 1346 1336 1325 1315 1324 1333 1342 1351 1344 1337 1330 1322 1338 1354 1389 1423 1436 1406 1360 1314 1301 1330 1378 1426 1456 1486 1474 1461 1422 1383
3710A383l9l8J2J1J5J5JM3M4Jn4n5l8NRQJ2J1J0RJ0J0K9K9m2m3k3k4J%J3N5N2N2rrrrQRRQ
$$ 1383 1344 1306 1318 1329 1344 1359 1360 1403 1447 1448 1394 1339 1301 1306 1315 1323 1335 1346 1356 1365 1375 1385 1414 1443 1401 1358 1335 1311 1312 1312 1325 1380 1432 1484 1475 1466 1457 1448 1456 1465 1474 1482
3705A482J%J%k9k9J4J3K2K2%Jm0l9LLK2K1K2K1J2J2l0l1n6n7l5l5jjK1K0M4M5K5j7n8n8j7
$$ 1482 1483 1483 1484 1484 1455 1426 1440 1453 1475 1497 1497 1498 1458 1419 1422 1425 1447 1468 1490 1511 1523 1535 1505 1474 1418 1361 1326 1291 1290 1289 1310 1330 1374 1419 1444 1427 1369 1311 1294
3700A294j8l0k9j1L2M4M5MNl6l7l6l6L1L1L1L1K1K1K0K1l6l5l2l3MM7K2K3lmlll7l6OOK5K6
$$ 1294 1276 1246 1217 1206 1238 1282 1327 1331 1336 1300 1263 1227 1191 1222 1253 1284 1315 1336 1357 1377 1398 1362 1327 1295 1262 1266 1313 1335 1358 1355 1351 1348 1345 1308 1272 1278 1284 1309 1335
3695A335M3M4N8J5l4p6j12p0MLj0j0L0L0M0lm8m8l3RPPj2j2j2j2j0j1j1j0K9L0L0K9J9J9J9
$$ 1335 1378 1422 1480 1495 1461 1385 1273 1203 1207 1210 1200 1190 1220 1250 1290 1287 1239 1191 1158 1167 1174 1181 1169 1157 1145 1133 1123 1112 1101 1091 1120 1150 1180 1209 1228 1247 1266
3691A266J9k9l0n3j1J2J2J4J4M4M3M1M1rn2l3RL7nm8m7l7PN3N3Q6Q5Q1Ro3j06q4q3m2%J9K0
$$ 1266 1285 1256 1226 1173 1162 1174 1186 1200 1214 1258 1301 1342 1383 1374 1322 1289 1298 1335 1330 1282 1235 1198 1205 1258 1311 1397 1482 1563 1572 1509 1403 1319 1236 1194 1194 1213 1233
3686A233mlJ8J8K5K6K6K5j9j9j9k0oonoJ9J9J9J9J1J1J1J1K0J9J6J7J8k5m4m3J7J7J4J4k3
$$ 1233 1229 1226 1244 1262 1287 1313 1339 1364 1345 1326 1307 1287 1281 1275 1270 1264 1283 1302 1321 1340 1351 1362 1373 1384 1404 1423 1439 1456 1474 1449 1405 1362 1379 1396 1410 1424 1401
3682A401o6m1m2qqqqK9K9J0l2j4j3N2N2L1j2J1J2J1J1QRJ0l2n1n1nmL5L6N4J1l6l6j9k0K3
$$ 1401 1335 1294 1252 1244 1236 1228 1220 1249 1278 1288 1256 1242 1229 1281 1333 1364 1352 1363 1375 1386 1397 1405 1414 1424 1392 1341 1290 1285 1281 1316 1352 1406 1417 1381 1345 1326 1306 1329
3677A329K3j9j9j9j9j1j1L2L2M4M5KKqpqqK2K2k3o5n0oRJ0j4j3j4j3l3l3J2N4K8j4n4j1J3
$$ 1329 1352 1333 1314 1295 1276 1265 1254 1286 1318 1362 1407 1409 1411 1403 1396 1388 1380 1402 1424 1401 1336 1286 1280 1289 1299 1285 1272 1258 1245 1212 1179 1191 1245 1273 1259 1205 1194 1207
3672A207J2J3J2L1j3k8k9QN0K4K4Ol6j3j2RJ0j4K8M4M4MMLMLLj7j6j6j7L7L7L7L7J8J7J8J8
$$ 1207 1219 1232 1244 1275 1262 1234 1205 1213 1263 1287 1311 1317 1281 1268 1256 1265 1275 1261 1289 1333 1377 1381 1385 1388 1392 1395 1398 1381 1365 1349 1332 1369 1406 1443 1480 1498 1515 1533 1551
3668A551j7j6n6n6m1JK0K0K0K0k2k3j0j0j0j0J9K0J9J9J9K0J9J9ooonm0l9l9l9lklkJJl8l9
$$ 1551 1534 1518 1462 1406 1365 1366 1386 1406 1426 1446 1424 1401 1391 1381 1371 1361 1380 1400 1419 1438 1457 1477 1496 1515 1509 1503 1497 1492 1452 1413 1374 1335 1332 1330 1327 1325 1326 1327 1289 1250
3663A250l1J2L1L1qpqpJ8J7J7J8J8J8k4k5k4k5J8J8M0M0O4K1n1n0j1j1j0j1j0j0n4n4l6QK
$$ 1250 1219 1231 1262 1293 1285 1278 1270 1263 1281 1298 1315 1333 1351 1369 1345 1320 1296 1271 1289 1307 1347 1387 1451 1472 1421 1371 1360 1349 1339 1328 1318 1308 1254 1200 1164 1172 1174
3658A174Lj9K3M5M5k3k4l1l2j3L0P3P3N8J4mmopQRQRqqqqL4L4rrmlmmjjjjj4j4j5j4popoL5
$$ 1174 1177 1158 1181 1226 1271 1248 1224 1193 1161 1148 1178 1251 1324 1382 1396 1392 1388 1382 1375 1383 1392 1400 1409 1401 1393 1385 1377 1411 1445 1436 1427 1423 1420 1416 1412 1411 1410 1409 1408 1394 1380 1365 1351 1344 1338 1331 1325 1360
3652A360L4pqJ7J8k5k4k7k7J6J6J3J3k7k7RN2L9J9J1J1J0RKKj9k0m4m5kkj%m3m4k5k6J8J7
$$ 1360 1394 1387 1379 1396 1414 1389 1365 1338 1311 1327 1343 1356 1369 1342 1315 1324 1376 1415 1434 1445 1456 1466 1475 1477 1479 1460 1440 1396 1351 1349 1347 1346 1346 1303 1259 1234 1208 1226 1243
3648A243M5M5K7j6k9k8rj0K6K6j8o1n6j3LLJ5J6lm%M3O1O1L5L5pqm4m4%JL2N3O3K0l3p6p6
$$ 1243 1288 1333 1360 1344 1315 1287 1278 1268 1294 1320 1302 1241 1185 1172 1175 1178 1193 1209 1206 1202 1202 1245 1306 1367 1402 1437 1430 1422 1378 1334 1334 1335 1367 1420 1483 1503 1470 1394 1318
3643A318l5nJ6M7M6M2jl3n5l1J2J0RK0M1N4J0k0k0k2k3k5k6m7m7k7k6J6J6J8J7lmk5k6K1O4
$$ 1318 1283 1278 1294 1341 1387 1429 1428 1395 1340 1309 1321 1331 1340 1360 1401 1455 1465 1445 1425 1403 1380 1355 1329 1282 1235 1208 1182 1198 1214 1232 1249 1246 1242 1217 1191 1212 1276
3638A276O9O9N1Po1j03o4k1M8M7Mm0m6m6opK4K3O6O6K6K7K7K7J4J4k8k8j4j4j4j4m6m6JM4
$$ 1276 1345 1414 1465 1472 1411 1308 1244 1223 1271 1318 1322 1282 1236 1190 1184 1177 1201 1224 1290 1356 1382 1409 1436 1463 1477 1491 1463 1435 1421 1407 1393 1379 1333 1287 1288 1332
3634A332N5N5J5J5j2j3j3j2M3M4K5j8m4m3K5K6L2L2J1J1j3j4n6n6p9p9l7l6onL7L7M6M6M3
$$ 1332 1387 1442 1457 1472 1460 1447 1434 1422 1465 1509 1534 1516 1472 1429 1454 1480 1512 1544 1555 1566 1553 1539 1483 1427 1348 1269 1232 1196 1190 1185 1222 1259 1305 1351 1394
3630A394M4jm3j9j9l7l7PN0N2J0l4l5K4K3j9j9m1m1m3jL5L6L8L7M8M7k4k4j0j0j0j1j4j5j5
$$ 1394 1438 1437 1394 1375 1356 1319 1282 1289 1339 1391 1401 1367 1332 1356 1379 1360 1341 1300 1259 1216 1215 1250 1286 1324 1361 1409 1456 1432 1408 1398 1388 1378 1367 1353 1338 1323
3625A323j4j8j8j7j8NNQl5n0n0l4RL7L7M0L9N6N5Ql4k6k6pqm2m3%jJ4J4J3J4K7K6j6j6POM9
$$ 1323 1309 1291 1273 1256 1238 1243 1248 1256 1221 1171 1121 1087 1096 1133 1170 1210 1249 1305 1360 1368 1334 1308 1282 1275 1267 1225 1182 1182 1181 1195 1209 1222 1236 1263 1289 1273 1257 1264 1270 1319
3620A319M9P4P5L1L2KLj8j9k4k5k4k4j%jjLLLLm1m1m1m0l8l7NOL2L2J2J1PQQQj9j9K4K3no
$$ 1319 1368 1442 1517 1548 1580 1582 1585 1567 1548 1524 1499 1475 1451 1450 1450 1449 1448 1451 1454 1457 1460 1419 1378 1337 1297 1259 1222 1227 1233 1265 1297 1309 1320 1327 1335 1343 1351 1332 1313 1337 1360 1355 1349
3615A349k7k8PPOPj8j7k1K3J8J9k2k2J4J4km4l1J1K8K8L3L3J2J2j7j7MMk7k6k6k7k0k1j8j8
$$ 1349 1322 1294 1301 1308 1314 1321 1303 1286 1265 1288 1306 1325 1303 1281 1295 1309 1307 1263 1232 1243 1271 1299 1332 1365 1377 1389 1372 1355 1359 1363 1336 1310 1284 1257 1237 1216 1198 1180
3610A180j3K9P3P4N3J0J3J3K6K5MNOPl6l6l8l9l6l5k1K3M1M1JJk1k0NNMNJ1J0J0J0ppk6k5
$$ 1180 1167 1196 1269 1343 1396 1406 1419 1432 1458 1483 1487 1492 1498 1505 1469 1433 1395 1356 1320 1285 1264 1287 1328 1369 1370 1371 1350 1330 1335 1340 1344 1349 1360 1370 1380 1390 1383 1376 1350 1325
3606A325jM2O0O1L5L6J7k6p6p7n7n8k1k2%%l1l2J0J1PPQPKK%M2N3N2L7ol9l9m2m1l5l5j4K9
$$ 1325 1324 1366 1426 1487 1522 1558 1575 1549 1473 1396 1339 1281 1260 1238 1238 1238 1207 1175 1185 1196 1203 1210 1218 1225 1227 1229 1229 1271 1324 1376 1413 1407 1368 1329 1287 1246 1211 1176 1162 1191
3601A191O5J07Q6M4Ml8l8l8k2k3jjJ9J9rl0j8K4K4j8l6j4M2M2j2j2j2j3LLm0m0l9l9L1L2M3
$$ 1191 1256 1363 1449 1493 1497 1459 1421 1383 1361 1338 1337 1336 1355 1374 1365 1335 1317 1341 1365 1347 1311 1297 1339 1381 1369 1357 1345 1332 1335 1338 1298 1258 1219 1180 1211 1243 1286
3596A286M2M2M3l4l4l5l4l2l3j2j1rqL4L4J9K0kkj2j2J0RK6K5K6K5L0K9j3j3k2k1k1k1PQQ
$$ 1286 1328 1370 1413 1379 1345 1310 1276 1244 1211 1199 1188 1179 1171 1205 1239 1258 1278 1276 1274 1262 1250 1260 1269 1295 1320 1346 1371 1401 1430 1417 1404 1382 1361 1340 1319 1326 1334 1342
3591A342QJ9J8J9J8j8j9j9j9K1K0K0K1k4k3k3k4ooJ5J6L4L5rqk2k2K1K0MLM4M3%m3n8n9k3
$$ 1342 1350 1369 1387 1406 1424 1406 1387 1368 1349 1370 1390 1410 1431 1407 1384 1361 1337 1331 1325 1340 1356 1390 1425 1416 1408 1386 1364 1385 1405 1409 1412 1456 1499 1499 1456 1398 1339 1316
3587A316J9O4O4N9J6l1l2m6m6mmK4K4Nl8n6n5j6j6J7J8L9L9N8N8M0lm5m4k8J5M0M0K2K1k6
$$ 1316 1335 1399 1463 1522 1538 1507 1475 1429 1383 1379 1375 1399 1423 1428 1390 1334 1279 1263 1247 1264 1282 1321 1360 1418 1476 1516 1513 1468 1424 1396 1411 1451 1491 1513 1534 1508
3582A508k7m8m8mnnnooooj3j3j3j4L4L3L3L3j8j7j7j8j7j7j7j8j5j6j6j6K4K3K3K4N3N4N3
$$ 1508 1481 1433 1385 1381 1376 1371 1366 1360 1354 1348 1342 1329 1316 1303 1289 1323 1356 1389 1422 1404 1387 1370 1352 1335 1318 1301 1283 1268 1252 1236 1220 1244 1267 1290 1314 1367 1421 1474
3578A474N3k2k3k3k3K2K2K4j8o5o6k5k5jjK1K1J7J8J7J8O7O6L6l5o8o9l0l0k1k2k2k1K6K6
$$ 1474 1527 1505 1482 1459 1436 1458 1480 1504 1486 1421 1355 1330 1305 1304 1303 1324 1345 1362 1380 1397 1415 1482 1548 1584 1549 1481 1412 1382 1352 1331 1309 1287 1266 1292 1318
3574A318K6K6L8L9J7J7J4J4k8k9k1k2k1k2j0j1qqk7J6L5L4J7J6L8L8J2J2l0l1l7l7L1L1K0
$$ 1318 1344 1370 1408 1447 1464 1481 1495 1509 1481 1452 1431 1409 1388 1366 1356 1345 1337 1329 1302 1318 1353 1387 1404 1420 1458 1496 1508 1520 1490 1459 1422 1385 1416 1447 1467
3569A467k4m2m2j0j0J0J1k3k3k4k3J2J2N2N1K5j9l4l5j2L1M6M7j4n6l3l2k2k2k1k2J4J4J4
$$ 1467 1443 1401 1359 1349 1339 1349 1360 1337 1314 1290 1267 1279 1291 1343 1394 1419 1400 1366 1331 1319 1350 1396 1443 1429 1373 1340 1308 1286 1264 1243 1221 1235 1249 1263
3565A263J4j0j0L3L3M0M1L8L8L6qk6k6J0J0J0J0l2l2j6K7K2k0j7K5N2N2j7j6ononk1k0k1k1
$$ 1263 1277 1267 1257 1290 1323 1363 1404 1442 1480 1516 1508 1482 1456 1466 1476 1486 1496 1464 1432 1416 1443 1465 1445 1428 1453 1505 1557 1540 1524 1518 1513 1507 1502 1481 1461 1440 1419
3561A419QQQQK2K1k1k2l9l9l9l9j4j5j1j2NM6O3O3K2k1l9l9j1j1j1j1k5k4J9J8KJM5M4L2L2
$$ 1419 1427 1435 1443 1451 1473 1494 1473 1451 1412 1373 1334 1295 1281 1266 1255 1243 1248 1294 1357 1420 1442 1421 1382 1343 1332 1321 1310 1299 1274 1250 1269 1287 1289 1290 1335 1379 1411 1443
3556A443j1j1m2m2k4J9J4J5J7J7L5L4L1L2j0n2n2j0mnkkklkkj8j7m2JK6K5j4j4K9L0L0K9n
$$ 1443 1432 1421 1379 1337 1313 1332 1346 1361 1378 1395 1430 1464 1495 1527 1517 1465 1413 1403 1399 1394 1392 1390 1388 1385 1383 1381 1363 1346 1304 1305 1331 1356 1342 1328 1357 1387 1417 1446 1441
3551A441nqqm0q3q3m0QQJ0J1qqpqk3k3m7mK7K6L0K9k2k1k1k2L7L7P5P5R5K5o4o4l2l3k9l0
$$ 1441 1436 1428 1420 1380 1297 1214 1174 1182 1190 1200 1211 1203 1195 1188 1180 1157 1134 1087 1083 1110 1136 1166 1195 1173 1152 1131 1109 1146 1183 1258 1333 1428 1453 1389 1325 1293 1260 1231 1201
3546A201LM6M6Lk6k7n3j1J0J0k7k8k5J7L5L6K2K2K3K2PQPQJ0J0J0J0RJ0M9N0O6K4k5o8n3j1
$$ 1201 1204 1250 1296 1299 1273 1246 1193 1182 1192 1202 1175 1147 1122 1139 1174 1210 1232 1254 1277 1299 1306 1314 1321 1329 1339 1349 1359 1369 1378 1388 1437 1487 1553 1577 1552 1484 1431 1420
3542A420OOJ5J6k5k4j5K9M4M5rn2o7o8o4k1K7K6K2K3K3K2J%m3m3KKKKj5j5K5K5J8k6m4m4J0
$$ 1420 1426 1432 1447 1463 1438 1414 1399 1428 1472 1517 1508 1456 1389 1321 1257 1236 1263 1289 1311 1334 1357 1379 1380 1380 1337 1294 1296 1298 1300 1302 1287 1272 1297 1322 1340 1314 1270 1226 1236
3537A236RJ0J0L2L2L2L2J2J2J2J2L9L9rn1l1l0l3l4k9l0J3J3L3L3L3L3J8J8J7J8j6j6j6j7
$$ 1236 1245 1255 1265 1297 1329 1361 1393 1405 1417 1429 1441 1480 1519 1510 1459 1428 1398 1365 1331 1302 1272 1285 1298 1331 1364 1397 1430 1448 1466 1483 1501 1485 1469 1453 1436
3533A436ppn0n0m8m8nnJ4J5J4J5J6J7J6J6RQRQm7m7nmQQQQK0K0k2k3k5k6mmpqJ2N4N8N8J4
$$ 1436 1429 1422 1372 1322 1274 1226 1221 1216 1230 1245 1259 1274 1290 1307 1323 1339 1348 1356 1365 1373 1326 1279 1274 1270 1278 1286 1294 1302 1322 1342 1320 1297 1272 1246 1242 1238 1231 1223 1235 1289 1347 1405 1419
3527A419k9j7j7K3K3nnk7k6J2J2j0rj6j7n6n7o5k3%M2M9M9RRNMNMPPPPM6M6M6M5M7M7k5k4
$$ 1419 1390 1373 1356 1379 1402 1397 1392 1365 1339 1351 1363 1353 1344 1328 1311 1255 1198 1133 1110 1110 1152 1201 1250 1259 1268 1273 1277 1282 1286 1293 1300 1307 1314 1360 1406 1452 1497 1544 1591 1566 1542
3522A542k0k0k0k0k9l0l0k9m6m5m3m3K2O5M1M0K2K1M6Lm5m6p1l0RRJ2J2K6K7j7j6l6l6j4j5
$$ 1542 1522 1502 1482 1462 1433 1403 1373 1344 1298 1253 1210 1167 1189 1254 1295 1335 1357 1378 1424 1427 1382 1336 1265 1235 1244 1253 1265 1277 1303 1330 1313 1297 1261 1225 1211 1196
3518A196K2K1k2k2j8j8MLRRJ0Rk9k8J4J4K7K7M5M6M8Nl9m0nL8N4N3K3k0l9l9j6j6NNMNMMn
$$ 1196 1218 1239 1217 1195 1177 1159 1163 1166 1175 1184 1194 1203 1174 1146 1160 1174 1201 1228 1273 1319 1367 1372 1333 1293 1288 1326 1380 1433 1456 1436 1397 1358 1342 1326 1331 1336 1340 1345 1349 1353 1348
3513A348nnnJ9J8J8J9j4j4j3j4J2J3J2J3MMNMl2l1J1J1j2j3j3j3L2L1L1L2j4j3j4j4j2j2R
$$ 1348 1343 1338 1333 1352 1370 1388 1407 1393 1379 1366 1352 1364 1377 1389 1402 1406 1410 1415 1419 1387 1356 1367 1378 1366 1353 1340 1327 1359 1390 1421 1453 1439 1426 1412 1398 1386 1374 1383
3508A383RK0K0k3k3k1k1l9l9k1K1J9J9J6J6nnll%%K1O3N1L0j1j2j1j2OK7lm6o5o4k5k4mlJ5
$$ 1383 1392 1412 1432 1409 1386 1365 1344 1305 1266 1245 1266 1285 1304 1320 1336 1331 1326 1323 1320 1320 1320 1341 1404 1455 1485 1474 1462 1451 1439 1445 1472 1469 1423 1358 1294 1269 1245 1241 1238 1253
3503A253N7Q3Q3M2M3K7K7K7K7J9K0l7n9o1j9kjj0rj0rk0j9j8j8j1J0Km0p9n7j3QJ0RJ1J2j
$$ 1253 1310 1393 1476 1518 1561 1588 1615 1642 1669 1688 1708 1671 1612 1551 1532 1530 1529 1519 1510 1500 1491 1471 1452 1434 1416 1405 1415 1417 1377 1298 1241 1228 1236 1246 1255 1266 1278 1277
3499A277jjjj6j6j6j6j1j2L1L1M9M9L3rj7K7M2M2QPQQk7k6k7k6J2J3J3J2mnnnk9l0k9l0L1
$$ 1277 1276 1275 1274 1258 1242 1226 1210 1199 1187 1218 1249 1298 1347 1380 1371 1354 1381 1423 1465 1473 1480 1488 1496 1469 1443 1416 1390 1402 1415 1428 1440 1436 1431 1426 1421 1392 1362 1333 1303 1334
3494A334L1L2L1j5j5j5j6j8j9j8j9m1m1L1L0N2N3N3N2J4J3k9k9kjkjj3j2j2j3pqL5L5ONl4
$$ 1334 1365 1397 1428 1413 1398 1383 1367 1349 1330 1312 1293 1252 1211 1242 1272 1324 1377 1430 1482 1496 1509 1480 1451 1449 1448 1446 1445 1432 1420 1408 1395 1388 1380 1415 1450 1456 1461 1427
3489A427l5l8NK3K3k5k4J7J8J9J8J8J9o1o1m2JJ4J5J7J7J6J5k9p2p6l4J0J1QQj7K7M1M0J%
$$ 1427 1392 1354 1359 1382 1405 1380 1356 1373 1391 1410 1428 1446 1465 1404 1343 1301 1302 1316 1331 1348 1365 1381 1396 1367 1295 1219 1185 1195 1206 1214 1222 1205 1232 1273 1313 1314 1314
3485A314j2j3N6N6N6J5nmj6j5n8n7o5o4o2o2l9LN0N1N9N9N9N9LLLLRRJ0RPOPPo5o4m6lJ7J7
$$ 1314 1302 1289 1345 1401 1457 1472 1467 1463 1447 1432 1374 1317 1252 1188 1126 1064 1025 1028 1078 1129 1188 1247 1306 1365 1368 1371 1374 1377 1386 1395 1405 1414 1421 1427 1434 1441 1376 1312 1266 1263 1280 1297
3480A297J9J9j5j5j5j5L9L9nm8p7l5L9L8K0K0K0K0J8J8J7J8J2J3J2J3m3m3m3m3n3n4l5QO2
$$ 1297 1316 1335 1320 1305 1290 1275 1314 1353 1348 1300 1223 1188 1227 1265 1285 1305 1325 1345 1363 1381 1398 1416 1428 1441 1453 1466 1423 1380 1337 1294 1241 1187 1152 1160 1222
3475A222O1Q8M6J4J4J2J2l9l8MMrrrrL9M0M0M0m0l9m0l9k5k4J8J8NNNMqrqrRJ0RRK6K5K6K5
$$ 1222 1283 1371 1417 1431 1445 1457 1469 1430 1392 1396 1400 1391 1382 1373 1364 1403 1443 1483 1523 1483 1444 1404 1365 1340 1316 1334 1352 1357 1362 1367 1371 1363 1354 1346 1337 1346 1356 1365 1374 1400 1425 1451 1476
3470A476N5N5j6j6kkkkKJKJK6K6j7j8l2l2l2l2J5J6J5J6k1k1k1k1pqL5L5L5L5qpm4m4m4m3
$$ 1476 1531 1586 1570 1554 1552 1550 1548 1546 1548 1549 1551 1552 1578 1604 1587 1569 1537 1505 1473 1441 1456 1472 1487 1503 1482 1461 1440 1419 1412 1404 1439 1474 1509 1544 1536 1529 1485 1441 1397 1354
3465A354J4J4J4J4kjkkJJJJonL4L5L1j2n6n7k8J5L3L3m4m3k5J8K6K7O7O8J3n7o0n9PPPPQQ
$$ 1354 1368 1382 1396 1410 1408 1407 1405 1403 1404 1405 1406 1407 1401 1396 1430 1465 1496 1484 1428 1371 1343 1358 1391 1424 1380 1337 1312 1330 1356 1383 1450 1518 1531 1474 1414 1355 1362 1369 1376 1383 1391 1399
3460A399l2l2k0K2O7O7O6K3k4k4l6l5l6l5jjjjL9L9L9L9j4j4j4j5j0j1j1j1j7j7K3K3K3j9
$$ 1399 1367 1335 1315 1337 1404 1471 1537 1560 1536 1512 1476 1441 1405 1370 1369 1368 1367 1366 1405 1444 1483 1522 1508 1494 1480 1465 1455 1444 1433 1422 1405 1388 1411 1434 1457 1438
3456A438j9K3mljjK0K0k2k3j2j2L1L1J0J0RJ0O6O6M7Nj8j7k0k0k2k3k5k5km5m4kJ7J8Km1k6
$$ 1438 1419 1442 1438 1435 1434 1433 1453 1473 1451 1428 1416 1404 1435 1466 1476 1486 1495 1505 1571 1637 1684 1689 1671 1654 1634 1614 1592 1569 1544 1519 1517 1472 1428 1426 1443 1461 1463 1422 1396
3451A396k5k8k8NOM8M9OOONj6j6j6j7MLLLK5K5Ll3k3k3k3k3j6J9M2M2MLMMl5l4ON7P8N7K0
$$ 1396 1371 1343 1315 1320 1326 1374 1423 1429 1435 1441 1446 1430 1414 1398 1381 1385 1388 1391 1394 1419 1444 1447 1414 1391 1368 1345 1322 1306 1325 1367 1409 1413 1416 1420 1424 1389 1355 1361 1418 1496 1553 1573
3446A573j5m8m9l0Oj0m5l4j3lkk2J4L9J8k7m9l0l0rK7N0M9N0N0M3Qj5j5l5l5m5k3K1N7N8K3
$$ 1573 1558 1510 1461 1431 1437 1427 1382 1348 1335 1332 1330 1308 1322 1361 1379 1352 1303 1273 1243 1234 1261 1311 1360 1410 1460 1503 1511 1496 1481 1446 1411 1366 1343 1364 1421 1479 1502
3441A502j1j0j3j3%%J%n0n0k7RmmjkJ0J0J0J0J6J7k7k6j2j2j1j2k0k0ok7m7j1M3Q0N7Qmnj5
$$ 1502 1491 1481 1468 1455 1455 1455 1456 1456 1406 1356 1329 1338 1334 1330 1329 1327 1337 1347 1357 1367 1383 1400 1373 1347 1335 1323 1312 1300 1280 1260 1254 1227 1180 1169 1212 1292 1349 1357 1353 1348 1333
3436A333j4j5j5J9J9O0N9rn1k8k7j7j6j7j7MLLLJ1J1RQL7ok5k5K1K0j9k0J0N2K8K9mmm6m6
$$ 1333 1319 1304 1289 1308 1327 1387 1446 1437 1386 1358 1331 1314 1298 1281 1264 1268 1271 1274 1277 1288 1299 1308 1316 1353 1347 1322 1297 1318 1338 1319 1299 1309 1361 1389 1418 1414 1410 1364 1318
3431A318J9K0Jm1j7j7j9j9K7K7Ql5p0p0jkJ5J4N7N7M4M3JJkjkkooL4L4J5k7m6m6j7j7K6K6
$$ 1318 1337 1357 1358 1317 1300 1283 1264 1245 1272 1299 1307 1272 1202 1132 1131 1129 1144 1158 1215 1272 1316 1359 1360 1361 1359 1358 1356 1354 1348 1342 1376 1410 1425 1398 1352 1306 1289 1272 1298 1324
3427A324O1O0M2kk7k8j2L1P3P3N7J4m9m9l0l1ONK4K4J8k5m4m4j8j9K1K2M2jm7m8m1m2k0k0
$$ 1324 1385 1445 1487 1485 1458 1430 1418 1449 1522 1595 1652 1666 1617 1568 1538 1507 1513 1518 1542 1566 1584 1559 1515 1471 1453 1434 1455 1477 1519 1518 1471 1423 1382 1340 1320 1300
3422A300L8L8L9L8k9k9k9k8LLLMK1K1K1K1j5j5K7K8K6K7NNK7K8j8o1p4n3l7j5mlJ9J9L9L9
$$ 1300 1338 1376 1415 1453 1424 1395 1366 1338 1341 1344 1347 1351 1372 1393 1414 1435 1420 1405 1432 1460 1486 1513 1518 1523 1550 1578 1560 1499 1425 1372 1335 1320 1316 1313 1332 1351 1390 1429
3418A429l3l2j9j9j7j7n1k9NM8M6K4jjJ7N9M7K6PQOOJ2J3L4L4RQl4l5l4l4j3j3J%m2m1p0o9
$$ 1429 1396 1364 1345 1326 1309 1292 1241 1212 1217 1265 1311 1335 1334 1333 1350 1409 1456 1482 1489 1497 1503 1509 1521 1534 1568 1602 1611 1619 1585 1550 1516 1482 1469 1456 1457 1457 1415 1374 1304 1235
3413A235k2K1N0N0Nl8m1o2o9p0j6N5Q4Q5P9N8K2k0m6m7nL9K1k2m6k6K4O6N4L3pk9l0qPQQR
$$ 1235 1213 1234 1284 1334 1339 1301 1260 1198 1129 1059 1043 1098 1182 1267 1346 1404 1426 1406 1360 1313 1308 1347 1368 1346 1300 1274 1298 1364 1418 1451 1444 1415 1385 1377 1384 1392 1400 1409
3408A409J6J6k5k4J9O2O2J9j5j5j8j8J2J1J2J1K8K7J2l2k1K0K7Mm4o5p4p3n6j4ONK5K6K6K5
$$ 1409 1425 1441 1416 1392 1411 1473 1535 1554 1539 1524 1506 1488 1500 1511 1523 1534 1562 1589 1601 1569 1548 1568 1595 1599 1555 1490 1416 1343 1287 1273 1279 1284 1309 1335 1361 1386
3404A386K8K9K8K8k9l0k8k8L2N3mm6m3jK7Nm8m8K0K0J4qk2K2O0L9Pl6l3l3l6l5K5K4K5K5L7
$$ 1386 1414 1443 1471 1499 1470 1440 1412 1384 1416 1469 1465 1419 1376 1375 1402 1407 1359 1311 1331 1351 1365 1357 1335 1357 1417 1456 1463 1427 1394 1361 1325 1290 1315 1339 1364 1389 1426
3399A426L7ook4k3nL7O1O0M3%n5p6o4o4j7K5J5pnJ6J4pl5l5l5l4J0N2N2J0poL4L3j0j1j1j1
$$ 1426 1463 1457 1451 1427 1404 1399 1436 1497 1557 1600 1600 1545 1469 1405 1341 1324 1349 1364 1357 1352 1368 1382 1375 1340 1305 1270 1236 1246 1298 1350 1360 1353 1347 1381 1414 1404 1393 1382 1371
3394A371lmm6m7mnjkK1O4N2L0MLK7j7m0m0m2m3J1J1J1J1J1J1J2J2L0N0O2J9l1n1n2l1J2N4
$$ 1371 1368 1364 1318 1271 1267 1262 1261 1259 1280 1344 1396 1426 1430 1433 1460 1443 1403 1363 1321 1278 1289 1300 1311 1322 1333 1344 1356 1368 1398 1448 1510 1529 1498 1447 1395 1364 1376 1430
3390A430P4P4K9L0K9L0l6l5l3l2j3K9L0j3m2m2m4m3n1k9MM7J0j1JKm5o7l7NK8PK0J9om7m8
$$ 1430 1504 1578 1607 1637 1666 1696 1660 1625 1592 1560 1547 1576 1606 1593 1551 1509 1465 1422 1371 1342 1346 1393 1403 1392 1393 1395 1350 1283 1246 1251 1279 1286 1306 1325 1319 1272 1224
3385A224nL1L1qrlmllooooNNK0kmL8O8M6qqJ8M0L6ok4k3k5k5k5k5J1J2J1J2JJKJKJJKJ5J5
$$ 1224 1219 1250 1281 1273 1264 1261 1257 1254 1251 1245 1239 1233 1227 1232 1237 1257 1255 1251 1289 1357 1403 1395 1387 1405 1445 1481 1475 1451 1428 1403 1378 1353 1328 1339 1351 1362 1374 1375 1376 1378 1379 1381 1382 1383 1385 1400 1415
3379A415J5J5j7j8j7j7LKKLJ3J3J3J3l2l1l2l1K6K7K6K6K5K4j8j9l6l6j7K5M3M4LLK4K4k1
$$ 1415 1430 1445 1428 1410 1393 1376 1379 1381 1383 1386 1399 1412 1425 1438 1406 1375 1343 1312 1338 1365 1391 1417 1442 1466 1448 1429 1393 1357 1340 1365 1408 1452 1455 1458 1482 1506 1485
3375A485o4n1qL2j1n3n3J3J4pn0n0pK4K5K6K7opppopponoklQN0O8O9J7J7k6k6j2j3L0L1M8
$$ 1485 1421 1370 1362 1394 1383 1330 1277 1290 1304 1297 1247 1197 1190 1214 1239 1265 1292 1286 1279 1272 1265 1259 1252 1245 1239 1234 1228 1226 1223 1231 1281 1349 1418 1435 1452 1426 1400 1388 1375 1405 1436 1484
3370A484M9M5M6Jm1q6q6q4m2L4L3K3K2K2K2k1k2k1k2QQN1N0L9L8L6L6K6j7l5l6k6k5k6k5J7
$$ 1484 1533 1578 1624 1625 1584 1498 1412 1328 1286 1320 1353 1376 1398 1420 1442 1421 1399 1378 1356 1364 1372 1423 1473 1512 1550 1586 1622 1648 1631 1596 1560 1534 1509 1483 1458 1475
3365A475J8J8J8MMMMj4j4j4j4qqqqJ6J6k7k6J3J3J4J3LLj6n9n2n2j3j2%J%%JJKJk4k4k1k1
$$ 1475 1493 1511 1529 1533 1537 1541 1545 1531 1517 1503 1489 1481 1473 1465 1457 1473 1489 1462 1436 1449 1462 1476 1489 1492 1495 1479 1420 1368 1316 1303 1291 1291 1292 1292 1292 1293 1294 1296 1297 1273 1249 1228 1207
3360A207K1O4M1M0K5K5K5K5J1J1L4qjkmnk6k6k6k6J3J3J3J2kk%J%M3L0J0pqqqm8m8m7m8j0
$$ 1207 1228 1292 1333 1373 1398 1423 1448 1473 1484 1495 1529 1521 1520 1518 1514 1509 1483 1457 1431 1405 1418 1431 1444 1456 1454 1452 1452 1453 1453 1496 1526 1536 1529 1521 1513 1505 1457 1409 1362 1314 1304
3355A304j1rrj1J1K6j7l5QL5J4j2l4l1j1PM9P9N8Nl6k7mlk%jj4j5K9K8OONOl8l8k0K3L4L4
$$ 1304 1293 1284 1275 1264 1275 1301 1284 1249 1257 1292 1306 1294 1260 1229 1218 1225 1274 1353 1411 1416 1380 1353 1349 1346 1344 1344 1343 1329 1314 1343 1371 1377 1383 1388 1394 1356 1318 1298 1321 1355 1389
3350A389L4L5L6J5j7o1m7nJ1J1J0J1J0J0OOPOk1k2j9j8j7K7P0P1J8k4j%k1k2k1k1J4J3J4J3
$$ 1389 1423 1458 1494 1509 1492 1431 1384 1379 1390 1401 1411 1422 1432 1442 1448 1454 1461 1467 1446 1424 1405 1387 1370 1397 1467 1538 1556 1532 1531 1531 1510 1488 1467 1446 1460 1473 1487 1500
3345A500m3m3%%k0k0j8j9KK4N6R9R2N0j0l1k5lK4K3nm7l6j4j3j3j2j1k2k3k2k2kkkkRRl3l2
$$ 1500 1457 1414 1414 1414 1394 1374 1356 1337 1339 1363 1419 1518 1610 1660 1650 1619 1594 1591 1615 1638 1633 1586 1550 1536 1523 1510 1498 1487 1465 1442 1420 1398 1396 1394 1392 1390 1399 1408 1375 1343
3340A343m2k1J4N6R2P1J0l2p9p8l4RM2M1M5M4M0M1M0M1j3j3j3j3k3k2k3k2pon0m9m6m7klk1
$$ 1343 1301 1280 1294 1350 1442 1513 1523 1491 1412 1334 1300 1309 1351 1392 1437 1481 1521 1562 1602 1643 1630 1617 1604 1591 1568 1546 1523 1501 1494 1488 1438 1389 1343 1296 1294 1291 1270
3336A270JL4P7O1L8K1jl4p7l6QL0L0M2K0qn1n5j2L0j3l9j8K3M4N5J2k2o5o7k3MK5K8PJ9J9
$$ 1270 1271 1305 1382 1443 1481 1502 1501 1467 1390 1354 1362 1392 1422 1464 1484 1476 1425 1370 1358 1388 1375 1336 1318 1341 1385 1440 1452 1430 1365 1298 1275 1279 1304 1332 1339 1358 1377
3331A377J8J8qpK0M2K8j4l2l2j8j9j8j9k5k5k5k6L6L5L5L6KLLLJ9J9NK6L9mk2k1KKm1m1p0
$$ 1377 1395 1413 1405 1398 1418 1460 1488 1474 1442 1410 1392 1373 1355 1336 1311 1286 1261 1235 1271 1306 1341 1377 1379 1382 1385 1388 1407 1426 1431 1457 1496 1492 1470 1449 1451 1453 1412 1371 1301
3327A301p0n0pJ9M0L1L1J1J1J1J0L5L5J6k6m6m6ooL5L5J6k6n5n5n7n8j8j9K9P1P6P7L6L6J6
$$ 1301 1231 1181 1174 1193 1233 1264 1295 1306 1317 1328 1338 1373 1408 1424 1398 1352 1306 1300 1294 1329 1364 1380 1354 1299 1244 1187 1129 1111 1092 1121 1192 1268 1345 1381 1417 1433
3322A433J7k7k6noL7L7PQQPk2k2o3o2n2rJ0Rj6j6K7K6L8L7L7L8j4j4j4j4m6m5m6m6k6k6k4
$$ 1433 1450 1423 1397 1392 1386 1423 1460 1467 1475 1483 1490 1468 1446 1383 1321 1269 1260 1270 1279 1263 1247 1274 1300 1338 1375 1412 1450 1436 1422 1408 1394 1348 1303 1257 1211 1185 1159 1135
3318A135k3j0L3P7P7Q4M2nnl4l3RRooooL6L6L6L6j%j%J5J5J4J5J8J8jm3l0l0J0J0j4j3l8N
$$ 1135 1112 1102 1135 1212 1289 1373 1415 1410 1405 1371 1338 1347 1356 1350 1344 1338 1332 1368 1404 1440 1476 1475 1475 1474 1474 1489 1504 1518 1533 1551 1569 1568 1525 1495 1465 1475 1485 1471 1458 1420 1425
3313A425K1K1j9j9k1k1K2K2k3k2k3k3k1k1k1k1l6l7l6l6j9j9K1K2M5Kj3j4M5Q7O1O0J7k6j
$$ 1425 1446 1467 1448 1429 1408 1387 1409 1431 1408 1386 1363 1340 1319 1298 1277 1256 1220 1183 1147 1111 1092 1073 1094 1116 1161 1163 1150 1136 1181 1268 1329 1389 1406 1380 1379
3308A379kK3K4K3K3RQl5l4j2j1rqLM7M6Mm0m1k4J8M7M8PQM3M4M3M4j7j7o0o0l9m0m0l9k7k8
$$ 1379 1377 1400 1424 1447 1470 1479 1487 1452 1418 1406 1395 1386 1378 1381 1428 1474 1478 1438 1397 1373 1391 1438 1486 1493 1501 1544 1588 1631 1675 1658 1641 1581 1521 1482 1442 1402 1363 1336 1308
3304A308k7k7K7K6j3j3jM1O1O0J6J6k6k7l2l2k9k9J4N7L3L3k5k4k5k5POPPK4K5K4K5j3j4l7
$$ 1308 1281 1254 1281 1307 1294 1281 1280 1321 1382 1442 1458 1474 1448 1421 1389 1357 1328 1299 1313 1370 1403 1436 1411 1387 1362 1337 1344 1350 1357 1364 1388 1413 1437 1462 1449 1435 1398
3299A398NM7M6k2k3l0l1n5j2L5L4L7L7j5j5j5j5j8j7j8j7L3L3j0rn8n8n5n5j5K8M7M7L3L3
$$ 1398 1403 1450 1496 1474 1451 1421 1390 1335 1323 1358 1392 1429 1466 1451 1436 1421 1406 1388 1371 1353 1336 1369 1402 1392 1383 1325 1267 1212 1157 1142 1170 1217 1264 1297 1330
3295A330N8J4k4k5k7k7j9j9K2K2Lj9k7RM6M6NOKKKKj%jjL2L2L1L2J1J1J1J1O0O1J7J8KLKL
$$ 1330 1388 1402 1378 1353 1326 1299 1280 1261 1283 1305 1308 1289 1262 1271 1317 1363 1368 1374 1376 1378 1380 1382 1381 1381 1380 1379 1411 1443 1474 1506 1517 1528 1539 1550 1610 1671 1688 1706 1708 1711 1713 1716
3290A716l6l6l6l5j1j1j1j1j3j3j3j4K2K1k1k1NMNNj9j8j9j8J3J3j6l7k8PM1J9kjklk5k5k5
$$ 1716 1680 1644 1608 1573 1562 1551 1540 1529 1516 1503 1490 1476 1498 1519 1498 1477 1482 1486 1491 1496 1477 1459 1440 1422 1435 1448 1432 1395 1367 1374 1415 1434 1432 1431 1429 1426 1401 1376 1351
3285A351k4K5K5K5K5K5K4j9j8QQQPONNNooooooooK2K2K3K2K4K4Kl3o1m0J7J8%JJJJ9K0J7J7
$$ 1351 1327 1352 1377 1402 1427 1452 1476 1457 1439 1447 1455 1463 1470 1476 1481 1486 1491 1485 1479 1473 1467 1461 1455 1449 1443 1465 1487 1510 1532 1556 1580 1582 1549 1488 1448 1465 1483 1483 1484 1485 1486 1505 1525 1542 1559
3279A559om2o2o2k5J7J8k5k4k3n0pJ3J3J6J5kkkkK1K1K1K1mmmnKKKKrqrrK7K6K7K6K7K6K7
$$ 1559 1553 1511 1449 1387 1362 1379 1397 1372 1348 1325 1275 1268 1281 1294 1310 1325 1323 1321 1319 1317 1338 1359 1380 1401 1397 1393 1389 1384 1386 1388 1390 1392 1383 1375 1366 1357 1384 1410 1437 1463 1490 1516 1543
3274A543K6j%jjm0m0m0m0l5l5l6l5k5k4k2k2K5O9M4M4M1M1mm6m9oJ0J0k2k1K0K1L0L0K7K7
$$ 1543 1569 1568 1568 1567 1566 1526 1486 1446 1406 1371 1336 1300 1265 1240 1216 1194 1172 1197 1266 1310 1354 1395 1436 1432 1386 1337 1331 1341 1351 1329 1308 1328 1349 1379 1409 1436 1463
3270A463k0o4l9m0JJJJJJJJL5L6L6L6lmllk7k7k7k6NNNOJ1J2J2J2JJJJk8k8k8k8k6k5k5k6
$$ 1463 1443 1379 1340 1300 1301 1302 1303 1304 1305 1306 1307 1308 1343 1379 1415 1451 1448 1444 1441 1438 1411 1384 1357 1331 1336 1341 1346 1352 1363 1375 1387 1399 1400 1401 1402 1403 1375 1347 1319 1291 1265 1240 1215 1189
3264A189J2J2N5N5N4N5J0l2n6j3L2L1J4J4k8k7k5mJ1l2m8oL6L6j7n9o0j7%%MLM0O2P3L0k6
$$ 1189 1201 1213 1268 1323 1377 1432 1442 1410 1354 1341 1373 1404 1418 1432 1404 1377 1352 1348 1359 1327 1279 1273 1309 1345 1328 1269 1209 1192 1192 1192 1196 1199 1239 1301 1374 1404 1378
3260A378k5k8k7J6L7M8Ol1n2n4l2K4M5L4L4JJ%JJ0Rl1l1l4RN2N3K3k0n0k8K0M2N4J2k1k1m
$$ 1378 1353 1325 1298 1314 1351 1399 1405 1374 1322 1268 1236 1260 1305 1339 1373 1374 1375 1375 1376 1386 1395 1364 1333 1299 1308 1360 1413 1436 1416 1366 1338 1358 1400 1454 1466 1445 1424 1420
3255A420L8N9N9J5k8l3l3l5l6jj%jK5K4K2K2%m3j8j9m4m4m3m4L8L8L8L8N3N3N3N3J3J4J6J7
$$ 1420 1458 1517 1576 1591 1563 1530 1497 1462 1426 1425 1424 1424 1423 1448 1472 1494 1516 1516 1473 1455 1436 1392 1348 1305 1261 1299 1337 1375 1413 1466 1519 1572 1625 1638 1652 1668 1685
3250A685PN0L5J3J2l0o5q6p8l6j8j8j2j2j2j2j6j6j6j6RRRRK9K9K9K9J2J3J2J3k9k9qqRRl4
$$ 1685 1692 1742 1777 1790 1802 1772 1707 1621 1543 1507 1489 1471 1459 1447 1435 1423 1407 1391 1375 1359 1368 1377 1386 1395 1424 1453 1482 1511 1523 1536 1548 1561 1532 1503 1495 1487 1496 1505 1471
3246A471l4l2l2J5N8P4P4L4L4llk4k4nmmnl4l3l4l4k6k5J7J7J1J1J1J1mmmml3l3l0l0pL7N5
$$ 1471 1437 1405 1373 1388 1446 1520 1594 1628 1662 1659 1656 1632 1608 1603 1599 1595 1590 1556 1523 1489 1455 1429 1404 1421 1438 1449 1460 1471 1482 1478 1474 1470 1466 1433 1400 1370 1340 1333 1370 1425
3241A425N5K6K7j4j3l5RN3N2Ol8l2l2qL5J1J1j9j9K1K0mm6k3k3L5L4L5L5poJ2J2L4pn3n2o0
$$ 1425 1480 1506 1533 1519 1506 1471 1480 1533 1585 1591 1553 1521 1489 1481 1516 1527 1538 1519 1500 1521 1541 1537 1491 1468 1445 1480 1514 1549 1584 1577 1571 1583 1595 1629 1622 1569 1517 1457
3236A457j7L0L0k3k3k3k3kkk3k4l8l8L3L4J4J4N4N4J6k6lkqqn1n0l4l4RRL1L1RJ0j8j7n7n7
$$ 1457 1440 1470 1500 1477 1454 1431 1408 1406 1404 1381 1357 1319 1281 1314 1348 1362 1376 1430 1484 1500 1474 1471 1469 1461 1453 1402 1352 1318 1284 1293 1302 1333 1364 1373 1383 1365 1348 1291 1234
3231A234n1rL9L9K4K4M5M5K7K7OOk6k5J7J7QRL1L0K5K5j8j8k9k9qqj5j4l9NL2L2N9J6k7k7
$$ 1234 1183 1174 1213 1252 1276 1300 1345 1390 1417 1444 1450 1456 1430 1405 1422 1439 1447 1456 1487 1517 1542 1567 1549 1531 1502 1473 1465 1457 1442 1428 1389 1394 1426 1458 1517 1533 1506 1479
3227A479n4j2J2J1pqllM0M0j6j5k1K2K2k0l7l6rrJ2J2L0L1RRk4k5klJ2J3l1l0k9k9j0L2L5
$$ 1479 1425 1413 1425 1436 1429 1421 1418 1415 1455 1495 1479 1464 1443 1465 1487 1467 1430 1394 1385 1376 1388 1400 1430 1461 1470 1479 1455 1430 1428 1425 1437 1450 1419 1389 1360 1331 1321 1353 1388
3222A388L4nom2m2k3K0N0N0J0J0l3l3j2j2NMo3o4q4m1OOK4K3O7O6M9M8M5M6J1l2j1L2N1N1
$$ 1388 1422 1417 1411 1369 1327 1304 1324 1374 1424 1434 1444 1411 1378 1366 1354 1359 1363 1300 1236 1152 1111 1117 1123 1147 1170 1237 1303 1352 1400 1445 1491 1502 1470 1459 1491 1542 1593
3217A593Pl6o9o8k9k9jjJ8O0N2N1j6j7k8k7k7k8J8J8J9J8J8J8J8J8noonl1l0l1l1llllk4k4
$$ 1593 1600 1564 1495 1427 1398 1369 1368 1367 1385 1445 1497 1548 1532 1515 1487 1460 1433 1405 1423 1441 1460 1478 1496 1514 1532 1550 1545 1539 1533 1528 1497 1467 1436 1405 1402 1399 1396 1393 1369 1345
3213A345oL7N6N7N6N7L4rJ3J3J4k8m7m7n5n5n2n3m6lJ6J5K9K9K8K9M4M4k7k8j9j9j9k0J5J4
$$ 1345 1339 1376 1432 1489 1545 1602 1636 1627 1640 1653 1667 1639 1592 1545 1490 1435 1383 1330 1284 1281 1297 1312 1341 1370 1398 1427 1471 1515 1488 1460 1441 1422 1403 1383 1398 1412
3208A412J5J4KKk2K1L1L2j3n6o2o1k2k2NNNML5L4ooJ4N6P2P2Ql6j1j1l6l6PPNNKKJ7k6o9k6
$$ 1412 1427 1441 1443 1445 1423 1444 1475 1507 1494 1438 1376 1315 1293 1271 1276 1281 1286 1290 1325 1359 1353 1347 1361 1417 1489 1561 1569 1533 1522 1511 1475 1439 1446 1453 1458 1463 1465 1467 1484 1458 1389 1363
3203A363K0K0K3K3%%M0M0j0n3n4j0M2M2M2M3L4rn5n6k5k6J7J7J1J2l1l1k5k6K2O5P5P6L5L5
$$ 1363 1383 1403 1426 1449 1449 1449 1489 1529 1519 1466 1412 1402 1444 1486 1528 1571 1605 1596 1541 1485 1460 1434 1451 1468 1479 1491 1460 1429 1404 1378 1400 1465 1540 1616 1651 1686
3199A686mmlmm6m6k9J3j6n8n5j3M0M1J%k7k8k7k8j%jjM9M9OPpoooJ7J8N8N7J4k9m7m7k4k3
$$ 1686 1682 1678 1675 1671 1625 1579 1550 1563 1547 1489 1434 1421 1461 1502 1503 1503 1476 1448 1421 1393 1392 1392 1391 1390 1439 1488 1494 1501 1494 1488 1482 1476 1493 1511 1569 1626 1640 1611 1564 1517 1493 1470
3194A470k3k4j8j8j8j8N0N0QPJ8J9J8J8J4J5k8k8klm2m2k7J5L5L4j5j4j5j5RRQRJ9J9J9J9
$$ 1470 1447 1423 1405 1387 1369 1351 1401 1451 1459 1466 1484 1503 1521 1539 1553 1568 1540 1512 1510 1507 1465 1423 1396 1411 1446 1480 1465 1451 1436 1421 1430 1439 1447 1456 1475 1494 1513 1532
3189A532J4J4J4J4j1j1j1j1LKk1K1M2M2j1q3p5l2J0J1J3J3J3J3K5K4K1K2%m4q8q7j9K4M3M2
$$ 1532 1546 1560 1574 1588 1577 1566 1555 1544 1547 1549 1528 1549 1591 1633 1622 1539 1464 1432 1442 1453 1466 1479 1492 1505 1530 1554 1575 1597 1597 1553 1465 1378 1359 1383 1426 1468
3184A468j%jjK3K4M7Nk7k7j1L1P3P3N7J4l8l8m1m1opopk4k4k5k4pqpqK0J9k3k4l9m0J%J6k6
$$ 1468 1467 1467 1466 1465 1488 1512 1559 1564 1537 1510 1499 1530 1603 1676 1733 1747 1709 1671 1630 1589 1583 1576 1570 1563 1539 1515 1490 1466 1459 1451 1444 1436 1456 1475 1452 1428 1389 1349 1350 1350 1366 1340
3179A340m5m5L2L1L1L1Q1Q2O3K1k3k2k5k5k7k7j1L2K9j4l0k9M3M3J%k7k8k7k8l3l3J2N4Q1
$$ 1340 1295 1250 1282 1313 1344 1375 1456 1538 1601 1622 1599 1577 1552 1527 1500 1473 1462 1494 1523 1509 1479 1450 1493 1536 1537 1537 1510 1482 1455 1427 1394 1361 1373 1427 1508
3175A508L9ooK5K4Pl7oorql2l1n5j2J7J6m9n0k8J5L4L3%jm0m1KM4M4JMLM3M3N2N1QRk4k3l9
$$ 1508 1547 1541 1535 1560 1584 1591 1554 1548 1542 1533 1525 1493 1462 1407 1395 1412 1428 1379 1329 1301 1316 1350 1383 1383 1382 1342 1301 1303 1347 1391 1392 1396 1399 1442 1485 1537 1588 1596 1605 1581 1558 1519
3170A519q3r0m7llj5j5j2j3M0Q3N9N9RRl1l1l7NK5K4%%%%j9k0j9j9PPN0N0M5M4km5p3p2JM3
$$ 1519 1436 1346 1299 1296 1293 1278 1263 1251 1238 1278 1361 1420 1479 1488 1497 1466 1435 1398 1403 1428 1452 1452 1452 1452 1452 1433 1413 1394 1375 1382 1389 1439 1489 1534 1578 1576 1531 1458 1386 1387 1430
3165A430N1N0J1J0mnnmj8j8j8j8j5j4j5j4M3M3M4M3J3J4k7k6rL4PQk9p1o8k6K5O6M3M3Nl8
$$ 1430 1481 1531 1542 1552 1548 1543 1538 1534 1516 1498 1480 1462 1447 1433 1418 1404 1447 1490 1534 1577 1590 1604 1577 1551 1542 1576 1583 1591 1562 1491 1423 1397 1422 1488 1531 1574 1579 1541
3160A541n4n4n2rJ1N4O3K0k3k4J5J5M0mj5j5j8j8PPPPj3j2j3j3J2J2J2J2pppqj7j8j8j8PP
$$ 1541 1487 1433 1381 1372 1383 1437 1500 1520 1497 1473 1488 1503 1543 1539 1524 1509 1491 1473 1480 1487 1494 1501 1488 1476 1463 1450 1462 1474 1486 1498 1491 1484 1477 1469 1452 1434 1416 1398 1405 1412
3155A412PPj8j8j6j5J0N3N3J1k3k4k3k4K9P1P2K8KK%jjjkjk0k0K3K3L1L0N5J2k2k2k4k5k1
$$ 1412 1419 1426 1408 1390 1374 1359 1369 1422 1475 1486 1463 1439 1416 1392 1421 1492 1564 1592 1594 1596 1596 1595 1594 1593 1591 1590 1570 1550 1573 1596 1627 1657 1712 1724 1702 1680 1656 1631 1610
3151A610k1j9j9QN1N1Qm8m8n1n0K1K2Km0m0m1K7K8J4J5J4J4oom6m7n4j2L6L6J7J7J8J7J0J0
$$ 1610 1589 1570 1551 1559 1610 1661 1669 1621 1573 1522 1472 1493 1515 1517 1477 1437 1396 1423 1451 1465 1480 1494 1508 1502 1496 1450 1403 1349 1337 1373 1409 1426 1443 1461 1478 1488 1498
3146A498om8m9pO4O4J9k3m2m3l9m0KLj6j6l7NM9R1R4N2mmJ8k5p8p7o2j9ONN0N1J8J8J8J8m2
$$ 1498 1492 1444 1395 1388 1452 1516 1535 1512 1470 1427 1388 1348 1350 1353 1337 1321 1284 1289 1338 1429 1523 1575 1571 1567 1585 1560 1482 1405 1343 1324 1330 1335 1385 1436 1454 1472 1490 1508 1466
3141A466m2%%POPPJ9K0K0K0JJJJk9k9n2j0KKNNk7k7k7k8rj0rj0ONM8M9K4K4K4K5j5j5j5j5
$$ 1466 1424 1424 1424 1431 1437 1444 1451 1470 1490 1510 1530 1531 1532 1533 1534 1505 1476 1424 1414 1416 1418 1423 1428 1401 1374 1347 1319 1310 1300 1291 1281 1287 1292 1340 1389 1413 1437 1461 1486 1471 1456 1441 1426
3136A426k1k0K6O9M5M4MMkjm2m2j1L2N0N1K8K8Rl3o4o3ON0L1j1k7k7J1J1J2J1MNMNK2K2K3
$$ 1426 1405 1385 1411 1480 1525 1569 1573 1577 1575 1574 1532 1490 1479 1511 1561 1612 1640 1668 1677 1644 1580 1517 1523 1573 1604 1593 1566 1539 1550 1561 1573 1584 1588 1593 1597 1602 1624 1646 1669
3131A669K2l2l1l2l2k3k4k4k3l1l2j2L0M6M5K9j3qqL1L2M0M0K1k2m1m1jjk2k2k3k2MNMMj3
$$ 1669 1691 1659 1628 1596 1564 1541 1517 1493 1470 1439 1407 1395 1425 1471 1516 1545 1532 1524 1516 1547 1579 1619 1659 1680 1658 1617 1576 1575 1574 1552 1530 1507 1485 1489 1494 1498 1502 1489
3127A489j4l8OL9M0jjk2k3k0k0K2O5O4K3k6k6k9k8k3k2k0k0k9J4L3L2j3j2j3j3J5J5J2J2j8
$$ 1489 1475 1437 1443 1482 1522 1521 1520 1498 1475 1455 1435 1457 1522 1586 1609 1583 1557 1528 1500 1477 1455 1435 1415 1386 1400 1433 1465 1452 1440 1427 1414 1429 1444 1456 1468 1450
3122A450o1l7l7j7j8j7j8k0k0K6P0O1O1K2K1nmJ9k3m2m1jjpqL3L3J5k7m5m6k1k2K1K1J9J9
$$ 1450 1389 1352 1315 1298 1280 1263 1245 1225 1205 1231 1301 1362 1423 1445 1466 1461 1457 1476 1453 1411 1370 1369 1368 1361 1353 1386 1419 1434 1407 1362 1316 1295 1273 1294 1315 1334 1353
3118A353nL8N5N5L9lk1k0k3k3k8k7J5J5J2J1J2J1nnL5L4Ol7l8OK0K1K3K4kjkjk1k0k0k0qq
$$ 1353 1348 1386 1441 1496 1535 1532 1511 1491 1468 1445 1417 1390 1405 1420 1432 1443 1455 1466 1461 1456 1491 1525 1531 1494 1456 1462 1482 1503 1526 1550 1548 1547 1545 1544 1523 1503 1483 1463 1455 1447
3113A447L2L3K2k1m0l9k9k9J4J3J8J7J7J8RRJ0RKKKKl8l8l6l5k3K1O7J10P4Kk6k6ooooMNN
$$ 1447 1479 1512 1534 1513 1473 1434 1405 1376 1390 1403 1421 1438 1455 1473 1482 1491 1501 1510 1512 1514 1516 1518 1480 1442 1406 1371 1348 1369 1436 1546 1620 1622 1596 1570 1564 1558 1552 1546 1550 1555 1560
3108A560Mo5o6l5L7L0K9qrl0l0J1J1L4J3kM1N0Pk5m7m3m3m5m5qqqqJ0J0RJ0J3J2J3J2M4M5
$$ 1560 1564 1499 1433 1398 1435 1465 1494 1486 1477 1447 1417 1428 1439 1473 1486 1484 1525 1575 1582 1557 1510 1467 1424 1379 1334 1326 1318 1310 1302 1312 1322 1331 1341 1354 1366 1379 1391 1435 1480
3103A480M2M2Ll9l9LK3K3K6K6OOrJ3K1k1l9l9j9j9L8N8O0J8%%l3l2p3p2o0j8J6L7Pj5jjJ5
$$ 1480 1522 1564 1567 1528 1489 1492 1515 1538 1564 1590 1596 1602 1593 1606 1627 1606 1567 1528 1509 1490 1528 1586 1646 1664 1664 1664 1631 1599 1526 1454 1394 1376 1392 1429 1436 1421 1420 1419 1434
3098A434J5J5J5NMK1O4O6M5%k1k8k7J5N9O4K2k3k2j6j5j6j5LLl9m0k3k3L4N5J4k9k8J5J5J4
$$ 1434 1449 1464 1479 1484 1488 1509 1573 1639 1684 1684 1663 1635 1608 1623 1682 1746 1768 1745 1723 1707 1692 1676 1661 1664 1667 1628 1588 1565 1542 1576 1631 1645 1616 1588 1603 1618 1632
3094A632k5k6l0l1j4L0N0K9%JJ1J1l1l2j0j1j0j0k9k8k8k8nnJ1N4N8J5n7n8n9n9k8M3Q6Q5
$$ 1632 1607 1581 1551 1520 1506 1536 1586 1615 1615 1616 1627 1638 1607 1575 1565 1554 1544 1534 1505 1477 1449 1421 1416 1411 1422 1476 1534 1549 1492 1434 1375 1316 1288 1331 1417 1502
3089A502J9J9PPPPJ1J1l1l2k3k3K0K0N8N8N5N5J7k7m5m5rqrqj3j3n6n6k4k3J6J6km6k1k1K2
$$ 1502 1521 1540 1547 1554 1561 1568 1579 1590 1559 1527 1504 1481 1501 1521 1579 1637 1692 1747 1764 1737 1692 1647 1638 1630 1621 1613 1600 1587 1531 1475 1451 1428 1444 1460 1458 1412 1391 1370 1392
3085A392K2K3K2J6J6k7k6K2K2K2K3N4N4N1N1om9o8o8q1q1l4QK0J9k1k0K3K3K1K1L5on5n4L
$$ 1392 1414 1437 1459 1475 1491 1464 1438 1460 1482 1504 1527 1581 1635 1686 1737 1731 1682 1614 1546 1465 1384 1350 1358 1378 1397 1376 1356 1379 1402 1423 1444 1479 1473 1418 1364 1367
3080A367KKKj3j3l6NL3L2qpJ2J2RRO1J7k9l0L2L2j1j0J1J0J1J1ONK2O4P2K8m4m4k0k0k0k0
$$ 1367 1369 1371 1373 1360 1347 1311 1316 1349 1381 1373 1366 1378 1390 1399 1408 1469 1486 1457 1427 1459 1491 1480 1470 1481 1491 1502 1513 1519 1524 1546 1610 1682 1710 1666 1622 1602 1582 1562 1542
3075A542opQj3PN0P8N7K4Mk9k8mlllJ3J3J1J2J0j2k7J6M9On3p4m6lJ4J4OOOOrrrrQRQRJ%m2
$$ 1542 1536 1529 1537 1524 1531 1581 1659 1716 1740 1744 1715 1687 1683 1680 1677 1674 1687 1700 1711 1723 1733 1721 1694 1710 1759 1765 1712 1638 1592 1589 1603 1617 1623 1629 1635 1641 1632 1623 1614 1605 1613 1622 1630 1639 1640 1640 1598
3070A598m2m1m0l9l8RN1L9J8QRPOPPPP%%%%j8j8j8j8M2M1L9L9K2j9m1q3o9k7J8J7QQPOj8m0
$$ 1598 1556 1515 1475 1436 1398 1407 1458 1497 1515 1523 1532 1539 1545 1552 1559 1566 1573 1573 1573 1573 1573 1555 1537 1519 1501 1543 1584 1623 1662 1684 1665 1624 1541 1472 1445 1463 1480 1488 1496 1503 1509 1491 1451
3064A451n3j0J7njJ9L2L1L3L3JJ%J%%%jM7M7M4M4O4K0m0o2k3J9K1k2kL9K5Mrrj0j1J7J7k6
$$ 1451 1398 1388 1405 1400 1399 1418 1450 1481 1514 1547 1548 1549 1549 1550 1550 1550 1550 1549 1596 1643 1687 1731 1795 1815 1775 1713 1690 1709 1730 1708 1706 1745 1770 1774 1765 1756 1746 1735 1752 1769 1743
3059A743k6m3m4jjJ0J0J1J0NMl7l8l3l4l3l3mlmmL9M0L9L9N0N1PPmmk3o5l8l8m1m1llmlJ7
$$ 1743 1717 1674 1630 1629 1628 1638 1648 1659 1669 1674 1678 1641 1603 1570 1536 1503 1470 1466 1463 1459 1455 1494 1534 1573 1612 1662 1713 1720 1727 1723 1719 1696 1631 1593 1555 1514 1473 1470 1467 1463 1460 1477
3054A477J8%m4m1m1o4k2K3O6Q7Q7N0N0k2k1k1k0K2K2j4j4j1j1K1O3M0M0J1J2J2J2RRL3j0j7
$$ 1477 1495 1495 1451 1410 1369 1305 1283 1306 1372 1459 1546 1596 1646 1624 1603 1582 1562 1584 1606 1592 1578 1567 1556 1577 1640 1680 1720 1731 1743 1755 1767 1776 1785 1818 1808 1791
3050A791j7j9k0rrrrppppk5k4k3k2QN1N1Qj8j9j9j8j3L0L0j3n1n1n1n1JM4O0O1P2L0m3m3J7
$$ 1791 1774 1755 1735 1726 1717 1708 1699 1692 1685 1678 1671 1646 1622 1599 1577 1585 1636 1687 1695 1677 1658 1639 1621 1608 1638 1668 1655 1604 1553 1502 1451 1452 1496 1556 1617 1689 1719 1676 1633 1650
3045A650N9N9J7PQNNk1k2o6j08r1m8jjL7Q0Q0L8J3J3k9l0j9K4M2M2KLLLl9l9LLppm8m7k7J5
$$ 1650 1709 1768 1785 1792 1800 1805 1810 1789 1767 1701 1593 1502 1454 1453 1452 1489 1569 1649 1687 1700 1713 1684 1654 1635 1659 1701 1743 1745 1748 1751 1754 1715 1676 1679 1682 1675 1668 1620 1573 1546 1561
3040A561qqMMM7M6L9L9mmk4k3k1k1K0O2L9L8nom5m5o5k2K5K5M5M6LLJ7J7km5n2n2J6J6J2J1
$$ 1561 1553 1545 1549 1553 1600 1646 1685 1724 1720 1716 1692 1669 1648 1627 1647 1709 1748 1786 1781 1775 1730 1685 1620 1598 1623 1648 1693 1739 1742 1745 1762 1779 1777 1732 1680 1628 1644 1660 1672 1683
3035A683pm9l0k9l2l2llllL3L3N8J4k2k2k5k5K1K2K1K1llK1k2o1o1o1o1l4QN6N6K0K0M4Kn6
$$ 1683 1676 1627 1597 1568 1536 1504 1501 1498 1495 1492 1525 1558 1616 1630 1608 1586 1561 1536 1557 1579 1600 1621 1618 1615 1636 1614 1553 1492 1431 1370 1336 1344 1400 1456 1476 1496 1540 1542 1486
3030A486n5j1L2L3L3L5L6L8L8jkOM9M9PporrRRL2rl7l6MMJ2J2J2J2j3j2j0rm0KK2K1j7j7j6
$$ 1486 1431 1420 1452 1485 1518 1553 1589 1627 1665 1664 1662 1668 1717 1766 1773 1766 1760 1751 1742 1751 1760 1792 1783 1746 1710 1714 1718 1730 1742 1754 1766 1753 1741 1731 1722 1682 1684 1706 1727 1710 1693 1677
3025A677j7L2L2L2L2qponJ9O2Q0Q0N0M9J05J47J99L27N05N04K77j06m10n10m22k94j81j37
$$ 1677 1660 1692 1724 1756 1788 1780 1773 1767 1762 1781 1843 1923 2003 2053 2102 2207 2354 2553 2880 3385 3889 4166 4060 3650 3140 2718 2424 2243 2106
3022B106j09o6m5m5o3o4o3o3k9k8k6k5k7J7Q9Q9N1Qj0j1j0j1j0j1k8k8M3M3J6J6J6J6j5j4
$$ 2106 1997 1931 1886 1841 1778 1714 1651 1588 1559 1531 1505 1480 1453 1470 1559 1648 1699 1707 1697 1686 1676 1665 1655 1644 1616 1588 1631 1674 1690 1706 1722 1738 1723 1709
3017A709K7K8J2J2l6p8o9p0k9l0k3k3K1O4N4J1nnM3M2K4j9k6k6k5k6J3N5N6J2l7l7l9m0j2
$$ 1709 1736 1764 1776 1788 1752 1674 1605 1535 1506 1476 1453 1430 1451 1515 1569 1580 1575 1570 1613 1655 1679 1660 1634 1608 1583 1557 1570 1625 1681 1693 1656 1619 1580 1540 1528
3013A528j2j2j2j8j7K5K5J9J9J8J9mmmnk9k9M2M2L4L4rrl1l1M0M0M5M4M4M4j6j7j6j6m2m3
$$ 1528 1516 1504 1492 1474 1457 1482 1507 1526 1545 1563 1582 1578 1574 1570 1565 1536 1507 1549 1591 1625 1659 1650 1641 1610 1579 1619 1659 1704 1748 1792 1836 1820 1803 1787 1771 1729 1686
3009A686J%l1l2k9k8j6K8M6M7PPPPKKKJK7K7K6K7qqrqqqrqk1k2k1k1m1m1OM9J8J8K1K1m5m5
$$ 1686 1687 1687 1656 1624 1595 1567 1551 1579 1625 1672 1679 1686 1693 1700 1702 1704 1706 1707 1734 1761 1787 1814 1806 1798 1789 1781 1773 1765 1756 1748 1727 1705 1684 1663 1622 1581 1587 1636 1654 1672 1693 1714 1669 1624
3003A624lkj0j0j0j1J8J8J7J8K2K2K1K2l4l4RRlllll8l7PM9K7j6J0J1j7j7K8P0O4K1ONn3n4
$$ 1624 1621 1619 1609 1599 1589 1578 1596 1614 1631 1649 1671 1693 1714 1736 1702 1668 1677 1686 1683 1680 1677 1674 1636 1599 1606 1655 1682 1666 1676 1687 1670 1653 1681 1751 1815 1836 1842 1847 1794 1740
2998A740n3n4j2j2L6P7N6N5M0ln9n8j9j8j3j3j3j4l2l3l3l2k5k5J8J8L4L4L3L4NMMNj1j2j1
$$ 1740 1687 1633 1621 1609 1645 1722 1778 1833 1873 1870 1811 1753 1734 1716 1703 1690 1677 1663 1631 1598 1565 1533 1508 1483 1501 1519 1553 1587 1620 1654 1659 1663 1667 1672 1661 1649 1638
2994A638j1k2k2K1K1J9J9N7N7L7l4o6o5m6m6mlm0l9m0m0J7J6O0N9K5K4j8j8l9l9L2L2PQPP
$$ 1638 1627 1605 1583 1604 1625 1644 1663 1720 1777 1814 1780 1714 1649 1603 1557 1553 1550 1510 1471 1431 1391 1408 1424 1484 1543 1568 1592 1574 1556 1517 1478 1510 1542 1549 1557 1564 1571
2989A571LKLKL5L4L5L4jjjjj4j5K9K8K2K1K2K2m1m0m1m0J4J3N4N4M3%j5N5P8P8J2J1n6n7n6
$$ 1571 1574 1576 1579 1581 1616 1650 1685 1719 1718 1717 1716 1715 1701 1686 1715 1743 1765 1786 1808 1830 1789 1749 1708 1668 1682 1695 1749 1803 1846 1846 1831 1886 1964 2042 2054 2065 2009 1952 1896
2985A896n6JJM4M4j0j0rj0l0l1J2J3onm9m8k1k0k1k1o9p0l9L3L6L6M1M0J3J3J0J1K1k1l6L4
$$ 1896 1840 1841 1842 1886 1930 1920 1910 1901 1891 1861 1830 1842 1855 1849 1844 1795 1747 1726 1706 1685 1664 1595 1525 1486 1519 1555 1591 1632 1672 1685 1698 1708 1719 1740 1719 1683 1717
2980A717M7M8RJ0rrj0rk0k1K2K2M9M8OOk5k5k5k5j6j6K7K6L8L7non3n4n7n6qn1k8M4O4K0M4
$$ 1717 1764 1812 1821 1831 1822 1813 1803 1794 1774 1753 1775 1797 1846 1894 1900 1906 1881 1856 1831 1806 1790 1774 1801 1827 1865 1902 1897 1891 1838 1784 1727 1671 1663 1612 1584 1628 1692 1712 1756
2975A756M5M5k6q1l8MMOPqrqrN7N7N7N7j1j1j0j1K6K6K6K7K5K5j7j7rrrrJJp0p1RQl4l5J7
$$ 1756 1801 1846 1820 1739 1701 1705 1709 1715 1722 1714 1705 1697 1688 1745 1802 1859 1916 1905 1894 1884 1873 1899 1925 1951 1978 2003 2028 2011 1994 1985 1976 1967 1958 1959 1960 1890 1819 1828 1836 1802 1767 1784
2970A784J7J8J7PPPPL4L4rrm9m9m7K5P0P0M4Q7R7kp1p2m7m8m7m8K8K9j5j5j1j2j1j1M7M7k
$$ 1784 1801 1819 1836 1843 1850 1857 1864 1898 1932 1923 1914 1865 1816 1769 1794 1864 1934 1978 2065 2162 2160 2089 2017 1970 1922 1875 1827 1855 1884 1869 1854 1843 1831 1820 1809 1856 1903 1901
2965A901lj9k0n6n5klL3L3P3P3onl1l0l0l1pqk9k9J1J0M5J15J18M6j6j6MMl3l4qn1q8j7N2
$$ 1901 1898 1879 1859 1803 1748 1746 1743 1776 1809 1882 1955 1949 1944 1913 1883 1853 1822 1815 1807 1778 1749 1760 1770 1815 1930 2048 2094 2078 2062 2066 2070 2037 2003 1995 1944 1856 1839 1891
2961A891N1POkkn1n2L0L1noP3P2J01J02R0j0q9q9pqm3m3PPPOK1K0n7n8M3M2ppk7k8o3o3J7
$$ 1891 1942 1949 1955 1953 1951 1900 1848 1878 1909 1904 1898 1971 2043 2144 2246 2336 2326 2237 2148 2141 2133 2090 2047 2054 2061 2068 2074 2095 2115 2058 2000 2043 2085 2078 2071 2044 2016 1953 1890 1907
2956A907J7l3l3L0L0k0k0ook8k8M3M4opM1M1l7l7lkl9l8M5M4K4K3L4L4l0l0M5M5nnmnn4n5
$$ 1907 1924 1891 1858 1888 1918 1898 1878 1872 1866 1838 1810 1853 1897 1891 1884 1925 1966 1929 1892 1889 1887 1848 1810 1855 1899 1923 1946 1980 2014 1984 1954 1999 2044 2039 2034 2030 2025 1971 1916
2951A916L1L0o2o2k2k2J4J3J13J12ONP3P2OOL0j3r3r3mL8poQ9Q9K0k2L2L2l5l5K6K5k4k5L3
$$ 1916 1947 1977 1915 1853 1831 1809 1823 1836 1949 2061 2067 2072 2145 2217 2223 2229 2259 2246 2153 2060 2056 2094 2087 2081 2170 2259 2279 2257 2289 2321 2286 2251 2277 2302 2278 2253 2286
2947B286L2j7j8J1J1p9p9M2Q4K5m6pL6k8p1MP6L6pP1P1J7k6N5R8L4rO2J05K8m3mL9k4o8LP5
$$ 2286 2318 2301 2283 2294 2305 2226 2147 2189 2273 2298 2252 2245 2281 2253 2182 2186 2262 2298 2291 2362 2433 2450 2424 2479 2577 2611 2602 2664 2769 2797 2754 2750 2789 2765 2697 2700 2775
2942B775L6L7Q9J60J12O9J40J82J06NQRp5j45r6k4r1j33q0qn7r9j3Q7Q8M6M2M3o5j37p6om1
$$ 2775 2811 2848 2937 3097 3209 3278 3418 3600 3706 3711 3719 3728 3653 3508 3412 3388 3297 3164 3084 3076 3019 2920 2907 2994 3082 3128 3170 3213 3148 3011 2935 2929 2888
2938B888q4J6J16P5MM8M7l4j04m9K3k8r8o3Qm2q4kR8M6k5QN0j3n7J7Q8J4n8LJ02L3o6lR8J4
$$ 2888 2804 2820 2936 3011 3015 3063 3110 3076 2972 2923 2946 2918 2820 2757 2765 2723 2639 2637 2735 2781 2756 2764 2814 2801 2744 2761 2849 2863 2805 2808 2910 2943 2877 2874 2972 2986
2934B986j14n0N0L0m1M1J13J9j08o1O7M9n0jR9M6q3j2J16J02KQ1K38J84%nJ24P7n0mJ24P2
$$ 2986 2872 2822 2872 2902 2861 2902 3015 3034 2926 2865 2932 2981 2931 2930 3029 3075 2992 2980 3096 3198 3200 3281 3519 3703 3703 3698 3822 3899 3849 3845 3969 4041
2930D041q6n0J07J05n2m6Q2M1q8l6J49J18j0P3K30J76rlJ54P0j15l0J54J16p0oK36K04J9Q8
$$ 4041 3955 3905 4012 4117 4065 4019 4101 4142 4054 4018 4167 4285 4275 4348 4578 4754 4745 4742 4896 4966 4851 4821 4975 5091 5021 5015 5251 5455 5474 5562
2926E562K73J82n9kK68K68lL0K71K47k3RL08L10J1j0K90L09O7K32O73O77L21L25P08O65K51
$$ 5562 5835 6017 5958 5956 6224 6492 6489 6519 6790 7037 7014 7023 7331 7641 7652 7642 7932 8241 8308 8540 9213 9890 10211 10536 11244 11909 12160
2923A2160L03Q29R22N09M91R04Q11L13M10J078J165O68Q87J813K018J462J815L225L907L779
$$ 12160 12463 13292 14214 14723 15214 16118 16929 17242 17652 18730 19895 20563 21450 23263 25281 26743 28558 31783 35690 39469
2920C9469N007P753R807J1386J5882K3837L2534M3904O3813Q5940Q5282M2322k7564q2363
$$ 39469 44476 52229 62036 73422 89304 113141 145675 189579 253392 339332 424614 466936 439372 357009
2919C57009r4571p4492m9825l4499k4911j6473j0902r067p733n214l472l514l397k188j362
$$ 357009 262438 187946 138121 103622 78711 62238 51336 42269 34536 29322 25850 22336 18939 16751 15389
2917A5389j746j917j135o31r87j109m98j68o10q30l04L3l79o29k72Mk38l85jK41n8k77o3J8
$$ 15389 13643 11726 10591 9960 8973 7864 7366 7198 6588 5758 5454 5487 5108 4479 4207 4211 3973 3588 3587 3828 3770 3493 3430 3448
2914C448l09n23j95N5j58k93n1J16o8k10LJ74l9j81NJ71m4k21o4J05k4j41J6J24o1k00m3J37
$$ 3448 3139 2616 2421 2476 2318 2025 1974 2090 2022 1812 1815 1989 1950 1769 1774 1945 1901 1680 1616 1721 1697 1556 1572 1696 1635 1435 1392 1529
2910A529Qj43j4J09L8l6R2J77M9p8oN1j07k05m9J09L8p6K3J06k3j45p4M3k8j04K4J42M2n5
$$ 1529 1537 1394 1380 1489 1527 1491 1583 1760 1809 1731 1725 1776 1669 1464 1415 1524 1562 1486 1509 1615 1592 1447 1373 1416 1388 1284 1308 1450 1492 1437
2907A437M4J58N9q0j0Q3J2j16m5M0l1j46m7Q3J3j25q2M5Jq2j2J15J15J6J5Q0Qp5l3L7L8l2
$$ 1437 1481 1639 1698 1618 1608 1691 1703 1587 1542 1582 1551 1405 1358 1441 1454 1329 1247 1292 1293 1211 1199 1314 1429 1445 1460 1540 1548 1473 1440 1477 1515 1483
2903A483l1O2O2o6k4O9lj40r8K7K7j3j3Q5Q6j4j4M0L9o0o0L2L2j1j1J18J19L1J02K05J35j1
$$ 1483 1452 1514 1576 1510 1486 1555 1552 1412 1314 1341 1368 1355 1342 1427 1513 1499 1485 1525 1564 1504 1444 1476 1508 1497 1486 1604 1723 1754 1856 2061 2196 2185
2899B185n3RRo5o5j1j2q3q3kjp2p2j1j0q2q1P7P6OOR3R3poK9L0j26j27l6l5l6l5K6K7j02j01
$$ 2185 2132 2141 2150 2085 2020 2009 1997 1914 1831 1829 1828 1756 1684 1673 1663 1581 1500 1577 1653 1659 1665 1758 1851 1844 1838 1867 1897 1771 1644 1608 1573 1537 1502 1528 1555 1453 1352
2894A352MNNMN0N0m9n0J2J3l1l0M4M3n6n6j8j8j7j8N6N6j6j5M0L9o1o0J3J4J3J4RRl3l4K6
$$ 1352 1356 1361 1366 1370 1420 1470 1421 1371 1383 1396 1365 1335 1379 1422 1366 1310 1292 1274 1257 1239 1295 1351 1335 1320 1360 1399 1338 1278 1291 1305 1318 1332 1341 1350 1317 1283 1309
2890A309K6m5m5J9J9n2n2N0M9OPM3M3k8k8jkjkJ1J1J1J0M8M9k3k4K2K2pk7K3O6K5j8J0N3Q
$$ 1309 1335 1290 1245 1264 1283 1231 1179 1229 1278 1284 1291 1334 1377 1349 1321 1320 1318 1317 1315 1326 1337 1348 1358 1406 1455 1432 1408 1430 1452 1445 1418 1441 1507 1532 1514 1524 1577 1585
2885A585l4RK9j3q5q3l9l8j6N3N2j9o1nL8J1J1L5L5J5k8k5m6j03j03j0O1L5J3O9R0L1j2J5
$$ 1585 1551 1560 1589 1576 1491 1408 1369 1331 1315 1368 1420 1401 1340 1335 1373 1384 1395 1430 1465 1480 1452 1427 1381 1278 1175 1165 1226 1261 1274 1343 1433 1464 1452 1467
2881A467L7ok7LM6Nl8rL4L2j2j4j4n6n5J2Q4O6K3lk4m5o5m7k6k6m7rJ3m1m0K8P1K0n0k3M9
$$ 1467 1504 1498 1471 1474 1520 1525 1487 1478 1512 1544 1532 1518 1504 1448 1393 1405 1489 1555 1578 1575 1551 1506 1441 1394 1368 1342 1295 1286 1299 1258 1218 1246 1317 1337 1287 1264 1313
2877A313L1j1j5K8M3M4N5N4J1l3k4J8J8k4j3L0K8j4l3j1j2l3k1K2lkK5M6J8k5k5J8k5o8k0
$$ 1313 1344 1333 1318 1346 1389 1433 1488 1542 1553 1520 1496 1514 1532 1508 1495 1525 1553 1539 1506 1495 1483 1450 1429 1451 1448 1446 1471 1517 1535 1510 1485 1503 1478 1410 1390
2872A390K3Pj3K1K0K0J9j5j5j6j5N8N9J6J6J2J2km5KP3M7n4n8j6lmJ3J2J3J2k4k3k4k4jjj
$$ 1390 1413 1420 1407 1428 1448 1468 1487 1472 1457 1441 1426 1484 1543 1559 1575 1587 1599 1597 1552 1554 1627 1674 1620 1562 1546 1543 1539 1552 1564 1577 1589 1565 1542 1518 1494 1493 1492 1491
2868A491jj7j6j6j6J0RN2N3J5J5k8p0k3M9P4L0MNm1q3q2j0J9J8L2L1j1j1m4m5K7K7N9O0O0
$$ 1491 1490 1473 1457 1441 1425 1435 1444 1496 1549 1564 1579 1551 1481 1458 1507 1581 1611 1615 1620 1579 1496 1414 1404 1423 1441 1473 1504 1493 1482 1438 1393 1420 1447 1506 1566 1626
2863A626N9opj02j02q4j3J9J8Q2Q3N3j7m1J%m3m9oom9l1J2K7K8KJNMK8P0M6k5rL4L2j1k9J5
$$ 1626 1685 1679 1672 1570 1468 1384 1371 1390 1408 1490 1573 1626 1609 1568 1569 1569 1526 1477 1471 1465 1416 1385 1397 1424 1452 1454 1455 1460 1464 1492 1562 1608 1583 1574 1608 1640 1629 1600 1615
2859A615K7m4o4o5KJN1N1N1N0%%%%j5j5j5j5n0n0ppJ5J5%m4l2J1kk2j6K8K6j6m4m3K5K5K8
$$ 1615 1642 1598 1534 1469 1471 1472 1523 1574 1625 1675 1675 1675 1675 1675 1660 1645 1630 1615 1565 1515 1508 1501 1516 1531 1531 1487 1455 1466 1464 1442 1426 1454 1480 1464 1420 1377 1402 1427 1455
2854A455K8%k2k1K2N1K9ppooJM3M7Lj9K4N1L0j2j2J0l2n2n2n1n2j1L1K2JJ4N6N5J2JJkkj0
$$ 1455 1483 1483 1461 1440 1462 1513 1542 1535 1528 1522 1516 1517 1560 1607 1610 1591 1615 1666 1696 1684 1672 1682 1650 1598 1546 1495 1443 1432 1463 1485 1486 1500 1556 1611 1623 1624 1625 1623 1621 1611
2849A611j0ppj2L1O1M0j3j3j4j4m0m0MMJ7L9K6m5o0j8L8J5l8l9L1L1mlL9M0M9M9M9M9L2L1
$$ 1611 1601 1594 1587 1575 1606 1667 1707 1694 1681 1667 1653 1613 1573 1577 1581 1598 1637 1663 1618 1558 1540 1578 1593 1555 1516 1547 1578 1574 1571 1610 1650 1699 1748 1797 1846 1878 1909
2844A909J3l0p1p0k8k9l2J0M0J8j0l1m9p0p0k7K1K1j8K5O9P0Lm0n5n6n0pJ1J1mnL8L8J7J7
$$ 1909 1922 1892 1821 1751 1723 1694 1662 1672 1712 1730 1720 1689 1640 1570 1500 1473 1494 1515 1497 1522 1591 1661 1664 1624 1569 1513 1463 1456 1467 1478 1474 1469 1507 1545 1562 1579
2840A579J6J7j4j4J2l0o7k5L6N6L5J3K5K5k1m2j2L1M8M7L3j1m3k2L4L5L2L3L2L3M2M1M2M1
$$ 1579 1595 1612 1598 1584 1596 1566 1499 1474 1510 1566 1601 1614 1639 1664 1643 1601 1589 1620 1668 1715 1748 1737 1694 1672 1706 1741 1773 1806 1838 1871 1913 1954 1996 2037
2836B037K3K3P9J00N1Qk6m7l5l4l3l4k7J4L6L7JM4J01P9j5n8l6l5q0q0q0q1p3p4llpqpqo7
$$ 2037 2060 2083 2162 2262 2313 2321 2295 2248 2213 2179 2146 2112 2085 2099 2135 2172 2173 2217 2318 2397 2382 2324 2288 2253 2173 2093 2013 1932 1859 1785 1782 1779 1772 1764 1757 1749 1682
2831A682o7PM9K7NJ9K0rrJ9M1j8o0l5l5l9l8k0K2K0J9K3K2L7L7M6K5j7n9j8K5j0rL7Q0O2J8
$$ 1682 1615 1622 1671 1698 1703 1722 1742 1733 1724 1743 1784 1766 1706 1671 1636 1597 1559 1539 1561 1581 1600 1623 1645 1682 1719 1765 1790 1773 1714 1696 1721 1711 1702 1739 1819 1881 1899
2827A899M3M3J0l4k2jmk6k5mkk3k1%j5j6NM8R1R0N1N1N3N3N3N3Q3Q2Q2Q2L9L9L6L6J3k9nn
$$ 1899 1942 1985 1995 1961 1939 1938 1934 1908 1883 1879 1877 1854 1833 1833 1818 1802 1807 1855 1946 2036 2087 2138 2191 2244 2297 2350 2433 2515 2597 2679 2718 2757 2793 2829 2842 2813 2808 2803
2822B803J1J0J1J0K9K9K6K7Lm0q8j31j15p3l1l0q8j31q9m5J1J1J4J5%%lkj5n8l3l4m6m7k8
$$ 2803 2814 2824 2835 2845 2874 2903 2929 2956 2959 2919 2831 2700 2585 2512 2481 2451 2363 2232 2143 2098 2109 2120 2134 2149 2149 2149 2146 2144 2129 2071 2038 2004 1958 1911 1883
2818A883J5K7K8L0L0N0N1N1N1K9K8NM7P2P2P5P5O9O8K2k2o6o7n1qJ5J6L6P9R6R5J75K75L98
$$ 1883 1898 1925 1953 1983 2013 2063 2114 2165 2216 2245 2273 2278 2325 2397 2469 2544 2619 2688 2756 2778 2756 2690 2623 2572 2564 2579 2595 2631 2710 2806 2901 3076 3351 3749
2814C749M69M14J43k34n05n21m22l42k71j48m8j9j9l9LJ2l2m7m8l4l4OPk7p0m5K6N1RL7L7
$$ 3749 4218 4632 4775 4541 4036 3515 3093 2751 2480 2332 2284 2265 2246 2207 2210 2222 2190 2143 2095 2061 2027 2033 2040 2013 1943 1898 1924 1975 1984 2021 2058
2810B058O0N9O0N9R6R6N2N2L4J2K0O3N9L6N9P9Q3M0K1K0K8j5l5l5n1p2q4m1l3l3J4N6N6J3
$$ 2058 2118 2177 2237 2296 2392 2488 2540 2592 2626 2638 2658 2721 2780 2816 2875 2954 3037 3077 3098 3118 3146 3131 3096 3061 3010 2938 2854 2813 2780 2747 2761 2817 2873 2886
2806B886qpk3r4j10q9o3q4j12j13q0o0n2j1OOj4j4j0l2m4jK2K2J1L1L9nn0n1k5k5mlJ0J1J1
$$ 2886 2878 2871 2848 2754 2644 2555 2492 2408 2296 2183 2103 2043 1991 1980 1986 1992 1978 1964 1954 1922 1878 1877 1899 1921 1932 1963 2002 1997 1947 1896 1871 1846 1842 1839 1849 1860 1871
2801A871J0K0J9k3k3l6l6j5j4nmmnJ1J0J0J1L9M0M0L9M3M3%Jm4m3m3m3kjjjkjjkL9L9L8L9
$$ 1871 1881 1901 1920 1897 1874 1838 1802 1787 1773 1768 1764 1760 1755 1766 1776 1786 1797 1836 1876 1916 1955 1998 2041 2041 2042 1998 1955 1912 1869 1867 1866 1865 1864 1862 1861 1860 1858 1897 1936 1974 2013
2796B013K0K1K1K1j4j3j3j4kllkJ1J0RQj8o2o1j8%%LLrrj1L1M9N0RRl7l7o1j9L3L3L3L4J7
$$ 2013 2033 2054 2075 2096 2082 2069 2056 2042 2040 2037 2034 2032 2043 2053 2062 2070 2052 1990 1929 1911 1911 1911 1914 1917 1908 1899 1888 1919 1968 2018 2027 2036 1999 1962 1901 1882 1915 1948 1981 2015 2032
2791B032k5o5k2K3O6O3O4L3j0k8k8ppJ5J4N3N3J1J0M8M9NOj2j3j2j2L8L7L8L8N7N8L6L7M0
$$ 2032 2007 1942 1920 1943 2009 2072 2136 2169 2159 2131 2103 2096 2089 2104 2118 2171 2224 2235 2245 2293 2342 2347 2353 2341 2328 2316 2304 2342 2379 2417 2455 2512 2570 2606 2643 2683
2787B683M0K1k2j4j4MMnmM2Q5J32J33R5R5Q8J29J75J74J66J24P7P6P2P3P2P2O9O9J18J61K15
$$ 2683 2723 2744 2722 2708 2694 2698 2702 2697 2693 2735 2820 2952 3085 3180 3275 3363 3492 3667 3841 4007 4131 4208 4284 4356 4429 4501 4573 4642 4711 4829 4990 5205
2783E205K58L15L57M27M69N14N85O61P61Q88J015J161J289J402J500J525J368J069O85K45
$$ 5205 5463 5778 6135 6562 7031 7545 8130 8791 9552 10440 11455 12616 13905 15307 16807 18332 19700 20769 21454 21699
2780B1699j67n26p40p54n98l37rL55O83R89J230J363J262R30L75l20j075j729k170k347k303
$$ 21699 21532 21006 20266 19512 18914 18577 18568 18923 19606 20595 21825 23188 24450 25380 25755 25435 24360 22631 20461 18114 15811
2778A5811k121j821j469j171r46p62o18m91l61k61j70r9k9J3M8M7O4J06J02L0m6j17j73k14
$$ 15811 13690 11869 10400 9229 8283 7521 6903 6412 6051 5790 5620 5521 5492 5505 5553 5600 5664 5770 5872 5902 5856 5739 5566 5352
2775E352k33j61o7k3j%L1L0L1L0N8N8J01J01J00J00L3L3J03J75J77J78K16K17K59K60L15L16
$$ 5352 5119 4958 4891 4868 4867 4867 4898 4928 4959 4989 5047 5105 5206 5307 5407 5507 5540 5573 5676 5851 6028 6206 6422 6639 6898 7158 7473 7789
2771G789L26L97M83O11P21Q49R92J120J229J358J474J545J556J556J553J554J508J379J192
$$ 7789 8115 8512 8995 9606 10327 11176 12168 13288 14517 15875 17349 18894 20450 22006 23559 25113 26621 28000 29192
2769B9192Q93N21J37k37n92r18j160j242j199j086r01o56m15k07p9q9k16m27o69q83j097j300
$$ 29192 30085 30606 30743 30506 29914 28996 27836 26594 25395 24309 23408 22752 22337 22130 22051 21962 21746 21319 20650 19767 18670 17370
2766A7370j428j416j346j240j112r20p35n66l81j60N3J77K49K73L16L32K89K08N2j76l60m76
$$ 17370 15942 14526 13180 11940 10828 9908 9173 8607 8226 8066 8119 8296 8545 8818 9134 9466 9755 9963 10015 9839 9479 9003
2764I003n47n78n34m32l04k09j10l0O9J43K14L04M05M80N52O75Q59J036J192J358J487J663
$$ 9003 8456 7878 7344 6912 6608 6399 6289 6259 6328 6471 6685 6989 7394 7874 8426 9101 9960 10996 12188 13546 15033 16696
2761A6696J876K230K728L357M027M528M627L994K472K51k181m225n435n677n208m391l466
$$ 16696 18572 20802 23530 26887 30914 35442 40069 44063 46535 46786 44605 40380 34945 29268 24060 19669 16203
2759A6203k638j997j545j218r77p63o15n16m37l66l37l17k73k30k29k29k10j66j42r9n0k9
$$ 16203 13565 11568 10023 8805 7828 7065 6450 5934 5497 5131 4794 4477 4204 3974 3745 3516 3306 3140 2998 2899 2849 2820
2756B820n5r8r7p6p0o9n6n6j3j3J8J8k5k5k7k7m3q6o3k0K5K4L0L1P1P2P2N1Mo6r2p0m3m4n5
$$ 2820 2765 2667 2570 2494 2424 2355 2299 2243 2230 2217 2235 2253 2228 2203 2176 2149 2106 2020 1957 1937 1962 1986 2016 2047 2118 2190 2262 2313 2317 2251 2159 2089 2046 2002 1947
2752A947n4n3n2l5Qmk4mJ7MMJ6J6J7J6PQj3j4ONj3n6m8m8m9m8l4Qkk4k7oK3K3K0K0K0K0M4
$$ 1947 1893 1840 1788 1753 1761 1757 1733 1729 1746 1750 1754 1770 1786 1803 1819 1826 1834 1821 1807 1813 1818 1805 1749 1701 1653 1604 1556 1522 1530 1528 1504 1477 1471 1494 1517 1537 1557 1577 1597 1641
2747A641M5M2M2jm3o3o2j6j6j6j6NOONk3k4k1k1k6J7L3L4M7K6qm9j9K5N2L1J7J7M0km4m4m
$$ 1641 1686 1728 1770 1769 1726 1663 1601 1585 1569 1553 1537 1542 1548 1554 1559 1536 1512 1491 1470 1444 1461 1494 1528 1575 1601 1593 1544 1525 1550 1602 1633 1650 1667 1707 1705 1661 1617 1613
2742A613mPPPPJ5J5k9p2p6l3K7M9M4M3M5M5J2J2J3J2j6j5j6j5m5m4l0n1n5j1L3L4K4K3O6O6
$$ 1613 1609 1616 1623 1630 1637 1652 1667 1638 1566 1490 1457 1484 1533 1577 1620 1665 1710 1722 1734 1747 1759 1743 1728 1712 1697 1652 1608 1578 1527 1472 1461 1494 1528 1552 1575 1641 1707
2738A707M7M7MNn1n0n1n0qppqJ5J5J5J5L3L2j0j0k5k5k3k4jK1L4rn9l8K1O4M6K4K6M7N1L0
$$ 1707 1754 1801 1805 1810 1759 1709 1658 1608 1600 1593 1586 1578 1593 1608 1623 1638 1671 1703 1693 1683 1658 1633 1610 1586 1585 1606 1640 1631 1572 1534 1555 1619 1665 1689 1715 1762 1813 1843
2733A843j6l7k2k2k1k0J1N4N4J1n1n2j1j2l6l5l6l5k7k6k4k4J6N9P7P8R0R0No6p8l5L5L6J6
$$ 1843 1827 1790 1768 1746 1725 1705 1716 1770 1824 1835 1784 1732 1721 1709 1673 1638 1602 1567 1540 1514 1490 1466 1482 1541 1618 1696 1786 1876 1881 1815 1737 1702 1737 1773 1789
2729A789J5J6J5L2L3P5P5Q3Q4J02J45J85J86J70J27M9M9K6j8n9j02j56j99j80j81j40j40j03
$$ 1789 1804 1820 1835 1867 1900 1975 2050 2133 2217 2319 2464 2649 2835 3005 3132 3181 3230 3256 3238 3179 3077 2921 2722 2542 2361 2221 2081 1978
2726A978j03n5n6j6N5P9L6m3q6o4o4k3k4k3k3n5n4K1O4N4N4L8mk5k5rL4j1j1rqqqrqPQl5l5
$$ 1978 1875 1820 1764 1748 1803 1882 1918 1875 1789 1725 1661 1638 1614 1591 1568 1513 1459 1480 1544 1598 1652 1690 1686 1661 1636 1627 1661 1650 1639 1630 1622 1614 1606 1597 1589 1596 1604 1569 1534
2721A534n0n1l1J1M3M2M6M5L1L2L1L1K8K8m4q7q8m4K8K8L1L1L1L0k3k4k3k4j3j4j4j4J1J1
$$ 1534 1484 1433 1402 1413 1456 1498 1544 1589 1620 1652 1683 1714 1742 1770 1726 1639 1551 1507 1535 1563 1594 1625 1656 1686 1663 1639 1616 1592 1579 1565 1551 1537 1548 1559
2717A559N1N1K2k2o6o6m1JP7P7O1O1J8J9l4l3l4l3l8l9l8l9m9m9pok2k1K1K2j%%%NMMNL6L7
$$ 1559 1610 1661 1683 1661 1595 1529 1488 1489 1566 1643 1704 1765 1783 1802 1768 1735 1701 1668 1630 1591 1553 1514 1465 1416 1409 1403 1381 1360 1381 1403 1402 1402 1402 1402 1407 1411 1415 1420 1456 1493
2712A493L6L6lklljjK3k0o4o3j9K3P0P0P0P0pm9k5k6m5m6m6m5k6k6k6k7M5M4M4M4k0j9kM2
$$ 1493 1529 1565 1562 1560 1557 1554 1553 1552 1575 1555 1491 1428 1409 1432 1502 1572 1642 1712 1705 1656 1631 1605 1560 1514 1468 1423 1397 1371 1345 1318 1363 1407 1451 1495 1475 1456 1454 1496
2707A496L6L5nmqpnmj4K9P4P4P3L0RRl8q0n6n6m3m4m4m3j2j1PM9L7L6L9L9O0N9O0N9M8M8M5
$$ 1496 1532 1567 1562 1558 1550 1543 1538 1534 1520 1549 1623 1697 1770 1800 1809 1818 1780 1700 1644 1588 1545 1501 1457 1414 1402 1391 1398 1447 1484 1520 1559 1598 1658 1717 1777 1836 1884 1932 1977
2702A977M5K9j2l2l1l9l8OM9L0j3k8k9j5j5j5j5M5M6M4M4K8Pk8p1p2p1l1l1k7k6k7k6QQRQ
$$ 1977 2022 2051 2039 2007 1976 1937 1899 1905 1954 1984 1971 1943 1914 1899 1884 1869 1854 1899 1945 1989 2033 2061 2068 2040 1969 1897 1826 1795 1764 1737 1711 1684 1658 1666 1674 1683 1691
2698A691J2J2RJ0J4k9m8m7l4l4RRK0K0qk9m6mK9N0K8PK0K0M7M6M7M7LLLLl1l1J2J2NOl6l6
$$ 1691 1703 1715 1724 1734 1748 1719 1671 1624 1590 1556 1565 1574 1594 1614 1606 1577 1531 1527 1556 1606 1634 1641 1661 1681 1728 1774 1821 1868 1871 1874 1877 1880 1849 1818 1830 1842 1847 1853 1817 1781
2693A781j3RM2Q4P2K9j5j5j3j2j2j3j6j7j7j6mmlmNMM7M7J2J3RJ0j4n5m4k3j8j9jM2O4K2k5
$$ 1781 1768 1777 1819 1903 1975 2004 1989 1974 1961 1949 1937 1924 1908 1891 1874 1858 1854 1850 1847 1843 1848 1852 1899 1946 1958 1971 1980 1990 1976 1921 1877 1854 1836 1817 1816 1858 1922 1944 1919
2688A919o9o4m4%K1Kj9j9Kkk4j0j0j9k0o2o2k3k2m7mJ2J1J4J4L9L9j8l9jM1K7Pl2l1l3l3j
$$ 1919 1850 1786 1742 1742 1763 1765 1746 1727 1729 1727 1703 1693 1683 1664 1644 1582 1520 1497 1475 1428 1424 1436 1447 1461 1475 1514 1553 1535 1496 1495 1536 1563 1570 1538 1507 1474 1441 1440
2684A440jjjJ0J1J0J1M2M2M3M2POPPj8j7K5K5NMNMJ8J8J6J5j8o0o0j7POJ0RL1L1J2l1m2m3
$$ 1440 1439 1438 1437 1447 1458 1468 1479 1521 1563 1606 1648 1655 1661 1668 1675 1657 1640 1665 1690 1695 1699 1704 1708 1726 1744 1760 1775 1757 1697 1637 1620 1627 1633 1643 1652 1683 1714 1726 1695 1653 1610
2679A610k7J5N8N7N9O0O0O0N9O0K0J9k3k3k7k7k7k6j8j8o1o0n6n6rL3KLMNL2L1L2L1PQl6l5
$$ 1610 1583 1598 1656 1713 1772 1832 1892 1952 2011 2071 2091 2110 2087 2064 2037 2010 1983 1957 1939 1921 1860 1800 1744 1688 1679 1712 1714 1717 1721 1726 1758 1789 1821 1852 1859 1867 1831 1796
2674A796j%jjNNNNMMl9l9m4m5m5m5j6j5m0MM7M8L2j1kkmnJ5J4J5J5j0rRN2N5N5J5J5RJ0RJ0
$$ 1796 1795 1795 1794 1793 1798 1803 1808 1813 1817 1821 1782 1743 1699 1654 1609 1564 1548 1533 1493 1497 1544 1592 1624 1613 1611 1609 1605 1600 1615 1629 1644 1659 1649 1640 1649 1701 1756 1811 1826 1841 1850 1860 1869 1879
2669A879kjkkJ6J7J6J6j2j3j2j2k3k3k3k3j3j3j2j3k4k3k3k4K3K3L2J1l5p7p7l3K2O5K4j7
$$ 1879 1877 1876 1874 1872 1888 1905 1921 1937 1925 1912 1900 1888 1865 1842 1819 1796 1783 1770 1758 1745 1721 1698 1675 1651 1674 1697 1729 1740 1705 1628 1551 1518 1540 1605 1629 1612
2664A612l3l3PPL7L7nnj3j3j2j2l4j2K0O2O5K1k0k1j1L1K0kj9j8K3K3J0J0l3l2m6m6j5N6R9
$$ 1612 1579 1546 1553 1560 1597 1634 1629 1624 1611 1598 1586 1574 1540 1528 1548 1610 1675 1696 1676 1655 1644 1675 1695 1693 1674 1656 1679 1702 1712 1722 1689 1657 1611 1565 1550 1606 1705
2660A705R9N5J2Pj5m8m8n5n5n4n5j6j7K7K6N1N2QRrqqrK7K6O9O9L7L7nol6l6l6l6k7k8k8k8
$$ 1705 1804 1859 1871 1878 1863 1815 1767 1712 1657 1603 1548 1532 1515 1542 1568 1619 1671 1679 1688 1679 1671 1663 1654 1681 1707 1776 1845 1882 1919 1914 1908 1872 1836 1800 1764 1737 1709 1681 1653
2655A653QQQPklllJ8J9LK5M7Mo7o8j9K4%%K0K0j9k0LM5K1K2K1K2K1K1RRRQRRRQK1K1K1K1J5
$$ 1653 1661 1669 1677 1684 1682 1679 1676 1673 1691 1710 1713 1738 1785 1789 1722 1654 1635 1659 1659 1659 1679 1699 1680 1660 1663 1708 1729 1751 1772 1794 1815 1836 1845 1854 1863 1871 1880 1889 1898 1906 1927 1948 1969 1990 2005
2649B005J5l2p5n2n1j2j1l7l8l7l7RRN2N2N1N2L3j0l5l6MMLKKLj8j8j8j7L1L1j2j1JJJKM4
$$ 2005 2020 1988 1913 1861 1810 1798 1787 1750 1712 1675 1638 1647 1656 1708 1760 1811 1863 1896 1886 1851 1815 1819 1823 1826 1828 1830 1833 1815 1797 1779 1762 1793 1824 1812 1801 1802 1803 1804 1806 1850
2644A850M5M5M5L9M0O3K1l7l7q0p9n8j5L2L3K4K4K4K5l5l4l5l4m3m2m2m3k2k3K1K0RJ0J0R
$$ 1850 1895 1940 1985 2024 2064 2127 2148 2111 2074 1994 1915 1857 1842 1874 1907 1931 1955 1979 2004 1969 1935 1900 1866 1823 1781 1739 1696 1674 1651 1672 1692 1701 1711 1721 1730
2640A730k9k9j0L2N2N2J2J1k2k2o5o6m2m3k2K1P6J18P9L5klnnNNl7l8j3j4j3j4J1J2L5qk7
$$ 1730 1701 1672 1662 1694 1746 1798 1810 1821 1799 1777 1712 1646 1604 1561 1539 1560 1636 1754 1833 1868 1866 1863 1858 1853 1858 1863 1826 1788 1775 1761 1748 1734 1745 1757 1792 1784 1757
2636A757k7k7k7k1K2M0M0j8j7j8j8JJM3M3KJKJM7M7M2M2M5k6q3q3l7OK4K4oomnOK7lm5q1o0
$$ 1757 1730 1703 1676 1655 1677 1717 1757 1739 1722 1704 1686 1687 1688 1731 1774 1776 1777 1779 1780 1827 1874 1916 1958 2003 1977 1894 1811 1774 1780 1804 1828 1822 1816 1812 1807 1813 1840 1837 1792 1711 1651
2631A651kM1K3k0m4k4L6P8N6N5M7M6M7M7k1k2k1k1k2k2k3k2K6K5O9O8L4L4qrJ0J0l2l3k8k8
$$ 1651 1649 1690 1713 1693 1649 1625 1661 1739 1795 1850 1897 1943 1990 2037 2016 1994 1973 1952 1930 1908 1885 1863 1889 1914 1983 2051 2085 2119 2111 2102 2112 2122 2090 2057 2029 2001
2626B001k7k8nonoj6j6j5j6l8l9l8l8m8m8onL1L1L1L1j9j9j9k0m0m1KKKJM4M4M6M7MMKJKK
$$ 2001 1974 1946 1941 1935 1930 1924 1908 1892 1877 1861 1823 1784 1746 1708 1660 1612 1606 1601 1632 1663 1694 1725 1706 1687 1668 1648 1608 1567 1569 1571 1573 1574 1618 1662 1708 1755 1759 1763 1765 1766 1768 1770
2621A770j1j2j1j2j4j4j1j2K2O5M1l0n7j4N4N4M8Oj3j2j9k0K4K4M5M6K7j5k8k8J0J0j3n5n5
$$ 1770 1759 1747 1736 1724 1710 1696 1685 1673 1695 1760 1801 1771 1714 1700 1754 1808 1856 1862 1849 1837 1818 1798 1822 1846 1891 1937 1964 1949 1921 1893 1903 1913 1900 1845 1790
2617A790j2K0K0m6m6m5kM5M5M1M1L8L8j2n5p1p1l6Oj7j7k4k3J9J9J6J5J5J6l6l5l6l5lmlm
$$ 1790 1778 1798 1818 1772 1726 1681 1679 1724 1769 1810 1851 1889 1927 1915 1860 1789 1718 1682 1688 1671 1654 1630 1607 1626 1645 1661 1676 1691 1707 1671 1636 1600 1565 1562 1558 1555 1551
2612A551j2j2L0L1J9J9Mm0m4kM2M3J7J8k5k5j5j4Rl3n3n4j3j4l8l9RN2P0P0N4J1l2l2l5l5
$$ 1551 1539 1527 1557 1588 1607 1626 1630 1590 1546 1544 1586 1629 1646 1664 1639 1614 1599 1585 1594 1561 1508 1454 1441 1427 1389 1350 1359 1411 1481 1551 1605 1616 1584 1552 1517 1482
2608A482qqqqJ5J4J4J5M1M2j%k1k0k1k0k0k0K3K2L6L6opj5j4K6K5%l6n9n8m3m2k0J6M4M4M7
$$ 1482 1474 1466 1458 1450 1465 1479 1493 1508 1549 1591 1590 1590 1569 1549 1528 1508 1488 1468 1491 1513 1549 1585 1579 1572 1557 1543 1569 1594 1594 1558 1499 1441 1398 1356 1336 1352 1396 1440 1487
2603A487M6poooj3j2L0L0MMLMk8k9J5J4kkkkJ8J9J8J9M1M2M1M2k2k2k1k2k5k6K4N9M3Qj3j3
$$ 1487 1533 1526 1520 1514 1508 1495 1483 1513 1543 1547 1551 1554 1558 1530 1501 1516 1530 1528 1526 1524 1522 1540 1559 1577 1596 1637 1679 1720 1762 1740 1718 1697 1675 1650 1624 1648 1707 1750 1758 1745 1732
2598A732m5m4m4m4nnnnj1j1L2L1QQQQl6l6l6l6j1j2j1j1RRRJ0J3J4J3J4k0j9L8N9K8pKK3K2
$$ 1732 1687 1643 1599 1555 1550 1545 1540 1535 1524 1513 1545 1576 1584 1592 1600 1608 1572 1536 1500 1464 1453 1441 1430 1419 1428 1437 1446 1456 1469 1483 1496 1510 1490 1471 1509 1568 1596 1589 1591 1614 1636
2593A636K3K4K3l6l7l7l6jjjjj5j4j4j4KKm1m0k8k7J6J5K0J9L9Q1R2R2M8Nn4n5l6l5k7k7k9
$$ 1636 1659 1683 1706 1670 1633 1596 1560 1559 1558 1557 1556 1541 1527 1513 1499 1501 1503 1462 1422 1394 1367 1383 1398 1418 1437 1476 1557 1649 1741 1789 1794 1740 1685 1649 1614 1587 1560 1531
2588A531J3L6L6om8m8mM0M0j8j7j7j8j5j6j6j5K0K0j9k0K6O9M8Mj4j5N4N4N5N4J2J1jjkjm6
$$ 1531 1544 1580 1616 1610 1562 1514 1510 1550 1590 1572 1555 1538 1520 1505 1489 1473 1458 1478 1498 1479 1459 1485 1554 1602 1606 1592 1577 1631 1685 1740 1794 1806 1817 1816 1815 1813 1812 1766
2584A766m6llj0j1j0j0m6m7k8J5LLNOj5j4MM6N7N7L8L8RRj3j2l8l8q0q1p7p8l0J2J0RJ2J2
$$ 1766 1720 1717 1714 1704 1693 1683 1673 1627 1580 1552 1567 1570 1573 1578 1584 1569 1555 1559 1605 1662 1719 1757 1795 1804 1813 1800 1788 1750 1712 1632 1551 1474 1396 1366 1378 1388 1397 1409 1421
2579A421L7L7L7L6J8J8N7N8Ml9l8MK7K7J1l2n6n6j4K9N4J1nmk6k5k5k5ooonj6j6l7l8j9k0
$$ 1421 1458 1495 1532 1568 1586 1604 1661 1719 1723 1684 1646 1650 1677 1704 1715 1683 1627 1571 1557 1586 1640 1651 1646 1642 1616 1591 1566 1541 1535 1529 1523 1518 1502 1486 1449 1411 1392 1372
2574A372kM2O4O5M6M6J6J6J6J6K1K0%jm0l9NM7K4j8l5l5j2j3L4P7P2P1P2P1R2N0km5q5q5j28
$$ 1372 1370 1412 1476 1541 1587 1633 1649 1665 1681 1697 1718 1738 1738 1737 1697 1658 1663 1710 1734 1716 1681 1646 1634 1621 1655 1732 1804 1875 1947 2018 2110 2160 2158 2113 2028 1943 1815
2570A815j28p0k7K0K0J%J9O2P3P4NNl0k9l0l0pon0m9m7m7k8J5L5L5L8L8MMMMK7K7j7o1o6k4
$$ 1815 1687 1617 1590 1610 1630 1631 1631 1650 1712 1785 1859 1864 1869 1839 1810 1780 1750 1743 1737 1687 1638 1591 1544 1516 1531 1566 1601 1639 1677 1681 1685 1689 1693 1720 1747 1730 1669 1603 1579
2565A579pqK3K3O3O3J4k7k8J5oollooooL2L2J2k9o0n9m3jK8K8j2j2k7k7k7k8K3K3j9k0l7l8
$$ 1579 1572 1564 1587 1610 1673 1736 1750 1723 1695 1710 1704 1698 1695 1692 1686 1680 1674 1668 1700 1732 1744 1715 1655 1596 1553 1552 1580 1608 1596 1584 1557 1530 1503 1475 1498 1521 1502 1482 1445 1407
2560A407L4L4J9J9lkL4L4L3L3ql0j5N7R4R5L7J6J2l1n1n1rrrrK4K4K2K1j5n7l4l3J1J1J0J1
$$ 1407 1441 1475 1494 1513 1510 1508 1542 1576 1609 1642 1634 1604 1589 1646 1740 1835 1872 1888 1900 1869 1818 1767 1758 1749 1740 1731 1755 1779 1801 1822 1807 1750 1716 1683 1694 1705 1715 1726
2556A726J%%%onool7l8l8l7NNNNJ4J4m2o3m4%J9J9N9J01N9J5mmppj4j4l0p2p5l2J6N8N1L0
$$ 1726 1727 1727 1727 1727 1721 1716 1710 1704 1667 1629 1591 1554 1559 1564 1569 1574 1588 1602 1560 1497 1453 1453 1472 1491 1550 1651 1710 1725 1721 1717 1710 1703 1689 1675 1645 1573 1498 1466 1482 1540 1591 1621
2550A621JJJ5J4k7k8l0rK6O9N4N3O6M4j1n4k9k8j1L3K9j3l8q2q4m2RQm5o7o1j8MM6O5O5K5
$$ 1621 1622 1623 1638 1652 1625 1597 1567 1558 1584 1653 1707 1760 1826 1870 1859 1805 1776 1748 1737 1770 1799 1786 1748 1666 1582 1540 1549 1557 1512 1445 1384 1366 1370 1416 1481 1546 1571
2546A571K5N1N2Ol7m5k2k6m7m6m6jM1O5M4J5J6K7K8j5j5jjkjmlmmj0j0Mj6k7J5J6k7m4k3K1
$$ 1571 1596 1647 1699 1705 1668 1623 1601 1575 1528 1482 1436 1435 1476 1541 1585 1600 1616 1643 1671 1656 1641 1640 1639 1637 1636 1632 1629 1625 1621 1611 1601 1605 1589 1562 1577 1593 1566 1522 1499 1520
2541A520M3L4L4L3L4j8l9j1L1P6L2j1j2rrn1n1k2k1k0k0L0N2O4K2nJ6J5ojK2J8kl8n9m6m6
$$ 1520 1563 1597 1631 1664 1698 1680 1641 1630 1661 1737 1769 1758 1746 1737 1728 1677 1626 1604 1583 1563 1543 1573 1625 1689 1711 1706 1722 1737 1731 1730 1752 1770 1768 1730 1671 1625 1579
2536A579l5Rj4j5K0M1N4J0l4l3l4l4l2J2J4k9l8ML6N7N0K9lm6m6k6OM8M3K0ppNNNNj6j5K7
$$ 1579 1544 1553 1539 1524 1544 1585 1639 1649 1615 1582 1548 1514 1482 1494 1508 1479 1441 1445 1481 1538 1588 1617 1614 1568 1522 1496 1502 1550 1593 1613 1606 1599 1604 1609 1614 1619 1603 1588 1615
2532A615K7O3O3J8k6m1j9QRk1k2k1k1jjjjJ5J4J4J4lmlmk3k3k3k3KKJKK3K2K2K3N8N9N9N9
$$ 1615 1642 1705 1768 1786 1760 1719 1700 1708 1717 1696 1674 1653 1632 1631 1630 1629 1628 1643 1657 1671 1685 1682 1678 1675 1671 1648 1625 1602 1579 1581 1583 1584 1586 1609 1631 1653 1676 1734 1793 1852 1911
2527A911J3J3om8p1p1l0l1rj0rj0l3l2l3l3m2m2K9P1P7On1n1J5J5J6J5RRRRkkklL0L0L0L0
$$ 1911 1924 1937 1931 1883 1812 1741 1711 1680 1671 1661 1652 1642 1609 1577 1544 1511 1469 1427 1456 1527 1604 1610 1559 1508 1523 1538 1554 1569 1578 1587 1596 1605 1603 1601 1599 1596 1626 1656 1686 1716
2522A716k9k8k8k8k0k0k0k0J5J6lm6l7l8L1L1P5P5P2P3L3rn6n7m2m2JJJ1J2J1J2J1J1J2J1
$$ 1716 1687 1659 1631 1603 1583 1563 1543 1523 1538 1554 1551 1505 1468 1430 1461 1492 1567 1642 1714 1787 1820 1811 1755 1698 1656 1614 1615 1616 1627 1639 1650 1662 1673 1684 1696 1707
2517A707k0k1k1k0k9k9n0qM5Q8J09J09O2O1O2O2R7R7M7Nl6p9j25j26j09o6m8m7k7k6k7k6l0
$$ 1707 1687 1666 1645 1625 1596 1567 1517 1509 1554 1642 1751 1860 1922 1983 2045 2107 2204 2301 2348 2353 2317 2238 2113 1987 1878 1812 1764 1717 1690 1664 1637 1611 1581
2513A581l0J3J2l1l1n4j3M2M1M4M3noooNNNNJ7J8J7J7J9J8k9p2n8n8j6j6j9K4O8O7J9k4%J
$$ 1581 1551 1564 1576 1545 1514 1460 1447 1489 1530 1574 1617 1612 1606 1600 1594 1599 1604 1609 1614 1631 1649 1666 1683 1702 1720 1691 1619 1561 1503 1487 1471 1452 1476 1544 1611 1630 1606 1606 1607
2509A607KJKKJ5J5J4J5J6J7k6k7k9k9J4J3L1L2rrk2K1L9L9onnok1k2o5o4m7m7mmJ5J5J4J5
$$ 1607 1609 1610 1612 1614 1629 1644 1658 1673 1689 1706 1680 1653 1624 1595 1609 1622 1653 1685 1676 1667 1645 1666 1705 1744 1738 1733 1728 1722 1701 1679 1614 1550 1503 1456 1452 1448 1463 1478 1492 1507
2504A507j5j5j4j5llklQQN0N1NNM8M8O3O3O0O0K8j5l4l3j6j5j5j5K5K5Ol7j3j4j6j6MMK8j5
$$ 1507 1492 1477 1463 1448 1445 1442 1440 1437 1445 1453 1503 1554 1559 1564 1612 1660 1723 1786 1846 1906 1934 1919 1885 1852 1836 1821 1806 1791 1816 1841 1847 1810 1797 1783 1767 1751 1755 1759 1787 1772
2499A772m1m1K7K7J%k6J7M7No5o5m7nJ5J4MNMNk1k2k1k1poL7L6K4K4K3K4k9l0l0k9J4J3k9
$$ 1772 1731 1690 1717 1744 1745 1745 1719 1736 1783 1788 1723 1658 1611 1606 1621 1635 1639 1644 1648 1653 1632 1610 1589 1568 1561 1555 1592 1628 1652 1676 1699 1723 1694 1664 1634 1605 1619 1632 1603
2494A603k9klklj9j9%M2M1M0K5j8n7n6q3m1K2K2K5K4L0L0L0L0m0m1k1K1N7N7J7J7J2J2J2J1
$$ 1603 1574 1572 1569 1567 1564 1545 1526 1526 1568 1609 1649 1674 1656 1599 1543 1460 1419 1441 1463 1488 1512 1542 1572 1602 1632 1592 1551 1530 1551 1608 1665 1682 1699 1711 1723 1735 1746
2490A746m4m4m4m5j2j2j2j3POOOJ7J7k6k6m3m3MM7O2O1O5O4k4k4k4k4J9K0J9K0L3L3J5k9j6
$$ 1746 1702 1658 1614 1569 1557 1545 1533 1520 1527 1533 1539 1545 1562 1579 1553 1527 1484 1441 1445 1492 1554 1615 1680 1744 1720 1696 1672 1648 1667 1687 1706 1726 1759 1792 1807 1778 1762
2485A762j7j9j9l8l8j9K4J4J5J7J8JJJJJJJJl1l1k8k9k5J8O3O2Ml8l9NL0L1rrjkjkk2k2k2
$$ 1762 1745 1726 1707 1669 1631 1612 1636 1650 1665 1682 1700 1701 1702 1703 1704 1705 1706 1707 1708 1677 1646 1618 1589 1564 1582 1645 1707 1711 1673 1634 1639 1669 1700 1691 1682 1681 1679 1678 1676 1654 1632 1610
2480A610k2JJJJk4k3k4k4pqppL2L2K9K9jm3k0k0LLLKJ4J3J4J3J4J3J4J3J1J1J0J1j4j5j4j4
$$ 1610 1588 1589 1590 1591 1592 1568 1545 1521 1497 1490 1482 1475 1468 1500 1532 1561 1590 1589 1546 1526 1506 1509 1512 1515 1517 1531 1544 1558 1571 1585 1598 1612 1625 1636 1647 1657 1668 1654 1639 1625 1611
2475A611K5K5K6K5ppopk6k6k6k5mmL9L9L1L0L0L0j1j1NM8M0mm8m7n4n4l5PK6K6K8K9j%jjL
$$ 1611 1636 1661 1687 1712 1705 1698 1692 1685 1659 1633 1607 1582 1578 1574 1613 1652 1683 1713 1743 1773 1762 1751 1756 1804 1844 1840 1792 1745 1691 1637 1602 1609 1635 1661 1689 1718 1717 1717 1716 1715 1718
2470A718LLLk3k2k2k2k8k9k6k6j4K9M8M8K0K0K1K0L3L4N7J5q9r0m9n0n1n1k0N1P2P2L1L1J1
$$ 1718 1721 1724 1727 1704 1682 1660 1638 1610 1581 1555 1529 1515 1544 1592 1640 1660 1680 1701 1721 1754 1788 1845 1860 1771 1681 1632 1582 1531 1480 1460 1511 1583 1655 1686 1717 1728
2465A728l1n0n0%%%Jk1k0k0k1ONONN6N7P7L5j9o1m1m0j3j4K9K9J5J5J5J5K4K4j9j9kkmnj9
$$ 1728 1697 1647 1597 1597 1597 1597 1598 1577 1557 1537 1516 1522 1527 1533 1538 1594 1651 1728 1763 1744 1683 1642 1602 1589 1575 1604 1633 1648 1663 1678 1693 1717 1741 1722 1703 1701 1699 1695 1690 1671
2461A671o3o2k0L4L4L4L4Q2L9l3l4j5K8MM%%%Jk0k0k0k0j4j3N4N5M9NL0L0L1L1j2j2k3k3k3
$$ 1671 1608 1546 1526 1560 1594 1628 1662 1744 1783 1750 1716 1701 1729 1733 1737 1737 1737 1737 1738 1718 1698 1678 1658 1644 1631 1685 1740 1789 1794 1824 1854 1885 1916 1904 1892 1869 1846 1823
2456A823k4lmlmN4N4L5qk7k7J2J3k6k6J7J7J9K0k8p0n8n9J1J0KKLKK6K6j7j6PPQPqrrqJ3J4
$$ 1823 1799 1796 1792 1789 1785 1839 1893 1928 1920 1893 1866 1878 1891 1865 1839 1856 1873 1892 1912 1884 1814 1756 1697 1708 1718 1720 1722 1725 1727 1753 1779 1762 1746 1753 1760 1768 1775 1767 1758 1749 1741 1754 1768
2451A768J3J4J9K0Q6Q6O9kq7q8m5mk7k7l0l0k7k7J5N8P4P4N0Pj1j1L5L6P8P8J12J12P3P4R7
$$ 1768 1781 1795 1814 1834 1920 2006 2075 2073 1986 1898 1853 1849 1822 1795 1765 1735 1708 1681 1696 1754 1828 1902 1952 1959 1948 1937 1972 2008 2086 2164 2276 2388 2461 2535 2632
2446B632J67K50L50M03L04Q7j56l32l76l04k33j70j28p2k9nmk1o3p9p9l9l9NMNMj0j1j0j1
$$ 2632 2799 3049 3399 3802 4106 4193 4037 3705 3329 3025 2792 2622 2494 2422 2393 2388 2384 2363 2300 2221 2142 2103 2064 2069 2073 2078 2082 2072 2061 2051 2040
2443B040L5L4L5L4K2K1M0Q3R0R1N0N1M1M2J13J12J19J19J66K08K45K46L15M43O49Q33Q52N81
$$ 2040 2075 2109 2144 2178 2200 2221 2261 2344 2434 2525 2575 2626 2667 2709 2822 2934 3053 3172 3338 3546 3791 4037 4352 4795 5444 6277 7129 7710
2439G710Lo08r24q54o58n31m36l36k18j47j07j07n5j2OOM8M7R0R0Q7Q7R3R3J68K68L51L51
$$ 7710 7713 7105 6181 5327 4669 4138 3702 3366 3148 3001 2894 2787 2732 2720 2726 2732 2780 2827 2917 3007 3094 3181 3274 3367 3535 3803 4154 4505
2436D505K21m9k89m16l86k87k06j34o8o7m4kL7L6M0L9J04J05J04J04J93J92K59L00K68J11
$$ 4505 4726 4677 4388 3972 3586 3299 3093 2959 2891 2824 2780 2778 2815 2851 2891 2930 3034 3139 3243 3347 3540 3732 3991 4291 4559 4670
2433D670j07k92l41l42k77j77p9qm2m2k1k0P9P9J31J32K02K03K59K60K42K84L75M74O38Q23
$$ 4670 4563 4271 3930 3588 3311 3134 3055 3047 3005 2963 2942 2922 3001 3080 3211 3343 3545 3748 4007 4267 4509 4793 5168 5642 6280 7103
2429G103R89Q89M61j23n62p75q40q41q21o94n32m05l04k05j20p8q3q3q0q0p6p6p5p6l4l4L8
$$ 7103 8092 8981 9442 9319 8757 7982 7142 6301 5480 4786 4254 3849 3545 3340 3220 3142 3059 2976 2896 2816 2740 2664 2589 2513 2479 2445 2483
2426B483L7k7k7k8k7j8j9j8j8M4M5J15J16J27J26J69J69K28K28K27K28L26L25L79M22M81N81
$$ 2483 2520 2493 2466 2438 2411 2393 2374 2356 2338 2382 2427 2542 2658 2785 2911 3080 3249 3477 3705 3932 4160 4486 4811 5190 5612 6093 6674
2423F674O56O56O63O63M57j3o77j146j223r82p03n47m46l18j77j05r5r5n5n5J7J6R6R7J39
$$ 6674 7330 7986 8649 9312 9769 9756 9079 7933 6710 5728 5025 4478 4032 3714 3537 3432 3337 3242 3187 3132 3149 3165 3261 3358 3497
2420C497J39Q3Q3O5J08K31L30L34K06mk46l88m30l87l03k13j28m6mK1K0M4M3M4M3R9R9J04
$$ 3497 3636 3719 3802 3867 3975 4206 4536 4870 5076 5072 4826 4438 4008 3621 3318 3105 2977 2931 2927 2948 2968 3012 3055 3099 3142 3241 3340 3444
2416C444J04J84K70L92M34L22Rl06m49m43l01k29j86j36j36o3o2J3J3J9J8Q3J68K21K64L02
$$ 3444 3548 3732 4002 4394 4828 5150 5159 4853 4404 3961 3660 3431 3245 3109 2973 2910 2848 2861 2874 2893 2911 2994 3162 3383 3647 3949
2413C949K58K27K27L13N12P02R02Q46M20k24q22j043r57p61n62m42k99k27j41j20p6k4k5q
$$ 3949 4207 4434 4661 4974 5486 6188 7090 7936 8356 8132 7310 6267 5310 4549 3987 3545 3246 3019 2878 2758 2682 2658 2633 2625
2410B625rq0q0q4q4q5q4k4k3M7M7J8J8J8J8ononM5M5M5M5R1R0M9M8J00R9J03J02O8J10J95
$$ 2625 2616 2536 2456 2372 2288 2203 2119 2095 2072 2119 2166 2184 2202 2220 2238 2232 2227 2221 2216 2261 2306 2351 2396 2487 2577 2626 2674 2774 2873 2976 3078 3146 3256 3451
2406C451K80L35L35K91L5k37l79m03l18k78k36k04j62j39r7m2%j6j7n6n7mnmnm6m7m6m6k6
$$ 3451 3731 4066 4401 4692 4727 4490 4111 3708 3390 3112 2876 2672 2510 2371 2274 2232 2232 2216 2199 2143 2086 2082 2077 2073 2068 2022 1975 1929 1883 1857
2402A857k6k5k6J3J4J3J4OOPO%%M3M3K8K8K9K8l2l2j4K9L5L4nom2m2m2m2o8o8k1K2K5K5K8
$$ 1857 1831 1806 1780 1793 1807 1820 1834 1840 1846 1853 1859 1859 1859 1902 1945 1973 2001 2030 2058 2026 1994 1980 2009 2044 2078 2073 2067 2025 1983 1941 1899 1831 1763 1742 1764 1789 1814 1842
2398A842K8K8K8K7K8mmmml9m0l9l9%%%%N3N4N3N4K7K7j6j6j0j0L2L3LMLLJ0J0l3l3k4k4k4
$$ 1842 1870 1898 1926 1953 1981 1977 1973 1969 1965 1926 1886 1847 1808 1808 1808 1808 1808 1861 1915 1968 2022 2049 2076 2060 2044 2034 2024 2056 2089 2092 2096 2099 2102 2112 2122 2089 2056 2032 2008 1984
2393A984k4l1l1J2J2l5l4l2l2l0J2L1L1l4l4l1l2n0rJ1J1k3k2K2O5L9mn0r3j15p2NM8L4L4
$$ 1984 1960 1929 1898 1910 1922 1887 1853 1821 1789 1759 1771 1802 1833 1799 1765 1734 1702 1652 1643 1654 1665 1642 1620 1642 1707 1746 1742 1692 1599 1484 1412 1417 1465 1499 1533
2389A533L6L7M2M2M2M2K1K2j9j9k2K0M0L9QRM9M8J6k7p1p2n9j7L1P3N3j7m6m7j1j2j1j2K3
$$ 1533 1569 1606 1648 1690 1732 1774 1795 1817 1798 1779 1757 1777 1817 1856 1864 1873 1922 1970 1986 1959 1888 1816 1757 1740 1771 1844 1897 1880 1834 1787 1776 1764 1753 1741 1764
2384A764K4K3K3ONOOnnnnl7l8l8l8j7j7j7j8l9m0LML2L3N6J4n1n1l6QL4L4L7L7MNKKlm6m3
$$ 1764 1788 1811 1834 1840 1845 1851 1857 1852 1847 1842 1837 1800 1762 1724 1686 1669 1652 1635 1617 1578 1538 1541 1545 1577 1610 1666 1680 1629 1578 1542 1550 1584 1618 1655 1692 1696 1701 1703 1705 1702 1656 1613
2379A613jL4P6P7L3k8p2m9n0o5o4j7K6O4O4J9k3n1n1oL7L1L1L4L3P4P3K7j7j3j3n5n6n7j5
$$ 1613 1612 1646 1722 1799 1832 1804 1732 1683 1633 1568 1504 1487 1513 1577 1641 1660 1637 1586 1535 1529 1566 1597 1628 1662 1695 1769 1842 1869 1852 1839 1826 1771 1715 1658 1643
2375A643L3L2J0J1M8M9L3l8p0o9k1k0k0k1J8J8J7J8J2J1N2N1K8j5J0Rkjjkk0j9k0k0LK%%J3
$$ 1643 1676 1708 1718 1729 1777 1826 1859 1821 1751 1682 1661 1641 1621 1600 1618 1636 1653 1671 1683 1694 1746 1797 1825 1810 1820 1829 1827 1826 1825 1823 1803 1784 1764 1744 1747 1749 1749 1749 1762
2370A762k9m7m8llJ2j0%M3M1jk4k3J6J6J3J3J4J3l1l0l1l1OOOOL0L0j3j3K9L0K9K9POOPnm
$$ 1762 1733 1686 1638 1635 1632 1644 1634 1634 1677 1718 1717 1693 1670 1686 1702 1715 1728 1742 1755 1724 1694 1663 1632 1638 1644 1650 1656 1686 1716 1703 1690 1719 1749 1778 1807 1814 1820 1826 1833 1828 1824
2365A824m7m7m7m7mmKKLKK3K2K3K3k4k4k4k4RQQQJ7J6J5J5Kk0OM9N9j2n2k9pJ5J5om2o3p6
$$ 1824 1777 1730 1683 1636 1632 1628 1630 1632 1635 1637 1660 1682 1705 1728 1704 1680 1656 1632 1641 1649 1657 1665 1682 1698 1713 1728 1730 1710 1716 1765 1824 1812 1760 1731 1724 1739 1754 1748 1706 1643 1567
2360A567l4RRJ1J1K3K3K3K3J5J4k7k8JKJJJ0RRJ0lklklklkJ9K0J9K0j7j7jM2M7Ml8l7JM3M4
$$ 1567 1533 1542 1551 1562 1573 1596 1619 1642 1665 1680 1694 1667 1639 1640 1642 1643 1644 1654 1663 1672 1682 1679 1677 1674 1672 1669 1667 1664 1662 1681 1701 1720 1740 1723 1706 1705 1747 1794 1798 1760 1723 1724 1767 1811
2355A811%l9m0m2m2k4k5k1k2j7K6K5j7j4j5K6K5L6L5L6L5L6L6J6k5r9j00k9O9R4R4K9K9K9
$$ 1811 1811 1772 1732 1690 1648 1624 1599 1578 1556 1539 1565 1590 1573 1559 1544 1570 1595 1631 1666 1702 1737 1773 1809 1825 1800 1701 1601 1572 1641 1735 1829 1858 1887 1916
2350A916K9j3j4j1j2j2j2KKLKjj%jK4K4j9k0noonl9l9l7l6l8MK3K3jkkjk4k4k4k4J0J0J0J0
$$ 1916 1945 1932 1918 1907 1895 1883 1871 1873 1875 1878 1880 1879 1878 1878 1877 1901 1925 1906 1886 1881 1875 1869 1864 1825 1786 1749 1713 1675 1679 1702 1725 1724 1722 1720 1719 1695 1671 1647 1623 1633 1643 1653 1663
2345A663j0rl4J0O8O8K4j9qqj1j1NMMNM1M0M1M1M5M6KLm3m3q2q3m4jJ7J8J1J2J1J1K9K9K7
$$ 1663 1653 1644 1610 1620 1688 1756 1780 1761 1753 1745 1734 1723 1728 1732 1736 1741 1782 1822 1863 1904 1949 1995 1997 2000 1957 1914 1832 1749 1705 1704 1721 1739 1750 1762 1773 1784 1813 1842 1869
2340A869K6j9o3m0m0q2j03o1RN5L4k1k1J7J7J7J8K3K4K3K3M4M3N3L2j4n7n9j5J8J8k1k1j1
$$ 1869 1895 1876 1813 1773 1733 1651 1548 1487 1496 1551 1585 1564 1543 1560 1577 1594 1612 1635 1659 1682 1705 1749 1792 1845 1877 1863 1806 1747 1732 1750 1768 1747 1726 1715
2336A715J0K2k1l8l8o3k1K4M5M8K6L2L1K9L0J5J5k8k8k0k0j9k0l6l5PPJ7J6J7J7J3J3j6l6
$$ 1715 1725 1747 1726 1688 1650 1587 1566 1590 1635 1683 1709 1741 1772 1801 1831 1846 1861 1833 1805 1785 1765 1746 1726 1690 1655 1662 1669 1686 1702 1719 1736 1749 1762 1746 1710
2332A710%M2O9M8K6j6l4l4l5PK6K6K0K0K0K0J9J9K0J9N1N2L0j3l7p9q2m0MLPQN6P8M8Mn2n2
$$ 1710 1710 1752 1821 1869 1895 1879 1845 1811 1776 1783 1809 1835 1855 1875 1895 1915 1934 1953 1973 1992 2043 2095 2125 2112 2075 1996 1914 1874 1878 1881 1888 1896 1952 2030 2078 2082 2030 1978
2327A978j1j2l0k9k9k9l3l3J0J0L5L5L4L4N1L0l3p5n8l6j9KL5N7P0K8PPMNk8k8k8k7m2m1m2
$$ 1978 1967 1955 1925 1896 1867 1838 1805 1772 1782 1792 1827 1862 1896 1930 1981 2011 1978 1903 1845 1809 1790 1792 1827 1884 1954 1982 1989 1996 2000 2005 1977 1949 1921 1894 1852 1811 1769
2323A769m1j0rj0rm8m7m7m8OOOOK2K2K4K5J8O1P7P7P8L6j2j2l9l9l9m0OOPOM7M8ONJ6J6M0
$$ 1769 1728 1718 1709 1699 1690 1642 1595 1548 1500 1506 1512 1518 1524 1546 1568 1592 1617 1635 1696 1773 1850 1928 1964 1952 1940 1901 1862 1823 1783 1789 1795 1802 1808 1855 1903 1909 1914 1930 1946 1986
2318A986kl9l9l9l9NM7O4O4L4qn6n5k5k5J7J8PPPPl9l8l9l8LLMLN2N2Ml8k7k7l0l0j8j7j8
$$ 1986 1984 1945 1906 1867 1828 1833 1880 1944 2008 2042 2034 1978 1923 1898 1873 1890 1908 1915 1922 1929 1936 1897 1859 1820 1782 1785 1788 1792 1795 1847 1899 1903 1865 1838 1811 1781 1751 1733 1716 1698
2313A698j7M0M1M0M1L8L9K2k0k3J9L6L6J2J2l1l1l3l3RRj4j4j5j4K0K0K1K0K9K9K9K9J4J4
$$ 1698 1681 1721 1762 1802 1843 1881 1920 1942 1922 1899 1918 1954 1990 2002 2014 1983 1952 1919 1886 1895 1904 1890 1876 1861 1847 1867 1887 1908 1928 1957 1986 2015 2044 2058 2072
2309B072J4J3qpL4L5LLKLM6M5LKRRRRj2j2j2j2j2j2j2j2L0K9L0K9J9J9J9J9K5K5K5K5p7p7
$$ 2072 2086 2099 2091 2084 2118 2153 2156 2159 2161 2164 2210 2255 2258 2260 2269 2278 2287 2296 2284 2272 2260 2248 2236 2224 2212 2200 2230 2259 2289 2318 2337 2356 2375 2394 2419 2444 2469 2494 2417 2340
2304B340K2K2R5R5R5R5J05J06K05K47K28J57R3N0J1l1q2j24j13m3K4O6J16J87K67L37L76L77
$$ 2340 2362 2384 2479 2574 2669 2764 2869 2975 3180 3427 3655 3812 3905 3955 3966 3935 3853 3729 3616 3573 3597 3663 3779 3966 4233 4570 4946 5323
2300E323K96J69R7R7K3j33k43k01r9%M3J42K35K78L35M92O73Q29J059J500K087K756L702M939
$$ 5323 5619 5788 5885 5982 6005 5872 5629 5428 5329 5329 5372 5514 5749 6027 6362 6854 7527 8356 9415 10915 13002 15758 19460 24399
2298B4399N802N332L525J490J18j007k618m511n542n187m013k945k214j660j217j005r37q65
$$ 24399 30201 35533 39058 40548 40666 39659 37041 32530 26988 21801 17788 14843 12629 10969 9752 8747 7810 6945
2295F945p48o21n30m31l36l37l24k52j26n5r0r1o9p0o9p0m4m5m5m4o7o7r0m8MNl7q0l4Rj7
$$ 6945 6197 5576 5046 4615 4279 3942 3618 3366 3240 3185 3095 3004 2935 2865 2796 2726 2682 2637 2592 2548 2481 2414 2324 2276 2280 2285 2248 2168 2134 2143 2126
2292B126j8k2k2k2k2k7k7J6J5K4K3K4K3RRRRl1l0l1l0J0J1J0J1j9j9J2Q3J26J26Q3M1J5J6
$$ 2126 2108 2086 2064 2042 2020 1993 1966 1982 1997 2021 2044 2068 2091 2100 2109 2118 2127 2096 2066 2035 2005 2015 2026 2036 2047 2028 2009 2021 2104 2230 2356 2439 2480 2495 2511
2287B511l0k9j7j6j6j7qrqqJ0RJ5J4O4J35J74K16K52K96L38L39K84J85K9p0q4m2%M2L9l2j20
$$ 2511 2481 2452 2435 2419 2403 2386 2378 2369 2361 2353 2363 2372 2387 2401 2465 2600 2774 2990 3242 3538 3876 4215 4499 4684 4713 4643 4559 4517 4517 4559 4598 4566 4446
2283D446k21l05l47l50l07k58j86j51j50p6l4n5n5k4J8J9k4m2m2K6K6K1K1k2k2J6J6J6J6J9
$$ 4446 4225 3920 3573 3223 2916 2658 2472 2321 2171 2095 2061 2006 1951 1927 1945 1964 1940 1898 1856 1882 1908 1929 1950 1928 1906 1922 1938 1954 1970 1989
2280A989K0%m1p5p4n8j6J6J5J8J8k1k1k2k1J1J0J1J0j5j6j6j6J1J2j1j0JJj6n8m5lM4Q7M4
$$ 1989 2009 2009 1968 1893 1819 1761 1745 1761 1776 1794 1812 1791 1770 1748 1727 1738 1748 1759 1769 1754 1738 1722 1706 1717 1729 1718 1708 1709 1710 1694 1636 1591 1588 1632 1719 1763
2275A763Kj4j4J4J4k9k9kkJ9K0N5N6P7P7Q2Q2L5ql4l3j5j5n5n4j4j4Jm3o0o1j7j6j7j7j1j1
$$ 1763 1765 1751 1737 1751 1765 1736 1707 1705 1703 1722 1742 1797 1853 1930 2007 2089 2171 2206 2198 2164 2131 2116 2101 2046 1992 1978 1964 1965 1922 1862 1801 1784 1768 1751 1734 1723 1712
2271A712j1j2L0L0j3j3%%LLj2L1L0j2l2l2j4j4m3m3K7K8K1K1k2k1k2k2lL9L8L7kkJ0J0J0J1
$$ 1712 1701 1689 1719 1749 1736 1723 1723 1723 1726 1729 1717 1748 1778 1766 1734 1702 1688 1674 1631 1588 1615 1643 1664 1685 1663 1642 1620 1598 1595 1634 1672 1709 1707 1705 1715 1725 1735 1746
2266A746k1k0k0k0KKl8l9l0J2K9K8Nl8l7MK3K3j5j5J8O1O1J8k3k3k3k3J2N5P3P3L4L4L4L4
$$ 1746 1725 1705 1685 1665 1667 1669 1631 1592 1562 1574 1603 1631 1636 1598 1561 1565 1588 1611 1596 1581 1599 1660 1721 1739 1716 1693 1670 1647 1659 1714 1787 1860 1894 1928 1962 1996
2262A996P7P7Q0Q0P9J23K12K83K97K54J75P7l4j33k06k07j80j08m9m9o7o7j09j10j29j29j27
$$ 1996 2073 2150 2230 2310 2389 2512 2724 3007 3304 3558 3733 3810 3776 3643 3437 3230 3050 2942 2893 2844 2777 2710 2601 2491 2362 2233 2106
2258B106j27j32q9l8NK2K2K5K5qqp7p6n0pJ4J4j1L2N1N1l6l7POJ2J2L4L3j2j2j3j2k2k1k2
$$ 2106 1979 1847 1758 1720 1725 1747 1769 1794 1819 1811 1803 1726 1650 1600 1593 1607 1621 1610 1642 1693 1744 1708 1671 1678 1684 1696 1708 1742 1775 1763 1751 1738 1726 1704 1683 1661
2254A661k1rqqrQRQQj%k2k2LMJ9O2P4L1j4j4K5K5K5K5QQj3j3pqJ2N4R4R4P8L5J1J1RRn4n3
$$ 1661 1640 1631 1623 1615 1606 1614 1623 1631 1639 1638 1638 1616 1594 1597 1601 1620 1682 1756 1787 1773 1759 1784 1809 1834 1859 1867 1875 1862 1849 1842 1834 1846 1900 1994 2088 2166 2201 2212 2223 2232 2241 2187 2134
2249B134n3n3l6l5l5l6kjkkj9k0j9j9k3k3k2k3l0l1n5j1LMPOM1M1M1M1K8K8j9o2l3l3l3l2
$$ 2134 2081 2028 1992 1957 1922 1886 1884 1883 1881 1879 1860 1840 1821 1802 1779 1756 1734 1711 1681 1650 1595 1584 1587 1591 1598 1604 1645 1686 1727 1768 1796 1824 1805 1743 1710 1677 1644 1612
2244A612l7NN3N2N7N6L3L2j7o1p9p9r7r6p6l3OM8M9M8L2L1J0J1m3m3%%K8K8K8K8L8L9L8L9
$$ 1612 1575 1580 1633 1685 1742 1798 1831 1863 1846 1785 1706 1627 1530 1434 1358 1325 1331 1379 1428 1476 1508 1539 1549 1560 1517 1474 1474 1474 1502 1530 1558 1586 1624 1663 1701 1740
2240A740J2J3l2p5n6j4L1L1O7O8P0K7j7j7KKmlk0o2p1k8J7J6j7j8MLONOOM3M4K4j8n6n6J2
$$ 1740 1752 1765 1733 1658 1602 1588 1619 1650 1717 1785 1855 1882 1865 1848 1850 1852 1848 1845 1825 1763 1692 1664 1681 1697 1680 1662 1666 1669 1675 1680 1686 1692 1735 1779 1803 1785 1729 1673 1685
2235A685J3KLK1K1Lm1l4l5PN0M9Pj7j7K8P0Q8Q9M4JPPPl6k9l0j1j1o6o6j8K4L7L8Q3Q3Q9R0
$$ 1685 1698 1700 1703 1724 1745 1748 1707 1673 1638 1645 1695 1744 1751 1734 1717 1745 1815 1903 1992 2036 2037 2044 2051 2058 2022 1993 1963 1952 1941 1875 1809 1791 1815 1852 1890 1973 2056 2145 2235
2230B235M4M5J4k9n2r4j11j11n4J7N3N3J0l3r0r0p3l2K5K5j3j2j1L2M8M8J6k7m5m5n9n9J2
$$ 2235 2279 2324 2338 2309 2257 2163 2052 1941 1887 1904 1957 2010 2020 1987 1897 1807 1734 1702 1727 1752 1739 1727 1716 1748 1796 1844 1860 1833 1788 1743 1684 1625 1637
2226A637J2k0k1k1k0KKP1P1L2j0k9k8%%J%RQRQJ2J2J2J2oonoJ8J8J8J8QPj3j4m1m0KKJ6J7
$$ 1637 1649 1629 1608 1587 1567 1569 1571 1642 1713 1745 1735 1706 1678 1678 1678 1679 1679 1688 1696 1705 1713 1725 1737 1749 1761 1755 1749 1744 1738 1756 1774 1792 1810 1818 1825 1812 1798 1757 1717 1719 1721 1737 1754
2221A754L5L6K4j8j5j6kkk3k3J0J0L2L2llk4k4QRj2j3m2m3J%L6L6N7N7N3N3L4rm6m6k7k8q
$$ 1754 1789 1825 1849 1831 1816 1800 1798 1796 1773 1750 1760 1770 1802 1834 1831 1828 1804 1780 1788 1797 1785 1772 1730 1687 1688 1688 1724 1760 1817 1874 1927 1980 2014 2005 1959 1913 1886 1858 1850
2216A850rj2j1k7p1m8oN4N4J4J3J2J1J2J1m1m2l9m0k4J9L5L4L7pk5k5l4l5l4l5jkO7O7O5K3
$$ 1850 1841 1829 1818 1791 1720 1672 1666 1720 1774 1788 1801 1813 1824 1836 1847 1806 1764 1725 1685 1661 1680 1715 1749 1786 1779 1754 1729 1695 1660 1626 1591 1590 1588 1655 1722 1787 1810
2211A810n3n2k0k0k0k0j1j2j2j2K5K5K4K5J0J1l3l2k2k2k2k1J8J8k5k5KKKLk4k3K0K0L4L5
$$ 1810 1757 1705 1685 1665 1645 1625 1614 1602 1590 1578 1603 1628 1652 1677 1687 1698 1665 1633 1611 1589 1567 1546 1564 1582 1557 1532 1534 1536 1538 1541 1517 1494 1514 1534 1568 1603
2207A603L5L4J6J5J6J5j9j9j9j9J6J6k7k7J5J5J5J5j2j2j2j2LLLKk2k3M9M8M6M6LLk1k1K1
$$ 1603 1638 1672 1688 1703 1719 1734 1715 1696 1677 1658 1674 1690 1663 1636 1651 1666 1681 1696 1684 1672 1660 1648 1651 1654 1657 1659 1637 1614 1663 1711 1757 1803 1806 1809 1788 1767 1788
2203A788K1L2L2j5n8m0m1m3m4k9k9J8O1O4O5mmj2j1L2L1J%m2m2m1m0m1m0j3j3j0j0J9O2L8
$$ 1788 1809 1841 1873 1858 1800 1760 1719 1676 1632 1603 1574 1592 1653 1717 1782 1778 1774 1762 1751 1783 1814 1815 1815 1773 1731 1690 1650 1609 1569 1556 1543 1533 1523 1542 1604 1642
2198A642L8K4K4K4K4%jM0M0K0k2JKk4k3k4k3l8l7l8l7RRQRklklj0j0j1j0l7l8j8K4K7K7L0
$$ 1642 1680 1704 1728 1752 1776 1776 1775 1815 1855 1875 1853 1854 1856 1832 1809 1785 1762 1724 1687 1649 1612 1621 1630 1638 1647 1645 1642 1640 1637 1627 1617 1606 1596 1559 1521 1503 1527 1554 1581 1611
2193A611K9M7M7MNk3k2m7mJ6J6J9J8j4j3j4j3J8J8K1K1j6K6M5M5O0N9N7N7J4k8m7m7l3l2j4
$$ 1611 1640 1687 1734 1738 1743 1720 1698 1651 1647 1663 1679 1698 1716 1702 1689 1675 1662 1680 1698 1719 1740 1724 1750 1795 1840 1900 1959 2016 2073 2087 2059 2012 1965 1932 1900 1886
2189A886K9P4P4L4L4K8K8j5j5l7l7l7l7o2o3m4jPPl4l3j6j6j7j6J3J3L7nj7j7K0K1J9k3m2
$$ 1886 1915 1989 2063 2097 2131 2159 2187 2172 2157 2120 2083 2046 2009 1947 1884 1840 1839 1846 1853 1819 1786 1770 1754 1737 1721 1734 1747 1784 1779 1762 1745 1765 1786 1805 1782 1740
2184A740m2ooopj4j4n7n7m3m3j%L3L4poj2L0P5P6M8Ol9l8l9LK2K3K6K6m6m5nonoJ4J4mm8n7
$$ 1740 1698 1692 1686 1680 1673 1659 1645 1588 1531 1488 1445 1444 1444 1477 1511 1504 1498 1486 1516 1591 1667 1715 1721 1682 1644 1605 1608 1630 1653 1679 1705 1659 1614 1609 1603 1598 1592 1606 1620 1616 1568 1511
2179A511n7j7j8LKKKO4O3Q8M4l1l2l5l4j8j9K4K4J5J6J2J3J7k6m2m1L0P3M9M9%j%jN3N3L4
$$ 1511 1454 1437 1419 1422 1424 1426 1428 1492 1555 1643 1687 1656 1624 1589 1555 1537 1518 1542 1566 1581 1597 1609 1622 1639 1613 1571 1530 1560 1633 1682 1731 1731 1730 1730 1729 1782 1835 1869
2175A869qOOMLm2m3k4J9K8K8j7n9l2l1QRL9L9P7P8K4m7n0n0k1k0m2JO1J03J01N9Ko9j02j03
$$ 1869 1861 1867 1873 1877 1880 1838 1795 1771 1790 1818 1846 1829 1770 1738 1707 1715 1724 1763 1802 1879 1957 1981 1934 1884 1834 1813 1793 1751 1752 1813 1916 2017 2076 2078 2009 1907 1804
2170A804n2n2l6OJ7k6m0l9lL9M0lppj0rJ5J5J6J5oppoppopPPNMJ1l2m8m8oL6Q4Q4O3O4J8J7
$$ 1804 1752 1700 1664 1670 1687 1661 1621 1582 1579 1618 1658 1655 1648 1641 1631 1622 1637 1652 1668 1683 1677 1670 1663 1657 1650 1643 1637 1630 1637 1644 1649 1653 1664 1632 1584 1536 1530 1566 1650 1734 1797 1861 1879 1896
2165A896Ql4p9q0p8l6J6N9N0M9J0RLMj6n8m0m1%jm8m9l0J3J4J4J7J6KJKJj3j3j4j3k4k4k3
$$ 1896 1904 1870 1791 1711 1633 1597 1613 1672 1722 1771 1781 1790 1793 1797 1781 1723 1683 1642 1642 1641 1593 1544 1514 1527 1541 1555 1572 1588 1590 1591 1593 1594 1581 1568 1554 1541 1517 1493 1470
2160A470k4L1L2L1L2N5N6J3J3RJ0L3rl0k9l0l0l0J2N9N9J2J1J1J1j4j4j5j4j2j1j2j2j0rL3
$$ 1470 1446 1477 1509 1540 1572 1627 1683 1696 1709 1718 1728 1761 1752 1722 1693 1663 1633 1603 1615 1674 1733 1745 1756 1767 1778 1764 1750 1735 1721 1709 1698 1686 1674 1664 1655 1688
2156A688L3K0K0J8J8J4k8j01j01n7j4NNM2M3O7K4k4k4k7k7K3K3K3K3RJ0N0M9J1l3qqJ5J6k7
$$ 1688 1721 1741 1761 1779 1797 1811 1783 1682 1581 1524 1510 1515 1520 1562 1605 1672 1696 1672 1648 1621 1594 1617 1640 1663 1686 1695 1705 1755 1804 1815 1782 1774 1766 1781 1797 1770
2151A770k7k4k4k4k4k7k6k7k7NONNK9L0j4j3MNK9j5j4j4K6K6j2j3L1L0rqrrJ3J3J3J2l0l1
$$ 1770 1743 1719 1695 1671 1647 1620 1594 1567 1540 1545 1551 1556 1561 1590 1620 1606 1593 1597 1602 1631 1616 1602 1588 1614 1640 1628 1615 1646 1676 1667 1659 1650 1641 1654 1667 1680 1692 1662 1631
2146A631l1l1l3l4RRNMM5M4L8nk4k4%%%JJ5J5J6J5J5J6J5J5oppoppJ8k6m5m6ooK4K4K3K4j0
$$ 1631 1600 1569 1536 1502 1511 1520 1525 1529 1574 1618 1656 1651 1627 1603 1603 1603 1603 1604 1619 1634 1650 1665 1680 1696 1711 1726 1720 1713 1706 1700 1693 1686 1704 1678 1633 1587 1581 1575 1599 1623 1646 1670 1660
2141A660rppm9oM1M1Q4Q4O3J9l2p6p8l5J8J7K0K1N4N4P8L5l8l8q1q2o4k1O8J40J61J18M6n3
$$ 1660 1651 1644 1637 1588 1582 1623 1664 1748 1832 1895 1914 1882 1806 1728 1693 1711 1728 1748 1769 1823 1877 1955 1990 1952 1914 1833 1751 1687 1666 1734 1874 2035 2153 2199 2146
2137B146j03j02o2j8j6j5n3n3m0KK1K1k3k3k3k3k7k7J7J6J1J2J1J2K3K3k0k0k1k2K0K1O2O2
$$ 2146 2043 1941 1879 1861 1845 1830 1777 1724 1684 1686 1707 1728 1705 1682 1659 1636 1609 1582 1599 1615 1626 1638 1649 1661 1684 1707 1687 1667 1646 1624 1644 1665 1727 1789
2133A789M3%noqql9l8l9l8p3p2k5J7M5M4R0Q9P1P1K6K5nm8m8oK5K6j2j3LM6K2K1KJM6Q9O3
$$ 1789 1832 1832 1827 1821 1813 1805 1766 1728 1689 1651 1578 1506 1481 1498 1543 1587 1677 1766 1837 1908 1934 1959 1954 1906 1858 1852 1877 1903 1891 1878 1881 1927 1949 1970 1972 1973 2019 2108 2171
2128B171K1l8j09j25q3pL6N9N8N9N9l2p5n1n0m3m3m3m2j2j2j1j2jjjjN8N7N8N7MMMNj6j6j6
$$ 2171 2192 2154 2045 1920 1837 1830 1866 1925 1983 2042 2101 2069 1994 1943 1893 1850 1807 1764 1722 1710 1698 1687 1675 1674 1673 1672 1671 1729 1786 1844 1901 1905 1909 1913 1918 1902 1886 1870
2123A870j6J6J6n5n5o2o3k0k0NMNNj4j4j3j4MMMMK0K1K1K0mmnmJ9K0J6J7Ll9q4q4l6ON3N3
$$ 1870 1854 1870 1886 1831 1776 1714 1651 1631 1611 1616 1620 1625 1630 1616 1602 1589 1575 1579 1583 1587 1591 1611 1632 1653 1673 1669 1665 1660 1656 1675 1695 1711 1728 1731 1692 1608 1524 1488 1494 1547 1600
2118A600J1J0l2l2ONONJ1J1N3N4jjjjJKKJRQRQj2j1j2j2mmm4m4m3JM7M8K5K5M1Q3Q6M2om9
$$ 1600 1611 1621 1589 1557 1563 1568 1574 1579 1590 1601 1654 1708 1707 1706 1705 1704 1705 1707 1709 1710 1719 1727 1736 1744 1732 1721 1709 1697 1693 1689 1645 1601 1558 1559 1606 1654 1679 1704 1745 1828 1914 1956 1950 1901
2113A901l6l5l8l9n5n5l6Onoklk5k5k2k2K9P3M8M8K9K9j4j4lmlmjkkjj6j6N3N3M7Nm2m2o7
$$ 1901 1865 1830 1792 1753 1698 1643 1607 1613 1608 1602 1600 1597 1572 1547 1525 1503 1532 1605 1653 1701 1730 1759 1745 1731 1728 1724 1721 1717 1716 1714 1712 1711 1695 1679 1732 1785 1832 1837 1795 1753 1686
2108A686o7k4k3J2J3J2J3L1L0J3l1j4j5j7j7j0j0j0j0n9n9j7j6M4M5M2M1lm6k3k2%JM2M3J9
$$ 1686 1619 1595 1572 1584 1597 1609 1622 1653 1683 1696 1665 1651 1636 1619 1602 1592 1582 1572 1562 1503 1444 1427 1411 1455 1500 1542 1583 1580 1534 1511 1489 1489 1490 1532 1575 1594
2104A594J9J9J9j9k0j9j9M1M1M1M1NMNMj3j3j4j3jkk6J7L5L5no%jjjmmm7m7k0k0j9k0mnmn
$$ 1594 1613 1632 1651 1632 1612 1593 1574 1615 1656 1697 1738 1743 1747 1752 1756 1743 1730 1716 1703 1702 1700 1674 1691 1726 1761 1756 1750 1750 1749 1748 1747 1743 1739 1692 1645 1625 1605 1586 1566 1562 1557 1553 1548
2098A548K7K6K7K6K6K7K6K7K9K9K9K9j0j0j0j0l1l2l1l2QPl5l5l4l3J3N7P5P6QPj8j9j8j9
$$ 1548 1575 1601 1628 1654 1680 1707 1733 1760 1789 1818 1847 1876 1866 1856 1846 1836 1805 1773 1742 1710 1718 1725 1690 1655 1621 1588 1601 1658 1733 1809 1817 1824 1806 1787 1769 1750
2094A750nnnnJ2J2J2J3O3O4J8J9Lm0q4q4p2l0j1j2J3J2J3J2L9L9%jQN1N1QJ4J5J2J1j5j6j5
$$ 1750 1745 1740 1735 1730 1742 1754 1766 1779 1842 1906 1924 1943 1946 1906 1822 1738 1666 1636 1625 1613 1626 1638 1651 1663 1702 1741 1741 1740 1748 1799 1850 1858 1872 1887 1899 1910 1895 1879 1864
2089A864j6J0RRJ0n6n6n6n6k3k2K1K0L7L6ooJ1J1l4p6o2k0N4N3K1K1K0K1jj%jj2j1M4O6N9
$$ 1864 1848 1858 1867 1876 1886 1830 1774 1718 1662 1639 1617 1638 1658 1695 1731 1725 1719 1730 1741 1707 1631 1569 1549 1603 1656 1677 1698 1718 1739 1738 1737 1737 1736 1724 1713 1757 1823 1882
2084A882J5l1l0opL4L3K8j4o0n9LM6K2K1J4J3J3J3%%%%L3L4j0rm3m3m3m4k6k6J6J6M8M8L3
$$ 1882 1897 1866 1836 1830 1823 1857 1890 1918 1904 1844 1785 1788 1834 1856 1877 1891 1904 1917 1930 1930 1930 1930 1930 1963 1997 1987 1978 1935 1892 1849 1805 1779 1753 1769 1785 1833 1881 1914
2080A914j1k2K1L6L7J7J7J5J6o5q7k7J5J8J8K0K0K7K6L6J4l5p9p8l6J7L9K6K6jm4m2JM8R0
$$ 1914 1903 1881 1902 1938 1975 1992 2009 2024 2040 1975 1888 1861 1876 1894 1912 1932 1952 1979 2005 2041 2055 2020 1941 1863 1827 1844 1883 1909 1935 1934 1890 1848 1849 1897 1987
2076A987O8ml3j2J4J4J3J2J3J2L6L6L6L5J3J3K8P1P2K8J3J2L3L2L2L3ppmmLM5O5O4R0R0J37
$$ 1987 2055 2051 2018 2006 2020 2034 2047 2059 2072 2084 2120 2156 2192 2227 2240 2253 2281 2352 2424 2452 2465 2477 2510 2542 2574 2607 2600 2593 2589 2585 2588 2633 2698 2762 2852 2942 3079
2071C079J80K25K24K72K73L07L50M12M12K85P3r9r9l1R6K43L99N16O43Q43J085J183R40M27
$$ 3079 3259 3484 3708 3980 4253 4560 4910 5322 5734 6019 6092 5993 5894 5863 5959 6202 6601 7117 7760 8603 9688 10871 11811 12238
2068A2238j57n69p53p68o69m40j70J23L93N96P24P98P98O79K39m53j121j438j310r84o58m09
$$ 12238 12081 11512 10759 9991 9322 8882 8712 8835 9228 9824 10548 11346 12144 12823 13062 12609 11488 10050 8740 7756 7098 6689
2065F689k25p8N1J53K24J36j62m83o40o22n22m32l60k75k03j42r9p2p3o3j9jjp6p5p6p6p9
$$ 6689 6464 6386 6437 6590 6814 6950 6788 6305 5665 5043 4521 4089 3729 3454 3251 3109 3010 2938 2865 2802 2783 2782 2781 2705 2630 2554 2478 2399
2062B399p9l2J0J2J1L3P5N7N7J4J4k2o5q1q1n5j2O4O3O0N9J6J7m3m2J%jjkjj3j3j3j3K1K0
$$ 2399 2320 2288 2298 2310 2321 2354 2429 2486 2543 2557 2571 2549 2484 2403 2322 2267 2255 2319 2382 2442 2501 2517 2534 2491 2449 2450 2450 2449 2448 2446 2445 2432 2419 2406 2393 2414 2434
2057B434O4O3J02J02N9N9QQN1N1O1O1O1O1J29J28J29J29J17J17J90J91K63L06L51M22N21O77
$$ 2434 2498 2561 2663 2765 2824 2883 2891 2899 2950 3001 3062 3123 3184 3245 3374 3502 3631 3760 3877 3994 4184 4375 4638 4944 5295 5717 6238 6915
2054F915P93P94O20M05K13K12L17N30P70R26J058J157J097P41J80k90l44p3K52M66O52Q95
$$ 6915 7708 8502 9122 9527 9740 9952 10269 10799 11569 12495 13553 14710 15807 16548 16728 16438 16094 16021 16273 16739 17391 18286
2051A8286R76P35K29k98o15o14n04n04o85q98q67n39o6L17N58O58N18l7q16j457j709j581
$$ 18286 19262 19997 20226 19928 19313 18699 18195 17691 17006 16108 15241 14702 14636 14953 15511 16169 16687 16650 15834 14377 12668 11087
2049A1087j305r78o77m06k01j6J25J24m5l16n53o52o62n62m33l05j98j26r6r7k1k1JJm1m2
$$ 11087 9782 8804 8127 7721 7520 7504 7629 7753 7708 7392 6839 6187 5525 4963 4530 4225 4027 3901 3805 3708 3687 3666 3667 3668 3627 3585
2045C585J1J2J6J6Q7J59J98K40K84L26L78M77O01O00M93K51K4j04o5J20L57N98Q95J195J297
$$ 3585 3596 3608 3624 3640 3727 3886 4084 4324 4608 4934 5312 5789 6390 6990 7483 7734 7758 7654 7589 7709 8066 8664 9559 10754 12051
2042A2051R43K11m87p83o27l83k55k45j46K5J54J21pm4K7J17J9l79q48j058r87p39m98k80
$$ 12051 12994 13205 12718 11935 11308 10925 10670 10425 10279 10304 10458 10579 10572 10528 10555 10672 10691 10312 9464 8406 7419 6680 6182 5902
2039E902r6N0R3jj87l73m72m57l57k55k13j90j47r7r7q5q5q6q5n1n2qr%J%Jn8n7n8n7L3L3
$$ 5902 5806 5856 5949 5948 5761 5388 4916 4459 4102 3847 3634 3444 3297 3200 3103 3018 2933 2847 2762 2711 2659 2651 2642 2642 2643 2643 2644 2586 2529 2471 2414 2447 2480
2035B480L2L3K0J9K0J9PPl6l6m8m8m9m8j0j1L3L2N1N1k0k0m0m0LKnonoooL7L6m6m6lmJ3J3
$$ 2480 2512 2545 2565 2584 2604 2623 2630 2637 2601 2565 2517 2469 2420 2372 2362 2351 2384 2416 2467 2518 2498 2478 2438 2398 2401 2403 2398 2392 2387 2381 2375 2369 2406 2442 2396 2350 2347 2343 2356 2369
2031B369k9k9PQQQl0l1l0l0JKKJK4K4K3K4k2k3k2k3L3L4L3L3oonoK2K3K2K2K3K2K3K2opop
$$ 2369 2340 2311 2318 2326 2334 2342 2312 2281 2251 2221 2222 2224 2226 2227 2251 2275 2298 2322 2300 2277 2255 2232 2265 2299 2332 2365 2359 2353 2348 2342 2364 2387 2409 2431 2454 2476 2499 2521 2515 2508 2502 2495
2025B495opoo%%%Jj5j5j5j5mmL9L9KKm0m1l2l2J1J1onnol0l1l0l1j2j3j3j2J9K0K0K0K0K0
$$ 2495 2489 2482 2476 2470 2470 2470 2470 2471 2456 2441 2426 2411 2407 2403 2442 2481 2483 2485 2445 2404 2372 2340 2351 2362 2356 2351 2346 2340 2310 2279 2249 2218 2206 2193 2180 2168 2187 2207 2227 2247 2267 2287
2020B287J9K0J8J7J8J8L2L3l8l9l6l7l7l6o5o5k3k2N2N2N2N2k8k7k7k7pooopoopmmmnNNl8
$$ 2287 2306 2326 2344 2361 2379 2397 2429 2462 2424 2385 2349 2312 2275 2239 2174 2109 2086 2064 2116 2168 2220 2272 2244 2217 2190 2163 2156 2150 2144 2138 2131 2125 2119 2112 2108 2104 2100 2095 2100 2105 2067
2015B067l8l0l0J3J3J8J8Q9R0N5N6J3J3nnnnj5j5j5j5l0l0l0l0m0m0LLj9j9j8j9l4l4QRL0
$$ 2067 2029 1999 1969 1982 1995 2013 2031 2120 2210 2265 2321 2334 2347 2342 2337 2332 2327 2312 2297 2282 2267 2237 2207 2177 2147 2107 2067 2070 2073 2054 2035 2017 1998 1964 1930 1938 1947 1977
2011A977L1K8K8Jm1j8j7j5j5K5K6km4o3o3J4J5J4J5J0J0J0J1J2J2L6po6o6k2K1QQJ0J1j7j7
$$ 1977 2008 2036 2064 2065 2024 2006 1989 1974 1959 1984 2010 2008 1964 1901 1838 1852 1867 1881 1896 1906 1916 1926 1937 1949 1961 1997 1990 1924 1858 1836 1857 1865 1873 1883 1894 1877 1860
2006A860N2N1M8Ol9m0k7J6O0N9J1l3rql5l5l5l4m6m5m6m5j3j4j3j3J8J9J9J8K7K7K6K7NMM
$$ 1860 1912 1963 2011 2017 1978 1938 1911 1927 1987 2046 2057 2024 2015 2007 1972 1937 1902 1868 1822 1777 1731 1686 1673 1659 1646 1633 1651 1670 1689 1707 1734 1761 1787 1814 1819 1823 1827
2002A827Nl8l7j9K3N3N3N3N3K3k1o5o5jM2J7J8K0J9k0k1m4kJ7J7l1l0k8k8j0L3QRk1k0k1k1
$$ 1827 1832 1794 1757 1738 1761 1814 1867 1920 1973 1996 1975 1910 1845 1844 1886 1903 1921 1941 1960 1940 1919 1875 1873 1890 1907 1876 1846 1818 1790 1780 1813 1821 1830 1809 1789 1768 1747
1997A747J2J1J1J2J2J2RRpn1o6o6k4J9L7L8J3J4J3J4L8L8L8L9jjjjpppoo5o5m6lQPN0N0N0
$$ 1747 1759 1770 1781 1793 1805 1817 1826 1835 1828 1777 1711 1645 1621 1640 1677 1715 1728 1742 1755 1769 1807 1845 1883 1922 1921 1920 1919 1918 1911 1904 1897 1891 1826 1761 1715 1712 1720 1727 1777 1827 1877
1992A877Om1m0n5n6j2j3j9j9lM0K9j3l0k9rqqqK3K2k0k0MMK8j5k1k1J8J9K3K3k0j9k6k7M5
$$ 1877 1883 1842 1802 1747 1691 1679 1666 1647 1628 1625 1665 1694 1681 1651 1622 1613 1605 1597 1589 1612 1634 1614 1594 1598 1602 1630 1615 1594 1573 1591 1610 1633 1656 1636 1617 1591 1564 1609
1987A609M5KKKKL0K9K9K9K7K7N0Qk5k6k7k8k8k8k8k8J5J5J3J2Nl8j5j4KKk2K1M3M3LLOPl6
$$ 1609 1654 1656 1658 1660 1662 1692 1721 1750 1779 1806 1833 1883 1891 1866 1840 1813 1785 1757 1729 1701 1673 1688 1703 1716 1728 1733 1695 1680 1666 1668 1670 1648 1669 1712 1755 1758 1761 1767 1774 1738
1982A738l7m4m4m4m4KLM5M6O3O3K0K1m7m7m4m4k2K0L8L9N3N3J1J1J6J7J7J7MNl9l8q5q4m2
$$ 1738 1701 1657 1613 1569 1525 1527 1530 1575 1621 1684 1747 1767 1788 1741 1694 1650 1606 1584 1604 1642 1681 1734 1787 1798 1809 1825 1842 1859 1876 1880 1885 1846 1808 1723 1639 1597
1978A597m2pol1J3N1N1J2J1K4K4j9j9k1k1K1K1RRQRl3l3J0J0J5J6k7k7K4K5K5K4OONOj0j1
$$ 1597 1555 1548 1542 1511 1524 1575 1626 1638 1649 1673 1697 1678 1659 1638 1617 1638 1659 1668 1677 1685 1694 1661 1628 1638 1648 1663 1679 1652 1625 1649 1674 1699 1723 1729 1735 1740 1746 1736 1725
1973A725L3L2K7K7j5j6l9l9o4k1K6K5K9K8K5K6K6K5oom9m8k2k2k2k2n6n5l7OM0M0M2M2J1J1
$$ 1725 1758 1790 1817 1844 1829 1813 1774 1735 1671 1650 1676 1701 1730 1758 1783 1809 1835 1860 1854 1848 1799 1751 1729 1707 1685 1663 1607 1552 1515 1521 1561 1601 1643 1685 1696 1707
1969A707J0J1KLm0m0l6l5l3l3kM1M1kk7k6l0k9J4J4J4J5llM1Q2N3j9m7m7NMNMooJ3N5O3O2
$$ 1707 1717 1728 1730 1733 1693 1653 1617 1582 1549 1516 1514 1555 1596 1594 1567 1541 1511 1482 1496 1510 1524 1539 1536 1533 1574 1656 1709 1690 1643 1596 1601 1605 1610 1614 1608 1602 1615 1670 1733 1795
1964A795K3K3j1j2j1j1nnonk3k3k3k4j4j5j5j5J7J7J7J7M1M1M1M0NMl9l8n8n8n7n8j0rL0L0
$$ 1795 1818 1841 1830 1818 1807 1796 1791 1786 1780 1775 1752 1729 1706 1682 1668 1653 1638 1623 1640 1657 1674 1691 1732 1773 1814 1854 1859 1863 1824 1786 1728 1670 1613 1555 1545 1536 1566 1596
1959A596K0k2JKM3M3M1M0M7Mm3m3k3k3o2o2m1L0N8N9Nl8j3j4M3M3M4M3M0L9nol0p4q9q9k0
$$ 1596 1616 1594 1595 1597 1640 1683 1724 1764 1811 1815 1772 1729 1706 1683 1621 1559 1518 1548 1606 1665 1670 1632 1619 1605 1648 1691 1735 1778 1818 1857 1852 1846 1816 1742 1653 1564 1544
1955A544K3M2M1N4N4Pl6n6n5j1L1N7N6J7J7mmmmmnm7m7J3J3J4J3J0Rl3l4RRQRl1l1l1l1kk
$$ 1544 1567 1609 1650 1704 1758 1765 1729 1673 1618 1607 1638 1695 1751 1768 1785 1781 1777 1773 1769 1765 1760 1713 1666 1679 1692 1706 1719 1729 1738 1705 1671 1680 1689 1697 1706 1675 1644 1613 1582 1580 1578
1950A578m1m2QN1K7K6L8L7L8L7l9m0l9m0l1l1J1J1QQQQKLKLL9M0llK5K5Ol7k3k2k5k5k7k7
$$ 1578 1537 1495 1503 1554 1581 1607 1645 1682 1720 1757 1718 1678 1639 1599 1568 1537 1548 1559 1567 1575 1583 1591 1593 1596 1598 1601 1640 1680 1677 1674 1699 1724 1730 1693 1670 1648 1623 1598 1571 1544
1945A544J5J6K1K1K1K1K9K9K9K9L2L3L2L2nmnmk1k0J9K0J1l1n0n0j0rj0rk3k3k0k0MM6K2K2
$$ 1544 1559 1575 1596 1617 1638 1659 1688 1717 1746 1775 1807 1840 1872 1904 1899 1895 1890 1886 1865 1845 1864 1884 1895 1864 1814 1764 1754 1745 1735 1726 1703 1680 1660 1640 1644 1690 1712 1734
1940A734PQPPn2n2n2n2K3K2K3K3k1k0k0k0k0j9K3K4LLKLM3M3%JqpL2L3K8j5o2o2l7l8RN2O3
$$ 1734 1741 1749 1756 1763 1711 1659 1607 1555 1578 1600 1623 1646 1625 1605 1585 1565 1545 1526 1549 1573 1576 1579 1581 1584 1627 1670 1670 1671 1663 1656 1688 1721 1749 1734 1672 1610 1573 1535 1544 1596 1659
1935A659O3oo%%J%J3J3J4J3jkkjk8k7k5k5m3jP1P0N1k0n1n1J0J0J0J1L7L8L8L7ppppjjm3m4
$$ 1659 1722 1716 1710 1710 1710 1711 1711 1724 1737 1751 1764 1763 1761 1759 1758 1730 1703 1678 1653 1610 1609 1680 1750 1801 1781 1730 1679 1689 1699 1709 1720 1757 1795 1833 1870 1863 1856 1849 1842 1841 1840 1797 1753
1930A753%J%%%JLLpL6N2N2L0j3J1J2J4J5J4J5l2l2l1l2j1j1j1j1K1K1K1K1KKKKMMl9l9n6n6
$$ 1753 1753 1754 1754 1754 1754 1755 1758 1761 1754 1790 1842 1894 1924 1911 1922 1934 1948 1963 1977 1992 1960 1928 1897 1865 1854 1843 1832 1821 1842 1863 1884 1905 1907 1909 1911 1913 1917 1921 1882 1843 1787 1731
1925A731l7NK1K0j9k0m2m2k4K0M5M6M9M8K3K3k5o7k9k8l0l1l0k9l0k9RJ0J0RK4K3M7NMMJJ
$$ 1731 1694 1699 1720 1740 1721 1701 1659 1617 1593 1613 1658 1704 1753 1801 1824 1847 1822 1755 1726 1698 1668 1637 1607 1578 1548 1519 1528 1538 1548 1557 1581 1604 1651 1656 1660 1664 1665 1666
1920A666j2j1j1j2n0n0n1n0MMMMN1N0N1N0K3K2K3K2j6j7j7j7opopj4j5N4N4J2l0j8MJ1J2k9
$$ 1666 1654 1643 1632 1620 1570 1520 1469 1419 1423 1427 1431 1435 1486 1536 1587 1637 1660 1682 1705 1727 1711 1694 1677 1660 1654 1647 1641 1634 1620 1605 1659 1713 1725 1695 1677 1681 1692 1704 1675
1915A675l0J4J4J3J4mmm4m4k3K0K0k2l4l3l4l3j4K9P3P4K2k1j0J2jk3k2j%k1l2J1L1L1L4L4
$$ 1675 1645 1659 1673 1686 1700 1696 1692 1648 1604 1581 1601 1621 1599 1565 1532 1498 1465 1451 1480 1553 1627 1649 1628 1618 1630 1629 1606 1584 1583 1583 1562 1530 1541 1572 1603 1637 1671
1911A671j3j2j3j2J0J1J1J0JJ%Jj0j0p9p8k4K0nnNMOORL0M3Jj4Oqqj4j3M3O4Ml9j4j4j8j9
$$ 1671 1658 1646 1633 1621 1631 1642 1653 1663 1664 1665 1665 1666 1656 1646 1567 1489 1465 1485 1480 1475 1480 1484 1490 1496 1505 1535 1578 1579 1565 1571 1563 1555 1541 1528 1571 1635 1639 1600 1586 1572 1554 1535
1906A535jM2N1L1KKnmnmNOONONONj3j4j4j4noooj8j9K2K1K7j7m5k5L4N5K5j7rj0j2j3m5m6
$$ 1535 1534 1576 1627 1658 1660 1662 1657 1653 1648 1644 1649 1655 1661 1666 1672 1677 1683 1688 1675 1661 1647 1633 1628 1622 1616 1610 1592 1573 1595 1616 1643 1626 1581 1556 1590 1645 1670 1653 1644 1634 1622 1609 1564 1518
1900A518n5l4%M2L2J2j2RL9L9L8L7J7J6K8K7POJ1J1nm8m7nN1K9j3l4l6j4K0K0Ol7l7OK1K2
$$ 1518 1463 1429 1429 1471 1503 1515 1503 1512 1551 1590 1628 1665 1682 1698 1726 1753 1760 1766 1777 1788 1783 1735 1688 1683 1734 1763 1750 1716 1680 1666 1686 1706 1712 1675 1638 1644 1665 1687
1896A687nonnk5k6J8J7LLRL1Rl4m9m9l7OM0O1N0K8K9N0M6K5pn0n7l6J9J9mk6l8ML5L4L7L7
$$ 1687 1682 1676 1671 1666 1641 1615 1633 1650 1653 1656 1665 1696 1705 1671 1622 1573 1536 1542 1582 1643 1693 1721 1750 1800 1846 1871 1864 1814 1757 1721 1740 1759 1755 1729 1691 1695 1730 1764 1801 1838
1891A838J7J6j1l3l0J3L1L0mmm7m7j5j5K8K8M8M7NOj2j1Lj8k0K1O6O5J5k7m7m6j9j9j9j9K4
$$ 1838 1855 1871 1860 1827 1797 1810 1841 1871 1867 1863 1816 1769 1754 1739 1767 1795 1843 1890 1895 1901 1889 1878 1881 1863 1843 1864 1930 1995 2010 1983 1936 1890 1871 1852 1833 1814 1838
1886A838K4K5K4MLMMLMLMk7k8k7k7J7J8J5J5J6k6k4k4J0J1N0N1N1Ql9l9o2o2m3jN4N4L8mm8
$$ 1838 1862 1887 1911 1915 1918 1922 1926 1929 1933 1936 1940 1913 1885 1858 1831 1848 1866 1881 1896 1912 1886 1862 1838 1848 1859 1909 1960 2011 2019 1980 1941 1879 1817 1774 1773 1827 1881 1919 1915 1867
1881A867m7m7m8l5QK7K6KJM2M1L3j0n5n4k1K2kkj4j5j4j5j1j2j2j2ooL6L7%JK1K2NMNMnnn
$$ 1867 1820 1773 1725 1690 1698 1725 1751 1753 1754 1796 1837 1870 1860 1805 1751 1730 1752 1750 1748 1734 1719 1705 1690 1679 1667 1655 1643 1637 1631 1667 1704 1704 1705 1726 1748 1753 1757 1762 1766 1761 1756 1751
1876A751mJ2J2J2J2noonp9p8p9p8j5j5K8K7O0N9L8L8J2J2k8k8nL7N4N4L4rk7k7OPN0M9L4L3
$$ 1751 1747 1759 1771 1783 1795 1790 1784 1778 1773 1694 1616 1537 1459 1444 1429 1457 1484 1544 1603 1641 1679 1691 1703 1675 1647 1642 1679 1733 1787 1821 1812 1785 1758 1764 1771 1821 1870 1904 1937
1872A937L4L3L7L7L6L7NMNMK9K8K8K9J2J2N3N2L1j1l2l2p5r6o5k3k5k5lL9N0N0L2j2o5j09
$$ 1937 1971 2004 2041 2078 2114 2151 2156 2160 2165 2169 2198 2226 2254 2283 2295 2307 2360 2412 2443 2432 2400 2368 2293 2197 2132 2109 2084 2059 2056 2095 2145 2195 2227 2215 2150 2041
1867B041q4j3J4J5L4P8J09O7ooJ3J4J3J3L9M0qn1l0l0j4K8M9M9Q0J01R8N5Ll9q7j09j18j18
$$ 2041 1957 1944 1958 1973 2007 2085 2194 2261 2255 2249 2262 2276 2289 2302 2341 2381 2373 2322 2292 2262 2248 2276 2325 2374 2454 2555 2653 2708 2711 2672 2585 2476 2358 2240
1863B240q3m0oJ5K5Lj3l5o9o9p1p1m8m9k7k8KJM4M5L8L9mmk0k0m2m1l1l1n3n2m0l9k1K1K7
$$ 2240 2157 2117 2111 2126 2151 2154 2141 2106 2037 1968 1897 1826 1778 1729 1702 1674 1676 1677 1721 1766 1804 1843 1839 1835 1815 1795 1753 1712 1681 1650 1597 1545 1505 1466 1445 1466 1493
1858A493K8QQK4K3JKONj3j3ON0N8L7J4J3J3J2j1j1l2l2l1l0J2J2L1L1J0Rk1k1k1k1J7J6J7
$$ 1493 1521 1529 1537 1561 1584 1585 1587 1593 1598 1585 1572 1578 1628 1686 1723 1737 1750 1763 1775 1764 1753 1721 1689 1658 1628 1640 1652 1683 1714 1724 1733 1712 1691 1670 1649 1666 1682 1699
1854A699J7qrqql0l1k8k7J3N5P2P2N8J5mll2l2n1n0k2K2J9J8kkJ3N6O5K1k2k3n3n3n5j3J4
$$ 1699 1716 1708 1699 1691 1683 1653 1622 1594 1567 1580 1635 1707 1779 1837 1852 1848 1845 1813 1781 1730 1680 1658 1680 1699 1717 1715 1713 1726 1782 1847 1868 1846 1823 1770 1717 1662 1649 1663
1849A663J3J6J5J2J2j0rj5j4MM7P3P4Jm1k5k5J6J5j1j1n1n1l2J0L0K9LMK1K2L8on2n2mlll
$$ 1663 1676 1692 1707 1719 1731 1721 1712 1697 1683 1687 1734 1807 1881 1882 1841 1816 1791 1807 1822 1811 1800 1749 1698 1666 1676 1706 1735 1738 1742 1763 1785 1823 1817 1765 1713 1709 1706 1703 1700
1844A700j9j8j8j9L5L4L5L5K0K1k2k2j9j9KKm7m7k8J4L2L2qqJ%JJJ7J6M1kl6l6RN1L9M0jj
$$ 1700 1681 1663 1645 1626 1661 1695 1730 1765 1785 1806 1784 1762 1743 1724 1726 1728 1681 1634 1606 1620 1652 1684 1676 1668 1669 1669 1670 1671 1688 1704 1745 1743 1707 1671 1680 1731 1770 1810 1809 1808
1840A808rrl1l0oom6m5n3j1QQ%%%%M7M7MMk7k7J6J6j1j1j1j1l1l2l1l1K9K9L0K9K8K8K8K8
$$ 1808 1799 1790 1759 1729 1723 1717 1671 1626 1573 1562 1570 1578 1578 1578 1578 1578 1625 1672 1676 1680 1653 1626 1642 1658 1647 1636 1625 1614 1583 1551 1520 1489 1518 1547 1577 1606 1634 1662 1690 1718
1835A718lmmmJ3J3J3J3kkm5m5j2j3j3j3n0n0pqM3M3M3M3J8J7J8J8J0J1l3l2j5j5K8K8K1K0
$$ 1718 1715 1711 1707 1703 1716 1729 1742 1755 1753 1751 1706 1661 1649 1636 1623 1610 1560 1510 1503 1495 1538 1581 1624 1667 1685 1702 1720 1738 1748 1759 1726 1694 1679 1664 1692 1720 1741 1761
1830A761K1K1M7M7NMj1j2j2j2J%J%%%m2m3m3m3%%NNNMk0k0jM1N7N7j5n9o0o0k0k0J3J3J3J3
$$ 1761 1782 1803 1850 1897 1902 1906 1895 1883 1871 1859 1860 1860 1861 1861 1861 1861 1819 1776 1733 1690 1690 1690 1695 1700 1705 1709 1689 1669 1668 1709 1766 1823 1808 1749 1689 1629 1609 1589 1602 1615 1628 1641
1825A641J8J8k6k5klL7L7J9k3l9m0J6N8L5L4L3L4J5k8n5n4j4j4K7K6K7K7l4l4l2l1m0KK1K1
$$ 1641 1659 1677 1651 1626 1624 1621 1658 1695 1714 1691 1652 1612 1628 1686 1721 1755 1788 1822 1837 1809 1754 1700 1686 1672 1699 1725 1752 1779 1745 1711 1679 1648 1608 1610 1631 1652
1820A652QROOK4j8l6l7J4J5J4J5JJJKJ3J3J4J3J1J1J0J1k5k4o5o5j1L1QPL7L7L6L7kklkk9
$$ 1652 1660 1669 1675 1681 1705 1687 1651 1614 1628 1643 1657 1672 1673 1674 1675 1677 1690 1703 1717 1730 1741 1752 1762 1773 1748 1724 1659 1594 1583 1614 1622 1629 1666 1703 1739 1776 1774 1772 1769 1767 1738
1815A738l0l0k9K4K3K4K4nnnnk1k0k0k0l9l9MLJ0RRRL2L2j0j1k5k6k5k6k6k7n1qK9K8L1L2
$$ 1738 1708 1678 1649 1673 1696 1720 1744 1739 1734 1729 1724 1703 1683 1663 1643 1604 1565 1569 1572 1582 1591 1600 1609 1641 1673 1663 1652 1627 1601 1576 1550 1524 1497 1446 1438 1467 1495 1526 1558
1811A558J5J5J5J5P8P7L0j2kjmmm5m6m5m5k8k9J4J4NNONK5K5j8j7rrrqk1k1K2K2M4M5M1M2
$$ 1558 1573 1588 1603 1618 1696 1773 1803 1791 1789 1788 1784 1780 1735 1689 1644 1599 1571 1542 1556 1570 1575 1580 1586 1591 1616 1641 1623 1606 1597 1588 1579 1571 1550 1529 1551 1573 1617 1662 1703 1745
1806A745j1n4k9l0j0j0j0j0L9L9jjlM0N6N6K0k4m2m2j5j5j3j3J3N6P5P4J4J4J4J4m1m2m1m1
$$ 1745 1734 1680 1651 1621 1611 1601 1591 1581 1620 1659 1658 1657 1654 1694 1750 1806 1826 1802 1760 1718 1703 1688 1675 1662 1675 1731 1806 1880 1894 1908 1922 1936 1895 1853 1812 1771
1801A771m0l9j6n8p3p2k9J5K2K3K8K8nL8Q3Q3N0Pj2j1o9o8n0p%%KLK6K6Ql6m5m5jM3Q3Q4O8
$$ 1771 1731 1692 1676 1618 1545 1473 1444 1459 1481 1504 1532 1560 1555 1593 1676 1759 1809 1816 1804 1793 1724 1656 1606 1599 1599 1599 1601 1604 1630 1656 1664 1628 1583 1538 1537 1580 1663 1747 1815
1797A815K5jkmmp4p4n6j2L9M0M3M2L1L0J2l1m1m1m3m4l3l3J0J0k5k5pL6M1M1M0M1L0j2l0l1
$$ 1815 1840 1839 1837 1833 1829 1755 1681 1625 1613 1652 1692 1735 1777 1808 1838 1850 1819 1778 1737 1694 1650 1617 1584 1594 1604 1579 1554 1547 1583 1624 1665 1705 1746 1776 1764 1734 1703
1792A703LLLL%J%%K3K3K3K3K0K0M5Jm7m8m7m8rL3N2N3K7K7j5j5n2n2n1n2n7n8j0L3J5J4J8
$$ 1703 1706 1709 1712 1715 1715 1716 1716 1716 1739 1762 1785 1808 1828 1848 1893 1894 1847 1799 1752 1704 1695 1728 1780 1833 1860 1887 1872 1857 1805 1753 1702 1650 1593 1535 1525 1558 1573 1587 1605
1787A605J7J6J7J6J6LKLLL3L3J5k9j5j5K6K5ppopm1m0l8l8m2KJ9K0kjkjJ8J9J9J8JJJJKLL
$$ 1605 1622 1638 1655 1671 1687 1690 1692 1695 1698 1731 1764 1779 1750 1735 1720 1746 1771 1764 1757 1751 1744 1703 1663 1625 1587 1545 1547 1566 1586 1584 1583 1581 1580 1598 1617 1636 1654 1655 1656 1657 1658 1660 1663 1666
1782A666Lj8j7j8j7K8K9J3l0l0J3K7K6nm7k3k3J4J3J1J1J4k8m5m4j8K4M4M3JJJJJKM5M4L6
$$ 1666 1669 1651 1634 1616 1599 1627 1656 1669 1639 1609 1622 1649 1675 1670 1623 1600 1577 1591 1604 1615 1626 1640 1612 1567 1523 1505 1529 1573 1616 1617 1618 1619 1620 1621 1623 1668 1712 1748
1777A748L6pplmmlrj0J3J2M6M6J7j8l1j0J1J1LLj9j8j2j2J0J0J1J1J1J1K3K3om2n1n2l1l2
$$ 1748 1784 1777 1770 1767 1763 1759 1756 1747 1737 1750 1762 1808 1854 1871 1853 1822 1812 1823 1834 1837 1840 1821 1803 1791 1779 1789 1799 1810 1821 1832 1843 1866 1889 1883 1841 1790 1738 1707 1675
1773A675mlJ8J8QPPQqrqqJ7J6J7J7K8K8K8K8k8k7ooJ1J0n4n3n6n6k6RK4K5kl8k7nnk6k3K6
$$ 1675 1671 1668 1686 1704 1712 1719 1726 1734 1726 1717 1709 1701 1718 1734 1751 1768 1796 1824 1852 1880 1852 1825 1819 1813 1824 1834 1780 1727 1671 1615 1589 1598 1622 1647 1645 1607 1580 1575 1570 1544 1521 1547
1767A547P4P3L6JPK8J8lJ1J0rrqrj9k0j9j9rqrqOOOOj0rj0rKKL6L6K9PkL5N0N0J7J7rqm4o5
$$ 1547 1621 1694 1730 1731 1738 1766 1784 1781 1792 1802 1793 1784 1776 1767 1748 1728 1709 1690 1681 1673 1664 1656 1662 1668 1674 1680 1670 1661 1651 1642 1644 1646 1682 1718 1747 1754 1752 1787 1837 1887 1904 1921 1912 1904 1860 1795
1762A795n8k2OOk1k0nL0L8L8l6l6qL5Q6Q6N6J3k7k7m3m3k1k2j9j8M2M3M2jn6n5n0n1MM6P4
$$ 1795 1737 1715 1721 1727 1706 1686 1681 1711 1749 1787 1751 1715 1707 1742 1828 1914 1970 1983 1956 1929 1886 1843 1822 1800 1781 1763 1805 1848 1890 1889 1833 1778 1728 1677 1681 1727 1801
1757A801P4M1M1nmk6k6n6n5n3n2J7O0O0J8l1l1l3l3l5l4l1l1J0N3O2O2M4Jk4k5j6j6K0K0K5
$$ 1801 1875 1916 1957 1952 1948 1922 1896 1840 1785 1732 1680 1697 1757 1817 1835 1804 1773 1740 1707 1672 1638 1607 1576 1586 1639 1701 1763 1807 1808 1784 1759 1743 1727 1747 1767 1792
1753A792K5M4M4l6p8l2J1K3k0l9MM0L9Km0p3p3o6NM2M3J1J1L9L8L9L9jkl7l7m7m6j1j1QQm2
$$ 1792 1817 1861 1905 1869 1791 1759 1770 1793 1773 1734 1738 1778 1817 1819 1779 1706 1633 1567 1572 1614 1657 1668 1679 1718 1756 1795 1834 1833 1831 1794 1757 1710 1664 1653 1642 1650 1658 1616
1748A616m1k7k7J0RM2M2L1j2k1k2k5k4J2J3J0RKm0j7j7l4l4l2l2k6J7L5L5M9M9OOQRRQj8j8
$$ 1616 1575 1548 1521 1531 1540 1582 1624 1655 1643 1622 1600 1575 1551 1563 1576 1586 1595 1597 1557 1540 1523 1489 1455 1423 1391 1365 1382 1417 1452 1501 1550 1556 1562 1570 1579 1588 1596 1578 1560
1743A560K5K5POPPkjjjJ5J5J6J5J6J5J5J6OONOj2j1j2j2j3j2j2j3j1j2L2L1M9M8M6M6j1n4
$$ 1560 1585 1610 1617 1623 1630 1637 1635 1634 1633 1632 1647 1662 1678 1693 1709 1724 1739 1755 1761 1767 1772 1778 1766 1755 1743 1731 1718 1706 1694 1681 1670 1658 1690 1721 1770 1818 1864 1910 1899 1845
1739A845p0o9k9J4L3L3jjjP0J00N9j5n8p4l2J0J0J2l1m9m9lllmPOo3o2n6j4L6P8P4L3J6J6
$$ 1845 1775 1706 1677 1691 1724 1757 1756 1755 1754 1824 1924 1983 1968 1910 1836 1804 1814 1824 1836 1805 1756 1707 1704 1701 1698 1694 1701 1707 1644 1582 1526 1512 1548 1626 1700 1733 1749 1765
1734A765M7M7K9j5j6j6j9j9lmmlk0k0k0k0j9j9jM3N9O0K0J9j9j8j9j9K2K2N9O0J6n6q4q5n4
$$ 1765 1812 1859 1888 1873 1857 1841 1822 1803 1800 1796 1792 1789 1769 1749 1729 1709 1690 1671 1670 1713 1772 1832 1852 1871 1852 1834 1815 1796 1818 1840 1899 1959 1975 1919 1835 1750 1696
1729A696j2PPOOOOJ3J3J3J2k3k4m5kM2Q4Q8M4j5j5j8j8m3m3k4J8K6K6j4j3PPQPNNMNl0k9l0
$$ 1696 1684 1691 1698 1704 1710 1716 1722 1735 1748 1761 1773 1750 1726 1681 1679 1721 1805 1893 1937 1922 1907 1889 1871 1828 1785 1761 1779 1805 1831 1817 1804 1811 1818 1826 1833 1838 1843 1847 1852 1822 1793 1763
1724A763k9j2j2j2j1mmmmN7N6L8nrrj3j2k2k3k3k3k5k6J7J7M4M3M4M4oom9m9m4m5JJLM6R0
$$ 1763 1734 1722 1710 1698 1687 1683 1679 1675 1671 1728 1784 1822 1817 1808 1799 1786 1774 1752 1729 1706 1683 1658 1632 1649 1666 1710 1753 1797 1841 1835 1829 1780 1731 1687 1642 1643 1644 1647 1693 1783
1719A783R0L3rn7n6o1o0j7j8k1k1k1k1j5j5j2j2N3R6O8O9J7k6kkK0J9k3k3l1l1n4j3L2L1L2
$$ 1783 1873 1906 1897 1840 1784 1723 1663 1646 1628 1607 1586 1565 1544 1529 1514 1502 1490 1543 1639 1707 1776 1793 1767 1765 1763 1783 1802 1779 1756 1725 1694 1640 1627 1659 1690 1722
1715A722L1L5qk9p1p4l1J3J3mmmmJ%LLPN0K5K6j8j9j8j8m8m9p2l0J3J4J6J7OPJ0RJ2N5P3P4
$$ 1722 1753 1788 1780 1751 1680 1606 1575 1588 1601 1597 1593 1589 1585 1586 1586 1589 1592 1599 1649 1674 1700 1682 1663 1645 1627 1579 1530 1458 1428 1441 1455 1471 1488 1494 1501 1511 1520 1532 1587 1660 1734
1710A734M0M0llJ1J1QQJ8k4m3m2k2k1j9j9qL4L4q%%kklklkL0K9L0L0k6k6k4k3j5K7K8j6l2
$$ 1734 1774 1814 1811 1808 1819 1830 1838 1846 1864 1840 1797 1755 1733 1712 1693 1674 1666 1700 1734 1726 1726 1726 1724 1722 1719 1717 1714 1712 1742 1771 1801 1831 1805 1779 1755 1732 1717 1744 1772 1756 1724
1705A724l2QQM5M4K6j7o5o5o7o8j4j4j2j1lM0N8N9k8k8rL4M3M3k6k5j%jjK5K4K4K5qqpqll
$$ 1724 1692 1700 1708 1753 1797 1823 1806 1741 1676 1609 1541 1527 1513 1501 1490 1487 1527 1585 1644 1616 1588 1579 1613 1656 1699 1673 1648 1647 1647 1646 1645 1670 1694 1718 1743 1735 1727 1720 1712 1709 1706
1700A706klk7k6J6J5J6J6J5J6ppponmmnNNl8l9k7k7J6J5O4O4M1O%JkjJ3J4J3J4l1l1l2l1J
$$ 1706 1704 1701 1674 1648 1664 1679 1695 1711 1726 1742 1735 1728 1721 1715 1710 1706 1702 1697 1702 1707 1669 1630 1603 1576 1592 1607 1671 1735 1776 1782 1782 1783 1781 1780 1793 1807 1820 1834 1803 1772 1740 1709 1710
1695A710JJJl9l9l9l9ppppqqqqK2K1O4O4K9K9K9K9%j%jqpqqLLJ%Pk9k9PN6N6J7l4m3k1MLm
$$ 1710 1711 1712 1713 1674 1635 1596 1557 1550 1543 1536 1529 1521 1513 1505 1497 1519 1540 1604 1668 1697 1726 1755 1784 1784 1783 1783 1782 1774 1767 1759 1751 1754 1757 1758 1758 1765 1736 1707 1714 1770 1826 1843 1809 1766 1745 1749 1752 1748
1689A748m0o2o2j4j4j3j4OOM9M8M0M0M0M0k8k7k8k7RJ0k0m0k3J2L3L4L1L1L1L2qqqqLKm0m0
$$ 1748 1708 1646 1584 1570 1556 1543 1529 1535 1541 1590 1638 1678 1718 1758 1798 1770 1743 1715 1688 1697 1707 1687 1647 1624 1636 1669 1703 1734 1765 1796 1828 1820 1812 1804 1796 1799 1801 1761 1721
1684A721m0m0LKKKKJJ7J7N7N7J9k3m2m2j1j2L2L1llk5k4j2j3RRk4k4m2m3kM1M9K8J9ll2l2
$$ 1721 1681 1641 1644 1646 1648 1650 1652 1653 1670 1687 1744 1801 1820 1797 1755 1713 1702 1690 1722 1753 1750 1747 1722 1698 1686 1673 1682 1691 1667 1643 1601 1558 1556 1597 1646 1674 1693 1690 1658 1626
1679A626j0L3O2M1lk5nJ5Qj4l2j1J7L8N1Rj6j6K4K3J9J9J8J9j1j1j1j1k2k3k1k1l6j5M7Q9
$$ 1626 1616 1649 1711 1752 1749 1724 1719 1734 1742 1728 1696 1685 1702 1740 1791 1800 1784 1768 1792 1815 1834 1853 1871 1890 1879 1868 1857 1846 1824 1801 1780 1759 1723 1708 1755 1844
1675A844O2J9LLj7j8l9l9k1k1k1k1J6J6L8L8K3K2j9k0llk4k4m3m3J3L5M3%j7j7l9l9k1K2L3
$$ 1844 1906 1925 1928 1931 1914 1896 1857 1818 1797 1776 1755 1734 1750 1766 1804 1842 1865 1887 1868 1848 1845 1842 1818 1794 1751 1708 1721 1756 1799 1799 1782 1765 1726 1687 1666 1688 1721
$$ [...]
##END=	
##END=	
