##TITLE=	May13-2019.71.fid
F - 01 - 1.0

##JCAMP-DX=	6.0	$$ MestReNova 14.1.1-24571
##DATA TYPE=	LINK
##BLOCK_ID=	1
##BLOCKS=	1    
##ORIGIN=	Mestrelab Research S.L.
##OWNER=	hrzepa
##$MNOVA/LINK_BLOCK_TYPE=	ITEM	$$ NMR Spectrum
##$MNOVA/ITEM/POLYGON=	(XY..XY)
5321,5835
8722,5835
8722,8208
5321,8208
5321,5835
##$MNOVA/ITEM/Z=	0
##$MNOVA/ITEM/ANGLE=	0
##TITLE=	May13-2019.71.fid
##JCAMP-DX=	6.0	$$ MestReNova 14.1.1-24571
##BLOCK_ID=	2
##DATA TYPE=	NMR SPECTRUM
##DATA CLASS=	XYDATA
##NUMDIM=	1
##ORIGIN=	Bruker BioSpin GmbH
##OWNER=	nmr
##.OBSERVE FREQUENCY=	100.671616723846995
##.OBSERVE NUCLEUS=	^13C
##.SOLVENT NAME=	DMSO
##.PULSE SEQUENCE=	zgpg30
##LONGDATE=	2019/05/13 20:42:00.000
##.ACQUISITIONMODE=	SIMULTANEOUS (DQD)
##$ORIGINAL FORMAT=	Bruker XWIN-NMR
##$MNOVA/SCALES_VERSION=	9
##$PARAMETER FILE=	(acqus, ASCII, /Users/hrzepa/Downloads/Polysiphenol%20SI%20NMR%20Original%20Data/3/3c%20-%2013C%20-%20400B.19.05.13.071/71/acqus, 0)
$$ ##TITLE= Parameter file, TOPSPIN		Version 3.2
$$ ##JCAMPDX= 5.0
$$ ##DATATYPE= Parameter Values
$$ ##NPOINTS= 11	$$ modification sequence number
$$ ##ORIGIN= Bruker BioSpin GmbH
$$ ##OWNER= nmr
$$ $$ 2019-05-13 20:42:02.941 +0100  nmr@CZC2524DW0
$$ $$ /opt/topspin/data/brad/nmr/May13-2019/71/acqus
$$ $$ process /opt/topspin3.2/prog/mod/shimcntl
$$ ##$ACQT0= -2.05882356948211
$$ ##$AMP= (0..31)
$$ 100 100 100 100 100 100 100 100 100 100 100 100 100 100 100 100 100 100
$$ 100 100 100 100 100 100 100 100 100 100 100 100 100 100
$$ ##$AMPCOIL= (0..19)
$$ 0 0 0 0 0 0 0 0 0 0 0 0 0 0 0 0 0 0 0 0
$$ ##$ANAVPT= -1
$$ ##$AQSEQ= 0
$$ ##$AQ_mod= 3
$$ ##$AUNM= <au_zg>
$$ ##$AUTOPOS= <15 >
$$ ##$BF1= 100.660544
$$ ##$BF2= 400.32
$$ ##$BF3= 100.660544
$$ ##$BF4= 100.660544
$$ ##$BF5= 100.660544
$$ ##$BF6= 100.660544
$$ ##$BF7= 100.660544
$$ ##$BF8= 100.660544
$$ ##$BYTORDA= 0
$$ ##$CAGPARS= (0..11)
$$ 0 0 0 0 0 0 0 0 0 0 0 0
$$ ##$CFDGTYP= 0
$$ ##$CFRGTYP= 9
$$ ##$CHEMSTR= <none>
$$ ##$CNST= (0..63)
$$ 1 1 145 1 1 1 1 1 1 1 1 1 1 1 1 1 1 1 1 1 1 1 1 1 1 1 1 1 1 1 1 1 1 1 1
$$ 1 1 1 1 1 1 1 1 1 1 1 1 1 1 1 1 1 1 1 1 1 1 1 1 1 1 1 1 1
$$ ##$CPDPRG= (0..8)
$$ <waltz16> <> <waltz16> <> <mlev> <mlev> <mlev> <mlev> <mlev>
$$ ##$D= (0..63)
$$ 0 1 0.00345 0 0 0 0 0 0 0.06 0 0.03 2e-05 3e-06 0 0 0.0002 0 0 0 0 0 0
$$ 0 0 0 0 0 0 0 0 0 0 0 0 0 0 0 0 0 0 0 0 0 0 0 0 0 0 0 0 0 0 0 0 0 0 0 0
$$ 0 0 0 0 0
$$ ##$DATE= 1557776522
$$ ##$DE= 6.5
$$ ##$DECBNUC= <off>
$$ ##$DECIM= 704
$$ ##$DECNUC= <off>
$$ ##$DECSTAT= 4
$$ ##$DIGMOD= 1
$$ ##$DIGTYP= 12
$$ ##$DQDMODE= 0
$$ ##$DR= 21
$$ ##$DS= 4
$$ ##$DSPFIRM= 0
$$ ##$DSPFVS= 20
$$ ##$DTYPA= 0
$$ ##$EXP= <c13q>
$$ ##$F1LIST= <111111111111111>
$$ ##$F2LIST= <222222222222222>
$$ ##$F3LIST= <333333333333333>
$$ ##$FCUCHAN= (0..9)
$$ 0 1 2 0 0 0 0 0 0 0
$$ ##$FL1= 83
$$ ##$FL2= 83
$$ ##$FL3= 83
$$ ##$FL4= 83
$$ ##$FOV= 20
$$ ##$FQ1LIST= <freqlist>
$$ ##$FQ2LIST= <freqlist>
$$ ##$FQ3LIST= <freqlist>
$$ ##$FQ4LIST= <freqlist>
$$ ##$FQ5LIST= <freqlist>
$$ ##$FQ6LIST= <freqlist>
$$ ##$FQ7LIST= <freqlist>
$$ [...]
$$ ##$Sgu3PowerLevels= (0..7)
$$ 0 0 0 0 0 0 0 0
$$ ##$Sgu4PowerLevels= (0..7)
$$ 0 0 0 0 0 0 0 0
$$ ##$Sgu5PowerLevels= (0..7)
$$ 0 0 0 0 0 0 0 0
$$ ##$Sgu6PowerLevels= (0..7)
$$ 0 0 0 0 0 0 0 0
$$ ##$Sgu7PowerLevels= (0..7)
$$ 0 0 0 0 0 0 0 0
$$ ##$Sgu8PowerLevels= (0..7)
$$ 0 0 0 0 0 0 0 0
$$ ##$SguType= 3
$$ ##$ShimPowMaxUA= (0..63)
$$ 130000 130000 130000 130000 130000 130000 130000 130000 130000 130000 130000
$$ 130000 130000 130000 130000 130000 130000 130000 130000 130000 0 0 0 0
$$ 0 0 0 0 0 0 0 0 0 0 0 0 0 0 0 0 0 0 0 0 0 0 0 0 0 0 0 0 0 0 0 0 0 0 0 0
$$ 0 0 0 0
$$ ##$ShimPowMaxUC= (0..63)
$$ 130000 130000 130000 130000 130000 130000 130000 130000 130000 130000 130000
$$ 130000 130000 130000 130000 130000 130000 130000 130000 130000 0 0 0 0
$$ 0 0 0 0 0 0 0 0 0 0 0 0 0 0 0 0 0 0 0 0 0 0 0 0 0 0 0 0 0 0 0 0 0 0 0 0
$$ 0 0 0 0
$$ ##$ShimPowMaxUG= (0..63)
$$ 524287 524287 524287 524287 524287 524287 524287 524287 524287 524287 524287
$$ 524287 524287 524287 524287 524287 524287 524287 524287 524287 0 0 0 0
$$ 0 0 0 0 0 0 0 0 0 0 0 0 0 0 0 0 0 0 0 0 0 0 0 0 0 0 0 0 0 0 0 0 0 0 0 0
$$ 0 0 0 0
$$ ##$ShimPowRcbType= 3
$$ ##$ShimPowRes= (0..63)
$$ 1e-20 1e-20 1e-20 1e-20 1e-20 1e-20 1e-20 1e-20 1e-20 1e-20 1e-20 1e-20
$$ 1e-20 1e-20 1e-20 1e-20 1e-20 1e-20 1e-20 1e-20 0 0 0 0 0 0 0 0 0 0 0 0
$$ 0 0 0 0 0 0 0 0 0 0 0 0 0 0 0 0 0 0 0 0 0 0 0 0 0 0 0 0 0 0 0 0
$$ ##$ShimPowRng0= (0..63)
$$ 1 1 1 1 1 1 1 1 1 1 1 1 1 1 1 1 1 1 1 1 0 0 0 0 0 0 0 0 0 0 0 0 0 0 0 0
$$ 0 0 0 0 0 0 0 0 0 0 0 0 0 0 0 0 0 0 0 0 0 0 0 0 0 0 0 0
$$ ##$ShimPowRng1= (0..63)
$$ 1 1 1 1 1 1 1 1 1 1 1 1 1 1 1 1 1 1 1 1 0 0 0 0 0 0 0 0 0 0 0 0 0 0 0 0
$$ 0 0 0 0 0 0 0 0 0 0 0 0 0 0 0 0 0 0 0 0 0 0 0 0 0 0 0 0
$$ ##$ShimPowRng2= (0..63)
$$ 1 1 1 1 1 1 1 1 1 1 1 1 1 1 1 1 1 1 1 1 0 0 0 0 0 0 0 0 0 0 0 0 0 0 0 0
$$ 0 0 0 0 0 0 0 0 0 0 0 0 0 0 0 0 0 0 0 0 0 0 0 0 0 0 0 0
$$ ##$ShimPowRng3= (0..63)
$$ 1 1 1 1 1 1 1 1 1 1 1 1 1 1 1 1 1 1 1 1 0 0 0 0 0 0 0 0 0 0 0 0 0 0 0 0
$$ 0 0 0 0 0 0 0 0 0 0 0 0 0 0 0 0 0 0 0 0 0 0 0 0 0 0 0 0
$$ ##$ShimSysFunc= (0..63)
$$ 1 2 3 4 5 7 9 11 15 16 8 10 12 14 6 17 13 18 19 20 0 0 0 0 0 0 0 0 0 0
$$ 0 0 0 0 0 0 0 0 0 0 0 0 0 0 0 0 0 0 0 0 0 0 0 0 0 0 0 0 0 0 0 0 0 0
$$ ##$ShimSysMatrix= 0
$$ ##$ShimSysType= 1
$$ ##$TFXNUM= 0
$$ ##$TRIPLO2= 0
$$ ##$VTU= 2
$$ ##$VTUETH= <149.236.99.20>
$$ ##$VTUTY= <no>
$$ ##$WBREFAM= (0..15)
$$ 132.2 106.2 100 100 100 100 100 100 100 100 100 100 100 100 100 100
$$ ##$WBREFLM= (0..15)
$$ 0 0 0 0 0 0 0 0 0 0 0 0 0 0 0 0
$$ ##$WBREFPH= (0..15)
$$ 77.55 -65.76 0 0 0 0 0 0 0 0 0 0 0 0 0 0
$$ ##$WBSGU= (0..15)
$$ 0 0 0 0 0 0 0 0 0 0 0 0 0 0 0 0
$$ ##$XFAC= 2
$$ ##END=
$$ 
##$DECIM=	704
##$DSPFVS=	20
##XUNITS=	HZ
##YUNITS=	ARBITRARY UNITS
##FIRSTX=	25277.269301538948639
##LASTX=	-3131.3881192264107085
##DELTAX=	-0.43348832563920591809
##XFACTOR=	1
##YFACTOR=	0.030082141086107766492
##FIRSTY=	-0.0963840484619140625
##MINY=	-16.413328170776367188
##MAXY=	1120.9261474609375
##NPOINTS=	65536
##XYDATA=	(X++(Y..Y))
$$ [...]
9623B6k8l0n7n7o3o3JKK7K7j9j9KKL0L0popoM4M3M4M4K1K0K1K2k8k6k7k7l7l7l6l7K9K8K9
9606a25K9MNN1M9%j%jj2j3l9PO1O3O5O5M0M0k5k5n5n5n5n6l6l6l7l7m1m1o5j9N1P9O4O3L3
9590ej3l0l0K4O8Q5N6on3n6n5k0k1M4M4O9P0MNk1k2LLj6o2p2qO7O8PPj2j2n8n7o2o1LLL7L8
9572d7k7k7k2k1K4K5M9M8K2K1L5L5L6L5oooon3n4n4n2K0K1K0K1N1N1R4R4O0J4poj0j0n6n6
9556B50o0o0l2l2k2k2k0j8j2J7K6j9l7l7l9m0M5M6M6M4MMLMk2k1k1k2j7j8j4j5L6Q2O5%l0
9539D2l1J1J1K8K7K8K7j3j3j3j3m1m1m1m1k8k8JJM4P1L6rlK4L4L4LKol4k1K5M1J4l6l6l7l7
9523a8p1p2n1nM2M2M5M5J8J8J7J8J4J4Lk4l2mK3K4OPj9k0k5JJk7n1n2j5L2N0N0N0N1J8j0M
9506I7Mj3m0l8j0L6O4N1N1RJ0RRk3k3pl5n0n1lK5J2J2J2J2kl0l0kJ0J1J2J3L1L2K9L0pl6k0
$$ plain form
9623 26 -2 -32 -89 -146 -209 -272 -271 -269 -242 -215 -234 -253 -251 -249 -219 -189 -196 -202 -209 -215 -171 -128 -84 -40 -19 1 22 44 16 -10 -37 -64 -101 -138 -174 -211 -182 -154 -125
9606 -125 -96 -92 -87 -36 13 13 12 12 11 -1 -14 -53 -46 15 78 143 208 248 288 263 238 183 128 73 17 -19 -55 -92 -129 -170 -211 -276 -295 -244 -165 -101 -38 -5
9590 -5 -18 -48 -78 -54 14 99 155 149 96 40 -15 -35 -56 -12 32 101 171 175 180 159 137 140 143 127 65 -7 -15 52 120 127 134 122 110 52 -5 -67 -128 -125 -122 -85 -47
9572 -47 -74 -101 -123 -144 -120 -95 -46 2 24 45 80 115 151 186 180 174 168 162 109 55 1 -51 -31 -10 10 31 82 133 227 321 381 395 388 382 372 362 306 250
9556 250 190 130 98 66 44 22 2 -16 -28 -11 15 -4 -41 -78 -117 -157 -112 -66 -20 24 28 32 35 39 17 -4 -25 -47 -64 -82 -96 -111 -75 7 72 72 42
9539 42 11 22 33 61 88 116 143 130 117 104 91 50 9 -32 -73 -101 -129 -128 -127 -83 -12 24 15 12 36 70 104 107 109 103 69 48 73 114 128 92 56 19 -18
9523 -18 -89 -161 -212 -217 -175 -133 -88 -43 -25 -7 10 28 42 56 59 35 3 -1 22 46 52 59 40 20 -5 -4 -3 -30 -81 -133 -148 -116 -66 -16 34 85 103 93 97
9506 97 101 88 48 10 0 36 100 151 202 211 221 230 239 216 193 186 151 101 50 47 72 84 96 108 120 118 88 58 56 66 77 89 102 133 165 194 224 217 181 161
9488A61j9m1m2m1m0J2J1J2J2J5J5J5J5k7k7j5J2L8L8oo%JKLNL4J6J6j5m2p2p0m4j7llrJ7L1
9471e8L0J9J9M8M7L8L8QQn0p8p7n0l1l2KK8NMOPN8N7J9k6l6l4K6K5NNn8n9k6k6L8L8M7M5J
9454C0%NOL3L3J%k7k8m3m3m4m4QPQPK6K5K5K5L2L3L2L2L9M0L9L9NNMNONOOk9k9k8k9NOONj
9434B44jkjj9j9k0j9l7l8o2o2o5j9K3N0N5N6J1J2l0l1klj4j3j4j4k2k2k1k2K2K2k2k3n5k8
9418b05J9Q5R8P0J6k9l5qL9L8nnnnk9k8p1p2l3J3L4L4JJM8M6M7M7M3M4M8pk2k2%J%Jk3k2k2
9400A25k2k6k5k5k5L5L4j2j1l4l3J2J1K6K7jjl9l8j2j1M4M4J7J7J6J5J6J5j2j3J6J5L3L2j3
9384A97j4k0k0k0k0m4m4m2m4j2j3j2j2M6M7P7K2m1m0m4m4L1L2L2L1k1k0k1k1RRQRK5K6K6K6
9368H4K6K5K6K6l6l6o7j2J1J0J4J3JJJJJ8J9J9J9N0N1NMl8l8j1j0mlllJ7J8J7J8n0m9llj2
$$ plain form
9488 161 142 101 59 18 -22 -10 1 13 25 40 55 70 85 58 31 16 28 66 104 98 92 92 93 95 98 103 137 153 169 154 112 40 -30 -74 -91 -94 -97 -106 -89 -58
9471 -58 -28 -9 10 58 105 143 181 189 197 147 69 -8 -58 -89 -121 -119 -91 -86 -82 -76 -69 -11 46 65 39 3 -31 -5 20 25 30 -28 -87 -113 -139 -101 -63 -16 29 30
9454 30 30 35 41 74 107 108 108 81 53 10 -33 -77 -121 -113 -106 -98 -91 -65 -40 -15 10 42 75 107 139 178 218 257 296 301 306 310 315 321 326 332 338 309 280 252 223 228 234 240 245 244
9434 244 243 241 240 221 202 182 163 126 88 26 -36 -101 -120 -97 -47 8 64 75 87 57 26 24 21 7 -6 -20 -34 -56 -78 -99 -121 -99 -77 -99 -122 -177 -205
9418 -205 -186 -101 -3 67 83 54 19 11 50 88 83 78 73 68 39 11 -60 -132 -165 -152 -118 -84 -83 -82 -34 12 59 106 149 193 241 234 212 190 190 191 191 192 169 147 125
9400 125 103 77 52 27 2 37 71 59 48 14 -19 -7 4 30 57 56 55 16 -22 -34 -45 -1 43 60 77 93 108 124 139 127 114 130 145 178 210 197
9384 197 183 163 143 123 103 59 15 -27 -71 -83 -96 -108 -120 -74 -27 50 72 31 -9 -53 -97 -66 -34 -2 29 8 -12 -33 -54 -45 -36 -28 -19 6 32 58 84
9368 84 110 135 161 187 151 115 48 36 47 57 71 84 85 86 87 88 106 125 144 163 213 264 269 273 235 197 186 176 172 169 166 163 180 198 215 233 183 134 131 128 116
9350A16j3j3j3j2j1j2j1MNMNJ0J0J0J0m3m3j5j5O2O3J7J7k6k5n3n2k0k1k0k1k1k1K5K5N7N5
9334A4Q4Q5K2K3K2K2qrp2j00r4l9J2L9L4PK3K4L5L5J6M3O4Pm3p1m2j4mlJKk5k6rqrqMNMNm8
9316@m7J6J7M1M2M2M2k1k1k1k0NONOn6n5n6n6l2l2N1N1M4M3M1M2j4m2n4jL9O8R8R9J9l5o5
9299A89l7%K7L8L8mn1m0j3k9l0k7k8nnnnl8m0l9m0mnmnJ2J2J1J2mmmmM5M5M2M3K5k2m9n1j1
9281f4j0j1j1QQRQJ4J5M1M3K6K6k9k9j9j8L6L7L6L7O1O1K1k5n5n5l1l0l1l0n4n5%JJ2J3M8
9265DP7P7L1l4l4j5j5j4j5RJ0RRPOPOoooon2n1LMPPPQk7k5k6k7L4L4k2k2rrM6M5P7P7K2K2
9245B24k0k1k2k2k3n1o1j4J%MLJ9K0K0J9%%%%M0M0M0M1K5K5l0l1j8j8RJ0j1j1M4M4M6M6rj0
9228C48j1j2j1j2o8o8o8o8m9n1n0n0m0l9J6J6rrl4l4LM9P8P8L2L2MMK3K4lml4l5pqN8N7MM
$$ plain form
9350 116 103 90 77 65 54 42 31 35 40 44 49 59 69 79 89 46 3 -12 -27 35 98 115 132 106 81 28 -24 -44 -65 -85 -106 -127 -148 -123 -98 -41 14
9334 14 98 183 205 228 250 272 264 255 183 83 -11 -50 -38 1 35 42 65 89 124 159 175 218 282 289 246 175 133 119 115 112 113 115 90 64 55 47 38 30 34 39 43 48 0
9316 0 -47 -31 -14 27 69 111 153 132 111 90 70 75 81 86 92 36 -19 -75 -131 -163 -195 -144 -93 -49 -6 35 77 63 21 -33 -34 5 73 171 270 289 254 189
9299 189 152 152 179 217 255 251 200 160 147 118 88 61 33 28 23 18 13 -25 -65 -104 -144 -148 -153 -157 -162 -150 -138 -127 -115 -119 -123 -127 -131 -86 -41 1 44 69 47 -2 -53 -64
9281 -64 -74 -85 -96 -88 -80 -71 -63 -49 -34 7 50 76 102 73 44 25 7 43 80 116 153 214 275 296 271 216 161 130 100 69 39 -15 -70 -70 -69 -57 -44 4
9265 4 81 158 189 155 121 106 91 77 62 71 81 90 99 106 112 119 125 119 113 107 101 49 -2 1 5 12 19 26 34 7 -18 -44 -71 -37 -3 -25 -47 -56 -65 -19 26 103 180 202 224
9245 224 204 183 161 139 116 65 4 -10 -9 -9 -5 -2 17 37 57 76 76 76 76 76 116 156 196 237 262 287 257 226 208 190 199 209 198 187 231 275 321 367 358 348
9228 348 337 325 314 302 234 166 98 30 -19 -70 -120 -170 -210 -249 -233 -217 -226 -235 -269 -303 -300 -251 -173 -95 -63 -31 -27 -23 0 24 21 17 -17 -52 -59 -67 -9 48 52 56
9210E6RL7K1k6l2nMMK9K9K9L0k8k8k8k8o8o6j3j2J9J9J9J9J1J3J2J2l4l3K1K1kjn3n4n6j1
9194a64N7N6J8J8K7N5M5kk9k9k0k0QPM8M8K0K1PQPQl3l4l3l3K2K2J8J9Jn4k3k3POPOO0N9O0
9176B48O0k9k8k8k9j2j2j2j3L9L9L9L9%j%%k6k6k6k6MMMMjjjjk7k6k7k6J4J4J5J4L0L1L0L0
9158B80j0j0j1j0n0m9m8m8kK7M1j3k5k4k8k7POQPk3k4k0k0pM9P2P3L5L5L5L5J1J1m4m5q3q4
9142B7k7k9J9J8J9J8j9j9L6L6M8M8qpkjjjk8k7%%j6j5L6L6J7l9o0n9k0L3N5N5J8l9l5l4pq
9125A8o1o3llK5K5j7j7J1J1K9K9K9K9NOONK6K5K5K6K2K2K2K2j5j6p1p1n7n6k9k9K6K6jkk4
9108f5k5n6%M1M1M5M3O2O2Jn5l9m0J3J2J9K0J9K0l9l8l8l8K8K6k7k8K3K2K2K3K6K6K6K6J0
9092A68J0J0J0k0k0k0k0m5m6m4m5OPPOl5l4K0K0L8L7L4L5Ln1n1MQQJ1J2L2L1L1L2NNk0p4o9
$$ plain form
9210 56 65 102 123 97 65 60 64 68 97 126 155 185 157 129 101 73 5 -61 -74 -86 -67 -48 -29 -10 1 14 26 38 4 -29 -8 13 11 10 -43 -97 -153 -164
9194 -164 -107 -51 -33 -15 12 67 112 110 81 52 32 12 20 27 75 123 143 164 171 179 186 194 161 127 94 61 83 105 123 142 143 89 66 43 50 56 63 69 129 188 248
9176 248 308 279 251 223 194 182 170 158 145 184 223 262 301 301 300 300 300 274 248 222 196 200 204 208 212 211 210 209 208 181 155 128 102 116 130 145 159 189 220 250 280
9158 280 270 260 249 239 189 140 92 44 42 69 110 97 72 48 20 -7 0 6 14 21 -2 -26 -46 -66 -73 -24 48 121 156 191 226 261 272 283 239 194 111 27
9142 27 0 -29 -10 8 27 45 26 7 43 79 127 175 167 160 158 157 156 155 127 100 100 100 84 69 105 141 158 119 59 0 -20 13 68 123 141 102 67 33 26 18
9125 18 -43 -106 -109 -112 -87 -62 -79 -96 -85 -74 -45 -16 13 42 47 53 59 64 90 115 140 166 188 210 232 254 239 223 152 81 24 -32 -61 -90 -64 -38 -39 -41 -65
9108 -65 -90 -146 -146 -105 -64 -19 24 86 148 149 94 55 15 28 40 59 79 98 118 79 41 3 -35 -7 19 -8 -36 -13 9 31 54 80 106 132 158 168
9092 168 178 188 198 178 158 138 118 73 27 -17 -62 -56 -49 -42 -36 -71 -105 -85 -65 -27 10 44 79 82 31 -20 -16 -8 0 11 23 55 86 117 149 154 159 139 65 -4
9075dp0j7j6L8O5P5L0k7k7K5K5J0Rm6m6OPOPM3M4M3M4J9J8l6l7l1l1l1l1k8k7k7k8j6j6j4
9058i2j3J7O3N2K6K3K3K1K1m1m1m2m0k4k4L1L2%JJJn9n9k9J7J8J8K1K0N1N0M8M7K5k2n2n1
9042C8l8l7l6l5m4JO8O8M8M9M8M9j5j5j6j5j5j6j5j5kkkkL8L9L8L9M0M0j6j5J5J6J6J5k1k0
9026B73k1k1l9l9o4j9L8L8M2M1j7j7j6j7k9k9k9k9m6m4m5m5QRQRk7k8k7k7jjN4N4N8N6LKk2
9009fk2L2L3K4K4K3K4jjjkk2k2k2k2K1K1K1K1m0m0m0l9k7k7M8P3N3Pk1k1KJJJM8M8P3K6m3
8992B06p0n8n8p2p4qL9M6M6M9M9OOPOK3K3K3K3l6l6l6l6k5k6L0L0L0L0k5k6ppqpj8j8j7j7
8975a3J2J0J0J1k5n1o3j6M0L9M3M2M8M9ppkkjkJ6J5J4J4k1m9l2l2j4J4lkk1k0k2k1l4l5NL3
8957h0N8N7N7N8J5j3l5o3o5l9%jnnK3K2JKJKJ3J5J2J1pn3m4j5J5J5J6J5L4Ol2l3lmmlj%%%
$$ plain form
9075 -4 -74 -91 -107 -69 -4 71 101 74 47 72 97 107 116 70 24 30 37 43 50 93 137 180 224 243 261 225 188 157 126 95 64 36 9 -18 -46 -62 -78 -92
9058 -92 -105 -88 -25 27 53 76 99 120 141 100 59 17 -23 -47 -71 -40 -8 -8 -7 -6 -5 -64 -123 -152 -135 -117 -99 -78 -58 -7 43 91 138 163 141 89 38
9042 38 0 -37 -73 -108 -152 -151 -83 -15 33 82 130 179 164 149 133 118 103 87 72 57 55 53 51 49 87 126 164 203 243 283 267 252 267 283 299 314 293 273
9026 273 252 231 192 153 89 70 108 146 188 229 212 195 179 162 133 104 75 46 0 -44 -89 -134 -126 -117 -109 -100 -127 -155 -182 -209 -210 -211 -157 -103 -45 11 14 16 -6
9009 -6 -28 4 37 61 85 108 132 131 130 129 127 105 83 61 39 60 81 102 123 83 43 3 -36 -63 -90 -42 31 84 91 70 49 51 52 53 54 102 150 223 249 206
8992 206 136 78 20 -52 -126 -134 -95 -49 -3 46 95 101 107 114 120 143 166 189 212 176 140 104 68 43 17 47 77 107 137 112 86 79 72 64 57 39 21 4 -13
8975 -13 -1 9 19 30 5 -46 -109 -125 -85 -46 -3 39 87 136 129 122 120 118 117 115 131 146 160 174 153 104 72 40 26 40 37 35 14 -6 -28 -49 -83 -118 -113 -80
8957 -80 -22 35 92 150 165 152 117 54 -11 -50 -50 -51 -56 -61 -38 -16 -15 -13 -12 -10 3 18 30 41 34 -19 -63 -78 -63 -48 -32 -17 17 23 -9 -42 -45 -49 -53 -56 -57 -57 -57 -57
8938e7J5J5M0M2M5J7k2k2OPol3k4k4k5k4k9kL6L5km8m6%K9N7N8L2j8j9k0j9k7k7k4k5RN5M3
8921bJ4J2j6j7RJ6J6J6J5L6Ql3l2LLpl5k5KL9M0J2J1jk8m2m1mK3%%K9K9N6N5%%l8l9l8l9j6
8903ij6j7j7l5l5l6l5%JMMrM8Q7J13Q7np8p6k7K9L9J3LLKJk4k2LMJ6J6j9m7n9nN6N4LLMLJ0
8884C5J1PPl7r1r1l6J8M6O2O1N4N5%%l9l9j2j1lnl2l2k8k8mN1R3R4O6O7L4k1m2m2m0J5J1J0
8867A64j9m6l5K2L2L3%k8l9J6L9L9k4k3n2n1l3l3ooN1N3N3N3J0J1J1J0M9M9K5l1p0p0l4oO
8851A20OQQllnml2o0o9o9j2L4O1O1J2j5KKK4N2N1K4j3j3j4j3k7%L9L8j2m1k5k5MLL1L1M9M8
8833B53Rj9k7k7K6K6K4K3J2j6j9j8QQl2l2nmMLj2J5J4J3J5J5PPPQm7m8m7m7o1o1l2J4K5K3
8816Erl9m4j7OL3O5O5O6O6L7J0K3K3J3j5n5n5k9l0j7J1L8L8J0l6o0o1qqJ4J3M1M1M6M5M5M5
$$ plain form
8938 -57 -42 -27 13 55 100 117 95 73 79 86 80 47 23 -1 -26 -50 -79 -81 -45 -10 -12 -60 -106 -106 -77 -20 38 70 52 33 13 -6 -33 -60 -84 -109 -100 -45 -2
8921 -2 12 24 8 -9 0 16 32 48 63 99 107 74 42 45 48 41 6 -19 -17 22 62 74 85 84 56 14 -27 -31 -8 -8 -8 21 50 106 161 161 161 123 84 46 7 -9
8903 -9 -25 -42 -59 -94 -129 -165 -200 -200 -199 -195 -191 -200 -152 -65 48 135 130 52 -24 -51 -22 17 30 33 36 38 39 15 -7 -4 0 16 32 13 -34 -93 -98 -42 12 15 18 22 25 35
8884 35 46 53 60 23 -68 -159 -195 -177 -131 -69 -8 46 101 101 101 62 23 11 0 -3 -8 -40 -72 -100 -128 -132 -81 12 106 172 239 273 252 210 168 128 143 154 164
8867 164 145 99 64 86 118 151 151 123 84 100 139 178 154 131 79 28 -5 -38 -44 -50 1 54 107 160 170 181 192 202 251 300 325 294 224 154 120 114 120
8851 120 126 134 142 139 136 131 127 95 35 -34 -103 -115 -81 -20 41 53 38 40 42 66 118 169 193 180 167 153 140 113 113 152 190 178 137 112 87 91 94 125 156 205 253
8833 253 262 243 216 189 215 241 265 288 300 284 265 247 255 263 231 199 194 190 194 197 185 200 214 227 242 257 264 271 278 286 239 191 144 97 36 -25 -57 -43 -18 5
8816 5 -4 -43 -87 -104 -98 -65 0 65 131 197 234 244 267 290 303 288 233 178 149 119 102 113 151 189 199 163 103 42 34 26 40 53 94 135 181 226 271 316
8800C16L9M0k7p3q1q0RRj9j9j9j9LLMLk7k7k7k6jjj%K2K3K4K3l6l5K0K0N9N9L5k1m1m1J1J2
8782A13m0m0l9l9JKJKNMNNPQm9m8n5n6M0R5P1J6mmRJ0J0Rk2k2KN6Q3Q3N6N5L7j8m2m3m3m4
8764A77j6j6k2k3k2k3j4j4j4j3N0N0M7M7L9j6p5p4o0nJ9J9L4L4N5N6L2n9j34j33p3j9M3M3
8749h0M3M2J5J5M0M0L6L7J3m2o6o7o8p0m6J0L6L6j5j6J9J8J9J9J3J3kK4P0O9L1Lj8j7k0j9
8734A15k3k3k3k3mmmnj9k0j9j9PL5K0J8L7L7L9L9J4M3N2Ok8k8l1l2m7m7m5m4p7m9J3M0L9M0
8717b0M1M1L7L7L7L6O8O7K8jj8j9ll1m7j9J8J8MLJ9qm9m8n1n0m8m8o1l3K1O8N6K9Kk7j2j3
8701B4j9j8j7j8j5J2N1N2j%jjopk3Nlm%jQL6L5QJ8J8J5J4l5o2o1l3k2OQk1l2l2OL3J4J5J6
8682c8J6J2J2J2J3LMLMj%l7o5n2pM1O8P9N3K8%k5n2l6l5J8O4L7L7Ok2ook9k9k9k9j1j0j1j2
$$ plain form
8800 316 355 395 368 295 214 134 143 152 133 114 95 76 79 82 86 89 62 35 8 -18 -19 -20 -21 -21 1 24 48 71 35 0 20 40 99 158 193 172 131 90 101 113
8782 113 73 33 -6 -45 -44 -42 -41 -39 -34 -30 -25 -20 -13 -5 -54 -102 -157 -213 -173 -78 -7 9 5 1 10 20 30 39 17 -5 -3 53 136 219 275 330 367 349 307 264 221 177
8764 177 161 145 123 100 78 55 41 27 13 0 50 100 147 194 233 217 142 68 8 3 22 41 75 109 164 220 252 193 59 -74 -147 -166 -123 -80
8749 -80 -37 5 20 35 75 115 151 188 201 159 93 26 -42 -112 -158 -148 -112 -76 -91 -107 -88 -70 -51 -32 -19 -6 -8 16 86 155 186 189 171 154 134 115
8734 115 92 69 46 23 19 15 11 6 -13 -33 -52 -71 -64 -29 -9 9 46 83 122 161 175 218 270 276 248 220 189 157 110 63 18 -26 -103 -152 -139 -99 -60 -20
8717 -20 21 62 99 136 173 209 277 344 372 371 353 334 331 300 253 234 252 270 274 277 296 288 239 191 140 90 42 -6 -67 -100 -79 -11 45 74 76 49 37 24
8701 24 5 -13 -30 -48 -63 -51 0 52 51 51 50 49 43 36 13 18 15 11 11 10 18 54 89 97 115 133 148 162 127 65 4 -29 -51 -45 -37 -58 -90 -122 -116 -83 -69 -54 -38
8682 -38 -22 -10 2 14 27 30 34 37 41 40 40 3 -62 -114 -121 -80 -12 67 120 148 148 123 71 35 0 18 82 119 156 162 140 134 128 99 70 41 12 1 -9 -20 -32
8664c2K0J9J8J9L6J0l1l1pprpL3Pn1q0q0n2k8jM2O9P1M4J5J5J4J4J0J1J1J0klJ5j3nK2K1p
8647A00m8m9m7m8m2j3K6K6J3J2N1P7Q3N6J7J6Kk5j0j0l0l0k8k8l6qL2L1QPQPj9j9j9j9NMN
8630E8NJ6J6J6J7k0k0k0j9k7k6k6k7K3K3K1K3K3K2K3K3m0m0o9j6J6J6J8J9j9j8j9j9j6j6j6
8614i5j6MMN1N0L5L6j0j0j5j5J3J3K7K8l6l7m4m5K0J9K3K3K3K3oopoK2K2K2K2ool4l4PPqo2
8597dm3m3%%mlK4K4J5J6M2M3ONm1m0m9m8l4K2K9K9L3L1M2M3M2M3K0K0k7k6lmmlK1K2K2K2l8
8579B02l8RQJ9J9rrJ4J4J3J4rrrrPPPPk8k8k7k8l4l3l4l4J9K0J9K0JKKKK2K3K2K3J1J1J1J0
8560B20l7l8l7l8pppppqppK5K6K5K5MNMNk9k8k8k8ppoqqqpqk4k4k4k4P0O9P0O9J7J7J7J7j5
8541A95j5j5j6k6k7k7k7o0o1o2o1K4K4K4K4L9L9L7L9nnnnJ5J4J5J5k4k5k4k3j1j1j1j1NNN
$$ plain form
8664 -32 -12 7 25 44 80 90 59 28 21 14 5 -2 31 38 -13 -93 -173 -225 -253 -254 -212 -143 -72 -28 -13 2 16 30 40 51 62 72 70 67 82 69 64 86 107 100
8647 100 52 3 -44 -92 -134 -147 -121 -95 -82 -70 -19 58 141 197 214 230 232 207 197 187 157 127 99 71 35 27 59 90 98 105 113 120 101 82 63 44 49 53 58
8630 58 63 79 95 111 128 108 88 68 49 22 -4 -30 -57 -34 -11 10 33 56 78 101 124 84 44 -25 -41 -25 -9 9 28 9 -9 -28 -47 -63 -79 -95
8614 -95 -111 -107 -103 -52 -2 33 69 59 49 34 19 32 45 72 100 64 27 -17 -62 -42 -23 0 23 46 69 63 57 50 44 66 88 110 132 126 120 86 52 59 66 58 -4
8597 -4 -47 -90 -90 -90 -94 -97 -73 -49 -34 -18 24 67 73 78 37 -3 -52 -100 -134 -112 -83 -54 -21 10 52 95 137 180 200 220 193 167 164 160 156 153 174 196 218 240 202
8579 202 164 173 181 200 219 210 201 215 229 242 256 247 238 229 220 227 234 241 248 220 192 165 137 103 70 36 2 21 41 60 80 81 83 85 87 109 132 154 177 188 199 210 220
8560 220 183 145 108 70 63 56 49 42 35 27 20 13 38 64 89 114 118 123 127 132 103 75 47 19 12 5 -1 -9 -17 -25 -32 -40 -64 -88 -112 -136 -66 3 73 142 159 176 193 210 195
8541 195 180 165 149 123 96 69 42 -18 -79 -141 -202 -178 -154 -130 -106 -67 -28 9 48 43 38 33 28 43 57 72 87 63 38 14 -9 -20 -31 -42 -53 -48 -43 -38
8524c8Oqpqpjj%jl8l9l9l8K8K8K9K8O3O2O3O4j8j7j8j8klkkJ3J4J4J3l2l3l2l2kklkRRJ0R
8505A9L1L0L1L0l8l8o8j4j1j0ppL2L0L2L2J6J6J5J6k2k1k2k2j4j4j5j3N1N3j2j2k0k0K7K6
8489H7POj7j8L2Q8N6N6J5J5J2J2j5p0q5q5l7l7rrj1j1j2j1oonoL8L7L8L8j1j1j1j1J1J1N7
8472A22N7K4K4o0n9m9m9J6J6P3P3N9Km8m8k3k4lll1l1j1j1j0j0j0j0L5L5N0M9M9M9mmmmJ2
8456B39J2J2J2n2n2n2n2J0RJ0J0mmM1O9K4l1m5m4k1k1K3K4N9L1k2p8o1l3k4k5k4k4MLnoK1
8439f7K2N0N0J8l9n2n3j1j1K7K6K6K6PQQQJ5J4J5J5J6J5J6J5j7j7K8N6L7j9o8o9k5k5k5k5
8423eMLN0N0N1N2NOl7l7rrJJM8J03Q9lo9r7j02p5m2j5K2K0K4K3PPOPjjjjNNm4r8q3k7L9L9
8404h9qqqqRRRRPPPPKLk5k5l4l4L7R2O3O4j6j5m7m5j9j9j1j1MO0O3O5K2K2qqqqk3k2k3k2L7
$$ plain form
8524 -38 -32 -40 -47 -55 -62 -63 -64 -64 -65 -103 -142 -181 -219 -191 -163 -134 -106 -43 19 82 146 128 111 93 75 73 70 68 66 79 93 107 120 88 55 23 -9 -11 -13 -16 -18 -9 0 10 19
8505 19 50 80 111 141 103 65 -3 -17 -28 -38 -45 -52 -20 10 42 74 90 106 121 137 115 94 72 50 36 22 7 -6 45 98 86 74 54 34 61 87
8489 87 94 100 83 65 97 185 241 297 312 327 339 351 336 266 181 96 59 22 13 4 -7 -18 -30 -41 -47 -53 -58 -64 -26 11 49 87 76 65 54 43 54 65 122
8472 122 179 203 227 167 108 59 10 26 42 115 188 247 249 201 153 130 106 103 100 69 38 27 16 6 -4 -14 -24 11 46 96 145 194 243 239 235 231 227 239
8456 239 251 263 275 223 171 119 67 77 86 96 106 102 98 139 208 232 201 156 112 91 70 93 117 176 207 185 107 46 13 -11 -36 -60 -84 -80 -77 -82 -88 -67
8439 -67 -45 5 55 73 34 -18 -71 -82 -93 -66 -40 -14 12 19 27 35 43 58 72 87 102 118 133 149 164 147 130 158 214 251 232 164 95 70 45 20 -5
8423 -5 -1 2 52 102 153 205 210 216 179 142 133 124 125 126 174 277 366 363 294 197 95 20 -22 -37 -15 5 29 52 59 66 72 79 78 77 76 75 80 85 41 -57 -140 -167 -128 -89
8404 -89 -97 -105 -113 -121 -112 -103 -94 -85 -78 -71 -64 -57 -55 -52 -77 -102 -136 -170 -133 -41 22 86 70 55 8 -37 -56 -75 -86 -97 -93 -33 30 95 117 139 131 123 115 107 84 62 39 17 54
8385E4L7O8J3j4j4j7j7l3l2k9k8oM9P7P7K5o8p7p6oM9N0oj2j2j6j6k1k2M2M2J8J8J8J7K9K9
8369A90K9K8j9j9j9k0j4j4j4j4l0l0n6n8l6l7J0J0M9M9KLKJK8K9K9K9j4j5m5J0P7P6O6%m6
8353B17m6m2m3MNj4j4o0n9j8j8K8K8N5N5N5N5mnmmk2k3k2k2j6j5J2J3K8K9j8j7onK2K3ppp
8335A11oj2j2j2j2QQPOj6m4n3rL1K9OOk1k1o7o8k6k6J9K0M7M7J0l6k0PJ6J6j9j9RRM8M7K1
8318B9K0k4k5LMj%m6m6K0K1K0K0k8k8k8k8K5K5K5K6QQPQqprqmnnmL0K9L0L0k8k9k7k8qpqp
8298e8QRRQK6K7k8k8n1n1MM%J%%L1L0k5k5m2m1J4J4M0M0M0M0j8j9j9j9ppppPQQQk4k4L2L1
8279f1K8K8k4k4j2L4O0O0j1n8l2l2JJJJJ2J2J3J1mlkmn3n3n0n0k0K7N6N6L4L5L3L5J4J5J4
8262H8J4QPPQ%JJJPQQPl3l3l3l3POOOj3j3j3j3lljlllN1N3L5L5n7n8n3n5L7L7J4J5m1m0k8
$$ plain form
8385 54 91 159 172 158 144 127 110 77 45 16 -12 -18 31 108 185 210 142 65 -11 -17 32 82 76 64 52 36 20 -1 -23 19 61 79 97 115 132 161 190
8369 190 219 247 228 209 190 170 156 142 128 114 84 54 -2 -60 -96 -133 -123 -113 -64 -15 -13 -10 -8 -7 21 50 79 108 94 79 34 44 121 197 263 263 217
8353 217 171 129 86 90 95 81 67 7 -52 -70 -88 -60 -32 23 78 133 188 184 179 175 171 149 126 104 82 66 51 63 76 104 133 115 98 92 87 109 132 125 118 111
8335 111 105 93 81 69 57 65 73 80 86 70 26 -27 -36 -5 24 30 36 15 -6 -73 -141 -167 -193 -174 -154 -107 -60 -50 -86 -106 -99 -83 -67 -86 -105 -96 -87 -39 8 29
8318 29 49 25 0 3 7 6 6 -40 -86 -66 -45 -25 -5 -33 -61 -89 -117 -92 -67 -42 -16 -8 0 7 15 7 0 -9 -17 -21 -26 -31 -35 -5 24 54 84 56 27 0 -28 -36 -43 -51 -58
8298 -58 -50 -41 -32 -24 2 29 1 -27 -78 -129 -125 -121 -121 -120 -120 -120 -89 -59 -84 -109 -151 -192 -178 -164 -124 -84 -44 -4 -22 -41 -60 -79 -86 -93 -100 -107 -100 -92 -84 -76 -100 -124 -92 -61
8279 -61 -33 -5 -29 -53 -65 -31 29 89 78 20 -12 -44 -43 -42 -41 -40 -28 -16 -3 8 4 1 -1 -5 -58 -111 -161 -211 -231 -204 -148 -92 -58 -23 10 45 59 74 88
8262 88 102 110 117 124 132 132 133 134 135 142 150 158 165 132 99 66 33 40 46 52 58 45 32 19 6 3 0 -1 -4 -7 -10 41 94 129 164 107 49 -4 -59 -22 15 29 44 3 -37 -65
8242f5k7K5K6N2K5k5o9n9l2NONMNNj7j7j6j7%jJJM7P4Q3L8l9l8m2m3j1j1M4M4L0K8K7K8l5
8225C9o2p3k6L5L6L8L7RRQRk1k2k0k1jkjjJ5J5J4J5K0K0K0K0l0k9l0k9n0n1NNJ0RJ0J0M2M2
8207B3j2j2NOOOm2m4J2J2k9l0K5K4M4J5MN0Q3N5L2Mk8n5l9l8jM5L4Pl3l3pL9M6J9kl1l5l5
8190I0J9J8jjn7n6k0k0k0k1L8L8L8L9L7L8L7L8K5K4l0l1J%JJl4l3o0j3K5K6k7k8j7j8j8j8
8174A0j1j2M2M4mmmmj4j4j3j4J5J5J5J5l0k9jM6P1P1Ql9m3m2RJ0N2N1O5L7l0p6p5l0J0L7M0
8157A74J3j8j8j9j9qqqqJ3J4J4J4M0M0M0M0K0J9l6l7k4k4n1r6r9n3J0J0llN2N1O8O7k4k5l9
8140G9m0J6J6KKKKj4j5M2M1J3J3J3J3RJ0RRk1k2k2k2n1n0m7m8o3j6L4O3P2P4P5P5J8J8J8J8
8123C25m5m4m5m4j5j5j5j5qqrqJ1J0J0J0J9J8J8J8POm9n0l0l1l0l0j3j3M2M2M8M8P2K5j8m7
$$ plain form
8242 -65 -92 -67 -41 11 36 11 -58 -117 -149 -144 -138 -133 -129 -124 -119 -136 -153 -169 -186 -186 -187 -186 -185 -138 -64 19 57 18 -20 -62 -105 -116 -127 -83 -39 -9 19 46 74 39
8225 39 -23 -96 -122 -87 -51 -13 24 33 42 50 59 38 16 -4 -25 -26 -28 -29 -30 -15 0 14 29 49 69 89 109 79 50 20 -9 -59 -110 -105 -100 -90 -81 -71 -61 -19 23
8207 23 11 -1 4 10 16 22 -20 -64 -52 -40 -69 -99 -74 -50 -6 9 13 63 146 201 233 237 209 154 115 77 76 121 155 162 129 96 89 128 174 193 191 160 125 90
8190 90 109 127 126 125 68 12 -8 -28 -48 -69 -31 7 45 84 121 159 196 234 259 283 253 222 223 223 224 225 191 158 98 85 110 136 109 81 64 46 28 10
8174 10 -1 -13 29 73 69 65 61 57 43 29 16 2 17 32 47 62 32 3 2 48 119 190 198 159 116 74 83 93 145 196 261 298 268 192 117 87 97 134 174
8157 174 187 169 151 132 113 105 97 89 81 94 108 122 136 176 216 256 296 316 335 299 262 238 214 163 67 -32 -85 -75 -65 -68 -71 -19 32 100 167 143 118 79
8140 79 39 55 71 73 75 77 79 65 50 92 133 146 159 172 185 194 204 213 222 201 179 157 135 84 34 -13 -61 -124 -140 -106 -43 29 103 178 253 271 289 307 325
8123 325 280 236 191 147 132 117 102 87 79 71 62 54 65 75 85 95 114 132 150 168 175 181 132 82 52 21 -9 -39 -52 -65 -23 19 67 115 187 212 194 147
8107A47m9k2NMPOJ0J0RJ0J3J3J3J3K0K1l5l5k9k9k9k9j1j1j1j1NNNNONONj6j7j5j7m4m4j3
8089a24L4M7P5Q8M3l9l8l9l8m6%M6P5L8ql6l7k7k6k8k7k2k3k0k0L2O0P0K5k2k0k5k4M6M4M6
8073H0M5L5L5NOo2r0m4JJ2J1m0m1l7l7J8J7M6M4M5M6M3M3M3M3J5J6p7p7r2r0o4o5n8n9l0l1
8057c45J7J7N4Q2Q0L5PPJ0J0RRk6n2l6J1K8K8N5J02R8L4k0k0j0j0l9l8%j%jn1n1p5l0M2O9
8041aJ6j0j0j0l9m0m9m9OOK8K7K8K8M0L9J0l4m8m8NNM6M7rrk7k6K9K9L8L8N1K3k8p4p5l0K5
8024e2K4K8K6n2n3n0n1K4P0M4M3MMMMM6M6j0j0J0J0J0J0L4L3M7J9k3p0o1l3nnlmj0j0rqK0
8007D1M9N9J2j2j3j5j6k6k5k6k6j3j5J3J3L2L4k2k3j1j1J5J6mmlmrqooLM8L9J1jjK5K5M6M6
7989B27rrNNL2L3j3j2o8o8k0k0k0k0o0o2noN2N2P7P7M1ml5l4j%jjm4m5J1J0K9K8k6k7j3j3
$$ plain form
8107 147 98 76 81 85 92 98 108 118 127 137 150 163 176 189 209 230 195 160 131 102 73 44 33 22 11 0 5 10 15 20 26 31 37 42 26 9 -6 -23 -67 -111 -124
8089 -124 -90 -43 32 120 163 124 86 47 9 -37 -37 9 84 122 114 78 41 14 -12 -40 -67 -89 -112 -132 -152 -120 -60 10 35 13 -7 -32 -56 -10 34 80
8073 80 125 160 195 200 206 144 54 10 11 23 34 -6 -47 -84 -121 -103 -86 -40 4 49 95 138 181 224 267 282 298 221 144 52 -38 -102 -167 -225 -284 -314 -345
8057 -345 -328 -311 -257 -175 -95 -60 -53 -46 -36 -26 -17 -8 -34 -86 -122 -111 -83 -55 0 102 200 234 214 194 184 174 135 97 97 96 96 95 44 -7 -82 -112 -70 -1
8041 -1 15 5 -5 -15 -54 -94 -143 -192 -186 -180 -152 -125 -97 -69 -29 10 20 -14 -62 -110 -105 -100 -54 -7 -16 -25 -52 -78 -49 -20 18 56 107 130 102 28 -47 -77 -52
8024 -52 -28 0 26 -26 -79 -129 -180 -156 -86 -42 1 5 9 13 17 63 109 99 89 99 109 119 129 163 196 243 262 239 169 108 75 70 65 62 58 48 38 29 21 41
8007 41 90 149 161 149 136 121 105 79 54 28 2 -11 -26 -13 0 32 66 44 21 10 -1 14 30 26 22 19 15 6 -2 -8 -14 -11 37 76 87 86 85 110 135 181 227
7989 227 218 209 214 219 251 284 271 259 191 123 103 83 63 43 -17 -79 -84 -90 -38 14 91 168 209 205 170 136 135 135 134 133 89 44 55 65 94 122 96 69 56 43
7972D3J5J4j0j1l8l7o5o4rrL0L0L0L0KKLKj6j7j6j7l1l2mmqrM7M7L7L6RRJ9K1K1K1k1k2l2
7954doJ9P5P5K0n7q6q8o1k3k3L4L4L4L4k1k1k5k5L1L1M9M9M9N0j4j5j4j4j8j9j9j8M3M4M4
7938A44M3qqj1j0l0n8p2j9K6K5K9K9jkK5K4N7K8n2j08q5n9l8j0poK3K3J0J0j7j8K1K2K1K1
7922c8L6L4L6L5k2k2k3k2NNL2L3L2L1o1o0m1m2J4J4M8M9K5l1l1l0K1K2L7L7L8L7KLk6k5j0
7906A42rM3M3L0j7q0q1n1oK4K4J1J1J1J0QPPPMLMML2L2k4k3K1K2pn2m0j2llONNNJ7J7J7J7
7887A81k6k7n1n1oM0O9P0J1J1j7j6rrqrRQj9j9NNO1O0K4K5l2l1n5n4n5n4n1n2MLK6K6kjl9
7870e5l8J7J8K5K5mn0p1p0pL9M9M9K4K5j4j4J4J4NNNNOPPPpqpoJ7J9J8J8j6j5j3j2lN3O5O6
7851A92N6K7oo2q8o0j1J6mlklk2k2k3k4pl4n0NM4M3M3M3K4l2p9q0m6RO2O1M5M5%%J6J7J6J6
$$ plain form
7972 43 58 72 62 51 13 -24 -89 -153 -162 -171 -141 -111 -81 -51 -49 -47 -44 -42 -58 -75 -91 -108 -139 -171 -175 -179 -187 -196 -149 -102 -65 -29 -20 -11 8 29 50 71 50 28 -4
7954 -4 -10 9 84 159 179 122 36 -52 -113 -136 -159 -125 -91 -57 -23 -44 -65 -90 -115 -84 -53 -4 45 94 144 130 115 101 87 69 50 31 13 56 100 144
7938 144 187 179 171 160 150 120 62 -10 -29 -3 22 51 80 79 77 102 126 183 211 159 51 -34 -93 -131 -141 -148 -154 -131 -108 -98 -88 -105 -123 -102 -80 -59 -38
7922 -38 -2 32 68 103 81 59 36 14 19 24 56 89 121 152 91 31 -10 -52 -38 -24 24 73 98 67 36 6 27 49 86 123 161 198 200 203 177 152 142
7906 142 133 176 219 249 232 152 71 20 14 38 62 73 84 95 105 113 120 127 134 138 141 145 149 181 213 189 166 187 209 202 150 110 98 95 92 98 103 108 113 130 147 164 181
7887 181 155 128 77 26 20 60 129 199 210 221 204 188 179 170 162 153 162 170 151 132 137 142 203 263 287 312 280 249 194 140 85 31 -20 -72 -68 -65 -39 -13 -15 -16 -55
7870 -55 -93 -76 -58 -33 -8 -12 -62 -133 -203 -210 -171 -122 -73 -49 -24 -38 -52 -38 -24 -19 -14 -9 -4 2 9 16 23 16 8 1 -5 12 31 49 67 51 36 23 11 8 61 126 192
7851 192 248 275 269 207 119 59 48 64 60 57 55 52 30 8 -15 -39 -46 -80 -130 -125 -81 -38 5 48 72 40 -39 -119 -165 -156 -94 -33 12 57 57 57 73 90 106 122
7834A22J8J7k8k9m1m1K4K4nnl3l2J4J6N8N9J8l7o7l8j1J6L2N9O6L9Mn1p1p1k6K9K0l5n9l3
7818g8K9N6N9L0QPOOl8l8l9l7llmlK2K0K2K1J1J2p1p2k9k9k9k8RRN5N5onnojkJ%P4J00P1J5
7799A72n2n2j9K8M7J8k8n6m1j3J6J6OOL3L3M3M3M3M4j3j3j3j3j9j9k0j9m4m5m5m3mllmK2K1
7783A0K2K2L4L5L4L4l4l4l5l4NNk2k3m9n1J5J4N1N0N1N1k6k6k6k5l6l4o0j3N2P8Q3N4J8J7
7767B07J5J6k4k4k4k3J0J0J1J0J7J7J8J7l0l0l0k9klm8m8poK1K1K1K1ppk1k1K4K5M6M5M3M2
7750B73rn6l0l0j2j2j2j2JJkkj5o1n0k3k1k0m6m7m4m4nM1O5O5Mk4LN0N0M9J1J2l5o1m5KK0
7734g1K0j1j1j1j1K7K6K7K5K6K6K6K6J%J%l3l4l4l3k7k6k7k7K3K4K3K4J9J9J7J8m5p3l5J1
7718a00P7J22J12Q4L3l2m3m3j9k0j9k0m4m4j7j7k0k1jM4Q2Q3L8k6m0m1KKl6l5p8p9o6k0K8
$$ plain form
7834 122 140 157 129 100 59 18 42 66 61 56 23 -9 5 21 79 138 156 119 52 14 3 19 51 110 176 215 219 168 97 26 0 29 49 14 -45 -78
7818 -78 -49 7 66 96 104 111 117 123 85 47 8 -29 -32 -35 -39 -42 -20 0 22 43 54 66 -5 -77 -106 -135 -164 -192 -183 -174 -119 -64 -70 -75 -80 -86 -87 -89 -88 -88 -14 86 157 172
7799 172 120 68 49 77 124 142 114 58 17 4 20 36 42 48 81 114 157 200 243 287 274 261 248 235 216 197 177 158 114 69 24 -19 -23 -26 -29 -33 -11 10
7783 10 32 54 88 123 157 191 157 123 88 54 59 64 42 19 -30 -81 -66 -52 -1 49 100 151 125 99 73 48 12 -22 -82 -95 -43 35 118 172 190 207
7767 207 222 238 214 190 166 143 153 163 174 184 201 218 236 253 223 193 163 134 132 129 81 33 26 20 41 62 83 104 97 90 69 48 72 97 143 188 231 273
7750 273 264 208 178 148 136 124 112 100 101 102 100 98 83 22 -28 -51 -72 -92 -138 -185 -229 -273 -278 -237 -172 -107 -103 -127 -124 -74 -24 25 36 48 13 -48 -93 -91 -71
7734 -71 -51 -62 -73 -84 -95 -68 -42 -15 10 36 62 88 114 115 115 116 116 83 49 15 -18 -45 -71 -98 -125 -102 -78 -55 -31 -12 7 24 42 -3 -76 -111 -100
7718 -100 -23 99 211 295 328 296 253 210 191 171 152 132 88 44 27 10 -10 -31 -32 12 94 177 215 189 149 108 110 112 76 41 -37 -116 -182 -202 -174
7702a74P4Q1N1K5K5KLk5k6J3J3O0N9K3K3k4k3m8m7m8m7K3K3P0O9M0L9k4k5m4m3m3m4j4j5j4
7687a2j5K0J8K0K0K7K7K7K8J0J0n5n5p7p8j3j4ppn3n3QQQRK4K4K5K4m3m4k8K7O4O5K2K1%j
7670a9K6K8QRPPOk2l8J8L7L7ooL9L9Nn0p9p8j9j8J0J1J0J1J4J3l1n9l6K0O5L8pl5k5L1M6M7
7653E4K3K3PPk0k0j1j0j1j0K0K1k6k5J1J1J2J1j0j1j1j0KLL0L0L1L0j5j6j9k0QRj%K7K7K4
7636A75K4K4K4k7k7k7k8l5l6l6l4OPPPl5l6oM0N6N8NNpqqqj1j1j1j1k8k6k8k7J0J1J0J1K0
7618a1J9P6P5%J%JJ%JJk0k0k0k0onnnNOL4L3J2J2m3m3j0j1j0j0K6K6K6K6l3l3l3l3NMO0O0
7600A39K6K6k9k9m7m8K7N4J0l7rj0mlmmLLLLJ4J4J1J0j0n6m3j6K5N3M0L9M9M9N0M9KLn3n3
7582B47m5m5J1J0M3M3j3j3l7l6rrN7N6K9j7m8k1J7J7j1j0o6o6n8n8mlMNM0O9M7Jk7k6l6l5
$$ plain form
7702 -174 -100 -19 32 57 82 84 87 62 36 49 62 122 181 204 227 203 180 132 85 37 -10 13 36 106 175 215 254 230 205 161 118 75 31 17 2 -12
7687 -12 -27 -7 11 31 51 78 105 132 160 170 180 125 70 -7 -85 -98 -112 -119 -126 -179 -232 -224 -216 -208 -199 -175 -151 -126 -102 -145 -189 -217 -190 -126 -61 -39 -18 -18 -19
7670 -19 7 35 43 52 59 66 72 50 12 30 67 104 98 92 131 170 175 125 46 -32 -51 -69 -59 -48 -38 -27 -13 0 -31 -90 -126 -106 -41 -3 -10 -45 -70 -39 7 54
7653 54 77 100 107 114 94 74 63 53 42 32 52 73 47 22 33 44 56 67 57 46 35 25 27 30 60 90 121 151 136 120 101 81 89 98 97 97 124 151 175
7636 175 199 223 247 220 193 166 138 103 67 31 -3 3 10 17 24 -11 -47 -53 -13 43 101 106 111 104 96 88 80 69 58 47 36 8 -18 -46 -73 -63 -52 -42 -31 -11
7618 -11 8 84 159 159 160 160 161 162 162 163 164 144 124 104 84 78 73 68 63 68 74 108 141 153 165 122 79 69 58 48 38 64 90 116 142 109 76 43 10 15 19 79 139
7600 139 165 191 162 133 86 38 65 119 129 92 83 73 69 66 62 58 61 64 67 70 84 98 109 119 109 53 10 -6 19 72 112 151 200 249 299 348 350 353 300 247
7582 247 202 157 168 178 221 264 251 238 201 165 156 147 204 260 289 272 224 203 220 237 226 216 150 84 26 -32 -36 -39 -35 -30 10 79 126 127 100 74 38 3
7566CK0K0N1N1K3K3M1M1j4j4n6n6n4n3PN2K7K7QQQPk0k1L5L5L2L3MNk0k0PQj2j2o8o7m5m4
7548@M7M7K3K3l2l2mmmmqpM5M5jm6p3p2j7K9J9rj5j4M0L8N1N1K4K3j4j4J4J3j5j5j5j5ppp
7531H1qJ4J4J4J3K3K4K3K3pppoPPPPn6n5n5n5k2k3k2k3PQPPjjkjL8L8L8L9ppo8o7m6%L9L9
7511b9L5L6L5L6K4K3K4K4k1k2k1k1m1m2mM2K8Jk7k6JKJJK9K9K8K9l4l4l3l4k2k1k2k2QQL4
7494BL6J4J3l2l3j1j2J6J5L7L6rj0L6L5O3O3RQj9k0n0n1o3l5MN0P2P3PPl9o7n5rK8K8j1j2
7477A14j1j1k5k4n1n2J2J2N7N8J4J3j4j4pqppk6k4k6k6M1M1M1M1%J%%j4j4l0kJ8J9J8J8l2
7460I3o1m2m4j3J5jjJ7J7J8J8L0N8M2M2%j%%j6j7j6j6J3J4J3J4J9K0J9J9j3j4j3j4k1k2NM
7444A65ol3o3o2l7j0K1K0J8J9J7J7j5m3m2j6pponLLMLJ1J0J0J0K4K4K4K5L7L6Pk1m7m7m8m9
$$ plain form
7566 3 23 43 94 145 168 191 232 273 259 245 189 133 79 26 33 85 112 139 147 155 163 170 150 129 164 199 231 264 268 273 253 233 240 248 236 224 156 89 44 0
7548 0 47 94 117 140 108 76 72 68 64 60 52 45 90 135 134 88 15 -57 -74 -45 -26 -35 -50 -64 -24 14 65 116 140 163 149 135 149 162 147 132 117 102 95 88 81
7531 81 73 87 101 115 128 151 175 198 221 214 207 200 194 201 208 215 222 166 111 56 1 -21 -44 -66 -89 -82 -74 -67 -60 -61 -62 -64 -65 -27 11 49 88 81 74 6 -61 -107 -107 -68 -29
7511 -29 6 42 77 113 137 160 184 208 187 165 144 123 82 40 36 78 106 107 80 54 55 57 58 59 88 117 145 174 140 106 73 39 17 -4 -26 -48 -40 -32 2
7494 2 38 52 65 33 0 -11 -23 -7 8 45 81 72 62 98 133 196 259 268 276 257 237 187 136 73 38 42 92 164 237 244 251 212 145 90 81 109 137 126 114
7477 114 103 92 67 43 -8 -60 -48 -36 21 79 93 106 92 78 71 63 56 49 23 -1 -27 -53 -12 29 70 111 111 112 112 112 98 84 54 52 70 89 107 125 93
7460 93 32 -10 -54 -67 -52 -53 -54 -37 -20 -2 16 46 104 146 188 188 187 187 187 171 154 138 122 135 149 162 176 195 215 234 253 240 226 213 199 178 156 161 165
7444 165 159 126 63 1 -36 -46 -25 -5 13 32 49 66 51 8 -34 -50 -57 -64 -70 -75 -72 -69 -65 -62 -51 -41 -31 -21 3 27 51 76 113 149 156 135 88 41 -7 -56
7426e6pqqqJ4J4J4J4K9K9N3N4L6j0m7m7kK5J0J0ppk3NL8L8L8L8l4o2m6m7j2j2j2j2kkn5n5
7409a22LM9P7P8L0K9KJRJ0RRononRJ0m6m6k8k9k8k7LKLLK3K4K4K5M5M5J7l1m3m3m4m3J6M4
7391D7Km5o0l4MLl9l9m0l9J4J3M2M1L5L5k1k0m1m1J3J2l0n7k3M1Q7Q7N8J4j3l9m3j5K0K1K2
7375b8K2K2K2K2K3M6M6M7M6J7J6J6J7k7k7k6k7j5j5j6j5PPPPmnmnRJ0RRKJL0K9L2L2k3k4k0
7356B72k1k0k1l9l9m0l9m3m1J3J3QRj7j9%%J%J0J0RJ0l8l8l9l8k7k7k8k7J4J3J5J5P8J06P1
7340F6Ol4l4rj1K0K2K1K2l4l4n8n9k6K1O5L7MMK9L1K8K8K8K8j9k0J8M6L2j5m1m2J1J0J1J1
7324A63k3k3k1k1JK8J2l4m6j9J9J8ooooJ1J2J1J1nmnnKKLKJ5J6J5J6J0J1L6L7N2K5k4p0n2
7306A52k4j5j4n6n4k7k8llK4K4O7O7J1J2j6j7j6j6j1j1j1j2J8J7km9o8o8ppkkK3Q7J06O1k0
$$ plain form
7426 -56 -63 -71 -79 -87 -73 -59 -45 -31 -2 27 80 134 170 160 113 66 64 89 99 109 102 95 72 77 115 153 191 229 195 133 87 40 28 16 4 -8 -10 -12 -67 -122
7409 -122 -119 -70 7 85 115 144 146 147 156 166 175 184 178 173 167 162 171 181 135 89 61 32 4 -23 -20 -18 -15 -12 11 35 59 84 129 174 191 160 117 74 30 -13 3 47
7391 47 49 4 -56 -90 -86 -83 -122 -161 -201 -240 -226 -213 -171 -130 -95 -60 -81 -101 -142 -183 -170 -158 -188 -245 -268 -227 -140 -53 5 19 6 -33 -76 -91 -71 -50 -28
7375 -28 -6 16 38 60 83 129 175 222 268 285 301 317 334 307 280 254 227 212 197 181 166 173 180 187 194 190 185 181 176 185 195 204 213 215 216 246 275 307 339 316 292 272
7356 272 251 231 210 171 132 92 53 10 -31 -18 -5 3 12 -5 -24 -24 -24 -23 -23 -13 -3 6 16 -22 -60 -99 -137 -164 -191 -219 -246 -232 -219 -204 -189 -111 -5 66
7340 66 72 38 4 -5 -16 4 26 47 69 35 1 -57 -116 -142 -121 -56 -19 -15 -11 18 49 77 105 133 161 142 122 140 186 218 203 162 120 131 141 152 163
7324 163 140 117 96 75 76 104 116 82 36 17 36 54 48 42 36 30 41 53 64 75 70 66 61 56 58 60 63 65 80 96 111 127 137 148 184 221 273 298 274 204 152
7306 152 128 113 99 43 -11 -38 -66 -69 -72 -48 -24 43 110 121 133 117 100 84 68 57 46 35 23 41 58 56 7 -61 -129 -136 -143 -145 -147 -124 -37 69 130 110
7290A10o7p2m5j8j7l0l1N3N3L8L8L8L8K3K3K2K3k0k0k1k0NONNJ9K0J9K0j5j5j5j6J0J0J0R
7274A75M0M0L9M0l3l2l3l3mnmnpql5l5k9k9J6J7%j%%nmnmRQRRJ2J3j6j5mmO1O1M2M1mnl2l2
7254B09l3l2k2k2k2k2ppJ7J8J2l5o9m2rj0qprql3l3k3K3M4M4N8N7M6J8rj0j1j1m0l9l8l8j6
7237a19J1M3M2J8J6J8J8K3K3K3K3k2k1PL5K6jm9m9m7m5j8j8j0rLL1L1L0NOllk8k9kK5L6L8
7220E8PPrJ9N1N1L2j4n0n0m0j3OOQQmlk2PJ5j3j0J7J3J3J4J5QQk0k0m2m2j1J6L1L0L3L2K3
7202A65K3K1K1kl0m1m0k1PK0M8L4OK3K3qqqqk8k9k9k9J8J8J7J6L7Rk1k1j2j2j1j2KJKJK7K7
7184A96K6K5Jk6j0j1lknmkk9o8o7k3Mj1j1M5M6Pk1k4k4k3k3L1N9N7L0nl2j7j7nK4PQ%%%%n
7166I8nk1QN0N1O8M0kjj9RM9M9j4o0k3Mj4j4l6l7l6l7k1k2k0j9l1lL5L6J4J3J4J3j1j1rj0
$$ plain form
7290 110 43 -29 -74 -92 -109 -139 -170 -117 -64 -26 12 50 88 111 134 156 179 159 139 118 98 103 109 114 119 138 158 177 197 182 167 152 136 146 156 166 175
7274 175 215 255 294 334 301 269 236 203 199 194 190 185 178 170 135 100 71 42 58 75 75 74 74 74 69 65 60 56 65 73 82 91 103 116 100 85 81 77 138 199 241 282 278 273 241 209
7254 209 176 144 122 100 78 56 49 42 59 77 89 54 -15 -57 -66 -76 -84 -91 -100 -108 -141 -174 -197 -174 -130 -86 -28 29 75 93 84 74 63 52 12 -27 -65 -103 -119
7237 -119 -108 -65 -23 -5 11 29 47 70 93 116 139 117 96 103 138 164 163 114 65 18 -27 -45 -63 -73 -82 -79 -48 -17 13 18 24 21 18 -10 -39 -41 -16 20 58
7220 58 65 72 63 82 133 184 216 202 152 102 62 49 55 61 69 77 73 70 48 55 70 57 47 64 77 90 104 119 127 135 115 95 53 11 0 16 47 77 110 142 165
7202 165 188 209 230 228 198 157 117 96 103 123 171 205 211 234 257 249 241 233 225 197 168 139 110 128 146 163 179 216 225 204 183 171 159 148 136 138 139 141 142 169 196
7184 196 222 247 248 222 212 201 198 196 191 187 185 156 88 21 -2 2 -9 -20 25 71 78 57 33 9 -14 -37 -6 53 110 140 135 103 86 69 64 88 95 103 103 103 103 103 98
7166 98 93 72 80 130 181 249 289 287 286 267 276 325 374 360 300 277 281 267 253 217 180 144 107 86 64 44 25 -6 -9 26 62 76 89 103 116 105 94 85 75
7149G5K8N6M0M0pqooJ2L9L9J2m1m1m2m3j8j8j7j6l4oL2L1Jk8k6KL3O0J9k7n0k3L6O3rj0qq
7131A26n9n9p1m4RN5Q6Q7L2L2k4k3m3m3m2m2k9l0jM4O7M0MLllmlk6k6k6k6j5j5j5j4M4M5M4
7115C2M5qqqrQPQPN2N2K2k4m3m4m7m6L0L1L0L1OOPOk9k8K7K7M7M7qrONONm3m2m3m3ppM6M5
7095A45Rl7j2j1j8j8j8j8k7k8k8k9O7O7L9pj4J3nnRJ0RJ0j9k0j6j6k0K7P4J02O9K3nnk5k5
7079B47q1q0l6l6l4l6K8K8N4N5K9K8j8j7l6l6qqRRRRL6L6L6L6K2K2K2K2j7j7j7j7k2k2k3k2
7062A54k0k0QQkjm8m8%JJ%j1j1j1j0NNNNj%j%OOPOL4L5L4L5kkl0n7p1k4L0N9N5K7nl3l6l7
7042D5j0j1K7K8K7K8J3J3J3J3onm9m8k8J9N7N7J5J5l1l1k3k3m8m8m8lN4Q3N9L2Kk6l5pK4N2
7026A96N1N1J2l3o4r2r3o4j8J0M2O9M2lm1m1rj0rrK4K6K5K6%j%%j1j2j2j1J1J2J1J2J3J2K8
$$ plain form
7149 75 103 159 199 239 232 224 218 212 224 263 302 314 273 232 190 147 129 111 94 78 44 38 70 101 102 74 48 50 83 143 162 135 85 62 98 161 152 142 134 126
7131 126 67 8 -63 -107 -98 -43 43 130 162 194 170 147 104 61 19 -23 -52 -82 -83 -39 28 68 72 75 72 69 65 62 36 10 -16 -42 -57 -72 -87 -101 -57 -12 32
7115 32 77 69 61 53 44 52 59 67 74 126 178 200 176 133 89 42 -4 26 57 87 118 124 130 137 143 114 86 113 140 187 234 226 217 223 228 234 239 196 154 111 68 61 54 100 145
7095 145 154 117 105 94 76 58 40 22 -5 -33 -61 -90 -23 44 83 76 62 75 70 65 74 84 93 103 84 64 48 32 12 39 113 215 284 307 302 297 272 247
7079 247 166 86 50 14 -20 -56 -28 0 54 109 138 166 148 131 95 59 51 43 52 61 70 79 115 151 187 223 245 267 289 311 294 277 260 243 221 199 176 154
7062 154 134 114 122 130 128 127 79 31 31 32 33 33 22 11 0 -10 -5 0 5 10 9 9 8 8 14 20 27 33 67 102 136 171 169 167 137 80 9 -15 15 74 129 156 151 118 82 45
7042 45 35 24 51 79 106 134 147 160 173 186 180 175 126 78 50 69 126 183 198 213 182 151 128 105 57 9 -39 -42 12 95 154 186 188 162 127 120 144 196
7026 196 247 298 310 277 213 121 28 -36 -54 -44 -2 67 109 106 65 24 15 5 -4 -13 11 37 62 88 88 87 87 87 76 64 52 41 52 64 75 87 100 112 140
7009A40Jk6k5J8J9J0J1QPJ0l7n5n5j3J5K7K7noNL3N5K7kkppl3l3j9RK1K2j4j3l9l9k7%M8M8
6991A04L7RllMLm1m1k5KJ5J5J2J2j6j6jjk7k7j1J7M8M7L1L1L0L1j0j0rqj1J7J8j1m0m0j3J5
6974A34%k7l8l8j0j0l4l6k7JL2L2K9K9%k9J5J4J2J3kkkkjkjkl1l1l1l2K6K5PL4K8j7l2nL0
6956A9L0ml2l8QO8P0N1Nk5k4QQQQRRj9j8k6k6K9L0N8N7K9j8n5n6kln9n8p0m4J8O3M0L9j3j4
6938F0j3j4kkkkJ9J8J9J9k5k5k5k5K7K7K7K8JKKKJ5J6J5J6j6j6j6j5l4l4K2K2K6K7K6K7PO
6921B10m8m8j4j4j4j4l2l2K2K3J7J7J8J7J1J1J1J2j2j1l7l7q9o2jK7M0L9J4J4K5K5J2j4m2
6906D4m2J2J1NONNJJN5N5K4mj5j6j0rj2j2j9m8l1l1j3j4K4N0M0ol4l3j%%jJJK6K6K8Jl8l7
6887emK3K5kmK3NNj4m1k5k6k0k0j9j9J8M5L0K9JJK7K7L0Ll6l5l3oL1L2J9rm8m8j2j2j2j2k0
$$ plain form
7009 140 141 115 90 108 127 137 148 156 163 173 136 81 26 13 28 55 82 77 71 76 109 164 191 189 187 180 173 140 107 88 97 118 140 126 113 74 35 8 8 56 104
6991 104 141 150 147 144 148 151 110 69 44 46 61 76 88 100 84 68 67 66 39 12 1 18 66 113 144 175 205 236 226 216 207 199 188 205 223 212 172 132 119 134
6974 134 134 107 69 31 21 11 -23 -59 -86 -85 -53 -21 8 37 37 8 23 37 49 62 60 58 56 54 53 51 50 48 17 -14 -45 -77 -51 -26 -19 15 43 26 -6 -11 19
6956 19 49 45 13 -25 -17 51 121 172 177 152 128 136 144 152 160 169 178 159 141 115 89 118 148 206 263 292 274 219 163 161 158 99 41 -29 -73 -55 8 48 87 74 60
6938 60 47 33 31 29 27 25 44 62 81 100 75 50 25 0 27 54 81 109 110 112 114 116 131 147 162 178 162 146 130 115 81 47 69 91 117 144 170 197 204 210
6921 210 162 114 100 86 72 58 26 -6 16 39 56 73 91 108 119 130 141 153 141 130 93 56 -33 -95 -96 -69 -29 10 24 38 63 88 100 86 44
6906 44 2 14 25 30 36 41 46 47 48 103 158 182 178 163 147 137 128 116 104 85 37 6 -25 -38 -52 -28 22 62 56 22 -11 -12 -12 -12 -13 -12 -11 15 41 69 70 32 -5
6887 -5 -9 14 39 37 33 56 61 66 52 11 -14 -40 -60 -80 -99 -118 -100 -55 -25 4 5 6 33 60 90 93 57 22 -11 -17 14 46 65 56 8 -40 -52 -64 -76 -88 -108
6869a08k0J9M8M3M2L3Nk6k7K7K7J1J2J0RK5lm1m1m1j3M4P3O5L6J4j3k5k5j5J3K8K8L0L0jj
6853B72n6n6m6m7RRK7K7K8K7l4l4l4l4J0J0J0J0K3K4K3K4j1j2j1j1o4o4o1o3q2n4nM1O4L6
6838a05j%L1L1k4k5j8j9j9j8j1j0J8O4O2L5klJ5J6J5J6K0K0l6l6j9k1k0k1L6L5L6L6J1J0J1
6822A10J0J6J6J6J6M0M0j5j5j5j5j4j5j8j9j8j8L5L5L4L5%J%%l6l7l5l5ML1N1j2p7p7r3o6
6805a40J3O0N0K2K6K5K4K4j%N5N5j6j6j6j5LMMMk5k4l7j0L4Q0O8M1K6k0n1n1j9k0j9j9klN1
6789A65N2O4L6j5o0m4m3m7m6qqrqK7K8K7K8j6j7j6j7%J%%M1M2j4j4j7j7L5L5l4q1n4n5m5m5
6772a49M6M7K1K0J9K1qrqpL0L1L1L1J8J8J4J5J0l7o6o6lllmK5K5K4K5L0L1k5k5l8l7N4N5L0
6755A83K9k6k5J8J8J8J8j9j9j8j9n7n7jkm6m7m7m7j7j7L8L9M4M5N9L2kjmljjj%K4K5N2N2L1
$$ plain form
6869 -108 -128 -109 -61 -18 24 57 62 36 9 36 63 74 86 96 105 130 127 86 45 4 -9 35 108 173 209 223 210 185 160 145 158 186 214 244 274 273 272
6853 272 216 160 114 67 76 85 112 139 167 194 160 126 92 58 68 78 88 98 121 145 168 192 181 169 158 147 83 19 -42 -105 -187 -241 -246 -205 -141 -105
6838 -105 -106 -106 -75 -44 -68 -93 -111 -130 -149 -167 -178 -188 -170 -106 -44 -9 -11 -14 1 17 32 48 68 88 52 16 -3 -24 -44 -65 -29 6 42 78 89 99 110
6822 110 120 136 152 168 184 224 264 249 234 219 204 190 175 157 138 120 102 137 172 206 241 241 242 242 242 206 169 134 99 103 134 185 173 96 19 -74 -140
6805 -140 -127 -67 -17 5 31 56 80 104 103 103 158 213 197 181 165 150 153 157 161 165 140 116 79 69 103 183 251 292 318 298 247 196 177 157 138 119 117 114 165
6789 165 217 281 317 302 242 198 155 108 62 54 46 37 29 56 84 111 139 123 106 90 73 73 74 74 74 115 157 143 129 112 95 130 165 131 50 -4 -59 -104 -149
6772 -149 -103 -56 -35 -15 4 25 17 8 0 -7 23 54 85 116 134 152 166 181 191 154 88 22 19 16 13 9 34 59 83 108 138 169 144 119 81 44 98 153 183
6755 183 212 186 161 179 197 215 233 214 195 177 158 101 44 43 41 -5 -52 -99 -146 -163 -180 -142 -103 -59 -14 45 77 75 74 70 67 66 65 64 64 88 113 165 217 248
6737B48L0%k8j5j5j6j6l3l3l3l3j0j0k6KK9L0M6J9k5k6J5J6pn2m1j2RL7K1K1Jk7k8jjk9k4
6721a7LJ8M7L4L3J5J4J4J5rqqqqrqqJ6J6J6J6L6L6QQK4K4pl4k6k6l9o6n4k7KKj0j0rrK2K2
6702D1J3j6l6pL8L9L4L5L5L5L1L0J8ro7o7m9kJ8J8k7n4k9klk9l5l5nK1L8L6M0L9J7J7J6J7
6686A54LLLLj1j0j0j1qqL8L7J2J1j6j7kjkkk4k4n2n2j2j2L3L4K2K3K2K2J7J7J7J7j3j4j3j3
6668A61JJJJJJJKPPPPmmnmKKLMK8N6M2j3n4q1n5JN8N8J5J6k6k5l1K5O7L9k7q2o4qM0M1M5M6
6649C03jjm9m9m5m6k6K9L0k7l6l6K5K5L9L9L9L9nnJ9K0K1l3m9m9k0j9k0k0m4m4m3m4j0j0K2
6633h1P8N9L3K3K4J4J3j5j4J8J8k7k8k5k5k2k3J4M2N8Lm3m3j9j8k2k3o8o9ppK1K0N8N9J2J2
6616@RJ1J1J0L3L4L3L3mmK8k6l2mk4k3k2k1k2k1O0O1O0O1K3K2Qm8q2q1k1k1J5J6j3j2PPPP
$$ plain form
6737 248 278 278 250 235 220 204 188 155 122 89 56 46 36 10 12 41 71 117 136 111 85 100 116 109 57 16 4 13 50 71 92 93 66 38 37 36 7 -17
6721 -17 -14 4 51 85 118 133 147 161 176 167 159 151 143 135 126 118 110 126 142 158 174 210 246 254 262 286 310 303 269 243 217 178 112 58 31 33 35 25 15 6 -3 19 41
6702 41 54 38 2 -5 33 72 106 141 176 211 242 272 290 281 214 147 98 96 114 132 105 51 22 20 17 -12 -47 -82 -87 -66 -28 8 48 87 104 121 137 154
6686 154 157 160 163 166 155 145 135 124 116 108 146 183 195 206 190 173 171 170 168 166 142 118 66 14 2 -10 23 57 79 102 124 146 163 180 197 214 201 187 174 161
6668 161 162 163 164 165 166 167 168 170 177 184 191 198 194 190 185 181 183 185 188 192 220 276 318 305 251 170 115 116 174 232 247 263 237 212 181 206 273 312 285 203 139 131 171 212 257 303
6649 303 302 301 252 203 158 112 86 115 145 118 82 46 71 96 135 174 213 252 247 242 261 281 302 269 220 171 151 132 112 92 48 4 -39 -83 -93 -103 -81
6633 -81 -3 56 89 112 136 150 163 148 134 152 170 143 115 90 65 43 20 34 76 134 137 94 51 32 14 -8 -31 -99 -168 -175 -182 -161 -141 -83 -24 -12 0
6616 0 9 20 31 41 74 108 141 174 170 166 194 168 136 132 108 85 63 42 20 -1 59 120 180 241 264 286 294 246 164 83 62 41 56 72 59 47 54 61 68 75
6599G5oopoL0L0L0L0k6k6JJk4k5p1o9m1m1ONPOPOJ3J3J3J3J2J3J3J3j9j8j8j8M6M4M6M6RQ
6581A15L7L6L2L2l3l3mnmmRRJ0Rj5j5o1o2j9j9RQL8L9P8N1rn6m7j9OORQQQQQL8L8L7L8J1J0
6562C40l6l5q8q9j00p3QN3M3J5ml2l3oL8L9K1k6j9j8k2k2j4j3j4j4k0k1M5M4O3O4J8J7k3k3
6546F3k4k3l2l3J3J3J1J2j6j6j3j3J4J5J1J1J0J1J1J1J1J1ool4l2k1k0K6K5JKM3M4K2k4m5
6530C3m3rrJ7J5j8o4q0n3j9QM1M0K7K7K5K5O6L9j0j0J%JJK2K3rl6m6m5j7J1K2K1mnK0K1K1
6513E0K1K6K7K6K6K5K4M0J3k1k0k2k2l5l5n0k3llJ0L8O5O4J7j1k6k6J%j0j0LL0N2N3M2J4o
6496C44ol7o4p1m3j1j2K1O7Q2N4Mk4l8l7o0o0k9jJ3J3Lk5l3l3oK2K0pj8j8jjjjJ5J5J5J5K7
6479I3K6K7K6j0j1j1j0m2m3m2m1k0j9J1L9N9N9O0O0kl0j3j4oooon9n9m3J1j0rl4l4K8K9K8
$$ plain form
6599 75 69 63 56 50 80 110 140 170 144 118 119 120 96 71 0 -69 -110 -151 -145 -140 -133 -127 -120 -114 -101 -88 -75 -62 -50 -37 -24 -11 -30 -48 -66 -84 -38 6 52 98 107 115
6581 115 152 188 220 252 219 186 182 177 173 169 178 187 197 206 191 176 115 53 34 15 24 32 70 109 187 238 229 173 126 107 113 119 128 136 144 152 160 168 206 244 281 319 330 340
6562 340 304 269 181 92 -8 -81 -73 -20 23 38 34 2 -31 -37 1 40 61 35 16 -2 -24 -46 -60 -73 -87 -101 -121 -142 -97 -53 10 74 92 109 86 63
6546 63 39 16 -16 -49 -36 -23 -12 0 -16 -32 -45 -58 -44 -29 -18 -7 3 14 25 36 47 58 52 46 12 -20 -41 -61 -35 -10 -9 -7 36 80 102 78 33
6530 33 -10 -19 -28 -11 4 -14 -78 -158 -211 -230 -222 -181 -141 -114 -87 -62 -37 29 68 58 48 49 49 50 51 73 96 87 51 5 -40 -57 -46 -24 -3 -7 -12 8 29 50
6513 50 71 97 124 150 176 201 225 265 278 257 237 215 193 158 123 73 50 47 44 54 92 157 221 238 227 201 175 176 176 166 156 159 189 241 294 336 350 344
6496 344 338 301 237 166 123 112 100 121 188 270 324 328 304 266 229 169 109 80 79 92 105 108 83 50 17 11 33 53 46 28 10 9 8 7 6 21 36 51 66 93
6479 93 119 146 172 162 151 140 130 88 45 3 -38 -58 -77 -66 -27 32 91 151 211 209 179 166 152 146 140 134 128 69 10 -33 -22 -32 -41 -75 -109 -81 -52 -24
6463b4K7K7K7K6K7K5K6K5K6j7j7j6j7j4j4n7n7m8PK1K1RRJ0Rmlmlj6j5L1Q8O7J1n6n5l0k9
6446B3n2n4m3J2K6K7POPOLLO2O4K6k9p8p6n4JL5L5l1l0l1l1l0l0j5M1O2O1L8L8M6M8JJrj0
6428G6j0rM5M5M5M5j8j7j8j8j2j3j2j3K0K0qqj9j9M3M2J8l8l4l4k3k2qM8M7M6MLj3j3J5J5
6412A98K7K8K7K8opo2o1K6K6K3K2J2m4q7j15j07q0l6K0Q1Q1K8K9QPPQJ5J6J5J6KKLKL3L4k2
6395A97k2l7l6l7l6m5m6J0RK0K0J8K0K7K6K7K7K1K1jn7m5j7l5l5j2j1j1j1l7l6l7l6LLLLM7
6378a38M7M6M6POOPrqM7M6rrj0roonop5p5q8o0l0K5Q8Q7N7N6JKk4k3k4k4M8M6M8M7k7k7k8
6360D3k7non9o1l1l2N9N9Q0N3J4J4rqrrqrqrL6L5L4L4k3n1l5l5MLMLL0L0k6k6JKl4o0m6L8
6342e0R3O8J8j0MNppopNNMNl3l3l4l2opk0QL9O7O9M1OOKKJ7j0ONqqqqm0m0l9l8l6rK8K9Lk4
$$ plain form
6463 -24 3 30 57 83 110 135 161 186 212 195 178 162 145 131 117 60 3 -45 -38 -17 4 13 22 32 41 37 34 30 27 11 -4 27 115 182 193 137 82 52 23
6446 23 -29 -83 -126 -114 -88 -61 -54 -48 -41 -35 -32 -29 33 97 123 94 16 -60 -114 -113 -78 -43 -74 -104 -135 -166 -196 -226 -241 -200 -138 -77 -39 -1 45 93 94 95 86 76
6428 76 66 57 102 147 192 237 219 202 184 166 154 141 129 116 136 156 148 140 121 102 145 187 205 167 133 99 76 54 46 94 141 187 191 194 181 168 183 198
6412 198 225 253 280 308 302 295 233 172 198 224 247 269 281 237 150 35 -72 -152 -188 -168 -87 -6 22 51 59 66 73 81 96 112 127 143 145 147 150 152 185 219 197
6395 197 175 138 102 65 29 -16 -62 -52 -43 -23 -3 15 35 62 88 115 142 163 184 183 126 81 64 29 -6 -18 -29 -40 -51 -88 -124 -161 -197 -194 -191 -188 -185 -138
6378 -138 -91 -45 1 8 14 20 27 18 10 57 103 94 85 75 66 60 54 49 43 -32 -107 -195 -255 -285 -260 -172 -85 -28 28 29 31 7 -16 -40 -64 -16 30 78 125 98 71 43
6360 43 16 11 5 -54 -115 -146 -178 -119 -60 20 73 87 101 92 84 75 66 58 49 41 32 68 103 137 171 148 97 62 27 31 34 38 41 71 101 75 49 50 52 18 -42 -88 -50
6342 -50 43 111 129 119 123 128 121 114 108 101 106 111 115 120 87 54 20 -12 -18 -25 -45 -37 2 69 138 179 185 191 193 195 212 202 208 213 205 197 189 181 141 101 62 24 -12 -21 7 36 39 15
6321A5rqLNMNl0l0k9k9pK0N9N7M5J7k2k3j9k0j9j9n8n7p1m4K9N7M3M3K5K4K4K4J7J7J8J7O
6304H0POOPOOPl3l3l3l2j6j6L9M0%%%%M7M8M7M7j2j3j2j3QQj9o5o1j4J2J2NOONK3K3K2K3L6
6285B10L7j9j9n6n6k9J7L4j2l9l8J1J2J2J1K8K8k8k8OOOOJ4J4J4J4n2n1n0m8J5M2%m4n4qJ9
6268g5J9K2K2K1K2MNNMNNMNj3j4j3j3j9j9L6L6K3K3K3K3l6l6l5l5k2k1k2k1qpM7M8K3K4l1
6251Il0m9m8M3M4PQPPK%KJlmmnj5j6j6j6L7L6L6L6j6j7j7j6J4J5J4J5k9l0k8k9ONOOjjjjj9
6231e5j8j9j9K5K5K5K5J8J8M5kp6p6j4L3M1M0j2j1mmlmPOm5m6k8J8M8M7J2J1J3J2k7k7K8K8
6214C5KJKKk0k0k0k0M9N0M9N0ooN0N0N9N9MMj5j5j4j5q1q0q1q0ONO1O2OONOk8k9k9k9J8J8
6196G1l7l7j7j6L7L9jjj%j9j8j7j8RRJ0Qj1j1j2j1M9N1N0N1pqpp%%j8RK1k5n3n3J6J6J7J6
$$ plain form
6321 15 6 -2 1 6 10 15 -15 -45 -74 -103 -110 -90 -31 26 71 88 66 43 24 4 -15 -34 -92 -149 -220 -264 -235 -178 -135 -92 -67 -43 -19 5 22 39 57 74 80
6304 80 87 93 99 106 112 118 125 92 59 26 -6 -22 -38 1 41 41 41 41 41 88 136 183 230 218 205 193 180 188 196 177 112 51 37 49 61 66 72 78 83 106 129 151 174 210
6285 210 247 228 209 153 97 68 85 119 107 68 30 41 53 65 76 104 132 104 76 82 88 94 100 114 128 142 156 104 53 3 -45 -30 12 12 -32 -86 -94 -75
6268 -75 -56 -34 -12 9 31 35 40 45 49 54 59 63 68 55 41 28 15 -4 -23 13 49 72 95 118 141 105 69 34 -1 -23 -44 -66 -87 -95 -102 -55 -7 16 40 9
6251 9 -21 -70 -118 -75 -31 -24 -16 -9 -2 0 0 2 3 0 -4 -8 -13 -28 -44 -60 -76 -39 -3 33 69 53 36 19 3 17 32 46 61 32 2 -26 -55 -49 -44 -38 -32 -33 -34 -35 -36 -55
6231 -55 -73 -92 -111 -86 -61 -36 -11 7 25 70 68 -8 -84 -98 -65 -24 16 4 -7 -11 -15 -18 -22 -15 -9 -54 -100 -128 -110 -62 -15 -3 8 21 33 6 -21 7 35
6214 35 37 38 40 42 22 2 -18 -38 11 61 110 160 154 148 198 248 307 366 370 374 359 344 330 315 234 154 73 -7 -1 4 65 127 133 139 144 150 122 93 64 35 53 71
6196 71 34 -3 -20 -36 1 40 39 38 37 37 18 0 -17 -35 -26 -17 -7 1 -10 -21 -33 -44 5 56 106 157 150 142 135 128 128 128 110 119 140 115 62 9 25 41 58 74
6178G4K8K8k8k8l0l0k9l1j7j8j5j4M4R0P8N1J8j0MMJ2J3J3J2l8l8J7J7LLn0n0n1nK2K3l1n8
6161a7o7k2K5N2L8M0LMLMlmllJ%JJJ7J7J7J7L0L0K8K8j9m7k9J7O1O2%m5l9PL3L4NNNNj4j5
6142B63o7o7m9kK6K7ppopJ4J3j4j4J1J1O7O7LLK7K7Kn3k2k2k2k3k2k3j5j6j5j6k0k1k1j9K3
6125A4K4K5K4N3N4kkj%jjj5j6j5j6opo1o1l3l3K3K2M5M6K1l4m5m4m9m9J5J5J4J5J2J1J2J1
6108c5NNMNK2K2K3K3OPOPj8j7j7j8j7j6j8j7J%JJK1K1K1K1J4J3J3J3N1N2K7k9o4o4j2j2J3
6091F4J4j4j4l0l0K9Q6O7O7J5J5mmmmN3N3N3N3k4k4n1n2j8j7p3p3q7q7l2l2J3J2J3J3M9M8
6075D3j6o2o5l8jjLMLMK9L0k5k6k0k1L4L5K1K0K1K1J0J2J2J1NMNNJ7J8J7J7k7k8k7k8m5m6
6057g5RJ0K6K7K5K7l3l2l5l5k8n5o6k0M6M6M9M9L6L5j6j8J8M4N7J1PL4L1Mj2j1j3j3J7J7J7
$$ plain form
6178 74 102 130 102 74 44 14 -15 -46 -63 -81 -96 -110 -66 24 102 153 171 161 165 169 181 194 207 219 181 143 160 177 180 183 133 83 32 27 49 72 41 -17
6161 -17 -84 -106 -81 -29 9 49 52 56 59 63 60 56 53 50 51 51 52 53 70 87 104 121 151 181 209 237 218 171 142 159 220 282 282 237 198 205 238 272 277 282 287 292 278 263
6142 263 196 129 80 78 104 131 124 117 111 104 118 131 117 103 114 125 192 259 262 265 292 319 321 268 246 224 202 179 157 134 119 103 88 72 52 31 10 -9 14
6125 14 38 63 87 140 194 192 190 189 189 188 187 172 156 141 125 119 112 51 -10 -43 -76 -53 -31 14 60 81 47 2 -42 -91 -140 -125 -110 -96 -81 -69 -58 -46 -35
6108 -35 -30 -25 -21 -16 6 28 51 74 80 87 93 100 82 65 48 30 13 -3 -21 -38 -37 -37 -36 -35 -14 7 28 49 63 76 89 102 153 205 232 203 139 75 63 51 64
6091 64 78 64 50 20 -10 19 105 172 239 254 269 265 261 257 253 306 359 412 465 441 417 366 314 296 279 206 133 46 -41 -73 -105 -92 -80 -67 -54 -5 43
6075 43 27 -35 -100 -138 -139 -140 -137 -133 -130 -126 -97 -67 -92 -118 -138 -159 -125 -90 -69 -49 -28 -7 3 15 27 38 43 47 52 57 74 92 109 126 99 71 44 16 -29 -75
6057 -75 -66 -56 -30 -3 22 49 16 -16 -51 -86 -114 -169 -235 -255 -209 -163 -114 -65 -29 6 -10 -28 -10 34 91 102 109 143 174 178 166 155 142 129 146 163 180
6041A80J7j4j4j4j4m9m8m5m6RN5L0K9K0K0K0K0o5o5l7RJ7j0nK1L4O2P4K8n2n2JJk9k9k8k9
6025Bn5n6jjL5L5L6L4MMMMkkkkj7j6k9jM4R1Q1N3K8Jm1m1j4j5j4j5ONn0n1qqM7M7P6P7J2l4
6006B51m3j5K2K2k5k5k4k5qpqpK3K2K3K2L0L0M3J5p0j16j03p5k1M4O3O5kkkkL9L9L5L6Ql9
5990B13o8o8K1K1K1K0%%n5n5n4n4n4n4rqM8M7M5M4M5M5mnnmJJJ%j0j1j0j1rqrqK5K5K5K4Q9
5971A88Q9L3l2n4n4n8n8m5m4JKM0M2J4j3lN3P8N1ln8m4j6J1J1J2J3mlmll9m0l9l8k8k8k4k4
5954a18J7P2N6K9nnopk9k9k9k9J4J4J5J4JJJJk0k0k0k0KKLKK8K8L7O4N8Kk9k9j6j7J8P2J09
5936B32J10O1Nk5k6k9k9o1o1o0o1j2j2j3j2J7J6J7J7l2l2l1l2JJJJL2L2L3L2j0j0n7n5ppp
5920g3pj3j2L3L4M2M4J7J6j3j4j3j3mllmK6K6K4K4rl6k0j9K0M7L0L1Qk0mmpqpql0l0l0k9m3
$$ plain form
6041 180 197 183 169 155 141 92 44 -1 -47 -38 17 47 76 96 116 136 156 91 26 -11 -2 15 5 0 21 55 117 191 219 167 115 116 117 88 59 31 2
6025 2 -53 -109 -110 -111 -76 -41 -5 29 33 37 41 45 43 41 39 37 20 4 -25 -26 18 109 190 243 271 272 231 190 176 161 147 132 138 143 93 42 34 26 73 120 196 273 285 251
6006 251 208 193 215 237 212 187 163 138 130 123 115 108 131 153 176 198 228 258 301 316 246 130 27 -48 -69 -25 38 103 101 99 97 95 134 173 208 244 252 213
5990 213 145 77 98 119 140 160 160 160 105 50 -4 -58 -112 -166 -175 -183 -135 -88 -43 1 46 91 87 82 77 73 74 75 76 76 66 55 45 34 25 17 8 0 25 50 75 99 188
5971 188 277 310 278 224 170 112 54 9 -35 -34 -32 8 50 64 51 48 101 179 230 227 169 125 109 120 131 143 156 152 149 145 142 103 63 24 -14 -42 -70 -94 -118
5954 -118 -101 -29 27 56 51 46 40 33 4 -25 -54 -83 -69 -55 -40 -26 -25 -24 -23 -22 -42 -62 -82 -102 -100 -98 -95 -93 -65 -37 0 64 122 124 95 66 50 33 51 123 232
5936 232 342 403 408 383 357 328 299 238 177 117 56 44 32 19 7 24 40 57 74 42 10 -21 -53 -52 -51 -50 -49 -17 15 48 80 70 60 3 -52 -59 -66 -73
5920 -73 -80 -93 -105 -72 -38 4 48 65 81 68 54 41 28 24 21 18 14 40 66 90 114 105 69 49 30 50 97 127 158 166 146 142 138 131 123 116 108 78 48 18 -11 -54
5902e4m4LLK5K6K5K4L7L7L5L5K6lJ3J4j3j2j2j2ONj1J6Rj9jkJ6J6J6J6O5O5N2K3%k8o2q9r9
5884A47p1m0l9j4J4N9O0K3k3k5k4j5j5j7j6l6o5o2l5j8J0M2M3M2M3K5N2N3K4k5n3k5k3k4k4
5869e2j3J4M6P3P9N1J1l6n1n1k4Mk4k5k2k3k5k6l9j1M3P0P1M5J8J8J6J6j3j2j3j3QQQQL1L0
5853A95L0L1j3j4j3j3nnnnn1n0n1m9n4n3l3J3P5P4L2L2MMk4k4l0l2J4J4N9O0L2L2JKo2r0p0
5836d2pN3K6k8k7J6J6K3K4k3k2J4J4M0M1N5K7l0p7p6m7kklmmlJ6J7J5J7l1l2l2l3J2J2J2J1
5819f4kkkkkkkkPOOPN3N3j1j1j7j6K8N7O7K0l7o4m5j6j5m3l6J0K9K9N4N5N5N5j4j4j3j4j8
5801A27j9j8j8J1J2J1J2rqrrK6K7K6K6JKKKnnnnk9l0k9k9KLKLj1j2J7J6l2l2J4J4K5K6K2K2
5782A37L5k0n4n4j6j6j5j6j0j1N0N0M0j6l1l0K2K2N0N0j0j0l8l7poL9M0L1L1l1l0j5M0P0P1
$$ plain form
5902 -54 -98 -95 -92 -67 -41 -16 8 45 82 117 152 178 175 188 202 189 177 165 153 159 164 153 169 178 159 158 156 172 188 204 220 285 350 402 425 425 397 335 246 147
5884 147 76 36 -3 -17 -3 56 116 139 116 91 67 52 37 20 4 -32 -97 -159 -194 -212 -202 -160 -117 -75 -32 -7 45 98 122 97 44 19 -4 -28 -52
5869 -52 -65 -51 -5 68 147 198 209 173 122 71 47 51 27 2 -20 -43 -68 -94 -133 -144 -101 -31 40 85 103 121 137 153 140 128 115 102 110 118 126 134 165 195
5853 195 225 256 243 229 216 203 198 193 188 183 132 82 31 -18 -72 -125 -158 -145 -70 4 36 68 72 76 52 28 -2 -34 -20 -6 53 113 145 177 178 180 118 28 -42
5836 -42 -49 4 30 2 -25 -9 7 30 54 31 9 23 37 77 118 173 200 170 93 17 -30 -32 -34 -37 -41 -45 -48 -32 -15 0 17 -14 -46 -78 -111 -99 -87 -75 -64
5819 -64 -66 -68 -70 -72 -74 -76 -78 -80 -73 -67 -61 -54 -1 52 41 30 13 -3 25 82 149 169 132 68 23 7 -8 -51 -87 -77 -48 -19 35 90 145 200 186 172 159 145 127
5801 127 108 90 72 83 95 106 118 109 101 92 83 109 136 162 188 189 191 193 195 190 185 180 175 146 116 87 58 60 63 65 68 57 45 62 78 46 14 28 42 67 93 115 137
5782 137 172 152 98 44 28 12 -3 -19 -29 -40 10 60 100 84 53 23 45 67 117 167 157 147 109 72 65 59 98 138 169 200 169 139 124 164 234 305
5767C05K5l1q0q1q8n9k4L2O0O1J9J9qqqpl5l5l5l4J7J8J8J8L0K9L0L0j%j%k0k0k0k0K0J9J9
5750A54K0l2l3l2l2p5p7m3J3jkLKL7L7L8L6O1O0NNk1k2k1k2j5j5j4j4L2L4L3L4NNONkjkkm
5732A43nnnJ6J6J6J6ooook2k2k2k2JJJJK3K3K3K3KJn4n3k7k8O4O3Q0N2Om9m7m7k5L1N7Q5J02
5714C89M7ol4n3KL0K9L4L3LLLLL6L6L6L5M3M3M2M3R6R6J02J02J25K18L06M35O07P72R97J310
5699E963J559J357O08m43j250j491j324j047p89n86m54l62k57k02j29p4m9m9m6m6q0q1k5k5
5689F78j7j6j7j7o4o5o4o4l0k9l0k9L2L2L3L2j1j2j1j1j4j3j4j3l6l5l5l6RQO4O4J2J1J2J2
5673C16j2j1j2j2qqqqo4o3l4J2K8K7L1L1K2K2l4l3klkkk4k5k4k4NMNMl6l7J9J9j9j9j9j8j0
5655b6j0j0j0OPL5P9P7N0J2J3OOOPRRRRK4K4l2l1k1k0k1k1m4m5m5m5j6j8j7j7l8l7n0k3K5
$$ plain form
5767 305 330 299 219 138 50 -9 -33 -1 59 120 139 158 150 142 134 127 92 57 22 -12 5 23 41 59 89 118 148 178 177 177 176 176 156 136 116 96 116 135 154
5750 154 174 142 109 77 45 -30 -107 -150 -137 -138 -140 -137 -135 -98 -61 -23 13 74 134 139 144 123 101 80 58 43 28 14 0 32 66 99 133 138 143 149 154 152 151 149 147 143
5732 143 138 133 128 144 160 176 192 186 180 174 168 146 124 102 80 81 82 83 84 107 130 153 176 178 179 125 72 45 17 81 144 224 276 282 233 186 139 114 145 202 287 389
5714 389 436 430 396 343 345 375 404 438 471 474 477 480 483 519 555 591 626 669 712 754 797 893 989 1091 1193 1318 1536 1842 2277 2884 3656 4653 5963
5699 5963 7522 8879 9487 9044 7794 6303 4979 3932 3143 2557 2103 1741 1484 1282 1153 1079 1030 981 935 889 809 728 703 678
5689 678 661 645 628 611 547 482 418 354 324 295 265 236 268 300 333 365 354 342 331 320 306 293 279 266 230 195 160 124 133 141 205 269 281 292 304 316
5673 316 304 293 281 269 261 253 245 237 173 110 76 88 116 143 174 205 227 249 215 182 180 177 175 173 149 124 100 76 81 85 90 94 58 21 40 59 40 21 2 -16 -26
5655 -26 -36 -46 -56 -50 -43 -8 71 148 198 210 223 229 235 241 248 257 266 275 284 308 332 300 269 248 228 207 186 142 97 52 7 -9 -27 -44 -61 -99 -136 -186 -209 -184
5638a84P1J02J00N5N5jjj8j8m6m6n3n3KKk4k4l6qK7Q2J19R3K7k7m2j4NMm9m9j5j4M1M1K7K7
5622A58k9k8l9l9N3N3M6M5j0j1pqpq%J%Jk1k1k1k2NNk3k2l3l1K1K3OOk3k1KLKLL1L2MLk9k9
5603B1K6K7PPk0k1l5l4m4p1r3l8K8Q3J13J12Q9L3Kn5q2q1n5n4%JJ9J9J9J9k2k1k2k2K8K7K8
5587f2K8N4N5%%j9k0RQM7M6M7M6jjn7n7k7k8k7k8L6L6L6L6L0L0L0L1MNNNk1k2k1k1j8j8j8
5570A58j8L5L4Nm1m9n0LKRQQRJ2J1J2J2k6k6k6k5j1j1j1j1l6l8J8J8L4L5L5L5KLKKm2m2j3
5552B6L3M1M0M3M3K9L0k7k6j2j3j3j2rrrj0pqpqooK2K2N8N8K8j8n4n5n7n8m3m1J2J3M3M4M4
5535A21M4K3K4K4K4LLLLm3m3m3m3j0j0o3o1j9K7L0K8J4J5J5J5j6j5J3J2K2K1pokkK5K6QRN1
5518B20N1K5l1o4o4m0l9K5N2L0k6p3p1k0L5Q5Q4M6j0k5k5l6l6l6l6k3k4L9O7P5J9j3j2qpK1
$$ plain form
5638 -184 -113 -11 89 144 199 198 197 179 161 115 69 16 -37 -35 -33 -57 -81 -117 -125 -98 -16 103 196 223 196 154 140 145 149 100 51 36 22 63 104 131 158
5622 158 129 101 62 23 76 129 175 220 210 199 192 184 177 169 169 170 170 171 150 129 108 86 91 96 73 51 18 -13 8 31 37 43 20 -1 1 4 6 9 40 72 76 79 50 21
5603 21 47 74 81 88 68 47 12 -22 -66 -137 -230 -268 -240 -157 -44 68 157 190 192 137 55 -26 -81 -135 -135 -134 -115 -96 -77 -58 -80 -101 -123 -145 -117 -90 -62
5587 -62 -34 20 75 75 75 56 36 45 53 100 146 193 239 238 237 180 123 96 68 41 13 49 85 121 157 187 217 247 278 282 287 292 297 276 254 233 212 194 176 158
5570 158 140 175 209 214 173 124 74 77 79 88 96 104 113 125 136 148 160 134 108 82 57 46 35 24 13 -23 -61 -43 -25 9 44 79 114 116 119 121 123 81 39 26
5552 26 59 100 140 183 226 255 285 258 232 220 207 194 182 173 164 155 145 138 130 123 115 109 103 125 147 205 263 291 273 219 164 107 49 6 -35 -23 -10 33 77 121
5535 121 165 188 212 236 260 263 266 269 272 229 186 143 100 90 80 17 -44 -63 -36 -6 22 36 51 66 81 65 50 63 75 97 118 111 105 103 101 126 152 160 169 220
5518 220 271 296 265 201 137 97 58 83 135 165 139 66 -5 -25 10 95 179 225 215 190 165 129 93 57 21 -2 -26 13 80 155 174 161 149 141 134 155
5502A55K0QQQQnmnmQQk0k0p5p4p2p3m0j3M2R7J15J15O4Ql6r1j24j24o3qM5M4N3N2N3N3mml1
5485G4l1k2k1M3M3N1N1j4j3k7k6k6k7K7K6K7K6k3k4k4k3k3k3K3K3N0N0J7l9q2q1n2LM2M0j
5469A4km6m7k6J9L1L2j2j2l2l1nmM1M1Q5Q7O1O0k3k3l5l5J0J1LMk4k4k5k5k5k4l0l1mlrrJ9
5452d8J8K8K6K7K8K7K8j8j8K1K0pol2l2l2l0j5j5J3J3O5O5K9j8l1lpl4p3p4PPL5L6L5L6%%
5435G1%%KJk6k5j9j8QQNMNMM7M7j8j8j1j1L5O3P6L1m1m0j2L3N4N4M5M5k0k0o5o6o3o2ON3M4
5417B06J6ML3M2M3K9K8K7j9m7m6ONmnl2l2j9j8j9j8m3m2J2J3K8K7N2N2J9l6l2l3k0j9k0k0
5401A18MMMMl1l0l0l0j8j8j9j8K4K5K3K5j9j8j9k0k0k0k0k0N7N6N5N6M2M1M1M1j1j2j2j2l1
5385A92l1l1l1pppoj2j1M4M5N5N6%Jj0j0j1j0l8l8o3o3j6L6O2O2ppppj2j2j2j2k3k3k4k2J4
$$ plain form
5502 155 175 183 191 199 207 202 198 193 189 197 205 185 165 90 16 -56 -129 -169 -182 -140 -43 72 187 251 259 223 132 8 -116 -179 -187 -142 -98 -45 7 60 113 109 105 74
5485 74 43 21 0 43 86 137 188 174 161 134 108 82 55 82 108 135 161 138 114 90 67 44 21 44 67 117 167 184 145 63 -18 -70 -67 -25 15 14
5469 14 12 -34 -81 -107 -88 -57 -25 -37 -49 -81 -112 -117 -121 -80 -39 46 133 194 254 231 208 173 138 148 159 162 166 142 118 93 68 43 19 -11 -42 -46 -49 -58 -67 -48
5452 -48 -30 -2 24 51 79 106 134 116 98 119 139 132 126 94 62 30 0 -15 -30 -17 -4 61 126 155 137 106 103 96 62 -11 -85 -78 -71 -36 0 35 71 71 71
5435 71 71 71 73 74 48 23 4 -14 -6 2 7 11 16 20 67 114 96 78 67 56 91 154 230 261 220 180 168 201 255 309 354 399 379 359 294 228 165 103 109 162 206
5417 206 222 226 259 301 344 373 401 428 409 362 316 322 327 323 318 286 254 235 217 198 180 137 95 107 120 148 175 227 279 298 262 230 197 177 158 138 118
5401 118 122 126 130 134 103 73 43 13 -5 -23 -42 -60 -36 -11 12 37 18 0 -19 -39 -59 -79 -99 -119 -62 -6 49 105 147 188 229 270 259 247 235 223 192
5385 192 161 130 99 92 85 78 72 60 49 93 138 193 249 249 250 240 230 219 209 171 133 70 7 -9 27 89 151 144 137 130 123 111 99 87 75 52 29 5 -17 -3
5368cJ4J5J4L1L1L1L0ooool1l2l1l1K0K0K0K0M7M7M7M6JJn1n1l8J7M1M1qqqqm1m0p2j6M2M1
5350A24M5M4K5K4l0l1n6n6k8k9j2j3j1j3L8L8L9L9mllmj6j5J2J1J1J0m5m6m1m0J4J4RJ1j7
5334ej8m4m5k1L5L8L9M1M3L9L9j6j6J9J8J9J8JKL0k5n2q0q1n4JL0J5J6K3K4K4K4K0K1K2K2
5318A66L6O4N1mr2r2l6K0M5J7l6o4n1NO4O5%%k7k8j2j2j2j2jjK7K7P5P5J4m2n3n3k9k9K1K1
5301A07K1K1POQRJK9N1j3n8l0nl2p6m8L2P9O1mk1k0rrJ7J7ll1m1NN6N6LLl9l9j1j1j6j6j6
5283D1j6PQQPK0K0l3l2mM3N8L0ql6k0K6M5M6ppl5l5l5l5j3j3j3j3J1J2J2J1rrrrK5K5K5K5
5266A14N3N4K5K6L3L3Om1o5l7%%k1k0QQnmnmj4j3j4j4kk%%ML1M4kl7rM7P5O4L6J4j3m7m7O
5247B65Ppopok4k4k3k4k4k3k4k3K5K5K3K3j1l8m9lK2K3K5K5KLKK%J%JJ7J7j0j0n0n0k1K4M9
$$ plain form
5368 -3 11 26 40 71 102 133 163 157 151 145 139 108 76 45 14 34 54 74 94 141 188 235 281 282 283 232 181 143 160 201 242 234 226 218 210 169 129 57 41 83 124
5350 124 169 213 238 262 232 201 145 89 61 32 20 7 -4 -17 21 59 98 137 133 130 127 123 107 92 104 115 126 136 91 45 4 -36 -22 -8 1 12 -5
5334 -5 -23 -67 -112 -133 -98 -60 -21 20 63 102 141 125 109 128 146 165 183 184 186 216 191 139 59 -22 -76 -75 -45 -30 -14 9 33 57 81 101 122 144 166
5318 166 202 266 317 313 221 129 93 113 158 175 139 75 24 29 93 158 158 158 131 103 91 79 67 55 54 53 80 107 182 257 271 229 176 123 94 65 86 107
5301 107 128 149 156 162 170 179 180 209 260 247 189 159 154 122 46 -2 30 109 170 166 145 125 116 107 124 141 138 107 66 71 127 183 186 189 150 111 100 89 73 57 41
5283 41 25 32 40 48 55 75 95 62 30 26 69 127 157 149 113 93 119 164 210 203 196 161 126 91 56 43 30 17 4 15 27 39 50 41 32 23 14 39 64 89 114
5266 114 167 221 246 272 305 338 344 303 238 201 201 201 180 160 168 176 171 167 162 158 144 131 117 103 101 99 99 99 103 134 178 176 139 130 177 252 316 352 366 353 306 259 265
5247 265 272 265 259 252 246 222 198 175 151 127 104 80 57 82 107 130 153 142 104 55 52 74 97 122 147 149 152 154 156 156 157 157 158 175 192 182 172 122 72 51 75 124
5229A24K1k5p1p9n2PL4M3M5J9J9QRQRL1L2MMm6m7J8O4O5L8k1m9k2k3LMM4M4M5M4K3K3l2l3
5212C32m2m1J3J3L1L1k5k4k5k4k6k6m6p3q3l7QQJ1J0l7l8l7l8K1K2K1K1K3K3P7P9N7N6K9K9
5196B93j3j3j3j3N1N0nnk6k7k7k7k3k3k3k3k3k3k3k3l0k9k9l0J5J4J4J4M5M6M5M6K5K5K5K5
5181B62m4m3m4m3J4J4J5J4j2j2j2j3MLN6N6K0k6k8k8l8l8l9l8l5l6K0J9L2L2L2P9Q6N8%k7
5165B60mmoom2m2m2m1m1l9m0m0LLL0L1L2L3k3k2K5K6jkm4m2J2J2J7J7j0j0j9k0QPJ0J0j8j8
5148d0M3M3M1M0Km4l3mJ1L9K5K5K5K5k9l0OOL5L4OOOOMNn1n1l5l5l5l4m4m5j5L1M9M8J3j6
5130C3j8j8k0k0J6J5J4J5L9L9N3K5k2n0n2k5J6J5l6l5K2O8O9K2MNJJlmllK0K0K1K0mll2l1
5113A74m8m8j8K8N9N8K2ok3k2k5k4opopJ%J%j6j7j6j7J2J2K7%ook3NL8L7L8L7j3m0k5k5j6
$$ plain form
5229 124 145 120 49 -30 -82 -75 -41 2 47 66 85 93 102 110 119 150 182 186 190 144 97 115 179 244 282 261 212 190 167 170 174 218 262 307 351 374 397 365 332
5212 332 290 249 262 275 306 337 312 288 263 239 213 187 141 68 -15 -52 -44 -36 -25 -15 -52 -90 -127 -165 -144 -122 -101 -80 -57 -34 43 122 179 235 264 293
5196 293 280 267 254 241 292 342 337 332 306 279 252 225 202 179 156 133 110 87 64 41 11 -18 -47 -77 -62 -48 -34 -20 25 71 116 162 187 212 237 262
5181 262 218 175 131 88 102 116 131 145 133 121 109 96 100 103 159 215 235 209 181 153 115 77 38 0 -35 -71 -51 -32 0 32 64 143 229 287 287 260
5165 260 256 252 246 240 198 156 114 73 32 -7 -47 -87 -84 -81 -51 -20 12 45 22 0 25 51 50 48 4 -38 -26 -14 3 20 10 0 -19 -39 -31 -24 -14 -4 -22 -40
5148 -40 3 46 87 127 129 85 52 48 59 98 123 148 173 198 169 139 145 151 186 220 226 232 238 244 248 253 202 151 116 81 46 12 -32 -77 -92 -61 -12 36 49 33
5130 33 15 -3 -23 -43 -27 -12 2 17 56 95 148 173 151 101 49 24 40 55 19 -16 6 74 143 165 169 174 175 176 173 169 166 163 183 203 224 244 240 237 205 174
5113 174 126 78 60 88 147 205 227 221 198 176 151 127 121 114 108 101 102 102 103 103 87 70 54 37 49 61 88 88 82 76 53 58 96 133 171 208 195 155 130 105 89
5095H9j5j5j5m1l9l8l8KK9J6J6N6Q5N7K9QQl3o1l5l4rrJ7J6J8J8J0L9L8J1K1K1J9K0m7m6m3
5079A25m2pM8J8J7J9K0J9J9J9K0N0nn8n9j12j10q8NQ2Q1LMLLk3k3k3k2k2k2k3k2N5N3N4N4
5063A10J1J2J1J2QQm4m4j4M1J0J0jkjkj1j1j2j1J3J3m2m3j0j1j0j1K4K5K5K5K5K4K5K5K5K5
5046B27K4K5JJ%JooooKKLKj5j5j5j5n8n8kllmmlK0K0K0K0n1n0NNKKKKM3M4j2j2kkjkn9n8l3
5025b8K1L7L8M1M1j2j2j2j2LMm9m9l5J1L9M0MNMNL9L9L9L9M3M3J3l2q0q0o4%N5N5on2j7J2
5008A30ppJ2J3J3J3k7k7rl6o5j8M4M6LMLMlllk%JJJl2l1lM2P2M5j3l9J3M2L8J0ol4k0k1j4
4990A30j3m2NM9K2m9m9l1J5M4M4j5j5j5j5n0m8n0n0k8k9k6k6L6Q3P3M4L2L4L1L1J0RJ0Rm8
4974A12m8m8m7qql4J2O6O5J4J3l0l0l0l0j8j8j7j8K3K4K3K4L4L5L5L5J8J8J8J8j2j2j2j2L6
$$ plain form
5095 89 74 59 44 3 -36 -74 -112 -110 -81 -65 -49 7 92 149 178 186 194 161 100 65 31 22 13 30 46 64 82 92 131 169 180 201 222 241 261 214 168 125
5079 125 83 76 124 142 159 178 198 217 236 255 275 325 320 262 203 91 -19 -107 -102 -20 61 64 68 71 74 51 28 5 -17 -39 -61 -84 -106 -51 2 56 110
5063 110 121 133 144 156 164 172 128 84 70 111 121 131 130 128 127 125 114 103 91 80 93 106 64 21 11 0 -10 -21 3 28 53 78 103 127 152 177 202 227
5046 227 251 276 277 278 278 279 273 267 261 255 257 259 262 264 249 234 219 204 146 88 86 83 80 76 72 69 89 109 129 149 98 48 53 58 60 62 64 66 109 153 141 129 127 125 124 122 63 5 -28
5025 -28 -7 30 68 109 150 138 126 114 102 105 109 60 11 -24 -13 26 66 70 75 79 84 123 162 201 240 283 326 339 307 227 147 83 83 138 193 187 135 118 130
5008 130 123 116 128 141 154 167 140 113 104 68 3 -15 29 75 78 82 85 89 86 83 80 78 78 79 80 81 49 18 15 57 129 174 161 122 135 177 215 225 219 185 165 144 130
4990 130 117 75 80 129 151 102 53 22 37 81 125 110 95 80 65 15 -33 -83 -133 -161 -190 -216 -242 -206 -123 -50 -6 26 60 91 122 132 141 151 160 112
4974 112 64 16 -31 -39 -47 -81 -69 -3 62 76 89 59 29 -1 -31 -49 -67 -84 -102 -79 -55 -32 -8 26 61 96 131 149 167 185 203 191 179 167 155 191
4958A91L6L4L3j5o1n1k4OOPPj8j8j8j8NNNMNNNNJ4J4J3J4k5k6k5k6%jjjj8j8j8j8k5k6JM7
4940A1P4M7j2l9l6l7rj0K9L1L1L1m2m2m1m2%%l6o3l8K7P9P8N1PMML8L8L8L8m3m3n6k8K9P6
4923A44O5L7K8%m1m1m1m1j3j4JJK8K8OOOPK3K4K3K2j5m2m0j3qK0K1pl9l8m1m1jkjkJ8J8J7
4905F2J6J8j0m7m7m7k0J9J9J5j3m8m8m1K4M3M4K7K7M1J5nok3NNOPPj0j1j0j0OOK1oo1o2n0
4888a42k3j4J2N5N4N0N0M8M8P3M5j6m4l2l2NL4L4L4L4L4j6m3k7k8n0n0n0m9k4k4k2k2kK6L9
4873c5L7prK9N7P4M7j2m1k8k8J1L7L8L7jk8m9m8k2k3%JN3N4M1J4j0l9l2l3mnK3N1K3ml4l3
4856A02mK3M6M7O2L5j7m5l0l1j1j0j0j1pqNL2M8M8j5j5RRll1k4k5KJllK2K3ll0m1m1j4J4M3
4838A39M3ql6l5qJJk5k5l2l1J5M2N6K8%%qqqpl2l1l1l1j9j8l4oK1K2K2K2nl3j8j7j0rqqLK9
$$ plain form
4958 191 227 261 294 279 218 167 143 149 155 162 169 151 133 115 97 102 107 112 116 121 126 131 136 150 164 177 191 166 140 115 89 89 88 87 86 68 50 32 14 -11 -37 -36 11
4940 11 85 132 120 81 45 8 -1 -11 18 49 80 111 69 27 -14 -56 -56 -56 -92 -155 -193 -166 -87 -9 42 49 53 57 95 133 171 209 166 123 67 39 68 144
4923 144 209 246 274 274 233 192 151 110 97 83 84 85 113 141 147 153 159 166 189 213 236 258 243 201 161 148 140 160 181 174 135 97 56 15 14 12 11 9 27 45 62
4905 62 78 96 86 39 -8 -55 -75 -56 -37 -22 -35 -83 -131 -172 -148 -105 -61 -34 -7 34 49 44 38 15 20 25 31 38 45 35 24 14 4 10 16 37 31 -30 -92 -142
4888 -142 -165 -179 -167 -112 -58 -8 42 90 138 211 256 240 196 164 132 137 171 205 239 273 307 291 248 221 193 143 93 43 -6 -30 -54 -76 -98 -100 -74 -35
4873 -35 2 -5 -14 15 72 146 193 181 140 112 84 95 132 170 207 206 178 129 81 59 36 36 37 90 144 185 199 189 150 118 85 81 76 99 150 173 169 135 102
4856 102 98 121 167 214 276 311 294 249 219 188 177 167 157 146 139 131 136 168 216 264 249 234 243 252 249 218 194 169 171 172 169 166 188 211 208 178 137 96 82 96 139
4838 139 182 174 138 103 95 96 97 72 47 15 -16 -1 41 97 125 125 125 117 109 101 94 62 31 0 -31 -50 -68 -102 -108 -87 -65 -43 -21 -26 -59 -77 -94 -104 -113 -121 -129 -126 -97
4819i7N9N8N4K6J4J4J1J0J1J1qpqpk3k3k2k1nK4QQppK1M9L5j1j1j1OOk0k0k6LL3L3L7L8rr
4801B17l6l6q2q2n4n4qrL0L0L0L0K9K9L0K9K6K6K6K6qqqqj2j1j2j1PPPPo9o9o4o6LN8K7K7
4784fM8M9K2K1l7l7RRL3L4l2l1m0m0K5K4N3N3K5K5mllmmmK4K3J4J4m7m7m7RM2M2K3K3K3K2
4766C03K0K0k6k6m5m5j8j7l3l2n7n6l7J7N0N1L3L2L3L3l1l1l1l1j9j9k0j8J4J5J5J5JKKJK9
4750I4K8P1P2N0nk0k0kkl9o6l6J0L8L8j2j3j2j2kkkkj5j5j4j5k2k2k2k2jjjjj6j7j7j7j4j4
4733i2j4j4OPPPK3K4K4K3JJKJM6M6J9J8J5J5l8l9lK4Rl7n5k7QRKKMMNL3M3kl8l8l9m1J4J5
4713b0J4J3klK5K5M3M2j3j3k3k3MNllllJ2J1J1J2k7k6k5k5n0k3K6P1O0L3J1j6n7n7llK5K6
4696D8kjRJ0RJ0k7k7k6k6J7J6J7J7k9k7K5K7RQL7L6M3M2J4l3p7p7n2n2m8m8j9K8O0O0L4L5
$$ plain form
4819 -97 -38 20 74 100 114 128 139 149 160 171 163 156 148 141 118 95 73 52 47 71 79 87 80 73 94 143 178 167 156 145 151 157 137 117 91 94 127 160 197 235 226 217
4801 217 181 145 63 -19 -73 -127 -135 -144 -114 -84 -54 -24 5 34 64 93 119 145 171 197 189 181 173 165 153 142 130 119 126 133 140 147 78 9 -55 -121 -118 -60 -33 -6
4784 -6 42 91 113 134 97 60 69 78 111 145 113 82 42 2 27 51 104 157 182 207 203 200 197 193 189 185 209 232 246 260 213 166 119 128 170 212 235 258 281 303
4766 303 323 343 317 291 246 201 183 166 133 101 44 -12 -49 -32 18 69 102 134 167 200 169 138 107 76 57 38 18 0 14 29 44 59 60 62 64 65 94
4750 94 122 193 265 315 310 290 270 268 266 227 161 125 135 173 211 199 186 174 162 160 158 156 154 139 124 110 95 73 51 29 7 6 5 4 3 -13 -30 -47 -64 -78 -92
4733 -92 -106 -120 -114 -107 -100 -93 -70 -46 -22 1 2 3 5 6 52 98 117 135 150 165 127 88 85 109 118 81 26 -1 7 16 18 20 24 28 33 66 109 107 69 31 -8 -49 -35 -20
4713 -20 -6 7 5 2 27 52 95 137 124 111 88 65 69 74 71 68 65 62 74 85 96 108 81 55 30 5 -45 -68 -42 29 89 122 133 117 60 3 0 -3 22 48
4696 48 46 45 54 64 73 83 56 29 3 -23 -6 10 27 44 15 -12 13 40 49 57 94 130 173 215 229 196 119 42 -10 -62 -110 -158 -177 -149 -89 -29 5 40
4680D0MMMMK4K4mln9n8l0J7M0M2j1j1K3K4K4K3JJJ%k0k0k0k0J2J2J1J2L7L7L7L7j9j8j8j8
4662A66j2j1j1j1J6J6J7J6l2l2l2l2L0L1L0L0l2l2l2l2L1L1L1L1qqrqJKJJjkK6K6RQm7m7m0
4645G9m0l9l9l9l9m0l9M7M8M7M7J9K0l2l3j9K6N5N6j3j4j4j4l3l3l0l0K5P9M9N0J3J3j0j1
4629A12k2L3Q2Q1M3j3m3m3kN2K5l0n4n4K5K6l6l5l5l5KKKKllmlMLMLj1j2j1j2POPOn2n2J2
4611b6J2J1J0J1J1ppL6L6jn6k5k4RQQQL0K9N4N3N6%n1n2J2J1j5j6n9n9m2J2Q2Q3P2J7k1k1
4594A89MLj8j9o1o1k7K7M3M3J7J8J7J7L5L4L1L1no2p6p6m2m2MLL1L0LLMLk4k5noM0M1M7M7
4576B16K0K0l7l7q0q0o2j7L7L6J1l5k4LLMNOK3K4jjPN3O9O9J0n4o1l4j0rqrL1L2Lk4rL7N6
4559A83N6LMMMk6k6o9o9j0L6N3N3pn3p3p2l3l3l1l0K5P2M4M5K3K2K2K2K2K2k5k4m2m2K3K3
$$ plain form
4680 40 44 48 52 56 80 104 100 97 38 -20 -50 -33 7 49 38 27 50 74 98 121 122 123 124 124 104 84 64 44 56 68 79 91 128 165 202 239 220 202 184 166
4662 166 154 143 132 121 137 153 170 186 154 122 90 58 88 119 149 179 147 115 83 51 82 113 144 175 167 159 150 142 143 145 146 147 146 144 170 196 205 213 166 119 79
4645 79 39 0 -39 -78 -117 -157 -196 -149 -101 -54 -7 12 32 0 -33 -52 -26 29 85 72 58 44 30 -3 -36 -66 -96 -71 8 57 107 120 133 123 112
4629 112 90 123 205 286 329 316 273 230 228 280 305 275 221 167 192 218 182 147 112 77 79 81 83 85 82 79 75 72 76 79 83 86 75 63 52 40 47 53 60 66 14 -38 -26
4611 -26 -14 -3 7 18 29 22 15 51 87 86 30 5 -19 -10 -2 6 14 44 73 127 180 236 236 185 133 145 156 141 125 66 7 -35 -23 59 142 214 231 210 189
4594 189 193 196 178 159 98 37 10 37 80 123 140 158 175 192 227 261 292 323 318 256 180 104 62 20 24 27 58 88 91 94 98 101 77 52 47 41 81 122 169 216
4576 216 236 256 219 182 102 22 -40 -57 -20 16 27 -8 -32 -29 -26 -22 -17 -11 12 36 35 34 41 94 163 232 242 188 127 93 83 74 66 57 88 120 123 99 90 127 183
4559 183 239 242 246 250 254 228 202 133 64 54 90 143 196 189 136 63 -9 -42 -75 -106 -136 -111 -39 5 50 73 95 117 139 161 183 158 134 92 50 73 96
4543I6OOj2J5L5j2o6o7l6l7l4l4rL7P6P5M8M7j8j7l6l7K8K9K4K5K5K4P5P4J7k9m8m8k4k3O
4527A81POPJ2J2J3J2J2J2RRj5p1o8j3J5M3L0L1k0k0k0k0ooooK7K7K7K7k6k6q1q1p3p3j9j8
4510a49L5L5L5L5J4J5J5J5K9K9K9K9MNMNl9l8J6J7k0k0QPkll1l0j9k0j8k0M3M4j1j1m1m2j4
4493f0j4j0j1J8J7O3O4RRRRRJ0QPQQJ3J3j4j5o1o1onL7L8j8j7k4k3L1L2klllJ5J5J5J5j8j7
4474H7j7j8k9k8m1j3N5J10J10N6j9m7nM2N3N3J7j2m0m1m0m1k3NK7N4O6L8J6j2l2l2noJ%k7
4458B62k7k5k6JJj7m4k7k6QL6K1K1nnnmL3L3L2L1L8J1j2m0n2k4J4J4m1m1jK7K5K5K7K7JKj6
4441B52J2J4j4m9m9m5JK7K7l7q2p2m5JJj3J5L4L3kk8l6qM9P5Q6L9k6k6pqqpJ6J6k2n0k8%j4
4423B2j3K5Q9O9M1K4K3L5Pl7o4p7l0KLNNj6j6l1mM6M6M8M8k4k3k4k4N2N2O5L7j4o1n1k5j3
$$ plain form
4543 96 102 108 96 111 146 134 68 1 -35 -72 -106 -140 -149 -112 -36 39 87 134 116 99 63 26 54 83 107 132 157 181 256 330 347 318 270 222 198 175 181
4527 181 188 194 201 213 225 238 250 262 274 283 292 277 206 138 125 140 183 213 244 224 204 184 164 158 152 146 140 167 194 221 248 222 196 115 34 -39 -112 -131 -149
4510 -149 -114 -79 -44 -9 5 20 35 50 79 108 137 166 170 175 179 184 145 107 123 140 120 100 108 115 113 110 79 49 30 10 -8 -28 15 59 48 37 -4 -46 -60
4493 -60 -74 -84 -95 -77 -60 3 67 76 85 94 103 112 122 130 137 145 153 166 179 165 150 89 28 22 17 54 92 74 57 33 10 41 73 71 68 65 62 77 92 107 122 104 87
4474 87 70 52 23 -5 -46 -59 -4 106 216 272 253 206 201 243 296 349 366 354 314 273 233 192 169 174 201 255 321 359 375 363 331 299 294 288 289 289 262
4458 262 235 210 184 185 186 169 125 98 72 80 116 137 158 153 148 143 139 172 205 237 268 306 317 305 265 213 189 203 217 176 135 134 161 186 211 238 265 266 268 252
4441 252 264 278 264 215 166 121 122 149 176 139 57 -15 -60 -59 -58 -71 -56 -22 11 9 -19 -55 -63 -14 61 147 186 160 134 127 119 111 104 120 136 114 64 36 36 22
4423 22 9 34 123 192 233 257 280 315 322 285 221 144 114 116 119 124 129 113 97 66 62 108 154 202 250 226 203 179 155 207 259 324 361 347 286 235 210 197
4407A97j3j1j2J9J8J9J8j9j8j9j8j9j8j9j8KLLLPORRO1Q8N3Pj6j6m6m7k8k8J8J8J2J2J2J1
4390B40M2M1k4k3l9l8QPooook5k5K1K1M4M5kkm6m6rL7M9K2k5n3o0l2J6J5l0l0lkrql6l5J5
4372cJ3M3M3RRRRk0k0k0k0K9K9P5J03R4M8j1l7m5m5p5p4n4n5qqppl4l5J%K9K8O3O3jjj3j3
4355I1j3j3m7m5j9M6Q1Q2M7Jj8j8k1k1lmnnl1o0m1NO0O0K7j9l3nM2M1ppppL3L3j3j3o7o7m5
4337ejJ6J6J9K0J7J7J7J7J4J4J5J4onn2n2RRRRK5K6K6K5rqrrJ5J5J5J5n2n2n2n2rj0j0rk6
4319c4k7k6k7J0J1P4P4N0N0MMk4k3p0o9ppqpJ0J0J0J0K1K2K2K1%jjjm8m8J6J5J9J9J9K0j2
4301G1j1j2j1j%j%K0K0K0K1L7L8L7L7L8L7L8L7k2k2k2k2p5p5p6p5L8L9L8L8K2K2K0K0j7m4
4285B02o1nL1L1L5L4lmm9n0j%K5K6j5m2MN9Q5L0j8j9j0j1j1j1k6k5k6k6JKk5n4l3K1R1R0O3
$$ plain form
4407 197 184 173 161 180 198 217 235 216 198 179 161 142 124 105 87 89 92 95 98 105 111 120 129 190 278 331 338 322 306 260 213 185 157 175 193 205 217 229 240
4390 240 282 323 299 276 237 199 207 214 208 202 196 190 165 140 161 182 226 271 269 267 221 175 166 203 252 274 249 196 136 104 120 135 105 75 72 70 61 53 17 -18 -3
4372 -3 10 53 96 105 114 123 132 112 92 72 52 81 110 185 288 382 430 419 382 337 292 217 143 89 34 26 18 11 4 -30 -65 -64 -64 -35 -7 56 119 118 117 104 91
4355 91 78 65 18 -27 -46 0 81 163 210 211 193 175 154 133 130 126 121 116 85 25 -16 -11 49 109 136 117 84 79 121 162 155 148 141 134 167 200 187 174 107 40 -5
4337 -5 -6 10 26 45 65 82 99 116 133 147 161 176 190 184 179 127 75 84 93 102 111 136 162 188 213 204 196 187 178 193 208 223 238 186 134 82 30 21 11 1 -8 -34
4319 -34 -61 -87 -114 -104 -93 -19 55 105 155 159 163 139 116 46 -23 -30 -37 -45 -52 -42 -32 -22 -12 9 31 53 74 74 73 72 71 23 -25 -9 6 25 44 63 83 71
4301 71 60 48 37 36 36 35 35 55 75 95 116 153 191 228 265 303 340 378 415 393 371 349 327 252 177 101 26 64 103 141 179 201 223 243 263 246 202
4285 202 141 136 167 198 233 267 264 260 211 161 160 160 185 211 196 154 158 217 302 332 314 295 285 274 263 252 226 201 175 149 150 152 127 73 40 61 152 242 305
4268C05O3k0k0l9l9QPj6j7m4m5l5l4ppJ5J5J5J5l2l1l2l1RRRRL0L0L0L0j5j5j5j6LKPOK9Q5
4250B21R6O8J5j2m5m5n2n2m0j3J1J2J2J3K0K0K0K0K0K0K0K0k4k4k5k4RQPPK0pj9j9RRk0m8
4234B08l3nNNJ3J2J2J2KKk5k4k6JL0L1Rj9l1l1k4k3m0j2j2j1rqJK9J4J3J0RJ0J0RJ0QQj6m2
4216H2k7k8JKKLM4P2P0M2L0Kk9k8j8RJ0j9n4n5rJ9Mk3k2OJ9J8K0K0K1K2J9J9rn4k7k7j1J6
4198A32%%mnK1K1J8j0l6l6J2P7Q3N6k5k6k8k8j4j4j7j6k1m9o3pM6P4O2O1L2L2MNK8K7j8j8
4182C56n3n3porqrqj0j0n6n6k9k9L6L5Q0P9N2N2j5j5p6p7p3j8J6J6opM0M0N7N6J1J0nmnnm0
4164B47m0m0m0m0m0m0l9M1M3M2M3QQQQL0L0L0L1L7L7L7L7KJJKj8j7j8j8L9L8qqj6j6j7j6l5
4147C34l5l5l5l5l5l2l2KN7M1J4J7J6J5J5K0K0J9J8j6m3n9lJ1J2J5J4J5J5J5J5l9l8l9l9J2
$$ plain form
4268 305 368 348 328 289 250 258 265 249 232 188 143 108 74 67 60 75 90 105 120 88 57 25 -6 3 12 21 30 60 90 120 150 135 120 105 89 92 94 101 107 136 221
4250 221 317 385 400 388 343 298 246 194 154 141 152 164 176 189 209 229 249 269 289 309 329 349 325 301 276 252 261 269 276 283 303 296 277 258 267 276 256 208
4234 208 175 170 175 180 193 205 217 229 231 233 208 184 158 159 189 220 229 210 179 148 124 101 61 49 37 26 17 9 10 39 53 66 76 85 95 105 114 124 132 140 124 82
4216 82 55 27 28 30 32 35 79 151 221 263 293 295 266 238 220 229 239 220 166 111 102 121 125 102 80 86 105 123 143 163 184 206 225 244 235 181 154 127 116 132
4198 132 132 132 128 123 144 165 183 173 137 101 113 190 273 329 304 278 250 222 208 194 177 161 140 91 28 21 67 141 203 264 296 328 332 337 365 392 374 356
4182 356 303 250 243 237 228 220 211 203 193 183 127 71 42 13 49 84 164 243 295 347 332 317 241 164 91 73 89 105 99 92 132 172 229 285 296 306 301 297 292 287 247
4164 247 207 167 127 87 47 7 -32 9 52 94 137 145 153 161 169 199 229 259 290 327 364 401 438 440 441 442 444 426 409 391 373 412 450 442 434 418 402 385 369 334
4147 334 299 264 229 194 159 127 95 97 154 195 209 226 242 257 272 292 312 331 349 333 290 231 228 239 251 266 280 295 310 325 340 301 263 224 185 197
4131A97J3J2J3k0k0m8m8m5m5k9K5Q2Q2j5j6%J%%l0l0l0l1J7J6k9k9J3J4J4J5J8J8J8J8M9M8
4115B18M8M9K3K3K3K3L5L5L5L5J5J5l1n8p4j9nnj1j0L7L6k2k1K4N2J8l8l7K0P4P5J4J4L4L3
4100F77L4L4ONOOJ6J6j2M4J25J80J68J41J08J08J41J68K13K69L32L87M63N18N30M37K65O2
4087E447j19k84m36m92m83m55m27l72l13k20j72j45j23r6k6k5k4k4L2L2L2L2P3P3P2P3P1P1
4075A772R9J55K15K72L20L47L70L69M03M59N72P02R00J140J429J668J770J604J187N78j42
4066A6189q25j316j557j635j542j382j216j022q19o32n03m09l15k12j55j22j23p6k0K6N5P6
4057B465J05J22J21J30J86K55L11L67M22M78N70O39P31P75Q68R64J168J481J943K518L091
4048A9710L487L486K949J860M21j038k205k962l243l188k906k518k116j766j413j099q93p65
$$ plain form
4131 197 210 222 235 215 195 147 99 54 9 -20 5 87 169 154 138 138 139 139 139 109 79 49 18 35 51 22 -7 6 20 34 49 67 85 103 121 170 218
4115 218 266 315 338 361 384 407 442 477 512 547 562 577 546 488 414 395 390 385 374 364 401 437 415 394 418 470 488 450 413 433 507 582 596 610 644 677
4100 677 711 745 751 756 762 768 784 800 788 832 957 1137 1305 1446 1554 1662 1803 1971 2184 2453 2785 3172 3635 4153 4683 5120 5385 5447
4087 5447 5328 5044 4608 4116 3633 3178 2751 2379 2066 1846 1674 1529 1406 1310 1284 1259 1235 1211 1243 1275 1307 1339 1412 1485 1557 1630 1701 1772
4075 1772 1871 2026 2241 2513 2833 3180 3550 3919 4322 4781 5353 6055 6955 8095 9524 11192 12962 14566 15753 16331 16189
4066 16189 15364 14048 12491 10856 9314 7932 6716 5694 4875 4243 3740 3331 3016 2804 2649 2527 2404 2328 2308 2334 2389 2465
4057 2465 2570 2692 2813 2943 3129 3384 3695 4062 4484 4962 5532 6171 6902 7677 8545 9509 10677 12158 14101 16619 19710
4048 19710 23197 26683 29632 31492 31913 30875 28670 25708 22465 19277 16371 13853 11737 9971 8558 7459 6566 5801
4040E801o55n26l62k70k26j70j34p7NL2O1Q8J15J14J44K00K46L03L59M53N81P10Q61R90J141
4029I784J344J668K128K748L430L986M190L841K826J317m37k011l137l732l898l688l301k806
4021A4252k309j856j468j187r84p97o31m67l38k54j98j63j62j39q3l6rj4J4P9J71K11K39K73
4011D144L65M58N13N78O71Q23J026J342J729K199K733L255L569L490K843J669K11j200k325
4003B8093l011l325l322l046k663k201j776j389j059q19o50n22m75m20l51k58k07j52j33j06
3994B208r3l9mmJJpK0P0J25J66K22K76L05L77M69O17P83J005J245J543J782J827J587J082
3983A5564M36k92r37j378j619j670j579j417j177r49p46o34n06l78k85k29j74j70j42r9r9
3974A520j08j07j04j04o4qJ5J6K3K3K3K2L4L3Q8Q9J30J31J61K16K70L63M49N04N38N38M77
$$ plain form
4040 5801 5146 4620 4258 3988 3762 3592 3458 3381 3386 3418 3479 3567 3682 3796 3940 4140 4386 4689 5048 5501 6082 6792 7653 8643 9784
4029 9784 11128 12796 14924 17672 21102 25088 29278 33119 35945 37262 36825 34814 31677 27945 24047 20359 17058 14252
4021 14252 11943 10087 8619 7432 6448 5651 5020 4553 4215 3961 3763 3600 3438 3299 3216 3180 3171 3157 3171 3250 3421 3632 3871 4144
4011 4144 4509 4967 5480 6058 6729 7552 8578 9920 11649 13848 16581 19836 23405 26895 29738 31407 31618 30418 28093
4003 28093 25082 21757 18435 15389 12726 10525 8749 7360 6301 5482 4832 4310 3835 3415 3064 2806 2599 2447 2314 2208
3994 2208 2115 2076 2072 2068 2069 2070 2063 2083 2153 2278 2444 2666 2942 3247 3624 4093 4710 5493 6498 7743 9286 11068 12895 14482 15564
3983 15564 16000 15708 14771 13393 11774 10104 8525 7108 5931 4982 4236 3602 3096 2718 2433 2204 2030 1860 1718 1619 1520
3974 1520 1412 1305 1201 1097 1033 1025 1040 1056 1079 1102 1125 1147 1181 1214 1302 1391 1521 1652 1813 2029 2299 2662 3111 3615 4153 4691 5168
3962E168K73K6j77l71n36o21o22n51m58l40k85k45j90j53r8p0p0q8q9l3l3m0m0m0m0KLLLj9
3949B69j9j8j9j8j9j9j8K2K3K3K3n7n7jkK8K7K8K8l5l5l4l5J6J6m0l9K1K2K1K2L5L4L5L4j8
3934B44j8j9j8J7J7J7J8J3J4J4J3L8L7j8j8k6k6k6k7j6j6j6j6m7m6m6m5K1K1K2K2K9K8K9K9
3918A99M3M3M3M3l4l4l5l4m2m3J3J3poppj3j3j3j3L9L8N1K3k2o8o9k4JJLMJ0J1J1J1j9k0j9
3902E8j9K3K2K3K3rqrqo4o2l4J2J2J3J5J5P2P2P3P2L2L2k3k4k9k9k9k9J2J3J2J2%%n3n3m3
3885I3LL2L3K6K6k9k9kkjkQQPQ%JJ%rrrrj6j6j6j6%%%%jkjjm7m7M4M5L7L7L7L7l8l7l8l7k1
3864D8k2k1k0k3k3k3k3J6J6J6J6K4K3L9J2j5j5l2mK7K9L0L0J3J2J2J3%jj0l8m2j4J5J5mmm
3848F8mK4K5K4K4K9K9K9K9j9k0j9k0rrj0rK5K5K4K3k8n5m0m1j4j5l0lponnnnlnjj%jLLJ5M3
$$ plain form
3962 5168 5441 5467 5290 4919 4383 3762 3140 2589 2131 1791 1506 1261 1071 918 820 750 680 592 503 470 437 397 357 317 277 279 282 285 288 269
3949 269 250 232 213 195 176 157 139 161 184 207 230 173 116 115 113 141 168 196 224 189 154 120 85 101 117 77 38 59 81 102 124 159 193 228 262 244
3934 244 226 207 189 206 223 240 258 271 285 299 312 350 387 369 351 325 299 273 246 230 214 198 182 135 89 43 -2 19 40 62 84 113 141 170 199
3918 199 242 285 328 371 337 303 268 234 192 149 162 175 168 162 155 148 135 122 109 96 135 173 224 247 225 157 88 64 65 66 69 73 83 94 105 116 97 77 58
3902 58 39 62 84 107 130 121 113 104 96 32 -30 -64 -52 -40 -27 -12 3 75 147 220 292 324 356 333 309 280 251 222 193 205 218 230 242 242 242 189 136 93
3885 93 96 128 161 187 213 184 155 153 151 150 148 156 164 171 179 179 180 181 181 172 163 154 145 129 113 97 81 81 81 81 81 80 78 77 76 29 -18 26 71 108 145 182 219 181 144 106 69 48
3864 48 26 5 -15 -38 -61 -84 -107 -91 -75 -59 -43 -19 4 43 55 40 25 -7 -11 16 45 75 105 118 130 142 155 155 154 144 106 64 50 65 80 76 72 68
3848 68 64 88 113 137 161 190 219 248 277 258 238 219 199 190 181 171 162 187 212 236 259 231 176 136 95 81 66 36 33 26 20 15 10 5 0 -3 -8 -9 -10 -10 -11 -8 -5 10 53
3828E3N0N0ONnoool3l2m9k1QQJ1J1J7M4N5Rm4m4m5m4jK6J5J4J4O1P9P9K6kl2l3p2p2o0l2k
3810@%J5j2k3k5k4k5K5N3L4L5Ok2k2Omlj7J0K0K0K2K1K4K5K4K4L3L4j6m4j8j8j9k0j2j2j3
3794H2j2m5m3n9l1L3O0M6M6J4J5J4J4J2J3K8%l4l4l6l6jjjjJ9K0J9J9K2K3K2K2k4k5ML2M5
3778B41J6k9k9j4J4K5K6j7j8j9j9l1n9n8l0J7J9K0K0LLKLKLKLL4L5L5L5nnklKK9J4J4pppp
3759B51k9k8%K7L8J0k1k1k7n5q0n2jM6O2L5j6m5k8k9RL6K1K1M3M3M2M1M8J9k0o6n9l2J5J5
3743B13L5L6L5L6j5j5m2m2o9o9o9o8j6j6J2J3NNNNrrJ9J8O1O2K3k3m0m1m0m0jM4Q0Q1N5Qj1
3726B16j2nnl3l3QPk1k0n0n0J4J5J8J7J8J8L9L9J1J1pqK0K0L1L1n1n2l5l5J1J2J0J0J0J0k0
3710A59k1k0k1k2k3K3K4J5J5j2j3k6k7k7k6KML1L1P4P4P1P1M9Ll5l5o0o0n9o0K3K2K2K3n9
$$ plain form
3828 53 103 153 159 164 159 153 147 141 108 76 27 6 14 22 33 44 61 105 160 169 125 81 36 -8 -9 17 32 46 60 121 200 279 305 303 271 238 166 94 34 2 0
3810 0 0 15 3 -20 -45 -69 -94 -69 -16 18 53 59 37 15 21 17 14 -3 7 27 47 69 90 114 139 163 187 220 254 238 194 176 158 139 119 107 95 82
3794 82 70 25 -18 -77 -108 -75 -15 31 77 91 106 120 134 146 159 187 187 153 119 83 47 46 45 44 43 62 82 101 120 142 165 187 209 185 160 164 196 241
3778 241 257 228 199 185 199 224 250 233 215 196 177 146 87 29 -1 16 35 55 75 78 81 83 86 88 91 93 96 130 165 200 235 230 225 223 220 222 251 265 279 272 265 258 251
3759 251 222 194 194 221 259 269 248 227 200 145 65 13 12 58 120 155 139 94 66 37 46 82 103 124 167 210 252 293 341 360 340 274 215 183 198 213
3743 213 248 284 319 355 340 325 283 241 172 103 34 -34 -50 -66 -54 -41 -36 -31 -26 -21 -30 -39 -20 -2 59 121 144 121 81 40 0 -40 -41 3 83 164 219 227 216
3726 216 204 199 194 161 128 136 143 122 102 52 2 16 31 49 66 84 102 141 180 191 202 195 187 207 227 258 289 238 186 151 116 127 139 149 159 169 179 159
3710 159 138 118 97 75 52 75 99 114 129 117 104 78 51 24 -2 0 4 35 66 140 214 285 356 405 408 373 338 278 218 159 99 122 144 166 189 130
3694A30n8n9n7L3L2L4L3K7K7%k9l5J1M8M8M6M5N8L0pn4r0r0m1K4L4L3nnm8m9m3LK4K3J5J4
3678A02j2j3k8k8L7L7L8L8k7k7j6j6O7O6M5M4k0k0m1m1j3j3j4j4J4J4j5j4j5j4LML1L1K1K1
3663B12k5k6jkjkj7j8j7j8k7k6j0L7O4J9n4q1n9ML1K9k2k3m9m8l7qL1P7Q9O1L2Llkmnj7j7
3645G0J1J1J6J6J6J6mnnmj5j5m2m3j0j1j0j1mmnmK6K4K6K5L3L3L2L3K0K1rl6l5pK1K0Lk4k4
3628A46LJ1J2K9Jj3j4j5j5j1j2j0j0K3N1L4L3Jk8j1j2l2l2l3l2k4k5MLkjM0M0K8l7o3l3K7
3611B1K8L0L0L4L5j5m2l9l9l9l8lK4K3lj4j5jk9m8m7j9RL0K9L3L4L9O8N2N3L8L8L6L7Nk2p
3595C06oPQQPj1j1j1j1l6l6l9l8l2n9p0k4L4L3L6L7L2L3L3L2k5k5k5k6JJJ%l4l5l4l4o2o3
3578a38k3K2N0N0N2N3qqqpKKm0m2lM4L1NnnL9L9K6K6K6K6k8k8n2n3k7J8N7N7K8K9K9K8RQQ
$$ plain form
3694 130 72 13 -44 -11 21 55 88 115 142 142 113 78 89 137 185 231 276 334 364 357 303 213 123 82 106 140 173 168 163 115 66 23 26 50 73 88 102
3678 102 90 77 49 21 58 95 133 171 144 117 101 85 152 218 263 307 287 267 226 185 172 159 145 131 145 159 144 130 115 101 104 108 139 170 191 212
3663 212 187 161 160 158 157 155 138 120 103 85 58 32 22 59 123 142 88 7 -52 -48 -17 12 -10 -33 -82 -130 -167 -175 -144 -67 22 83 115 118 115 113 109 104 87 70
3645 70 81 92 108 124 140 156 152 147 142 138 123 108 66 23 13 2 -8 -19 -23 -27 -32 -36 -10 14 40 65 98 131 163 196 216 237 228 192 157 150 171 191 194 170 146
3628 146 149 160 172 201 202 189 175 160 145 134 122 112 102 125 176 210 243 244 216 205 193 161 129 96 64 40 15 19 22 20 19 59 99 127 90 27 -6 21
3611 21 49 79 109 143 178 163 121 82 43 4 -34 -37 -13 10 7 -7 -22 -23 -52 -100 -147 -166 -157 -127 -98 -65 -31 8 76 128 181 219 257 293 330 335 313 306
3595 306 300 307 315 323 330 319 308 297 286 250 214 175 137 105 46 -24 -48 -14 19 55 92 124 157 190 222 197 172 147 121 122 123 124 124 90 55 21 -13 -75 -138
3578 -138 -161 -139 -89 -39 13 66 58 50 42 35 37 39 -1 -43 -46 -2 29 34 29 24 63 102 128 154 180 206 178 150 98 45 18 36 93 150 178 207 236 264 273 281 289
3560B89Qo9o9r3r2m5J9Q3Q4N8N9pok5k5L9L9J5J5j4j3l2l2l2l3j8j7j8j8m9m8m9m9J4J3M1
3544g7M1N0N0L0j6l6l6jM4M8K0m4m4PQQPMMN0N0K6K7K4K4Ql7p7p6l3l3onl4l4l1l2K5P2M4
3527A9M5JJJJJ6J7J7J7M2M2M1M2M4M4kk%%m7m6l6l5l5l6m2m1K2K3O2O2klpqqpK6K6K5K6j7
3509B88j8m5m6l6l6K8K9K8K8K5K5n0r6q3n4k6K0L8J2j0rN4Q1O7K1j6j7J1J1J1J1j2j1j2j2
3494A99K7K8K7K7k6k7k6k7m9m9m9m9k2k3K2K2K4K4O7O8lm9k2k3j7j6J1L9L1j5n0m9ON2P0M1
3478A94J1J0RQj6j7J1L8M0pk5k5m6m6m5m6kkK5K6L6L6j0j0nmnmj%%jj6j7j6j6K3K3K3K3l8
3460A16l8l8l8J5J5J5J5K3K4K3K3k2k2OOJ5J6m9m9j5j6L1L0M8M7J0l6k4LK9%j8j8k0k0ppo
3444F7pK2K2K3K2mlllj0rrrJ6J6J4J5l0n8o6j9L9O9L5j1j4j4j7j7l1l0L2L3M8M7j7m5l4J2
$$ plain form
3560 289 297 228 159 66 -26 -71 -52 31 115 173 232 225 219 194 169 208 247 262 277 263 250 218 186 154 121 103 86 68 50 1 -47 -96 -145 -131 -118 -77
3544 -77 -36 14 64 94 78 42 6 5 49 97 117 73 29 36 44 52 59 63 67 117 167 193 220 244 268 276 239 162 86 53 20 14 9 -25 -59 -90 -122 -97 -25 19
3527 19 64 65 66 67 68 84 101 118 135 177 219 260 302 346 390 388 386 386 386 339 293 257 222 187 151 109 68 90 113 175 237 235 232 225 217 209 202 228 254 279 305 288
3509 288 270 225 179 143 107 135 164 192 220 245 270 220 124 41 -13 -39 -19 19 31 21 12 66 147 214 235 219 202 213 224 235 246 234 223 211 199
3494 199 226 254 281 308 282 255 229 202 153 104 55 6 -16 -39 -17 5 29 53 120 188 185 136 114 91 74 58 69 108 139 124 74 25 31 83 153 194
3478 194 205 215 224 232 216 199 210 248 288 281 256 231 185 139 94 48 46 44 69 95 131 167 157 147 142 138 133 129 128 128 128 127 111 94 78 62 85 108 131 154 116
3460 116 78 40 2 17 32 47 62 85 109 132 155 133 111 117 123 138 154 105 56 41 25 56 86 134 181 191 155 131 134 163 163 145 127 107 87 80 73 67
3444 67 60 82 104 127 149 145 142 139 136 126 117 108 99 115 131 145 160 130 72 6 -13 26 95 130 119 105 91 74 57 26 -4 28 61 109 156 139 94 60 72
3427G2K8%n3n3j9K6M7Jl1l1%M4O6O6L2L1L2L2j4j4j4j4n4n3n3n4k0j9l5qJ2J3J2J3L9J3j1
3411B9l8j8j7l4nL6O3O5L8pprrJ3J3J4J3K0K0K0K0JJJJnopqpl4j9j9J9K0K0J9O8O8L8qppk5
3392C24LJ8J9L6Ql4l4l5l6l2l2m7k0k4k4k0k0LL0J5J5J3J3J2J1K8%l9m0k5k4m0j3J0J0J2J2
3376E3O1O1L1j5m9m9m9m8j4L0N9N9J3j4JKJ4J5J4J5lmlml4l5K1K1J5J5J6J5RQRQj9j9p1p1
3358F4m4J1L5L5L5L5L5L5nnnol1l2l2l1j6j5M0M0O9P0Qm6j8j9k1k2k4k5k4k5l7l6l4l4k6K9
3342g2N4N2NNNNOPPPJ4J3J4J4J0RJ0J0M1M1J7l9o0o1rqRJ0J0J0l2l2l3l2j9k1k0k1K5K4K4
3324aK3K4K5K4K4k0k0k0k0j5j6M0M0M3M2j3j3n4n5n3n4J1J0J1J1J1J1J0J1L2L1L2L1k7k7k7
3309F2k8mnN0N1M3M4j2j2p4p4p4p4m2m1NMN4N3N4N2L5L4POk5k6o7o9m9OM0L9J5J5J4J5oop
$$ plain form
3427 72 100 100 47 -6 -25 1 48 49 18 -13 -13 31 97 163 195 226 258 290 276 262 248 234 180 127 74 20 0 -19 -54 -62 -50 -37 -25 -12 27 40 29
3411 29 -9 -27 -44 -78 -83 -47 16 81 119 112 105 96 87 100 113 127 140 160 180 200 220 221 222 223 224 219 213 206 198 191 157 138 119 138 158 178 197 265 333 371 363 356 349 324
3392 324 327 345 364 400 408 374 340 305 269 237 205 158 138 114 90 70 50 53 83 98 113 126 139 151 162 190 190 151 111 86 62 22 9 19 29 41 53
3376 53 114 175 206 191 142 93 44 -4 -18 12 71 130 143 129 130 132 146 161 175 190 187 183 180 176 142 107 128 149 164 179 195 210 219 227 236 244 225 206 135 64
3358 64 20 31 66 101 136 171 206 241 236 231 226 220 189 157 125 94 78 63 103 143 212 282 290 244 226 207 186 164 140 115 91 66 29 -7 -41 -75 -101 -72
3342 -72 -18 34 39 44 49 54 60 67 74 81 95 108 122 136 146 155 165 175 216 257 274 235 175 114 105 97 106 116 126 136 104 72 39 7 -12 -33 -53 -74 -49 -25 -1
3324 -1 22 46 71 95 119 99 79 59 39 24 8 48 88 131 173 160 147 93 38 -15 -69 -58 -48 -37 -26 -15 -4 6 17 49 80 112 143 116 89 62
3309 62 34 30 25 75 126 169 213 201 189 115 41 -33 -107 -149 -190 -185 -181 -127 -74 -20 32 67 101 108 114 89 63 -4 -73 -122 -116 -76 -37 -22 -7 7 22 16 10 3
3291CnL9M1M0M0J6J6J5J6K6K6l9l9k0k0QQj4j4m1m2J3J3J3J3J8J7O2O2P2M3k6q2q2k7LLk1
3275A54k2K5K5RQj9j9l1l1l0l1%J%JJ2J2J2J2k5k4k5k3K6K7N5N5L8L7k7k7m2m2q5q4k3L2M4
3258b5J6J6J8J5J5L3L3L2L3J2J2J2J2k2k2k1k2k9k8k6k6QN5K8K8OOOOk2k2k2k2K7K7K6K7j
3242A99jjjk0k0k0k0qrqL8P6M9J0l6m1m2m3m4j8j7K8K9M4M4M1M0L0j6n5n5n0m9n0m9K2K2K2
3225B1K2K6K6K6K6j9k0j9k0qqL7L8J0J0j8j8J8J8j0j0m2m3MML0L1L1L1j1j0j0j0POPPj4j4
3208A32j4j4llmlj0j0j1j0J1J0J1J1J1J0J1J1K5K5K5K5k8k8k8k8j3j2j3j2J7J8J7J8KKKKK
3191A54KKKMMMMj2j3j2j2k7k7k7k7QQQPK6K6K5K6j6j7k9kM5R1R1M5rl6j3J5J6j1l9m0KKLK
3173B53j6j7j6j7j0rj0rk7k6k6k6j4j3L4L3L5L5L5L4K0J9k7k6n6n6RRL4L4OOK7K6K7K7k9k8
$$ plain form
3291 3 -2 37 78 118 158 174 190 205 221 247 273 234 195 175 155 163 171 157 143 102 60 73 86 99 112 130 147 209 271 343 386 360 278 196 169 172 175 154
3275 154 132 157 182 191 199 180 161 130 99 69 38 38 39 39 40 52 64 76 88 63 39 14 -9 17 44 99 154 192 229 202 175 133 91 6 -78 -101 -69 -25
3258 -25 -9 7 25 40 55 88 121 153 186 198 210 222 234 212 190 169 147 118 90 64 38 46 101 129 157 163 169 175 181 159 137 115 93 120 147 173 200 199
3242 199 198 197 196 176 156 136 116 108 99 91 129 205 254 264 228 187 145 102 58 40 23 51 80 124 168 209 249 279 263 208 153 103 54 4 -45 -23 -1 21
3225 21 43 69 95 121 147 128 108 89 69 61 53 90 128 138 148 130 112 130 148 138 128 86 43 47 51 81 112 143 174 163 153 143 133 140 146 153 160 146 132
3208 132 118 104 101 98 94 91 81 71 60 50 61 71 82 93 104 114 125 136 161 186 211 236 208 180 152 124 111 99 86 74 91 109 126 144 146 148 150 152 154
3191 154 156 158 160 164 168 172 176 164 151 139 127 100 73 46 19 27 35 43 50 76 102 127 153 137 120 91 89 134 225 316 361 352 316 303 318 334 323 284 244 246 248 251 253
3173 253 237 220 204 187 177 168 158 149 122 96 70 44 30 17 51 84 119 154 189 223 243 262 235 209 153 97 106 115 149 183 189 195 222 248 275 302 273 245
3156B45k8k8PQPPk2k3k3k2j%lkml2m3MM4M5M7M7pqJ9K0L4L4m8m9l7l7rrm4m4m4m3J7J7J7J7
3138B6rrK0J9K0K1k5k5m2m3LL%%JKM2P2Q0L4l2n9m3m4kM4L5Pj6J1N9N9K2K3nnm4m3j5j6j3
3120A13j3J5J4JJJJk0j9j9j9j7j6j6j6M3M3k1k1qqN7N7M0M0opJ3J2J2J3NNNNm3m4m3m3k7k7
3103D3k6k6jkjjJ4J3J4J4K5K5K6K5RRRRNOLMj0n5p6p4k8k9K0K0P8J07P1K6jjK4K4J1J2J1J1
3084C37m0m0m0m0m2m1m2m2j2j2j3j3K5K4P7P7O4Qq7q7l1K5M8M9K2K1K5l0o2o2m1J5L8L8j4
3069A02j4m6m4RJ0j7j7j7j8K8K6K7K8KKKKJ4J4J5J4k5k5k5k5mnmnPPPPPQPPj3j3m0m1J%N5
3050A0N6L0L0KLJJk6k7l9l9l8l9l2l1K5K4N1N0N1N0J9J9J9J9j6j6j5j6k2k2k1k2jjjjj9j9
3033cj9j9N6N6Q1Q0L0k6n0n0n8n9lmK5K5K4K5jjj%M9M9K5l1m3m3j9j9M1M0J4J3J0J0j8j7n9
$$ plain form
3156 245 217 189 196 204 211 218 196 173 150 128 127 127 124 122 118 86 43 47 91 136 183 230 223 215 234 254 288 322 274 225 188 151 142 133 89 45 1 -42 -25 -8 9 26
3138 26 17 8 28 47 67 88 63 38 -4 -47 -44 -41 -41 -41 -40 -38 4 76 156 190 158 99 56 12 10 54 89 96 80 91 150 209 231 254 249 244 200 157 142 126 113
3120 113 100 115 129 130 131 132 133 113 94 75 56 39 23 7 -9 34 77 56 35 27 19 76 133 173 213 207 200 213 225 237 250 255 260 265 270 227 183 140 97 70 43
3103 43 17 -9 -10 -12 -13 -14 0 13 27 41 66 91 117 142 151 160 169 178 183 189 192 196 186 131 55 -19 -47 -76 -56 -36 42 149 220 246 245 244 268 292 303 315 326 337
3084 337 297 257 217 177 135 94 52 10 -2 -14 -27 -40 -15 9 86 163 227 235 148 61 30 55 103 152 174 195 220 190 128 66 25 40 78 116 102
3069 102 88 42 -2 7 17 0 -17 -34 -52 -24 2 29 57 59 61 63 65 79 93 108 122 97 72 47 22 18 13 9 4 11 18 25 32 39 47 54 61 48 35 -5 -46 -45 -45 10
3050 10 66 96 126 128 131 132 133 107 80 41 2 -36 -75 -107 -138 -113 -89 -38 12 63 113 132 151 170 189 173 157 142 126 104 82 61 39 38 37 36 35 16 -3
3033 -3 -22 -41 15 71 152 232 262 236 186 136 78 19 16 12 37 62 86 111 110 109 108 108 157 206 231 200 157 114 95 76 117 157 171 184 194 204 186 169 110
3016A10n9lmK3K4nnM1M1M1M1K6K7l2q6q8l1K5K6L0K9K9L0NNONl2l2l2l2OPL4L3J2J2m3m3k
2999A39kK6K6PPPPK9K9K9K9k8k9k9k8qqqqJ1J1j6j7k8k8K7K8K9K9k7k6llN2N3O5O5RJ0k8k8
2981C72k9k8kjkkl2l2o3qK7K7L0L0K3K4o9o9o9o9K3K3J4J4J4J3K0J9K0J9k0k0k1k0j2j3j0
2965A21j1M2O9K5k0l8j1K7K6j0rrj0KKKLN2N2K3k3m5m5QQL4L4k2k1l4l5K1K2k1k1k1k1o6o6
2948A4l6RL4L5L8L9ppppJ9K0J9J9M7M8J8k9o3o4o7o7K0K0K0K0jjjjKKLKN9N8L0j7j8j7k1k0
2930A44LKLKl6l7l6l7jkjkj5j6L8L8M4M3M3M3%j%jl6l6K9P4O5L8j1n7p4p5k2k3l4l3j2M4L2
2912H7NK3K3j4j4j4j4K7K7K8K7M2M2j3j3n8n8o0o0j7m7o0nN1P8O6O7K8K8k8k7mlllj4j4j3
2896I3j4M4M4M3M4K2K2l4l3l8l9l8l9k1k1k1k0K6K7K8K7J8J8l7l8n8n7lkK6K6K5K6N7N7L2
$$ plain form
3016 110 51 48 44 67 91 86 81 122 163 204 245 271 298 266 180 92 61 86 112 142 171 200 230 235 240 246 251 219 187 155 123 129 136 170 203 215 227 184 141 139
2999 139 137 163 189 196 203 210 217 246 275 304 333 305 276 247 219 211 203 195 187 198 209 193 176 148 120 147 175 204 233 206 180 177 174 226 279 344 409 418 428 400 372
2981 372 343 315 313 312 310 308 276 244 181 173 200 227 257 287 310 334 265 196 127 58 81 104 118 132 146 159 179 198 218 237 217 197 176 156 144 131 121
2965 121 110 152 221 246 226 188 177 204 230 220 211 202 192 194 196 198 201 253 305 328 305 260 215 223 231 265 299 277 256 222 187 208 230 209 188 167 146 80 14
2948 14 -22 -13 21 56 94 133 126 119 112 105 124 144 163 182 229 277 295 266 203 139 72 5 25 45 65 85 84 83 82 81 83 85 88 90 149 207 237 220 202 185 164 144
2930 144 147 149 152 154 118 81 45 8 7 5 4 2 -13 -29 9 47 91 134 177 220 220 219 219 218 182 146 175 249 314 352 341 284 210 135 113 90 56 23 11 55 87
2912 87 92 115 138 124 110 96 82 109 136 164 191 233 275 262 249 191 133 73 13 -4 -51 -111 -116 -65 13 79 146 174 202 174 147 143 140 137 134 120 106 93
2896 93 79 123 167 210 254 276 298 264 231 193 154 116 77 56 35 14 -6 20 47 75 102 120 138 101 63 5 -52 -55 -57 -31 -5 20 46 103 160 192
2880A92k3n8n9opK1K0K1K1KKk9K7M0M1M4M4NNMNm7m8m7m7NOONJ2J1J1J1k9k9k9l0m4m4J1J0
2862FL2L3L3L2j5j5j6j5j6j5j5j6PQPP%%L9O7N8N7J9rnnRj9o6o6k8jnnPL5K8%j0j0k5k4k5
2844E8k5j1j2j0qoK2L3L2K7jm0l9j4J3K6K6klkllmK4K4J5J6k5n2n4n3j6J2K7K7K7K9J0J0J0
2826H5J0l7l7KK9K1ooK1M3J4k1k2mK4L4L3K4nj6j7ooj8m6n4n3m4j6J4J3J6J5%j%%J8K0J9K0
2809F0NOM4P2R0O3Lk4m7m7o4l6LLMNKKj0l7m9m8j1J5L2L1ONK5K5M0J2k0k0j0J8M9N0J1j6k8
2791B14k7K4K5rl7l7rj3j3Mk4k5k5k6k4j6J1N1N1M6M5L3Oj5j5m4m4o1n9l1J5K5K4%%NMK2n
2774D6j1J6N5N5M3M2L9L9J6m8o4o4l3J2M0M1Nk3l3l4j7J0M8M8L2Nl6l5k3k3k4k3J0J1J0J0
2758A42kkK5K4J6j1m9m8l4J3M0M0J9rm8m9k9k9j7J0M1M1M2M3%%K7K8L6L6k0j9m0m0m0l9rq
$$ plain form
2880 192 169 111 52 46 39 60 80 101 122 124 126 97 124 164 205 249 293 298 303 307 312 265 217 170 123 128 134 140 145 157 168 179 190 161 132 103 73 29 -15 -4 6
2862 6 38 71 104 136 121 106 90 75 59 44 29 13 20 28 35 42 42 42 81 148 206 263 282 273 268 263 272 253 187 121 93 92 87 82 89 124 152 152 142 132 107 83 58
2844 58 33 22 10 0 -8 -14 8 41 73 100 99 59 20 6 19 45 71 69 66 64 61 58 54 78 102 117 133 108 56 2 -51 -67 -55 -28 -1 26 55 65 75 85
2826 85 95 58 21 23 52 73 67 61 82 125 139 118 96 92 116 150 183 207 202 186 169 163 157 139 93 39 -14 -58 -74 -60 -47 -31 -16 -16 -17 -17 -17 1 21 40 60
2809 60 65 71 115 187 277 340 343 319 272 225 161 125 128 131 135 140 142 144 134 97 48 0 -11 4 36 67 73 78 103 128 168 180 160 140 130 148 197 247 258 242 214
2791 214 187 211 236 227 190 153 144 131 118 122 98 73 48 22 -2 -18 -7 44 95 141 186 219 225 210 195 151 107 46 -13 -44 -29 -4 20 20 20 25 29 51 46
2774 46 35 51 106 161 204 246 285 324 340 292 228 164 131 143 183 224 229 206 173 139 122 132 180 228 260 265 229 194 171 148 124 101 111 122 132 142
2758 142 140 138 163 187 203 192 143 95 61 74 114 154 173 164 116 67 38 9 -8 2 43 84 126 169 169 169 196 224 260 296 276 257 217 177 137 98 89 81
2742H1opM7P4L4k1n9o0m7j9JN7N4N5L9L9J1J1k5k4k5k5k4k5k5k4k5k4k5k3l2l2l1l2J3J2J2
2726a00J2L8L7L7L7O0N9Q9L4k6n3m1m1l5l5o0n8l6K0M4M2K2K1K1K2RRRRK2K3K2K2jkK6K5K2
2709C05K2l2l2o0l3J0O5N5%rJ8M2M2j2j2k9k9n7n6l0l0l0l0l1l2K6K5N9Q6M7rp1p2k0k0j8
2694D8j8j8j7l5l5l6l5L2L2L2L3k9k9k8k7k1ON4J00R2M6kk9l3l2K1K1RJ0RJ0QQQQN7N8N7N8
2677C93M9N0K0k7m8m9MLk0k0k0k0j7j6j7j7qqqqK2K2K2K2l0l0l0k9l0l0l0l0K2K2K2K1kkN0
2660A98N0jm8l7j0J0J0J2J2k1k2k1k2rrl7l7k3k3ON1Q2Q2L0L0NOOOl6l6qL7N3K6j2j1%JJ%
2642B91J3J4J3J3m9m9m9n0RQJ1J0lK5M0j5p1p1l8N5R0L5ol2l5l5l7l6PPQPJ3J3k3n1m5J0L1
2625B8L2JJJKJ6J6J6J7ppppOOOON8N8LLMNl2n9l5K0N6K9k4n2l8l8j5j6j5j5K4K5K2K2j5m3
$$ plain form
2742 81 75 68 115 189 223 202 143 83 36 17 18 75 129 184 223 262 273 284 259 235 210 185 161 136 111 87 62 38 13 -10 -42 -74 -105 -137 -124 -112 -100
2726 -100 -88 -50 -13 24 61 121 180 269 303 277 224 183 142 107 72 12 -46 -82 -62 -18 24 46 67 88 110 119 128 137 146 168 191 213 235 234 232 258 283 305
2709 305 327 295 263 203 170 180 245 300 300 291 309 351 393 381 369 340 311 254 198 168 138 108 78 47 15 41 66 125 211 258 249 178 106 86 66 48
2694 48 30 12 -5 -40 -75 -111 -146 -114 -82 -50 -17 -46 -75 -103 -130 -151 -145 -91 9 101 147 145 116 83 51 72 93 102 112 121 131 139 147 155 163 220 278 335 393
2677 393 442 492 512 485 437 388 392 395 375 355 335 315 298 282 265 248 240 232 224 216 238 260 282 304 274 244 214 185 155 125 95 65 87 109 131 152 150 148 198
2660 198 248 247 199 162 152 162 172 184 196 175 153 132 110 101 92 55 18 -5 -28 -22 29 111 193 223 253 258 264 270 276 240 204 196 233 286 312 300 289 289 290 291 291
2642 291 304 318 331 344 295 246 197 147 156 164 175 185 182 207 247 232 161 90 52 107 197 232 226 194 159 124 87 51 58 65 73 80 93 106 83 32 -13 -3 28
2625 28 60 61 62 63 65 81 97 113 130 123 116 109 102 108 114 120 126 184 242 245 248 252 257 225 166 131 151 207 236 212 160 122 84 69 53 38 23 47 72 94 116 101 58
2607E8n8kJ2J2J6J6K3K2K3K2K4K3K4K3O1O1l2l1m7m6k3L3J9J8K2K2M6M6M7M6j4j4j4j4l1l1
2591C62l1l1rrM2M3L5k1m5m5n1n0n1n1j0j1j0j0L3L4L3L4K7K6K7K7N4N5N4N5M8M8K1l3q6j14
2575C90j01j02o6o7m0J5P9J07P0J5j5j6j9j9L8L8j8j8l0l0o6r4n6kJ9K1J6J6J5J6N3N2klK5
2560B21K4K5K5J3J2m3m3l9l8l9l8n9n9lmL2L1L2L1K5K5K5K5rj0rj0l8l8l8l6JJKJK8K9K9K9
2543A13K9K9K9K8lllmJ4J4J4J4jjn6n6n1n0n0n0J9J9J8J9RRRQK9L0k3k3pM8Q8O0oopql8l9
2525A64J4J4Nm2q2n5L1R6Q5L8%k8j5j6k3k3L9Q5P0Nm8m8LKLKJ1J1m4m5k1k1j9j8l8RL7L8j5
2508A61j6j6j5J6J7J7J7L2L2k4k3j8j8j8j8NMMMO7O7O7O7j3j4j4j4m5m6m6m5KLLLm7m6p3k5
2491fJ8J9K3K2j2j2j2j2j9j8j9j9J7J8J6J7J8J7J8J7MLMMl1l1l1l0M4M5N8L0J2l5o5o6n3n5
$$ plain form
2607 58 0 -2 10 22 38 54 77 99 122 144 168 191 215 238 299 360 328 297 250 204 181 214 233 251 273 295 341 387 434 480 466 452 438 424 393 362
2591 362 331 300 291 282 324 367 402 381 336 291 240 190 139 88 78 67 57 47 80 114 147 181 208 234 261 288 342 397 451 506 554 602 623 590 504 390
2575 390 289 187 121 54 14 29 108 215 285 300 285 269 250 231 269 307 289 271 241 211 145 51 -5 -7 12 33 49 65 80 96 149 201 199 196 221
2560 221 245 270 295 308 320 277 234 195 157 118 80 21 -38 -41 -45 -13 18 50 81 106 131 156 181 172 162 153 143 105 67 29 -7 -6 -5 -3 -2 26 55 84 113
2543 113 142 171 200 228 225 222 219 215 229 243 257 271 270 269 213 157 106 56 6 -44 -25 -6 12 31 40 49 58 66 95 125 102 79 72 120 208 268 262 256 249 241 203 164
2525 164 178 192 197 155 73 18 49 145 230 268 268 240 225 209 186 163 202 287 357 362 314 266 269 271 274 276 287 298 254 209 188 167 148 130 92 101 138 176 161
2508 161 145 129 114 130 147 164 181 213 245 221 198 180 162 144 126 131 135 139 143 210 277 344 411 398 384 370 356 311 265 219 174 176 179 182 185 138 92 19 -6
2491 -6 12 31 54 76 64 52 40 28 9 -9 -28 -47 -30 -12 4 21 39 56 74 91 95 98 102 106 75 44 13 -17 27 72 130 160 172 137 72 6 -47 -102
2475a02JJJJJJj5j5j6j5M3M3R4R5N1Mo1o2j2j3j2j3j2j2M1M3P8P8M8Ll6l5J8J7QQQQJ5J4J5
2457C07J5j6j5j5j6m0m0m1m0ooooL4L4L4L4RJ0RJ0K7K6k9k8j5j5j5j5k6k5L0L0J1J2J1J2M
2441B44Mn1n1j3j3j3j3j2j2j2j2K3K3K3K2l2l3l2l2j6j6j6j6rqqqL5L6L4L6lklkk7k6K8K9
2424D6NNNOL8L9L9L8J0J1PPJ6l0o0o0j8j8j8j8j0j0j0j0j5j6j3j3J0N4L0L0J3J3J3J3rrrr
2406I3qpM5M6Pl9k9j%jjjk1n0n6j2L0N7O0L3mnJ9O6O6Kn1n1l4l5l4l4j1j0j0j0j0j2M3M4O5
2389A39O4O0O1J5m9q4n7l0l0k8k8K2K3K2K3K5K6k9l0k0k1k0k1ppM8M7N5N5%jk0k0k1k0K0K0
2373A82K1K0kjkjm0m0J6J6m4m3n7k7J7O5M1M0L6L6L6L6j7j7j8j7j3j4j3j3J1J2J2J2k6k7k6
2357A51k6l8l8l8l7j6j7j6j6K3K3K3K2K0J9J9J9j5j5j5j6j6j6j6j7mmN2N0M1M1M1M1%J%Jl1
$$ plain form
2475 -102 -101 -100 -99 -98 -97 -96 -111 -126 -142 -157 -114 -71 23 118 169 173 112 50 38 25 13 0 -12 -24 17 60 138 216 264 267 231 196 214 231 239 247 255 263 278 292 307
2457 307 322 306 291 276 260 220 180 139 99 93 87 81 75 109 143 177 211 220 230 239 249 276 302 273 245 230 215 200 185 159 134 164 194 205 217 228 240 244
2441 244 248 197 146 133 120 107 94 82 70 58 46 69 92 115 137 105 72 40 8 -8 -24 -40 -56 -65 -73 -81 -89 -54 -18 16 52 49 47 44 42 15 -11 17 46
2424 46 51 56 61 67 105 144 183 221 231 242 249 256 272 242 182 122 104 86 68 50 40 30 20 10 -5 -21 -34 -47 -37 17 47 77 90 103 116 129 120 111 102 93
2406 93 85 78 123 169 176 137 108 107 107 106 105 104 83 33 -23 -35 -5 52 112 145 141 136 155 221 287 289 238 187 153 118 84 50 39 29 19 9 -1 -13 30 74 139
2389 139 203 263 324 339 290 206 149 119 89 61 33 55 78 100 123 148 174 145 115 95 74 54 33 26 19 67 114 169 224 224 223 203 183 162 142 162 182
2373 182 203 223 221 220 218 217 177 137 153 169 125 82 25 -2 15 80 121 161 197 233 269 305 288 271 253 236 223 209 196 183 194 206 218 230 204 177 151
2357 151 125 87 49 11 -26 -42 -59 -75 -91 -68 -45 -22 0 20 39 58 77 62 47 32 16 0 -16 -32 -49 -53 -57 -5 45 86 127 168 209 209 210 210 211 180
2340A80l1k8k8k3K3N3N3M3M3M0M0%m7l6ql6l5l4l4mmlmK0J9K0K0rrrrJ8J8l8l7j4j4Mk3m0
2323C7NP0P0L6L6j9j9m8m7m7m7L9L9M0L9k0j9k0j9J1J2O7O7k5k5k5k5ononk4k4k4k4J5J5O9
2306A44O9P6M8lm9n0n0k5k6KKK9K9K8K7%%J0J0K6kk2k1l8j1j6j7j4j5KJ%%%k8j2j2%jJ5j2
2289I4n3n2j5J3M5M7M7M7K0qpK0L0L0k1k2%K7J2J2j8j9l4oK1K1K2K2rrOk2m6m7o4l6k2k2j8
2272a4j8PL4J9J9K1K1J9J9rl7l7rM1M0M3M2M1M0L9L9pl5o0q6q2q2m3j6k0j9j7L0O3O3K6jo
2255F8oL0N8M6J8j9k0j6j7j7j6LLMLJ1J2J1J1M2M1j5j4j3j2m0m1n4n5k4J9N9N9L2j3k0j9O
2239A05NJ2J2J2J2l8l8l8l7L3L4L4L4L6L5L6L6j5j6j5j6m0m0j3j2j%n2n2LO8J01P2M2J3k8
2223B84k8l4l5K2K1L0L0LLJ2J3j5j6n4n4n5n4LLMLK2K3K2K2OOk2k2n4n4KJk2k1k3k2OPOPL3
$$ plain form
2340 180 149 121 93 70 93 146 199 242 285 325 365 365 318 282 274 238 203 169 135 131 127 124 120 140 159 179 199 190 181 172 163 181 199 161 124 110 96 100 77 37
2323 37 42 112 182 218 254 235 216 168 121 74 27 66 105 145 184 164 145 125 106 117 129 196 263 238 213 188 163 157 152 146 141 117 93 69 45 60 75 144
2306 144 213 289 337 334 285 235 185 160 134 136 138 167 196 224 251 251 251 261 271 297 295 273 252 214 203 187 170 156 141 143 144 144 144 144 116 104 92 92 91 106 94
2289 94 41 -11 -26 -13 32 79 126 173 193 185 178 198 228 258 237 215 215 242 254 266 248 229 195 189 210 231 253 275 266 257 263 241 195 148 84 48 26 4 -14
2272 -14 -32 -25 9 28 47 68 89 108 127 118 81 44 35 76 116 159 201 242 282 321 360 353 318 258 172 90 8 -35 -51 -71 -90 -107 -77 -14 49 75 74 68
2255 68 62 92 150 196 214 195 175 159 142 125 109 112 115 119 122 133 145 156 167 209 250 235 221 208 196 156 115 61 6 -18 1 60 119 151 138 118 99 105
2239 105 110 122 134 146 158 120 82 44 7 40 74 108 142 178 213 249 285 270 254 239 223 183 143 130 118 117 117 65 13 16 84 185 257 299 312 284
2223 284 256 222 187 209 230 260 290 293 296 308 321 306 290 236 182 127 73 76 79 83 86 108 131 153 175 181 187 165 143 89 35 37 38 16 -5 -28 -50 -44 -37 -31 -24 9
2205IL4L4L4nnnnjkjkJ1J2J1J1L7L7j9j8l0l0K5K5jkkjj0j0j0rrrqrL2L2K9K9J5l1o0o0PQ
2185G8PQK7K8K8K8ppopjjlkk7n5o3j7N3Q1L8pJ2J2RRNMMMl4l4l3l4J5J6m0m0l0k8l0k9N5N5
2166D1N6N6K1K1K2K1l4l5l4l4PQO1O1M7K0Nm0o6o6j3j4J0RJ0ROOOOj5j4j4j5kllll3l3n6j1
2148b9M8P7P7N0qn4m2j5J5O0O2J6j1j2j4j4K8K9k7k7qpqp%J%Jj6j5j6j5L3L3L2L3l2l3l2l3
2131A20l3l2l3l1m1m0l7l6nN1P5P4j0j0j1rQQQQkkN2N2Ok2l9J7L5Qk9k8j8j7L7L8L9L8j6j7
2113A56qpqpnonnJ1J1J0J1nnnnK4K4K4K4M8M8m4m4l9m0J6J6m0m0n2k4J9P5M5M5J7J8l8l8o3
2096A09o4l7J8P4J03O5J1OPLKk1k1k2k1k1k2k1k1k3k3k2k3p1p1j7j6LLK2O7J04P8K8Jk2k2
2080A23k4k4MMMMJ3J4Lk4l3nM4P1O2L3Kk5n7n7p4m6k7k7j4J4N4N5Rj9k1OL5L5N1N0K1K1Qj9
$$ plain form
2205 9 43 77 111 106 101 96 91 90 88 87 85 96 108 119 130 167 204 185 167 137 107 132 157 156 154 152 151 141 131 121 112 103 94 86 77 109 141 170 199 214 183 123 63 70 78
2185 78 85 93 120 148 176 204 197 190 184 177 176 175 172 170 143 88 25 8 61 142 180 173 185 197 206 215 220 224 228 232 198 164 131 97 112 128 88 48 18 -10 -40 -69 -14 41
2166 41 97 153 174 195 217 238 204 169 135 101 108 116 177 238 285 305 310 270 204 138 125 111 121 130 140 149 155 161 167 173 158 144 130 115 113 110 107 104 71 38 -18 -29
2148 -29 19 96 173 223 215 161 119 104 119 179 241 257 246 234 220 206 234 263 236 209 201 194 186 179 179 180 180 181 165 150 134 119 152 185 217 250 218 185 153 120
2131 120 87 55 22 -9 -50 -90 -127 -163 -168 -117 -42 32 22 12 1 -8 0 8 16 24 22 20 72 124 130 108 69 86 121 129 100 72 54 37 74 112 151 189 173 156
2113 156 148 141 133 126 121 115 110 105 116 127 137 148 143 138 133 128 152 176 200 224 272 320 276 232 193 153 169 185 145 105 53 29 48 123 168 213 230 248 210 172 109
2096 109 45 8 26 100 203 268 279 285 292 295 297 276 255 233 212 191 169 148 127 104 81 59 36 -35 -106 -123 -139 -136 -133 -111 -44 60 138 166 167 145 123
2080 123 99 75 79 83 87 91 104 118 121 97 64 59 103 174 236 269 271 246 189 132 58 12 -15 -42 -56 -42 12 67 76 57 36 42 77 112 163 213 234 255 263 244
2062B44l0l0%K7K7j%%kkJ7J7L3Nl3l3n0k2kj%%j0rJ8J8L8L8Qk0k4k4k4k4j3J4O1O2M9K2RQ
2044C61k4n1l6l6k7k7o9p0l0L3N7K9j6m3k8k8j5J3M0M1ll1k9kM0O8N2N2M0J2K8K8mmnmj7j8
2028B77j8j7l9l8l9l8j5j5j5j4ONOOJ6J6J6J6L2L2L0L0%k7k8%L9L9N5K6j8m7l1l1kK6N3N3
2011C47M5%m0m0j4j5j3j3J7M6K9L0MNK0ql6l5l7l7j2j2j2j2nonoJ9J9JK9L9J2j8j7j9j8j9
1994B13j8J4J5L1Km4m4m6m5m3m3m0m0k3K4M4M3M9M9M7Jk2k1K0K0J6j2k2k2l2mM3M3L3NJ9J9
1978B29K1ok0m8m6j9K5K6Mm2m4m3PPPPMMl9l8k4K2M1M2J4J4j4j4J1J0N6N7OPm0m0l1l0l1l1
1961B1l1l2L2L1jkk7k7L6O2P4K8LL%%J8J9J9J9j6j6m4m4p6p5j1j2J7J8J6J7J3J3J2J3l2l2
1944FJ4J4PQk0k0J5J6l1k9l4l4L0L1%JK8K8L3L2LLOk1l2J4O1O1J7J8j6j7o2o2o0n9k2K3M4
$$ plain form
2062 244 214 184 184 211 238 237 237 237 235 233 250 267 300 305 272 239 189 167 165 164 164 164 154 145 163 181 219 257 265 245 221 197 173 149 136 150 211 273 322 344 353 361
2044 361 337 286 250 214 187 160 91 21 -9 24 81 110 94 51 23 -5 -20 -7 33 74 71 40 11 9 49 117 169 221 261 273 301 329 325 321 316 312 295 277
2028 277 259 242 203 165 126 88 73 58 43 29 35 40 46 52 68 84 100 116 148 180 210 240 240 213 185 185 224 263 318 344 326 279 248 217 215 241 294 347
2011 347 392 392 352 312 298 283 270 257 274 320 349 379 383 388 408 400 364 329 292 255 243 231 219 207 202 196 191 185 204 223 224 253 292 304 286 269 250 232 213
1994 213 195 209 224 255 257 213 169 123 78 35 -8 -48 -88 -111 -87 -43 0 49 98 145 146 124 103 123 143 159 147 125 103 71 67 110 153 186 191 210 229
1978 229 250 244 224 176 130 111 136 162 166 124 80 37 44 51 58 65 69 73 34 -4 -28 -6 35 77 91 105 91 77 88 98 154 211 217 224 184 144 113 83 52 21
1961 21 -10 -42 -10 21 20 18 -9 -36 0 62 136 164 167 170 170 170 188 207 226 245 229 213 169 125 49 -26 -37 -49 -32 -14 2 19 32 45 57 70 38 6
1944 6 20 34 41 49 29 9 24 40 9 -20 -54 -88 -58 -27 -27 -26 2 30 63 95 98 101 107 86 54 68 129 190 207 225 209 192 130 68 8 -51 -73 -50 -6
1927fJ6j0rK8N6O6K1m9n0l3J2L4Ok1k2non1n2k2k3K5K4N5N4K8K7L0L0L0L0K7K7K4K3j2o8l6
1911A98l6k0k0j6j7lN2K0K1j5j5j6j5JJJJJ6J6J6J5nnnnJ3J3J3J3L8L8L8L9k8k7k8k7n3n3
1894A54n2n3K1K1K2K1k2k3k2k3JJJJJ4J4J5J4K1K0k5k6k5k5K0K1L5L5O2Qn5j10q5l0OON1N2
1878F1M4j1m5m5k3k5MLN5N5N6N5j7j6j7j7K3K2K3K3k5k4k4k4K4K4K4K5j0j0j0j0K4K3m2m1
1862A32n0n0NNJ4J4J4J4K5K5K5K5j6j5j6j5ooN0M9N3N3klm0m0J5J5mlmlMMMMM6M7rrk8k9k9
1843B65k9j1j1j2j1J3J3J3J3m5m5m4m5JKJKK8K8K8K7N0M9oo%%j%J7J6J7J7k7k7k7k7j0rrj0
1826A88OPk2o7n9l1OOLLLLppppK3K3K3K3l0l0k9k9QJ0RJ0j2j2j1j2L5L7L6L7OPOPj0rM4M4
1806B22O6L8k3n0m4m4k9n6p4m5K7K6K9Kl6l4k8J9Q2Q3M2J5k5k5k9l0k7k8l3oL2L4K3K4K2K2
$$ plain form
1927 -6 10 0 -9 19 75 141 162 113 63 30 42 76 82 61 39 34 28 -23 -75 -97 -120 -95 -71 -16 38 66 93 123 153 183 213 240 267 291 314 302 234 198
1911 198 162 142 122 106 89 86 138 158 179 164 149 133 118 119 120 121 122 138 154 170 185 180 175 170 165 178 191 204 217 255 293 331 370 342 315 287 260 207 154
1894 154 102 49 70 91 113 134 112 89 67 44 45 46 47 48 62 76 91 105 126 146 121 95 70 45 65 86 121 156 218 226 171 61 -24 -54 -48 -42 9 61
1878 61 105 94 49 4 -19 -44 -40 -37 18 73 129 184 167 151 134 117 140 162 185 208 183 159 135 111 135 159 183 208 198 188 178 168 192 215 173 132
1862 132 82 32 37 42 56 70 84 98 123 148 173 198 182 167 151 136 130 124 174 223 276 329 327 324 284 244 259 274 270 267 263 260 264 268 272 276 322 369 360 351 323 294 265
1843 265 236 225 214 202 191 204 217 230 243 198 153 109 64 65 67 68 70 98 126 154 181 231 280 274 268 268 268 267 267 284 300 317 334 307 280 253 226 216 207 198 188
1826 188 194 201 179 112 53 22 28 34 37 40 43 46 39 32 25 18 41 64 87 110 80 50 21 -8 0 10 19 29 17 5 -6 -18 17 54 90 127 133 140 146 153 143 134 178 222
1806 222 288 326 303 253 209 165 136 80 6 -39 -12 14 43 45 9 -25 -53 -34 48 131 173 188 163 138 109 79 52 24 -9 -15 17 51 74 98 120 142
1791A42j0l8m9kL6L6l5o4m0j4l0k9QL5K0K0M1M2M2M3K6K6M1J4k5k5m3j5K2K3j4m2m2j4K3K2
1775A31Rj9mlJ4J5J4J5kj%JkK6K5kk2k2J6M4J6J7J8J9j9j8K1N0K7K8K7K7k9p4p3k7J1L8K4
1758C16K4K6km1m2l4l3ML3K3nm0m1l9j2M0Q5R3R2K9j7o1o0o4o3mlmlpoK1K1J3J3m3m3QPk0
1741A61k0%JK8K8OOO2O1M6M6j0rn8n7q5q5p2p0K1K0N2N1K4K4K6K7N2N2k3n2j8M6M1J3k2k3
1725B90j2j3o5o5o0j4J5J6k0j9QRJ6J5l9m0l9l9J5J6L4L4PPj4j3j3j4O6O6O7O6L5L4k0k0l8
1709B59l8l7l8J%N6N6M4M4j1j1p5p5m6JO2O3L5j2m4p2m7j9LMNN%%%%RQQQJKJJn3n3n2n3J4
1690d6J4J4J4nmnmj4j4M2M0P0O9M5j0l2l1qpj9j9j9j8J3J2J3J3J8J9J8J8n8n8n8n7j6j5j5
1673a00j6J5J5J4J5O9P0P0P0K2K2j4m2m1J3L7L6kkkkK2K2K1K2J1J1j7j7k8k9QL6J9l7r6r6
$$ plain form
1791 142 132 94 45 43 79 115 80 16 -24 -38 -68 -97 -89 -54 -34 -14 27 69 111 154 180 206 247 261 236 211 168 153 175 198 184 142 100 86 109 131
1775 131 140 121 117 114 128 143 157 172 170 169 169 170 168 194 219 217 195 173 189 233 249 266 284 303 284 266 287 337 364 392 419 446 417 343 270 243 254 292 316
1758 316 340 366 364 323 281 247 214 218 251 274 269 229 188 149 137 177 262 355 447 476 459 398 338 274 211 207 204 200 197 190 184 205 226 239 252 209 166 174 181 161
1741 161 141 141 142 170 198 204 210 272 333 379 425 415 406 348 291 206 121 49 -21 0 20 72 123 147 171 197 224 276 328 305 253 235 281 322 335 313 290
1725 290 278 265 200 135 75 61 76 92 72 53 61 70 86 101 62 22 -17 -56 -41 -25 9 43 50 57 43 30 17 3 69 135 202 268 303 337 317 297 259
1709 259 221 184 146 147 147 203 259 303 347 336 325 250 175 129 130 192 255 290 278 234 162 115 96 99 103 108 113 113 113 113 113 122 130 138 146 147 149 150 151 98 45 -7 -60 -46
1690 -46 -32 -18 -4 -9 -13 -18 -22 -36 -50 -8 32 102 171 216 206 174 143 135 128 109 90 71 53 66 78 91 104 122 141 159 177 119 61 3 -54 -70 -85 -100
1673 -100 -116 -101 -86 -72 -57 12 82 152 222 244 266 252 210 169 182 219 255 253 251 249 247 269 291 312 334 345 356 339 322 294 265 273 309 328 291 195 99
1657I9j0j1J7J8j7j7m1m0%N4N2N2QQQQM6M6M5M6qpqpJ5J5J5J5m3m3m3m3j3j3j4j3k8k9k5k6
1640F8QN3J0n4o5l6J8M8N5N5JJQQQQrj0j0rllklk7k7k7k7NMMML2L1k4k4j5j5j2j2J0N6Q5Q5
1621B51L6L5k1k0k7k6k4k3K5P1P1K4k7k6l0l0k4k4k2k3n9l2J6O3N1Nn8n8m6m5J0RM9N0M9M9
1605B19j3j2j3j2j6j6j6j6L0L1k5k5K4K4K3K4K9K9k7k7k6k7k7k6r0q8n8j2K2N0N3K4RJ0QQ
1590D5lmlmJ7J7J6J7rqrrPOOPk4k3k4k3K9L0L0L0nmM7M7L8j8m2m2j8j9j9j9o5o6j1j1j8j8
1572a29j4j4oN0P4P3J5J6m0m0j0j0j1j0K1K0K0K1L9L9L8L9N9N8MLl6l5l6l5J4J4J4J4j9k0
1556A80j9j9l0l0K6K6J2J1J2J2k4k4k4k4j3j3j1j2J7M5O0Mm9m9LLL0K9L2L1pK1L6j9o5o6j4
1540G8j4qpqql2l1K4K2M9M9ooK1K1K2K1J1J0J1J1l8l8l8l7ppppPOPOj2j3J6J5K5K5m0m0j7
$$ plain form
1657 99 89 78 95 113 96 79 38 -2 -2 52 104 156 164 172 180 188 234 280 325 371 363 356 348 341 356 371 386 401 358 315 272 229 216 203 189 176 148 119 94 68
1640 68 76 129 139 85 20 -16 2 50 105 160 161 162 170 178 186 194 185 175 165 156 153 150 148 145 118 91 64 37 42 46 50 54 86 117 93 69 54 39 27 15 25 81 166 251
1621 251 287 322 301 281 254 228 204 181 206 277 348 372 345 319 289 259 235 211 189 166 107 75 91 154 205 210 152 94 48 3 13 22 71 121 170 219
1605 219 206 194 181 169 153 137 121 105 135 166 141 116 140 164 187 211 240 269 242 215 189 162 135 109 19 -69 -127 -139 -117 -67 -14 10 19 29 37 45
1590 45 42 38 35 31 48 65 81 98 89 81 72 63 70 76 82 89 65 42 18 -5 24 54 84 114 109 105 152 199 237 219 177 135 117 98 79 60 -5 -71 -82 -93 -111 -129
1572 -129 -143 -157 -163 -113 -39 34 49 65 25 -15 -25 -35 -46 -56 -35 -15 5 26 65 104 142 181 240 298 302 305 269 234 198 163 177 191 205 219 200 180
1556 180 161 142 112 82 108 134 146 157 169 181 157 133 109 85 72 59 48 36 53 98 158 162 113 64 67 70 100 129 161 192 185 206 242 223 158 92 78
1540 78 64 56 49 41 33 1 -30 -6 16 65 114 108 102 123 144 166 187 198 208 219 230 192 154 116 79 72 65 58 51 58 64 71 77 65 52 68 83 108 133 93 53 36
1522C6j6j6j5M3M4M3M4l0l0kkK9K9l5o3n3LlklkO0O2J8J8J8J8L8L8qqn9o0l1l0j6J2M5J00
1505B14P3J8m9p8o1l3jK6L1L2NNK5K5K5K5k3k3k3k3p6p5p5p6K1K1K1K1L6L7L7L7J6J6J6J6
1489A83MMMNm5m5m4m5k3k5k4k4j4j5N1N1M2M3O7O7J9l7q5n7oK1L5L5K9K9L0K9K4K4k2k2k3
1473B40k2NOl0k9k9l0j5j6j5j6k0k0nN0O4O4K1K1L6L5QQj2j2j3j2j4j4j4j3J2J3J3J3l0k9
1457A99l0k9RQL7L6J9J9m4p3o7j1L8O7O2Ok5k5J7J7O3O3M9M8l4o1n8kL0L0K0K1K0K1j5j6j5
1441C94j5n5n4n5n4l7l7l8l7j5j7j6j7PPPPPPPOJ0J1J0J0J9J9k3k3k0L5O9O9M8M7KJllklo
1423B69oonKKLKm6m6m6m6RQQRm0l9K5P1Q4N7Rl7n5n6klJ8J7j0j0j8j9j8j8PPk1k1k5k4L0L0
1404E0M2M2M2M2J6J5J6J5j0j1j1j0NNONJ4J4J4J4kkkkL1L1L1L0K3K3l3l3l6l6l6l6n1n2k4
$$ plain form
1522 36 20 4 -11 32 76 119 163 133 103 101 99 128 157 122 59 6 9 6 4 1 -1 59 121 139 157 175 193 231 269 261 253 194 134 103 73 57 69 114 214
1505 214 287 305 256 178 117 84 83 109 140 172 177 182 207 232 257 282 259 236 213 190 114 39 -36 -112 -91 -70 -49 -28 8 45 82 119 135 151 167 183
1489 183 187 191 195 200 155 110 66 21 -2 -27 -51 -75 -89 -104 -53 -2 40 83 150 217 236 199 114 57 51 72 107 142 171 200 230 259 283 307 285 263 240
1473 240 218 223 229 199 170 141 111 96 80 65 49 29 9 4 54 118 182 203 224 260 295 303 311 299 287 274 262 248 234 220 207 219 232 245 258 228 199
1457 199 169 140 149 157 194 230 249 268 224 151 84 73 111 178 240 246 221 196 213 230 293 356 405 453 419 358 300 298 328 358 378 399 419 440 425 409 394
1441 394 379 324 270 215 161 124 87 49 12 -3 -20 -36 -53 -46 -39 -32 -25 -18 -11 -4 2 12 23 33 43 62 81 58 35 15 50 119 188 236 283 285 286 283 280 278 275 269
1423 269 263 257 252 254 256 259 261 215 169 123 77 86 94 102 111 71 32 57 128 212 269 278 241 186 130 128 125 143 160 150 140 122 103 85 67 74 81 60 39 14 -10 20 50
1404 50 92 134 176 218 234 249 265 280 270 259 248 238 243 248 254 259 273 287 301 315 313 311 309 307 338 369 400 430 453 476 443 410 374 338 302 266 215 163 139
1387A39k4OOm9n0n6n6jjM7M6K0J9rqppM4P3L8k7q2q0l0l1POL4L3j2j2M1M3L2L2k4k4l3l4l3
1370b4l4l2l2K3K3M6M4M3M4ml1m2MO3O2J0J0PPL4L5M2M3k2o8p3m4qqNMk1k2k4MJ4J4Nk3o0
1353A4n9n6j0K2K1J7M5P2M5J0J0k0j9l2l1OL4J7j1rJ8K4K3kkmln8n7m5j9K1K2K8L0J7j0l4
1336A5l4l4l5k6KM1M1L7L7L8L7J7J7J5J5k5n3n1k4J3M1K6K7k6k6k7k6k5k5n2n1l8rJ4M3N8
1321e3N8P4M7j6m4q2q3q7n9l3nK9N7O9O9N2K3j3j3j4J4K5K7nmmmlklkj0j0k6KM3M4M4M4J8
1303A64j0j0J8J2J2J3J4qqqqm1m1k6n3j01j02j3N1P5M7J1J1L4L4L3L2K2npK0L3Ol3l2KKJ9
1287A59qrJ8J7j1l1l1m9k0K3K3K5K5K1K2K0J9K8Jl8l8l0kL6L6j5m2k4k3j1L5O3O3M1J4j1l8
1271B58m8m7n0m9NNNNM3M2N6K9l9o7n2n1j9QM7M6Jk7j1j1KKJKmmnmk4k3l8j1L0L1L3L2K2K1
$$ plain form
1387 139 115 121 127 78 28 -28 -84 -85 -86 -39 7 27 46 37 29 22 15 59 132 170 143 61 -19 -49 -80 -73 -67 -33 0 -12 -24 17 60 92 124 100 76 43 9 -24
1370 -24 -58 -90 -122 -99 -76 -30 14 57 101 97 66 24 28 91 153 163 173 180 187 221 256 298 341 319 251 178 134 126 118 123 127 106 84 60 64 78 92 97 74 14
1353 14 -45 -101 -111 -89 -68 -51 -6 66 111 121 131 111 92 60 29 35 69 86 75 66 84 108 131 129 127 123 120 62 5 -40 -59 -38 -16 12 42 59 49 15
1336 15 -19 -53 -88 -114 -112 -71 -30 7 44 82 119 136 153 168 183 158 105 54 30 43 84 110 137 111 85 58 32 7 -18 -70 -121 -159 -168 -154 -111 -53
1321 -53 5 79 126 110 66 -16 -99 -186 -245 -278 -283 -254 -197 -128 -59 -7 16 3 -10 -24 -10 15 42 37 33 29 25 22 20 17 15 5 -5 -31 -29 14 58 102 146 164
1303 164 154 144 162 174 186 199 213 205 197 189 181 140 99 73 20 -81 -183 -196 -145 -70 -23 -12 -1 33 67 100 132 154 149 142 162 195 201 168 136 138 140 159
1287 159 151 142 160 177 166 135 104 55 35 58 81 106 131 152 174 194 213 241 242 204 166 136 134 170 206 191 149 125 102 91 126 189 252 293 307 296 258
1271 258 210 163 113 64 69 74 79 84 127 169 225 254 215 148 96 45 26 34 81 127 128 101 90 79 81 83 84 86 82 78 73 69 45 22 -16 -27 3 34 67 99 121 142
1252A42K1K1j5j5j6j5RRRRj3j3J6O3P6P6K3K3m8m8m8m8k5k6L1L0k1k2k1k2RRQRM7M8qpj2j1
1235B34j1j1kjjjj7j8j7j7J0J0J0J0l4l3l4l4K5K5K5K5MLn2n3nnnoMMMMO3O4QQj9j8j9j8j0
1216I9j0j1j0M0L9M0M0O3O4QRk5k4o2q9q7m1K4K4K0K1K1K0L6L7k0j9JKN4N3k9p6n0m9l3l3
1200D7l3l2K5K7K7K6J6J5J5J5k0k0k0k0J9J9J9K0jjj%j3j2j2j2j1j1j0j1l6l5l6l7K1K0K0
1184c3K0L7L8J0l5p6m9RL6J8J7J8J8jkn3n4KM9L7J1L4L5L3L3j1j1j1j2mnnml6l6l2l3KM6R3
1167I3O5QQPPj2j2j1j2m5m5m5m4l7l7N3N3M1J4JM7P2K5jjJKKJL7L6L4L4k0o6n5k7mmkkj8j8
1148A23j9j8LLLLKLLLoooom0m1l9m1J5J4J5J5N9N9N7N6L9j6m0m0j3j2j3j2k6k7k6k6j4j5j4
1131d1j5L1L1L1L2J5J6O7O8M0j4n9q6r3o5k3L2M5J9j7j6K7K8K9K8OOO2O2%J%JPOPPK3K2K3
$$ plain form
1252 142 163 184 169 154 138 123 132 141 150 159 146 133 149 212 288 364 387 410 362 314 266 218 193 167 198 228 207 185 164 142 151 160 168 177 224 272 264 257 245 234
1235 234 223 212 210 209 208 207 190 172 155 138 148 158 168 178 144 111 77 43 68 93 118 143 147 150 98 45 40 35 30 24 28 32 36 40 103 167 175 183 164 146 127 109 99
1216 99 89 78 68 108 147 187 227 290 354 362 371 346 322 260 171 84 43 67 91 111 132 153 173 209 246 226 207 208 210 264 317 288 212 162 113 80 47
1200 47 14 -18 7 34 61 87 103 118 133 148 128 108 88 68 87 106 125 145 144 143 142 142 129 117 105 93 82 71 61 50 14 -21 -57 -94 -73 -53 -33
1184 -33 -13 24 62 72 37 -39 -88 -79 -43 -25 -8 10 28 27 25 -28 -82 -80 -31 6 17 51 86 119 152 141 130 119 107 103 98 93 89 53 17 -15 -48 -46 0 93
1167 93 158 166 174 181 188 176 164 153 141 96 51 6 -38 -75 -112 -59 -6 35 49 50 97 169 194 193 192 193 195 197 198 235 271 305 339 319 253 198 171 167 163 161 159 141 123
1148 123 104 86 89 92 95 98 100 103 106 109 103 97 91 85 45 4 -35 -76 -61 -47 -32 -17 42 101 158 214 253 237 197 157 144 132 119 107 81 54 28 2 -12 -27 -41
1131 -41 -56 -25 6 37 69 84 100 167 235 275 261 202 116 23 -42 -65 -33 12 31 14 -2 25 53 82 110 116 122 184 246 246 247 247 248 255 261 268 275 298 320 343
1113C43K3onooM6M7m6m7p1p1p1p1%jj%RRJ0RL1L1L2L1N0N0onrrrqk1k1k1k1M2M1M2M1j4j4
1095C27j4j4l3l3K3K3J2J3m3m3RRRRpon9n8k4L1J%j3j3j4j3opooJJJJJ8J7J7J7OOPOJ7J8J6
1075B03J5J9j0QQL7O5O2L4pn4k9k9m0l9l7l8k0Prq%%llj5o2n1k2llJ%J8M4M5J7RRQPK1K1K2
1056A98K1K1K1K1K1j4j4l1mJ9rl8o6o0j4K3K3K5K5K4K5%Jj7J1ql6j9j8l7l8l5J1L6L6noJ2
1040A05M0N0N0L6Rn8q6p9l3NMK3K4M9M9L6QmmJ4J4Jk6l3l3l4l5n2n1l7J8M6M8N1N1J0J0j8
1023A68j8j8j8K8K8RRj9j9j4j5j5j4mlllk4k4o6o7l2K2L8L7J4J3j4j4NNL2L3N3N3K0l6m2m1
1006D4J9K0M4M3k0k1j1j1j1j1k6k6QO3N7N7mmk7k8k7k8K6K6K6K7j3j3j2j3QQN4N5J1J2j6j6
990B70m2m1m2m1k2k1k1k2K9K9K9K9kkm5m4J1O8O7J2j9j8K4K4rrqrk8k7k8k7j6j6j6j6OOPQ
$$ plain form
1113 343 366 360 355 349 343 389 436 390 343 272 201 130 59 59 58 57 57 66 75 85 94 125 156 188 219 269 319 313 308 299 290 281 273 252 231 210 189 231 272 314 355 341 327
1095 327 313 299 266 233 256 279 291 304 261 218 227 236 245 254 247 241 182 124 100 131 132 132 119 106 92 79 73 66 60 54 55 56 57 58 76 93 110 127 133 139 146 152 169 187 203
1075 203 218 237 227 235 243 280 345 407 441 434 380 351 322 282 243 206 168 148 155 146 138 138 138 135 132 117 55 4 -18 -21 -24 -23 -23 -5 39 84 101 110 119 127 134 155 176 198
1056 198 219 240 261 282 303 289 275 244 240 259 250 212 146 86 72 95 118 143 168 192 217 217 218 201 212 204 168 149 131 94 56 21 32 68 104 99 93 105
1040 105 145 195 245 281 290 232 146 67 34 39 43 66 90 139 188 224 232 228 224 238 252 253 227 194 161 127 92 40 -11 -48 -30 16 64 115 166 176 186 168
1023 168 150 132 114 142 170 179 188 169 150 136 121 106 92 88 85 82 79 55 31 -35 -102 -134 -112 -74 -37 -23 -10 -24 -38 -33 -28 4 37 90 143 163 127 85 44
1006 44 63 83 127 170 150 129 118 107 96 85 59 33 41 104 161 218 214 210 183 155 128 100 126 152 178 205 192 179 167 154 162 170 224 279 290 302 286 270
990 270 228 187 145 104 82 61 40 18 47 76 105 134 132 130 85 41 52 120 187 199 180 162 186 210 201 192 184 175 147 120 92 65 49 33 17 1 7 13 20 28
972B8N1P9M9nm2j4nno6o6o5o6NONNK2K1K2K1RRPRRRRQJ9J8J8J8J8J9J8J8J9J9J9J9poponn
953B35nnnmnnkkkkk0j9k2k1m1o9l7J7Q6Q7M3M4k4k5n2n3J7J6J6J7l6l5J0J1J4J3k9k9qM7O3
935A79O2kkmmNk2l8J8O9P0QQj8j9j8j8K4K5K4K5PQJ2m2o2l3opk3k3NMM1M0onppK0K1K5K5K4
916C83K5j4j4n6n7m4J2K6K7RRRQJ9J9J8J9rj0rj0j3j4j3j4KKo3o3o5o4j8j8MMMLJ4J3M2M1
898A44L6L6j0j0l7l7j0rL9M0M0M0M8M8L3k3k2k2k5k6KKJKl5l6l5l5L6L7L6L6pqppJ3J3J4J3
881C08nnonj4j4j4j4n0n0p4p3n5%L4O1L4Ommj3j2J5M2M2j3k7k7OONOK5K6K5K6J2J2J2J2RR
862B54j9j9n1n0MNj0j0j0j0LLMLJ%k7k6j9j9L6L7K5K6kkJ1J1Kk6l8PP0O9L3j3l0kJ2J3m1m1
844A64k1k2k1k1m6m5m5KM4M2J7k9o0o1l7l6M5M5M5M4K1K1l2l0j3L3O3O3K1K2l4l4l3l2nnJ5
$$ plain form
972 28 79 158 207 202 160 146 141 136 70 4 -61 -127 -122 -116 -111 -106 -84 -63 -41 -20 -11 -2 5 14 23 32 41 49 68 86 104 122 140 159 177 195 214 233 252 271 264 258 251 245 240 235
953 235 230 225 220 216 211 206 204 202 200 198 178 159 137 116 75 6 -31 -14 72 159 202 246 222 197 145 92 109 125 141 158 122 87 97 108 122 135 106 77 69 116 179
935 179 241 239 237 233 229 234 212 174 192 261 331 339 347 329 310 292 274 298 323 347 372 379 387 399 357 295 262 256 249 226 203 208 212 253 293 287 282 275 268 288 309 334 359 383
916 383 408 394 380 324 267 223 235 261 288 297 306 315 323 342 361 379 398 389 379 370 360 347 333 320 306 308 310 247 184 119 55 37 19 23 27 31 34 48 61 103 144
898 144 180 216 206 196 159 122 112 103 142 182 222 262 310 358 391 368 346 324 299 273 275 277 278 280 245 209 174 139 175 212 248 284 277 269 262 255 268 281 295 308
881 308 303 298 292 287 273 259 245 231 181 131 57 -16 -71 -71 -37 24 58 64 60 56 43 31 46 88 130 117 90 63 69 75 80 86 111 137 162 188 200 212 224 236 245 254
862 254 235 216 165 115 119 124 114 104 94 84 87 90 94 97 98 98 71 45 26 7 43 80 105 131 129 127 138 149 151 125 87 94 164 233 266 253 223 221 233 246 205 164
844 164 143 121 100 79 33 -12 -57 -55 -11 31 48 19 -41 -102 -139 -175 -130 -85 -40 4 25 46 14 -16 -29 4 67 130 151 173 139 105 72 40 35 30 45
828D5J5P0P0M4M3j1j2o1o1l4l3J3J2M1M0k3k4k3k4%%J%J0J0m2m2k5J9M9N0M4M5J4J4km7p3
812A12p4k3K3N3N3N2N2llJ5J5J5J5QRL6L7J2J2m3m3n3n3KLNONOn4n3n4n3J2J2J2J2j0j0j0
794E5j0k0k1L5L5mnmmK7K6Q0P9K4k1n1n1L2L3L2L3k5k4k4k4m1m2m2m1RRO4O5N7N6K8j9n4n3
777A99jjMNk3k3J4J5M3M2k0k0k0k0kkkkmllmN7N7JJm7m7j8K8M7M8onj0j1j0j1n2n2n2n2l5
759Cl5N5N7M7M8qqOOPOJ8J8l8l7JJKJNMNNKKKKk3k3k0k0L2Q7N6N6qpqpj1j1j1j0l2l1l2l1
738A23k3k3k3k3J7J7j1j0l1k9K5K5jkK7K6M0M0j5j5K3K3jn6n8n8pnL6L8j5j4qM8P2P2P3P3
722C70J3m4m0m1m4m4m8m8m7m7nnK3K1L9L8j7j7mnmnl9l8j4M0P6P6K5K5J4J4oo2j13n7OO0K9
705G5K9L2L2J5J6J5J5MMLMllllJ2J1J2J1J6J5j2j2k0k0p2p2m7%K9K9j5j6j5j6k2k3L2L3Q7
$$ plain form
828 45 60 130 200 244 287 276 264 203 142 108 75 88 100 141 181 158 134 111 87 87 87 88 88 98 108 66 24 -1 18 67 117 161 206 220 234 232 185 112
812 112 38 15 38 91 144 196 248 245 242 257 272 287 302 310 319 355 392 404 416 373 330 277 224 226 229 234 240 245 251 197 144 90 37 49 61 73 85 75 65 55
794 55 45 25 4 39 74 70 65 61 57 84 110 190 269 293 272 221 170 202 235 267 300 275 251 227 203 162 120 78 37 46 55 119 184 241 297 325 306 252 199
777 199 198 197 201 206 183 160 174 189 232 274 254 234 214 194 192 190 188 186 182 179 176 172 229 286 287 288 241 194 176 204 251 299 293 288 278 267 257 246 194 142 90 38 3
759 3 -32 23 80 127 175 167 159 165 171 178 184 202 220 182 145 146 147 149 150 155 159 164 169 171 173 175 177 154 131 111 91 123 210 266 322 314 307 299 292 281 270 259 249 217 186 154 123
738 123 100 77 54 31 48 65 54 44 13 -16 9 34 33 31 58 84 124 164 149 134 157 180 179 123 65 7 0 -5 31 69 54 40 32 80 152 224 297 370
722 370 383 339 299 258 214 170 122 74 27 -20 -25 -30 -7 14 53 91 74 57 53 48 44 39 0 -38 -52 -12 64 140 165 190 204 218 212 150 37 -20 -14 46 75
705 75 104 136 168 183 199 214 229 233 237 240 244 241 238 235 232 244 255 267 278 294 309 297 285 265 245 173 101 54 54 83 112 97 81 66 50 28 5 37 70 157
688A57Q8N8J2j4j4j6j7k5k5k5k5l0l0lkK6K5P7P8L9k5q1q1l8l8j1j0j0j0j0j0KJN6N7P0P0
672B66J5J4qqrqm0m0m1m0jkN1N1L4j2k9kJ6J6rj0JKK9K9M9M8K1K0K9K9K9K8l5l5l5l5o1o1
654B56o1o1NNnl2k2K3O7L9j1j2J4J5m8m8m9m8qqrpk8k8K8K8RJ0RJ0nnML1K8k8o1l4K5P9N7
636A24Jk0QM1M1K1l5l4K1M8M8mlm7m6j9j9J3J4M1M1RRRRj9j9j9k0J0RRRj1j2j1j1J6J6J6J6
619B50M6M7M6M6l5l5l5l5o1o2o1o1n9n9mmM9M9P3P4N3lk8k7n2n2RO4Q3Q3K7k8k0PMk4o2o3
602A40rrklK5K6K9L0K9L0K3K4l3l2k3k2k3k3l4l3l3l3K6K7K6K7mllmJ1J1J1J0MMMMmnJ3j5
584A84j5J3nmrrrqkkj%JK9J3J3mmk0QRRQRl6o4k9L5P5P4L7RNk2l7l6j7j7j7j7j8j9j9j8qp
564E8ook3NM5M5K9K8K8K9OONNl0n9m0m1j1J6J6j1k2k3k2k2L8O6M9M8nl2j9j9k4n1n0k2L6O4
$$ plain form
688 157 245 303 315 301 287 271 254 229 204 179 154 124 94 91 89 115 140 217 295 334 309 228 147 109 71 60 50 40 30 20 10 12 13 69 126 196 266
672 266 281 295 287 279 270 262 222 182 141 101 100 98 149 200 234 222 193 191 207 223 214 204 205 207 236 265 314 362 383 403 432 461 490 518 483 448 413 378 317 256
654 256 195 134 139 144 139 107 85 108 175 214 203 191 205 220 172 124 75 27 19 11 2 -5 -33 -61 -33 -5 4 14 23 33 28 23 27 58 86 58 -3 -37 -12 67 124
636 124 125 105 113 154 195 216 181 147 168 216 264 260 257 210 164 145 126 139 153 194 235 244 253 262 271 252 233 214 194 204 213 222 231 220 208 197 186 202 218 234 250
619 250 296 343 389 435 400 365 330 295 234 172 111 50 -9 -68 -72 -76 -27 22 95 169 222 219 191 164 112 60 69 133 216 299 326 298 278 285 289 265 203 140
602 140 131 122 120 117 142 168 197 227 256 286 309 333 300 268 245 223 200 177 143 110 77 44 70 97 123 150 146 143 140 136 147 158 169 179 183 187 191 195 191 186 199 184
584 184 169 182 177 173 164 155 146 138 136 134 133 133 134 163 176 189 185 181 161 169 178 187 195 204 168 104 75 110 185 259 296 305 310 288 251 215 198 181 164 147 129 110 91 73 65 58
564 58 52 46 23 28 73 118 147 175 203 232 238 244 249 254 224 165 125 84 73 89 105 94 72 49 27 5 43 109 158 206 201 169 150 131 107 56 6 -16 20 84
547H4O5L8kkmmqpppj5j4j4j4k5k6k5k5rrrj0PPQRK1N1L5L5KLKKj5j6%k7o0o0o1o2LLMLllM3
526a18M4N0M9MMJ8J8J8J8J5J5J5J5k7k6k7k6n0m8k8J8L9O4O9M1J3J3J1J1jjjjl1l1l1l1J0
509I4J0RJ0K1K1K2K1ooook5k4LLM0M0ooJ0J0L8L8K9K8j8j8n2n3pK1lm8o7o7qqrqJ1J0L7L6
490A11ll1KM8O5J9l6l6lll1l1k7k7k6k7J5J5j2j3JJM6M8L8L9qpJ2J3J2J3PQl9l9j4j5J4J3
473A12L7L8P9Q0J5m9n9n8mnmml0l0l1l0RRl3l4j9M2R0J17Q6K1l5q0q6q6p3m6ON1M2J5NNKL
456F8mmmmK3K3K3K3K3K3K0K0Nm1m3MK9Kk6k6K0K0Km5o1l3nnnoK3K2M1M2Mm1m8k0K7N5L5QK6
437A90K5jkjkk2k2k2k2j6j5j6j5rqrqJ8J9J8J9J8J9J8J9l6l6l6l5j5j4N0N1M2M2M1M0K6kk5
420B66p2q2q3k9l1qpqqN4N4N4N4L0L0K7K7jm7p4p4l2J5M5M4L1L0K8K7K0k6n5n6l1l2K4K4L3
$$ plain form
547 84 149 187 185 183 179 175 167 160 153 146 131 117 103 89 64 38 13 -12 -21 -30 -39 -49 -42 -35 -27 -18 3 54 89 124 126 129 131 133 118 102 102 75 15 -45 -106 -168 -165 -162 -158 -155 -158 -161 -118
526 -118 -74 -24 25 29 33 51 69 87 105 120 135 150 165 138 112 85 59 9 -39 -67 -49 -10 54 123 164 177 190 201 212 211 210 209 208 177 146 115 84 94
509 94 104 113 123 144 165 187 208 202 196 190 184 159 135 138 141 181 221 215 209 219 229 267 305 334 362 344 326 274 221 214 235 232 184 117 50 42 34 25 17 28 38 75 111
490 111 108 77 79 127 192 211 175 139 136 133 102 71 44 17 -9 -36 -21 -6 -18 -31 -30 -29 17 65 103 142 134 127 139 152 164 177 184 192 153 114 100 85 99 112
473 112 149 187 266 346 361 312 253 195 191 186 182 178 148 118 87 57 66 75 42 8 -11 31 121 238 324 345 310 230 144 58 -15 -61 -55 -4 38 53 58 63 65 68
456 68 64 60 56 52 75 98 121 144 167 190 210 230 235 194 151 155 184 186 160 134 154 174 176 131 70 37 32 27 22 16 39 61 102 144 148 107 59 39 66 121 156 164 190
437 190 215 214 212 211 209 187 165 143 121 105 90 74 59 50 42 33 25 43 62 80 99 117 136 154 173 137 101 65 30 15 1 51 102 144 186 227 267 293 291 266
420 266 194 112 29 0 -31 -39 -46 -54 -62 -8 46 100 154 184 214 241 268 267 220 146 72 40 55 100 144 175 205 233 260 280 254 199 143 112 80 104 128 161
403A61L3L3L3MNMMl4l5l5l5KJKKk8k7k7k7M3M3j3j2j2j1j2j1K0K0K0K0K8K8K8K8K5K6lm8n9
386A84l1OOLKLLJ8J7J8J8jkllol4m5KN4N5l6l5k5k5pl5o5j9K4ll9m1J4J3K6K6K7K7N7N6N7
368B61N7J4J5m1m1l1l2l1l2ooM9M9O5O6jm6p2p2J8J8J8J8l6l6o2l4J7O3O7O7J5J5k6k5k6k6
352B10mmlmoonok2k2k2k1%J%J%J%JRJ0RJ0J6J7J6J6l4l4l4l4j4j3j4j3m9m9m8m8l9j0O3J28
333e0J13O8K2pl2l3l5l5RRQRN1N2mnk1k1k1k1L8L9L9L9J1J2m4m4j2j3j2j3K6K5K6K6m4m5K0
316A30O5K6k1QRk4k3k4k3J6J6J6J7L2L2L1L2K9K9n5n4o6o5l8l7j6j5J3J2RQQRqqQO2P2P1M1
298C24j4l8l8MNL6L6k9k8o2o2o2o3lmlmM1M1M2M1N7N6M2j4k9k9L2L2K9K9l5l6KJJJj6j6j6
281B51j6K7K7L0k5o9p0qrool3l4j1j1j2j1L1L1P7P7P1P1POk1k1k1k2j0j1j1j1j0j0l8l8j6
$$ plain form
403 161 194 227 260 264 269 273 277 243 208 173 138 140 141 143 145 117 90 63 36 79 122 109 97 85 74 62 51 71 91 111 131 159 187 215 243 268 294 291 243 184
386 184 153 159 165 168 170 173 176 194 211 229 247 246 244 241 238 232 198 153 155 209 264 228 193 168 143 136 101 36 17 41 38 -1 -42 -28 -15 11 37 64 91 148 204 261
368 261 318 332 347 306 265 234 202 171 139 133 127 176 225 290 356 355 309 237 165 183 201 219 237 201 165 103 69 86 149 216 283 298 313 287 262 236 210
352 210 206 202 199 195 189 183 178 172 150 128 106 85 85 86 86 87 87 88 88 89 98 108 117 127 143 160 176 192 158 124 90 56 42 29 15 2 -47 -96 -144 -192 -231 -241 -178 -50
333 -50 63 131 153 146 114 81 46 11 20 29 37 46 97 149 145 140 119 98 77 56 94 133 172 211 222 234 190 146 134 121 109 96 122 147 173 199 155 110 130
316 130 195 221 200 208 217 193 170 146 123 139 155 171 188 220 252 283 315 344 373 318 264 198 133 95 58 42 27 40 52 61 69 77 86 78 70 78 140 212 283 324
298 324 310 272 234 238 243 279 315 286 258 196 134 72 9 6 2 -1 -5 36 77 119 160 217 273 315 301 272 243 275 307 336 365 330 294 296 297 298 299 283 267 251
281 251 235 262 289 319 294 225 155 147 138 132 126 93 59 48 37 25 14 45 76 153 230 301 372 379 385 364 343 322 300 290 279 268 257 247 237 199 161 145
265A45j5L0L1LLM9N0J8J8j0j0pqK0K0K4K3k2k3l1l2mmklK5K5M4M5k0k1l0l1l1l0m3m2m0l9
248G5J3O0M8J9%k9l0kL0K9MMl3l3K8K9Km4l4oRQJ1J0J0J1J0J0J2J1J1J2kkkkqrl3l3k8J7N7
229B10N6OPk2k1m4m4LKj6j7j6j7k1k0k1k0K9L0L0L0j6j6j6j6j9k0m6m7n3n3l3J4L2L2O3O3
213gQ4Q6KKNNNMl9m0l9m0K6K6K5K6kjK5K6L9L9m3m4m2m2K3K3J3J2l4l4OOL4L3J1J1nK3L5L5
195B78j1l8k3NL5L4J7J7J8J7k0k1k0k1l2l3l0l1j9RM0O7O3J8k0k0mlmmRQL3L3qn4p3p3n2k5
177F2j2j3J2J2L9L9M6M7L2Nj1l9m2j4kk9n6n7m0j4kjj4j3jK7K6K4%%K0K0J8J8N1K3k6k6JK
160A12JKk1k0nl3n4n5p0m2J6M4M6J8qqL9O6N7N8L1L1MMKLK2nl4l5j5J2mlJ2J2Kk5m8k1K5K5
142A38J5j3k5k5J4J3J4J3K5K5K5K5%j%%j9j8j8j9j1j2j1j1k3k3k1k1LL1J4J5RQQQj9j8j9j9
$$ plain form
265 145 130 160 191 194 197 246 296 314 332 322 312 305 297 317 337 361 384 362 339 308 276 272 268 266 263 288 313 357 402 382 361 331 300 269 239 196 154 114 75
248 75 88 148 196 215 215 186 156 154 184 213 217 221 188 155 183 212 214 170 136 130 139 147 158 168 178 189 199 209 221 232 243 255 253 251 249 247 239 230 197 164 136 153 210
229 210 266 272 279 257 236 192 148 151 153 137 120 104 87 66 46 25 5 34 64 94 124 108 92 76 60 41 21 -25 -72 -125 -178 -211 -197 -165 -133 -70 -7
213 -7 77 163 165 167 172 177 182 186 147 107 68 28 54 80 105 131 129 128 153 179 218 257 214 170 128 86 109 132 145 157 123 89 95 101 135 168 179 190 185 208 243 278
195 278 267 229 206 211 246 280 297 314 332 349 329 308 288 267 235 202 172 141 122 131 171 238 301 319 299 279 275 272 268 264 273 281 314 347 339 285 212 139 87 62
177 62 50 37 49 61 100 139 185 232 264 269 258 219 177 163 161 132 76 19 -21 -35 -37 -38 -52 -65 -66 -39 -13 11 11 11 31 51 69 87 138 161 135 109 110 112
160 112 113 115 94 74 69 36 -18 -73 -143 -185 -169 -125 -79 -61 -69 -77 -38 28 85 143 174 205 209 213 215 218 240 235 201 166 151 163 159 156 168 180 182 157 109 88 113 138
142 138 153 140 115 90 104 117 131 144 169 194 219 244 244 243 243 243 224 206 188 169 158 146 135 124 101 78 57 36 39 70 84 99 108 116 124 132 113 95 76 57
125E7k3k3OL4K0qJ0J0J7J8l0n7n6l0JK8K6Jj0j0jjJ%J5M1P2P3O1O1L3L3J2J2j7m4k2NMk4j6
107B79j6j6j6j7J0J1j8l6l6l8l8j2j3j2j3NNNNL5L6L5L5M3M4N8L0l2o0o1l4J3J3J5J5K0K0
91B64K0J9MLrl7n8n9k1K4P6P6K3K4m9m9m5m6o4j8L1N8L1KK0K0RJ0RRK4K4l1l1n7n7n7n8k6
74Hk4k6k6O1O0N9N8L5j2m0m1MMMMl6l5l5l5K8K8Q1Q0O6J9m8m7kkjkj4j5j4j5RRRRM8M8M8M8
55C57j5j5j5j5k2k2k3k2j9k0j9j9o9o7kM3N1N2N5N5j1j1j1j1k1k1k1k2mmM9M8Om1l0lJ3J2
39A66J5J4K8K7K8K8j6j6j6j6RRJ0Rj2j2j1j2j4j3j4j4oppomnmmj1j1j1j1j2j3j2j2j9k0j8
21a6j9nmllM1O7Q6L0J2M0J9K0J3j4l2K4M9K1n2n2kkkkj2j3j2j2j4j3l4r0j15o1L8R3J02P5
4A46L3k2m9m9LKK0K0K0K0L6L5k0k0nnnnJ1J2RJ0m6p4l5K2L7L7L7L7qo2m6j7QL6L8J0mmnol6
$$ plain form
125 57 34 11 17 51 71 63 73 83 100 118 88 31 -25 -55 -54 -26 0 1 -9 -19 -20 -21 -20 -20 -5 36 108 181 242 303 336 369 381 393 376 332 310 315 319 295 279
107 279 263 247 231 214 224 235 217 181 145 107 69 57 44 32 19 24 29 34 39 74 110 145 180 223 267 325 355 323 263 202 168 181 194 209 224 244 264
91 264 284 303 307 310 301 264 206 147 126 150 226 302 325 349 300 251 206 160 96 78 109 167 198 200 220 240 249 259 268 277 301 325 294 263 206 149 92 34 8
74 8 -16 -42 -68 -7 53 112 170 205 193 153 112 116 120 124 128 92 57 22 -13 15 43 124 204 270 289 241 194 192 190 189 187 173 158 144 129 138 147 156 165 213 261 309 357
55 357 342 327 312 297 275 253 230 208 189 169 150 131 62 -5 -7 36 87 139 194 249 238 227 216 205 184 163 142 120 116 112 161 209 215 174 144 141 154 166
39 166 181 195 223 250 278 306 290 274 258 242 251 260 270 279 267 255 244 232 218 205 191 177 171 164 157 151 147 142 138 134 123 112 101 90 78 65 53 41 22 2 -16
21 -16 -35 -40 -44 -47 -50 -9 58 144 174 186 226 245 265 278 264 232 256 305 326 274 222 220 218 216 214 202 189 177 165 151 138 104 14 -101 -162 -124 -31 71 146
4 146 179 157 108 59 62 64 84 104 124 144 180 215 195 175 170 165 160 155 166 178 187 197 151 77 42 64 101 138 175 212 204 142 96 79 87 123 161 171 167 163 158 152 116
-15A16l7j4M2O6L8k0m7l9l8l9l9OOOOopM9M9L3L3k2k2l1l1L4O1N3Pj2j2k5k6n4n3L9M0ooj0
-32H8j1J8J8l9l8n0k4L0P6O7M0J3J2J1J1J1J0j7j7o4o5j%j2j2l9l9J5J4M2M2K3K2k4k3n6n5
-48b3k7k8J5J6J5J5QPN3N3J9J8J8J9O3O3J8J7j1j0j1j0l9l9l8l9j1j1j1j1j3j3L3L3nnl3l3
-64F2JJJKj8j9M7M6J7J7j0j1l1l1n5n5mM1N9L1RROPm4m5p1p2k7k7J9J9J2J2J2J2L7L8L6L7
-82G0J2J2l4l4j9j8RQJ1J1J1J2m4m2m3m4K4K4K3K4J7J5J7J7L7L8L7L8l4l4l3l4M1M1M0M1k1
-98A96k2K5K4RQl7l8RJ0RJ0K0K0K0K0k9k9j%m2m1J4O1P5M8j0n5m8m8nnrqrql2l2ON1Q9O2L0
-116C08Mpon2n2p6m9j0L6K2k5m2m3rj1qrL5O5P5K8jkmnl9l9l6l6JM7M7Jl1l1poK3K4P0O9N4
-134B73N5K6K6kkk1OJ5l2r4r3m0Oj7j7rL8O7O6K0K1l3l2nM2K9Kj8m5n8j1K0J9K3K3K4K4l2
$$ plain form
-15 116 79 65 107 173 211 191 144 105 67 28 -11 -5 1 7 13 7 0 49 98 131 164 142 120 89 58 92 153 206 213 201 189 164 138 84 31 70 110 104 98 88
-32 88 77 95 113 74 36 -14 -38 -8 68 135 175 188 200 211 222 233 243 226 209 145 80 79 79 67 55 16 -23 -8 6 48 90 113 135 111 88 32 -23
-48 -23 -50 -78 -63 -47 -32 -17 -9 -2 51 104 123 141 159 178 241 304 322 339 328 318 307 297 258 219 181 142 131 120 109 98 85 72 105 138 133 128 95 62
-64 62 63 64 65 67 49 30 77 123 140 157 147 136 105 74 19 -36 -40 1 60 91 100 109 115 122 78 33 -38 -110 -137 -164 -145 -126 -114 -102 -90 -78 -41 -3 33 70
-82 70 82 94 60 26 7 -11 -2 6 17 28 39 51 7 -35 -78 -122 -98 -74 -51 -27 -10 5 22 39 76 114 151 189 155 121 88 54 95 136 176 217 196
-98 196 174 199 223 232 240 203 165 174 184 193 203 223 243 263 283 254 225 224 224 182 141 155 216 291 339 329 274 226 178 173 168 159 151 142 134 102 70 76 127 216 278 308
-116 308 312 305 299 247 195 119 70 60 96 118 93 51 8 -1 -12 -20 -29 6 71 146 174 173 171 167 162 123 84 48 12 13 60 107 108 77 46 39 33 56 80 150 219 273
-134 273 328 354 380 378 376 355 361 376 344 250 157 117 123 106 89 80 118 185 251 271 292 259 227 222 264 293 295 277 232 174 163 183 202 225 248 272 296 264
-151B64l1l5l5l5l5K8K9K8K9poooK0K1K0K0k3k4k3k4qrrqk8k8K7K7K6K6K6K6NNNNL7L7j9j8
-168B94j9j8j9j8n7n6jjlkkkj%j%OOPOj4j4j4j5PPOPK3K4K4K3kjkkM0L9M0L9k7k8k7k7nmm
-189B12mk3k4k4k3L0L1rl7m1m0mK4J8rQQJ5J5lK4M5kk8k7RL6L7Ql6l7l6l7k0PL2N9Q2Q3J7
-206C36k8l8l7m0m0JKJJKJJKJ4J3J4J4PPPOPOLLj3n9m9k1KKJKJ2j5j8J1K8%l6l6j0J7JKj7
-226F9j8j5j6K2N0L3L2J5j3NNM0O9M9N0Ql8k7%ooonpl5p2p3k1Pqr%jL9O7L8L7M0L9M5M6Nk2
-245D12k6k5k8k7j8j9K8K7QPk0k0PPL4L5PQk1k0k9k9k9k9j8j8m6m6k3k2M2M2O4O3L6L6j0j0
-261C30j0j0k2k2o8o8n8n7rqM2P2N4QonN2N2L2l3r5r5p8l3RL5M9N0NNk4k4k5k4L0K9N7N7L9
-278B33L9k6k6k7k7L8L7J1J1l5l6k3k4M1M0RRl7l7l0k9lkj3j3j3j3J4J4J4J4K4K4K4K4M0M0
$$ plain form
-151 264 233 198 163 128 93 121 150 178 207 200 194 188 182 202 223 243 263 240 216 193 169 161 152 143 135 107 79 106 133 159 185 211 237 242 247 252 257 294 331 312 294
-168 294 275 257 238 220 163 107 106 105 102 100 98 96 95 95 94 94 100 106 113 119 105 91 77 62 69 76 82 89 112 136 160 183 181 180 178 176 216 255 295 334 307 279 252 225 220 216 212
-189 212 208 185 161 137 114 144 175 166 129 88 48 44 68 86 77 85 93 108 123 120 144 189 187 159 132 141 177 214 222 186 149 113 76 56 63 95 154 236 319 336
-206 336 308 270 233 193 153 154 156 157 158 160 161 162 164 178 191 205 219 226 233 240 246 253 259 262 265 252 193 144 123 125 127 128 130 142 127 109 120 148 148 112 76 66 83 84 86 69
-226 69 51 36 20 42 92 125 157 172 159 164 169 209 278 327 377 385 347 320 320 314 308 302 297 290 255 183 110 89 96 88 79 79 78 117 184 222 259 299 338 383 429 434 412
-245 412 386 361 333 306 288 269 297 324 332 339 319 299 306 313 347 382 389 397 376 356 327 298 269 240 222 204 158 112 89 67 109 151 215 278 314 350 340 330
-261 330 320 310 288 266 198 130 72 15 6 -2 40 112 166 174 168 163 215 267 299 266 171 76 -2 -35 -26 9 58 108 113 118 94 70 45 21 51 80 137 194 233
-278 233 272 246 220 193 166 204 241 252 263 228 192 169 145 186 226 235 244 207 170 140 111 108 106 93 80 67 54 68 82 96 110 134 158 182 206 246 286
-294B86K0k6l3l4l8l8n2q0r0m4J2J2J5J4M7M6j7j7KJM6M8j4j4l7l7K2P6P1P0J9l6n1n1j2j2
-310G4j2j3J1J0J1J0nnnnnnnnM7M7P8K3j3j3j7j6K3K4K3K4j2j1J7J6J1J1nn9r6r5n0M3R9R8
-327B48M0M0k1k2k1k1J9K0K0K0n8n8q8l4J2J3J5J6K7K6K7K7M4M5l8l9ool3l4k1k0k1k1onl
-343H3km7QO1O0J7J8k9k8L7L7L7L8nnnnl6l6l7l6K2K1K2K1rrrrj1j2j2j2O2O1L1Lj1j2m0m1
-361A81k2k3k2k2%jKJmK3N3N4K9L0K9K9qrrrl9m0l9l9n2n1lK6L0L1Mk3KM8O7O6K5K4J2j5k7
-379C09k7k9k9m9n0j9RMLml3l7rJ9K0l9l8qJ9KJMLk0j8k2k1j3m0k4k4j0rM5R1J10O5l4p9p0
-396e1oN4N4N1K3ppk4k5MLK4K5K2K2j4m2k7k6ppNL3N1N1Mk4mnK1K1M1M1J0j7n1n1n3n3k5k5
-414IM0L9P0O9P0O9O0O0k4k3l9l9l9l9n0n0n0n0J7J7J7J7l0l1l0l1j0j0rrN3N5N1N2km7l8
$$ plain form
-294 286 306 280 247 213 175 137 85 5 -85 -129 -117 -105 -90 -76 -29 17 0 -17 -15 -14 32 80 66 52 15 -22 0 76 147 217 236 200 149 98 86 74
-310 74 62 49 60 70 81 91 86 81 76 71 66 61 56 51 98 145 223 246 233 220 203 187 210 234 257 281 269 258 275 291 302 313 308 249 153 58 8 51 150 248
-327 248 288 328 307 285 264 243 262 282 302 322 264 206 118 84 96 109 124 140 167 193 220 247 291 336 298 259 253 247 214 180 159 139 118 97 91 86 83
-343 83 81 34 42 103 163 180 198 169 141 178 215 252 290 285 280 275 270 234 198 161 125 147 168 190 211 202 193 184 175 164 152 140 128 190 251 282 285 274 262 222 181
-361 181 159 136 114 92 92 91 93 94 90 113 166 220 249 279 308 337 329 320 311 302 263 223 184 145 93 42 39 65 95 126 130 107 109 157 224 290 315 339 351 336 309
-379 309 282 253 224 175 125 106 115 119 122 118 85 48 39 58 78 39 1 -7 12 14 15 19 22 2 -16 -38 -59 -72 -112 -136 -160 -170 -179 -134 -43 67 132 98 19 -51
-396 -51 -57 -3 51 102 125 118 111 87 62 66 69 93 118 140 162 148 106 79 53 46 39 44 77 128 179 183 159 155 150 171 192 233 274 284 267 216 165 112 59 34 9
-414 9 49 88 158 227 297 366 426 486 462 439 400 361 322 283 233 183 133 83 100 117 134 151 121 90 60 29 19 9 0 -9 44 99 150 202 200 153 115
-430A15ronlmlmlm%%%j%%%%J7J8J8J8K4K5K4K5J2J3J2J3k5k5k4k3M3P1L5j1l3l3RJ0l4l5o2
-449A55o2k5k5KKj6j6K0O7P0M3ml2n1k3RL6M5M5J9J9k0k0k0k0MMLMlkklL0K9K9L0lkm9m8o8
-467A51o8m1m0J0J0J0J1L2L3L3L2lmmlLLJ%l6q3o9m2k0QL3N9M7K0ll1m4m2J0J0K1K2K2K2O3
-485A33O3QQOOOOm2m3m2m3m0m0J4J4K8K7K8K7J3J2J3J3L8L8L8L8m3m3m3m4qrrqPQPQPPQPK9
-504B08K8K8K9oopoNONNm2m2J3J3k9k9k9l0%%j%PQQPj7j8j8j8k0k1k1j9J7J9J8J9J7J8J8J7
-522A34JKJKjjjjjjjjQPPQK3K4K3K4J5J5J5J5l8l8l8l8RQRQl6l6l7l6l2l0jM3L3L2L5L6OO
-542A81m9n0l0l1k7k8k1K6N4N5M6M7rrk0j9j9k0n3n1n3n3J1J0J1J1j9k0j9j9L3L3L3L4m5m4
-558a23m1m1k2K5N4N4L3L2L0L1k8n6o7k0K7K8L1L0K8K8K7K7P4M7lm9n0k3jK6K8K9L0L0QQP
$$ plain form
-430 115 106 100 95 92 88 85 81 78 74 74 74 74 73 73 73 73 73 90 108 126 144 168 193 217 242 254 267 279 292 267 242 218 195 238 309 344 333 300 267 276 286 252 217 155
-449 155 93 68 43 45 47 31 15 35 102 172 215 211 179 128 105 114 150 195 240 259 278 258 238 218 198 202 206 209 213 210 208 206 203 233 262 291 321 318 316 267 219 151
-467 151 83 42 2 12 22 32 43 75 108 141 173 170 166 162 159 162 165 166 166 130 47 -22 -64 -84 -76 -43 16 63 83 80 49 5 -37 -27 -17 4 26 48 70 133
-485 133 196 204 212 218 224 230 236 194 151 109 66 26 -14 0 14 42 69 97 124 137 149 162 175 213 251 289 327 284 241 198 154 146 137 128 120 127 135 142 150 157 164 172 179 208
-504 208 236 264 293 287 281 274 268 273 279 284 289 247 205 218 231 202 173 144 114 114 114 113 113 120 128 136 143 126 108 90 72 52 31 10 -9 8 27 45 64 81 99 117 134
-522 134 135 137 138 140 139 138 137 136 135 134 133 132 140 147 154 162 185 209 232 256 271 286 301 316 278 240 202 164 173 181 190 198 162 126 89 53 21 -9 -10 33 66 98 133 169 175 181
-542 181 132 82 52 21 -6 -34 -55 -29 25 80 126 173 164 155 135 116 97 77 24 -27 -80 -133 -122 -112 -101 -90 -109 -129 -148 -167 -134 -101 -68 -34 -79 -123
-558 -123 -164 -205 -227 -202 -148 -94 -61 -29 1 32 4 -52 -119 -139 -112 -84 -53 -23 5 33 60 87 161 208 205 156 106 83 82 108 136 165 195 225 233 241 248
-574B48Qm8m7p3k7J1J2J4J5l4l4l4l3L4L5L3L3Pk1k1Pj8j9j6j7KLk2k2j4L2N9O1P0M2KLK1
-590B52K1K2K1K5K6j3m0l6qJ5M2N9N8L1j5m9m8m0j1KKMMj4j4j4j4qppqK7K7M3J5j3j4j5j5
-607B93j7j8j7j8j1j0j1j0llllj9j9j9j8k4k4l9j1K5K6K7K8J4J4K9KJ7J8J3J4ml2j6j6k5k5
-624A05k5k5k0k0j7j7NL3J8J7LKLLk2k2j1J6K8Jl6l5mK3QQK6K6K6K6M2M3M2M2K4K3K3K4o5
-641C21o5o2o1m2J3J0J0l7l7J8J9K0K0l5l6j1j1M4M5J3J4J3J4MMMNL0K9n8n9l7J9M3M4J9K0
-657B44qqm4m3m3m3k1k2L1L1Qm8o7o8l3K3M7M7L9M1O5O5N1mk8k8j9j9k0j9M1M1L7L8K5l1J
-673B59%k6k7k7k7k7k7k7k7L8L8L8L7NNNNm4m5m7PN7N7L6k0o1o1lN2O6O6O7O6N9Mk0k0K7K7
-690D85k9k8n6n6n6n6m1m2K4K3L2L2j5j4k7k6L9L8L2L1l3o0m9PL5Ql6l7QL5K6k9j5J3K8k7
$$ plain form
-574 248 256 208 161 88 61 72 84 98 113 79 45 11 -22 12 47 80 113 120 99 78 85 67 48 32 15 17 20 -2 -24 -38 -6 53 114 184 226 228 231 252
-590 252 273 295 316 341 367 354 314 278 270 285 327 386 444 475 460 411 363 323 312 314 316 320 324 310 296 282 268 260 253 246 238 265 292 335 350 337 323 308 293
-607 293 276 258 241 223 212 202 191 181 178 175 172 169 150 131 112 94 70 46 7 -4 21 47 74 102 116 130 159 161 178 196 209 223 219 187 171 155 130 105
-624 105 80 55 35 15 -2 -19 -14 19 37 54 57 59 62 65 43 21 10 26 54 55 19 -16 -20 3 11 19 45 71 97 123 165 208 250 292 316 339 362 386 321
-641 321 256 194 133 91 104 114 124 87 50 68 87 107 127 92 56 45 34 78 123 136 150 163 177 181 185 189 194 224 253 195 136 99 118 161 205 224 244
-657 244 236 228 184 141 98 55 34 12 43 74 82 34 -33 -101 -134 -111 -64 -17 22 63 128 193 244 240 212 184 165 146 126 107 148 189 226 264 289 258 259
-673 259 259 233 206 179 152 125 98 71 44 82 120 158 195 200 205 210 215 171 126 79 86 143 200 236 216 155 94 91 143 209 275 342 408 467 471 451 431 458 485
-690 485 456 428 372 316 260 204 163 121 145 168 200 232 217 203 176 150 189 227 259 290 257 197 148 155 190 198 162 125 133 168 194 165 150 163 191 164
-705A64n8n9MNMMl8l7l8l9J5J5J5J5N4N4N4N4J5J6J5J5RRRRj1j2j2j1MNNMNMNNJKKKk6k7k6
-725B04k7%jK3K4j2o6p8p7j9L5K1ppoqrj9j9j9j9l7l6J5P1J01J02M0M1k1k0o7o7l7l8QQL1
-741HL3L2L2K6K7K6K6j7j8j8j7K3K3K3K3J8J7j0j0ppN7N8L2L2l2l3k1k2POkkjkk0k1k0k0l2
-758A97l2l1l2L5L5L6L5L7L7jm8p9p8l6l5J4J4O1O0M3M2mml5l4ppRQQRJ0J0J0J0m2m1m2m2
-775I0ONN2N2L8L8qql2l2k9k9K3P0O6K1k6p2p5k9J1J1J4J4NNK4O9Q5N7J1n2q8o0j3J4Rj8k8
-792A91k9n2n1o4l6K5P1M7M7K5K5K5K5RJ0J0Rk0k1k0k1j5j5j5j5k0k1L4L5M1M1M1M1k3k2k3
-808B69k2qqqpj6j5J3J2K4K4l2l2j3j3j3j4o7o7l9l9m5m5J5P0P4M6J1J1LLL1L0K5K4llj5j5
-825A46j5j4j%n6n5l9m0j3j2j9k0j9k0L6L5L5L6K6K6K7K6M3M3j3j3L1L1Qm7m0j3mmJ0J0J0
$$ plain form
-705 164 106 47 51 56 60 64 26 -11 -49 -88 -73 -58 -43 -28 26 80 134 188 203 219 234 249 258 267 276 285 274 262 250 239 243 248 253 257 262 266 271 276 277 279 281 283 257 230 204
-725 204 177 177 176 199 223 211 145 67 -10 -29 6 27 20 13 7 -1 -10 -29 -48 -67 -86 -123 -159 -144 -73 28 130 170 211 190 170 103 36 -1 -39 -31 -23 8
-741 8 41 73 105 131 158 184 210 193 175 157 140 163 186 209 232 250 267 257 247 240 233 290 348 380 412 380 347 326 304 311 317 315 313 312 310 290 269 249 229 197
-758 197 165 134 102 137 172 208 243 280 317 316 268 189 111 75 40 54 68 129 189 232 274 270 266 231 197 190 183 192 200 208 217 227 237 247 257 215 174 132 90
-775 90 96 101 153 205 243 281 273 265 233 201 172 143 166 236 302 323 297 225 150 121 132 143 157 171 176 181 205 274 359 416 427 375 287 227 214 228 237 219 191
-792 191 162 110 59 -5 -41 -16 55 102 149 174 199 224 249 258 268 278 287 267 246 226 205 190 175 160 145 125 104 138 173 214 255 296 337 314 292 269
-808 269 247 239 231 223 216 200 185 198 210 234 258 226 194 181 168 155 141 74 7 -32 -71 -116 -161 -146 -76 -2 44 55 66 69 72 103 133 158 182 179 176 161 146
-825 146 131 117 116 116 60 5 -34 -74 -87 -99 -118 -138 -157 -177 -141 -106 -71 -35 -9 17 44 70 113 156 143 130 161 192 200 153 113 100 96 92 102 112 122
-841A22J0L7L8L7L7k5k4k5k5m4m4J1J2J5J6J5J6RRL5L5O4L6j0o5j22j21m8M4O8O7J2m4l6l7
-856G5j5L9M6M5ool6l6qqJ3J2J3J3M0M0M0M0k8k9k8k9K0K0K0J9L0L0L0L0n1n0m8m8k6K0K2
-872B05k4l8j0k8k8m2m1J2J3ppppj2j1M3M4K9K8JJL2L3L2L2m3m3J2J2pqo3o3l5l5qqO3O4L5
-889A16j1k7k7kkMMM0O8N5j0o1o1m1NPPJ%K8K7j9k0QQj8j7j8j7qpl3J3N5N7L1L2K4K3lm9n1
-908A11nK1K2K3K2K3K3l6l6l7l6j3j4j3j4J9K0J9J9PON3N2M0M0L7L7j2n7r1o4j0J7L1L1j0
-923B25j0p2p1k7K0K1K1J9K0J9J9k2k1ONl4l4J1J2M0L9J2J1K0K0M7M7QQk0j9j8j8J0RL3L3
-939C69j3j4k6k5n4n4m7m7J7J7M3M3M2M3K2K1K1K2m0l9m0l9RRRQK6K6K6K6M4M3k1k2o4o4l6
-955B41l6K4K4ll1k1K6M2M1on4n4n5k9k9J7J7Q0P9N9J3l1l1l4l3j3j3N2N3MNk4k5k9n7l9O
$$ plain form
-841 122 132 169 207 244 281 256 232 207 182 138 94 105 117 132 148 163 179 188 197 232 267 331 367 357 292 170 49 1 45 113 180 192 148 112 75
-856 75 60 99 145 190 184 178 142 106 98 90 103 115 128 141 181 221 261 301 273 244 216 187 207 227 247 266 296 326 356 386 335 285 237 189 163 183 205
-872 205 181 143 133 105 77 35 -6 6 19 12 5 -2 -9 -21 -32 11 55 84 112 113 114 146 179 211 243 200 157 169 181 174 166 103 40 5 -30 -38 -46 17 81 116
-889 116 105 78 51 49 47 51 55 95 163 218 208 147 86 45 50 57 64 65 65 93 120 101 81 89 97 79 62 44 27 19 12 -21 -8 47 104 135 167 191 214 211 162 111
-908 111 106 127 149 172 194 217 240 204 168 131 95 82 68 55 41 60 80 99 118 125 131 184 236 276 316 353 390 378 321 230 166 156 173 204 235 225
-923 225 215 143 72 45 65 86 107 126 146 165 184 162 141 147 152 118 84 95 107 147 186 198 209 229 249 296 343 351 359 339 320 302 284 294 303 336 369
-939 369 356 342 316 291 237 183 136 89 106 123 166 209 251 294 316 337 358 380 340 301 261 222 231 240 249 257 283 309 335 361 405 448 427 405 341 277 241
-955 241 205 229 253 250 219 198 224 266 307 301 247 193 138 109 80 97 114 194 273 332 345 314 283 249 216 203 190 242 295 299 304 280 255 226 169 130 136
-971A36L3L3QQJ8J7j0j1L1L1J1l5n9n9j5j6J2J1n0n0k2K3O2O2K6K6k0k0ooopk6k7k7k6%J%
-988E1J%%K7K8J3J2l3l3l1l1k9l1J5J5M2M3L0L1j3j2J1N7P2M5ql6k3k2j1j1j1j1%j%jj1j2
-1005A22j2j2j7j6j7j6J7J6M5M5L8L8k6k7J9J9J8J9opook2k3k2k2lkkkL2L3L2L2k6k7k6k7
-1022A53k3k3k0j9J6P2M0M0K2K1K1K2j6j5J2M0M4j0m2m3MMMMk7k7k7k8l7l8QQK8K8%%k4k4
-1038A48k2k2M4P1Q8L1l7l7j2j3ONp7j04o9j3J6J8l3l3ooJ9J9J9J9j9j7m3m3KN7P1P2J9J9
-1054A37m5m6m0l9rrQO3O0O0K1K0pql2l2J4J4M6M5M6M6oon3n2LMMLQPQPJ0J0J0J0J3J3J3J4
-1072C33%JJJQRJ2m3m8m7nnj2j2j2j2J%jjj4m3n8lK4K4j9j9k5k5K1K1M0M1ook5k6k5k5j6j5
-1090a1j6j6k3k3K4K3K3K2lnk7k7J%L1L1L1L1J9J8J9J8M4M4j%K0M8J7l8p3p4j2j2J7J7J7J7
$$ plain form
-971 136 169 202 210 218 236 253 243 232 263 294 305 270 211 152 137 121 133 144 94 44 22 45 107 169 195 221 201 181 175 169 163 156 130 103 76 50 50 51 51
-988 51 52 52 52 79 107 120 132 99 66 35 4 -25 -56 -41 -26 16 59 89 120 107 95 106 163 235 280 272 236 213 191 180 169 158 147 147 146 146 145 134 122
-1005 122 110 98 81 65 48 32 49 65 110 155 193 231 205 178 197 216 234 253 247 240 234 228 206 183 161 139 136 134 132 130 162 195 227 259 233 206 180 153
-1022 153 130 107 87 68 84 156 196 236 258 279 300 322 306 291 303 343 387 377 335 292 296 300 304 308 281 254 227 199 162 124 132 140 168 196 196 196 172 148
-1038 148 126 104 148 219 307 338 301 264 252 239 245 250 173 69 0 -13 3 21 -12 -45 -51 -57 -38 -19 0 19 0 -17 -60 -103 -101 -44 27 99 118 137
-1054 137 92 46 6 -33 -42 -51 -43 20 80 140 161 181 174 166 134 102 116 130 176 221 267 313 307 301 248 196 199 203 207 210 218 225 233 240 250 260 270 280 293 306 319 333
-1072 333 333 334 335 336 344 353 365 322 274 227 222 217 205 193 181 169 170 170 169 168 154 111 53 50 74 98 79 60 35 10 31 52 92 133 127 121 96 70 45 20 4 -11
-1090 -11 -27 -43 -66 -89 -65 -42 -19 3 0 -5 -32 -59 -58 -58 -27 4 35 66 85 103 122 140 184 228 227 227 247 295 312 274 201 127 115 103 120 137 154 171
-1107A71M8M8LKnoK3K2rrl6l7%%K8K7JJJ%j8j8K8K7L7L6RRl4l5k1L4K8%K0J9k0k0m5m6K6N4
-1125C43K3l2m6m6k3k2j2j3P1R7P9K2qrm4m4m4m3rrqrRQRQj4j4j4j4j0j1L6L6J1J0j6j7o1
-1142A70o1l4l3J5J5M0M0M6jl9l9k5k4k5k5L9L9L9M0L2L2L2L2J5J5J5J5llPL4L4j2m9m9l1
-1157B93l2l1l2l1l1n8n9j7j7K8K9M1M2J5J4L2L2J4l3m7k0L4Q0Q0L3llkkjkK0K0k7k6jjjk
-1174C28j1j1j1j1m0l9m0m0LLL1L0M3M2k0k1k2NJ6l0n2n2J0J0M5M5jjj0j1J7J7n6n6n6n6j8
-1190b0j8K8K7K9K9L0K9j0j0n3n3o7k1L9O5O4O5J9K0j5j5j6j5q8q7o0NN9N8L5L6k3k2kM4N2
-1206A38N3PQn4q2o2j6L0N8P0P0N8J2rqJ8J7j0j0j5j5o1o1k4k4LMj3j3L4L3M3M2mmn4n4n5
-1222E0n3MONNL1L1L1L1l6l7l6l5qpK7P5Q7M0j6m5k4k4k6k6j6j6j6j6M7M8M8M8k8k8k9k8j8
$$ plain form
-1107 171 219 267 270 272 267 261 284 306 297 288 252 215 215 215 243 270 271 272 273 273 255 237 265 292 329 365 374 383 349 314 293 327 355 355 375 394 374 354 309 263 289 343
-1125 343 366 334 288 242 219 197 185 172 243 340 419 441 433 424 380 336 292 249 240 231 223 214 223 231 240 248 234 220 206 192 182 171 207 243 254 264 248 231 170
-1142 170 109 75 42 57 72 112 152 198 197 158 119 94 70 45 20 59 98 137 177 209 241 273 305 320 335 350 365 362 359 366 400 434 422 373 324 293
-1157 293 261 230 198 167 136 78 19 2 -15 13 42 83 125 140 154 186 218 232 199 152 132 166 246 326 359 356 353 351 349 348 346 366 386 359 333 332 331 330 328
-1174 328 317 306 295 284 244 205 165 125 128 131 162 192 235 277 257 236 214 219 235 205 153 101 111 121 166 211 210 209 199 188 205 222 166 110 54 -2 -20
-1190 -20 -38 -10 17 46 75 105 134 124 114 61 8 -59 -80 -41 24 88 153 172 192 177 162 146 131 43 -44 -104 -99 -40 18 53 89 66 44 42 86 138
-1206 138 191 198 206 152 70 8 -8 22 80 150 220 278 290 281 273 291 308 298 288 273 258 197 136 112 88 91 95 82 69 103 136 179 221 217 213 159 105 50
-1222 50 -3 1 7 12 17 48 79 110 141 105 68 32 -3 -11 -18 9 84 171 211 195 150 126 102 76 50 34 18 2 -14 33 81 129 177 149 121 92 64 46
-1239D6j9j8j7MMNON3Q1M5jporrk4k4L1L2PPPPmmnmL1L2L1L2pon8n8j2M4K8Jm9m8n1n0l2l1
-1258a9K2K4M1M1j6j6o9r6n4JQ4J39J43Q8K2K2J5J5l9r5p7m9k2OqqL6L6L6L6mllmk7k7k7k7
-1275A17N2N2llnonok0k1k0k1M1M0M1M1J8J9l7l6l9l8l8l9K1K0K1K0LMLLK3K3jn7n3n2jjM1
-1293A01M0M1M1J1J1J0J1j9j9k0j9k9k8k9k9ppM9M9M1M2M2M2j3j4j3j4m6m5RJ0J3J3J3J3q
-1308B43pqqM9M9poK0K1K0K0mmmmk8k7k8k8OPPPj2j1j2j1jjkjp1p2j6j6J5J5J5J5J8J8J7J8
-1327A91M3M3M3M3m0m0m1m0kkkkl7l8J7J6K3mj6K9N0K1k6p2q9q9l7l7K6K6K6K5M3M2M2M2K5
-1343B02K4l2l1m0m1m0m1k0k1L4L3J5J5J4J5N3N4N0N1N0Lk5k6k8k9k8k9PQPPj8j7j8j8LLL
-1359A49LK5K4K5K5J1J2J1J1K8K8%%KLm4m4l0l0l1l0j3j4L0L0J3l2o7l9J9M6L3L2L4L4l0l1
$$ plain form
-1239 46 27 9 -8 -4 0 5 11 64 145 190 189 182 176 167 158 134 110 141 173 180 187 194 201 197 193 188 184 215 247 278 310 303 297 239 181 169 213 241 242 193 145 94 44 12 -19
-1258 -19 3 27 68 109 93 77 8 -88 -142 -141 -57 82 225 313 335 357 372 387 348 253 176 127 105 111 103 95 131 167 203 239 235 232 229 225 198 171 144 117
-1275 117 169 221 218 215 210 204 199 193 173 152 132 111 152 192 233 274 292 311 274 238 199 161 123 84 105 125 146 166 169 173 176 179 202 225 224 167 114 62 61 60 101
-1293 101 141 182 223 234 245 255 266 247 228 208 189 160 132 103 74 67 60 109 158 199 241 283 325 312 298 285 271 225 180 189 199 212 225 238 251 243
-1308 243 236 228 220 269 318 311 305 325 346 366 386 382 378 374 370 342 315 287 259 265 272 279 286 274 263 251 240 239 238 236 235 164 92 76 60 75 90 105 120 138 156 173 191
-1327 191 234 277 320 363 323 283 242 202 200 198 196 194 157 119 136 152 175 171 155 184 234 255 229 157 68 -21 -58 -95 -69 -43 -17 8 51 93 135 177 202
-1343 202 226 194 163 123 82 42 1 -19 -40 -6 27 42 57 71 86 139 193 243 294 344 347 322 296 268 239 211 182 189 197 204 211 193 176 158 140 143 146 149
-1359 149 152 177 201 226 251 262 274 285 296 324 352 352 352 354 357 313 269 239 209 178 148 135 121 151 181 194 162 95 56 75 121 154 186 220 254 224 193
-1375A93k9k9k9k9rj0j0j0LLm3m2p9p9n6j1M6P4P6M9L3L4j4j3p4p5p5p5j6j6L0K9P1P1P1P0
-1391C0kkkkQQQQonl4l2J0J1N6N7Q9Q8O6J9l9q6p6m8nK2K5mJ4J4J2J2J9J9J8J9K6K6K5K6K5
-1409D17K4K5K5l3l3l3l3NNKKn1r7q4n6j6L0OOJ6J6J6J6l8l7l8l8j6j6j4j5N5Q3K9j7l3l4
-1425D6rrmmK2K2j7m5k7J9M8N0OPrqqqJ%K9K8L9L8ppqqpqj1j0j1j1MMMMj6j7j7j7J8J8J8J8
-1445A40j2j2j2j2l4l4l4l4K8K8K8K9L5L6k9k9l7l8K7K7L8L7J0J0l4l5l4l4j3j1L3L4M5M4
-1459A51k0k0k6k6k7k6NMNML5L5L5L5ONNNj2j2j1j2K7K8K7K8j3j2j3j2K1K1ln9r2r0l4K2K9
-1476A3L1L4L5N1N2mmklkln1n1n1n0k7k7k7k6j3j2M3M3%%J%L4L3L4L4MMMMK6K5K6K5k4k4k5
-1495A30k4J1J1O2O3M1j3l8l8J3J2m3m3J0RL7L8K2K2l3l4k6k6K9K9L7L8RJ0j0j1j0j1l2l1
$$ plain form
-1375 193 164 135 106 77 68 58 48 38 41 44 1 -41 -120 -199 -255 -266 -220 -146 -70 -21 12 46 32 19 -55 -130 -205 -280 -296 -312 -282 -253 -182 -111 -40 30
-1391 30 28 26 24 22 30 38 46 54 48 43 9 -23 -13 -2 54 111 200 288 354 373 334 248 172 124 119 141 166 162 176 190 202 214 233 252 270 289 315 341 366 392 417
-1409 417 441 466 491 458 425 392 359 364 369 371 373 322 225 141 85 69 99 105 111 127 143 159 175 137 100 62 24 8 -8 -22 -37 18 101 130 113 80 46
-1425 46 37 28 24 20 42 64 47 2 -25 -6 42 92 98 105 96 88 80 72 73 73 102 130 169 207 200 193 185 177 170 162 151 141 130 119 123 127 131 135 119 102 85 68 86 104 122 140
-1445 140 128 116 104 92 58 24 -10 -44 -16 12 40 69 104 140 111 82 45 7 34 61 99 136 146 156 122 87 53 19 6 -5 28 62 107 151
-1459 151 131 111 85 59 32 6 11 15 20 24 59 94 129 164 170 175 180 185 173 161 150 138 165 193 220 248 235 223 210 198 219 240 237 178 86 -4 -38 -16 13
-1476 13 44 78 113 164 216 212 208 206 203 201 198 147 96 45 -5 -32 -59 -86 -112 -125 -137 -94 -51 -51 -51 -50 -50 -16 17 51 85 89 93 97 101 127 152 178 203 179 155 130
-1495 130 106 117 128 190 253 294 281 243 205 218 230 187 144 154 163 200 238 260 282 249 215 189 163 192 221 258 296 305 315 305 294 284 273 241 210
-1510B10l2l2LLLLj4j3j3j4J3J3j5j5l2l1K4K4J2J2J2J2l0k9k6k6j1M4L8L9k9n7j4L3L8J1
-1525A14k7k6j8j7j8j7RQQRK6K6K6K6j3j3j3j3k5k4k5k4N1N1N2N1L0L1L0L0nmnmopooJ0J0
-1543B82J0Rj2j3j3j3L0K9k5k6l2l2l2l3kkklj2j3M2M3j5j5j5j5l6l6pM0N3N4KJn3n4J2N7
-1559A53N3K5j2j1k4k4k3k4RQRRL8L9Rl6n5n5l0l0k3k2m8m8nM0P0O9N5N5%%j9j9RQJ9J9l6
-1576A52l7n3n3n2n3k8k8K8K8K8K8K8K6M5M4j1j1k2k1L4L4PQm4m5j4M1L8L8LMk4k4K0K1K0
-1592A55K0MLL0L1L7L6j9j8k7k6KKoommj0J8L4k2m5m5OPJ4J4J4J5m5m5m5m4J4J4J4J5K2K1
-1609A31oom3m3J2J3J2J2j5j6l1l1O0O0N8N7K7K8j8m6o2oK6K7KLm1m2J5J4K7K8k8k8k5k5L1
-1625A31L1K0K0l5l5m6m5m1m2j3M2O5O6J7J7J7J6JJ%Jj%n2n2k7L9N5N4J3l5k3MNNPPk4k4k4
$$ plain form
-1510 210 178 146 149 152 155 158 144 131 118 104 117 130 115 100 68 37 61 85 97 109 121 133 103 74 48 22 11 55 93 132 103 46 32 65 103 114
-1525 114 87 61 43 26 8 -9 0 8 16 25 51 77 103 129 116 103 90 77 52 28 3 -21 30 81 133 184 214 245 275 305 300 296 291 287 281 274 268 262 272 282
-1543 282 292 301 289 276 263 250 280 309 284 258 226 194 162 129 127 125 123 120 108 95 137 180 165 150 135 120 84 48 41 81 134 188 190 191 138 84 96 153
-1559 153 206 231 219 208 184 160 137 113 122 130 139 148 186 225 234 198 143 88 58 28 5 -17 -65 -113 -118 -78 -8 61 116 171 171 171 152 133 142 150 169 188 152
-1576 152 115 62 9 -43 -96 -124 -152 -124 -96 -68 -40 -12 14 59 103 92 81 59 38 72 106 113 121 77 32 18 59 97 135 138 142 118 94 114 135 155
-1592 155 175 179 182 212 243 280 316 297 279 252 226 228 230 224 218 214 210 200 218 252 230 185 140 146 153 167 181 195 210 165 120 75 31 45 59 73 88 110 131
-1609 131 125 119 76 33 45 58 70 82 67 51 20 -11 49 109 167 224 251 279 261 215 153 147 173 200 202 205 164 122 137 151 178 206 178 150 125 100 131
-1625 131 162 182 202 167 132 86 41 0 -42 -55 -13 52 118 135 152 169 185 186 187 187 188 187 187 135 83 56 95 150 204 217 182 159 163 168 173 180 187 163 139 115
-1642A15k4n1m9o3l6J6O2O4O5L4L4k1k1nnM8M7L6j1n5k8J4J3j2j2jjk8k9m7m8m7m8noonM5
$$ plain form
-1642 115 91 40 -9 -72 -108 -92 -30 34 99 133 167 146 125 120 115 163 210 246 235 180 152 166 179 167 155 154 153 125 96 49 1 -46 -94 -99 -105 -111 -116 -71
$$ [...]
-3131A74
##END=	
##END=	
