##TITLE=	May13-2019.70.fid
F - 01 - 1.0

##JCAMP-DX=	6.0	$$ MestReNova 14.1.1-24571
##DATA TYPE=	LINK
##BLOCK_ID=	1
##BLOCKS=	1    
##ORIGIN=	Mestrelab Research S.L.
##OWNER=	hrzepa
##$MNOVA/LINK_BLOCK_TYPE=	ITEM	$$ NMR Spectrum
##$MNOVA/ITEM/POLYGON=	(XY..XY)
5321,5835
8722,5835
8722,8208
5321,8208
5321,5835
##$MNOVA/ITEM/Z=	0
##$MNOVA/ITEM/ANGLE=	0
##TITLE=	May13-2019.70.fid
##JCAMP-DX=	6.0	$$ MestReNova 14.1.1-24571
##BLOCK_ID=	2
##DATA TYPE=	NMR SPECTRUM
##DATA CLASS=	XYDATA
##NUMDIM=	1
##ORIGIN=	Bruker BioSpin GmbH
##OWNER=	nmr
##.OBSERVE FREQUENCY=	400.32240192000000434
##.OBSERVE NUCLEUS=	^1H
##.SOLVENT NAME=	DMSO
##.PULSE SEQUENCE=	zg30
##LONGDATE=	2019/05/13 18:38:00.000
##.ACQUISITIONMODE=	SIMULTANEOUS (DQD)
##$ORIGINAL FORMAT=	Bruker XWIN-NMR
##$MNOVA/SCALES_VERSION=	9
##$PARAMETER FILE=	(acqus, ASCII, /Users/hrzepa/Downloads/Polysiphenol%20SI%20NMR%20Original%20Data/3/3c%20-%201H%20-%20400B.19.05.13.070/70/acqus, 0)
$$ ##TITLE= Parameter file, TOPSPIN		Version 3.2
$$ ##JCAMPDX= 5.0
$$ ##DATATYPE= Parameter Values
$$ ##NPOINTS= 11	$$ modification sequence number
$$ ##ORIGIN= Bruker BioSpin GmbH
$$ ##OWNER= nmr
$$ $$ 2019-05-13 18:38:50.921 +0100  nmr@CZC2524DW0
$$ $$ /opt/topspin/data/brad/nmr/May13-2019/70/acqus
$$ $$ process /opt/topspin3.2/prog/mod/shimcntl
$$ ##$ACQT0= -2.3109243697479
$$ ##$AMP= (0..31)
$$ 100 100 100 100 100 100 100 100 100 100 100 100 100 100 100 100 100 100
$$ 100 100 100 100 100 100 100 100 100 100 100 100 100 100
$$ ##$AMPCOIL= (0..19)
$$ 0 0 0 0 0 0 0 0 0 0 0 0 0 0 0 0 0 0 0 0
$$ ##$ANAVPT= -1
$$ ##$AQSEQ= 0
$$ ##$AQ_mod= 3
$$ ##$AUNM= <au_zg>
$$ ##$AUTOPOS= <15 >
$$ ##$BF1= 400.32
$$ ##$BF2= 400.32
$$ ##$BF3= 400.32
$$ ##$BF4= 400.32
$$ ##$BF5= 400.32
$$ ##$BF6= 400.32
$$ ##$BF7= 400.32
$$ ##$BF8= 400.32
$$ ##$BYTORDA= 0
$$ ##$CAGPARS= (0..11)
$$ 0 0 0 0 0 0 0 0 0 0 0 0
$$ ##$CFDGTYP= 0
$$ ##$CFRGTYP= 9
$$ ##$CHEMSTR= <none>
$$ ##$CNST= (0..63)
$$ 1 1 145 1 1 1 1 1 1 1 1 1 1 1 1 1 1 1 1 1 1 1 1 1 1 1 1 1 1 1 1 1 1 1 1
$$ 1 1 1 1 1 1 1 1 1 1 1 1 1 1 1 1 1 1 1 1 1 1 1 1 1 1 1 1 1
$$ ##$CPDPRG= (0..8)
$$ <> <> <> <> <mlev> <mlev> <mlev> <mlev> <mlev>
$$ ##$D= (0..63)
$$ 0 1 0 0 0 0 0 0 0 0.06 0 0 0 0 0 0 0.0002 0 0 0 0 0 0 0 0 0 0 0 0 0 0 0
$$ 0 0 0 0 0 0 0 0 0 0 0 0 0 0 0 0 0 0 0 0 0 0 0 0 0 0 0 0 0 0 0 0
$$ ##$DATE= 1557769130
$$ ##$DE= 6.5
$$ ##$DECBNUC= <off>
$$ ##$DECIM= 2496
$$ ##$DECNUC= <off>
$$ ##$DECSTAT= 4
$$ ##$DIGMOD= 1
$$ ##$DIGTYP= 12
$$ ##$DQDMODE= 0
$$ ##$DR= 22
$$ ##$DS= 2
$$ ##$DSPFIRM= 0
$$ ##$DSPFVS= 20
$$ ##$DTYPA= 0
$$ ##$EXP= <proton>
$$ ##$F1LIST= <111111111111111>
$$ ##$F2LIST= <222222222222222>
$$ ##$F3LIST= <333333333333333>
$$ ##$FCUCHAN= (0..9)
$$ 0 2 0 0 0 0 0 0 0 0
$$ ##$FL1= 90
$$ ##$FL2= 90
$$ ##$FL3= 90
$$ ##$FL4= 90
$$ ##$FOV= 20
$$ ##$FQ1LIST= <freqlist>
$$ ##$FQ2LIST= <freqlist>
$$ ##$FQ3LIST= <freqlist>
$$ ##$FQ4LIST= <freqlist>
$$ ##$FQ5LIST= <freqlist>
$$ ##$FQ6LIST= <freqlist>
$$ ##$FQ7LIST= <freqlist>
$$ ##$FQ8LIST= <freqlist>
$$ ##$FRQLO3= 19394.9549999833
$$ [...]
$$ ##$Sgu3PowerLevels= (0..7)
$$ 0 0 0 0 0 0 0 0
$$ ##$Sgu4PowerLevels= (0..7)
$$ 0 0 0 0 0 0 0 0
$$ ##$Sgu5PowerLevels= (0..7)
$$ 0 0 0 0 0 0 0 0
$$ ##$Sgu6PowerLevels= (0..7)
$$ 0 0 0 0 0 0 0 0
$$ ##$Sgu7PowerLevels= (0..7)
$$ 0 0 0 0 0 0 0 0
$$ ##$Sgu8PowerLevels= (0..7)
$$ 0 0 0 0 0 0 0 0
$$ ##$SguType= 3
$$ ##$ShimPowMaxUA= (0..63)
$$ 130000 130000 130000 130000 130000 130000 130000 130000 130000 130000 130000
$$ 130000 130000 130000 130000 130000 130000 130000 130000 130000 0 0 0 0
$$ 0 0 0 0 0 0 0 0 0 0 0 0 0 0 0 0 0 0 0 0 0 0 0 0 0 0 0 0 0 0 0 0 0 0 0 0
$$ 0 0 0 0
$$ ##$ShimPowMaxUC= (0..63)
$$ 130000 130000 130000 130000 130000 130000 130000 130000 130000 130000 130000
$$ 130000 130000 130000 130000 130000 130000 130000 130000 130000 0 0 0 0
$$ 0 0 0 0 0 0 0 0 0 0 0 0 0 0 0 0 0 0 0 0 0 0 0 0 0 0 0 0 0 0 0 0 0 0 0 0
$$ 0 0 0 0
$$ ##$ShimPowMaxUG= (0..63)
$$ 524287 524287 524287 524287 524287 524287 524287 524287 524287 524287 524287
$$ 524287 524287 524287 524287 524287 524287 524287 524287 524287 0 0 0 0
$$ 0 0 0 0 0 0 0 0 0 0 0 0 0 0 0 0 0 0 0 0 0 0 0 0 0 0 0 0 0 0 0 0 0 0 0 0
$$ 0 0 0 0
$$ ##$ShimPowRcbType= 3
$$ ##$ShimPowRes= (0..63)
$$ 1e-20 1e-20 1e-20 1e-20 1e-20 1e-20 1e-20 1e-20 1e-20 1e-20 1e-20 1e-20
$$ 1e-20 1e-20 1e-20 1e-20 1e-20 1e-20 1e-20 1e-20 0 0 0 0 0 0 0 0 0 0 0 0
$$ 0 0 0 0 0 0 0 0 0 0 0 0 0 0 0 0 0 0 0 0 0 0 0 0 0 0 0 0 0 0 0 0
$$ ##$ShimPowRng0= (0..63)
$$ 1 1 1 1 1 1 1 1 1 1 1 1 1 1 1 1 1 1 1 1 0 0 0 0 0 0 0 0 0 0 0 0 0 0 0 0
$$ 0 0 0 0 0 0 0 0 0 0 0 0 0 0 0 0 0 0 0 0 0 0 0 0 0 0 0 0
$$ ##$ShimPowRng1= (0..63)
$$ 1 1 1 1 1 1 1 1 1 1 1 1 1 1 1 1 1 1 1 1 0 0 0 0 0 0 0 0 0 0 0 0 0 0 0 0
$$ 0 0 0 0 0 0 0 0 0 0 0 0 0 0 0 0 0 0 0 0 0 0 0 0 0 0 0 0
$$ ##$ShimPowRng2= (0..63)
$$ 1 1 1 1 1 1 1 1 1 1 1 1 1 1 1 1 1 1 1 1 0 0 0 0 0 0 0 0 0 0 0 0 0 0 0 0
$$ 0 0 0 0 0 0 0 0 0 0 0 0 0 0 0 0 0 0 0 0 0 0 0 0 0 0 0 0
$$ ##$ShimPowRng3= (0..63)
$$ 1 1 1 1 1 1 1 1 1 1 1 1 1 1 1 1 1 1 1 1 0 0 0 0 0 0 0 0 0 0 0 0 0 0 0 0
$$ 0 0 0 0 0 0 0 0 0 0 0 0 0 0 0 0 0 0 0 0 0 0 0 0 0 0 0 0
$$ ##$ShimSysFunc= (0..63)
$$ 1 2 3 4 5 7 9 11 15 16 8 10 12 14 6 17 13 18 19 20 0 0 0 0 0 0 0 0 0 0
$$ 0 0 0 0 0 0 0 0 0 0 0 0 0 0 0 0 0 0 0 0 0 0 0 0 0 0 0 0 0 0 0 0 0 0
$$ ##$ShimSysMatrix= 0
$$ ##$ShimSysType= 1
$$ ##$TFXNUM= 0
$$ ##$TRIPLO2= 0
$$ ##$VTU= 2
$$ ##$VTUETH= <149.236.99.20>
$$ ##$VTUTY= <no>
$$ ##$WBREFAM= (0..15)
$$ 132.2 106.2 100 100 100 100 100 100 100 100 100 100 100 100 100 100
$$ ##$WBREFLM= (0..15)
$$ 0 0 0 0 0 0 0 0 0 0 0 0 0 0 0 0
$$ ##$WBREFPH= (0..15)
$$ 77.55 -65.76 0 0 0 0 0 0 0 0 0 0 0 0 0 0
$$ ##$WBSGU= (0..15)
$$ 0 0 0 0 0 0 0 0 0 0 0 0 0 0 0 0
$$ ##$XFAC= 2
$$ ##END=
$$ 
##$DECIM=	2496
##$DSPFVS=	20
##XUNITS=	HZ
##YUNITS=	ARBITRARY UNITS
##FIRSTX=	6408.3302564214200174
##LASTX=	-1604.3679904610892208
##DELTAX=	-0.12226593800080123864
##XFACTOR=	1
##YFACTOR=	0.011498332519889858591
##FIRSTY=	8.6413097381591796875
##MINY=	-0.24850472807884216309
##MAXY=	11565.208984375
##NPOINTS=	65536
##XYDATA=	(X++(Y..Y))
$$ [...]
3447 706 697 688 665 596 530 557 632 660 624 587 624 662 677 692 753 815 802 788 775 762 752 741 731 721 760 800 836 873 806 694 633 663 734 804 834
3442 834 864 845 826 808 789 841 894 894 801 692 628 670 758 781 711 642 664 735 759 708 656 692 727 717 706 709 712 715 718 743 767 792 817 761 705 649 593
3438 593 624 656 687 718 741 763 740 717 689 662 634 607 561 514 544 574 599 623 648 672 623 573 574 666 778 799 800 801 804 806 763 720 737 754 725 695 675
3433 675 654 680 705 703 701 698 696 713 729 746 763 769 776 736 696 682 667 699 731 790 848 884 919 826 733 685 638 623 608 594 579 654 730 698 666 664 663 661 660 610
3428 610 559 641 723 818 821 768 715 732 749 766 783 818 853 817 782 711 733 749 765 720 675 630 585 554 523 570 616 590 563 614 665 712 759 759 760 750
3424 750 739 682 625 627 629 654 679 646 613 557 501 463 425 464 503 553 603 607 611 686 761 790 818 770 723 721 719 726 732 662 592 614 636 658 679 663 647 585 523
3419 523 567 611 632 653 643 633 623 613 674 734 735 659 604 625 673 675 684 740 795 805 802 846 884 845 718 636 663 689 697 704 666 627 543 458 451 443 460 478
3415 478 496 513 530 546 539 532 495 457 466 475 498 521 568 614 568 522 522 522 481 440 490 616 711 730 689 648 636 624 655 686 651 570 495 496 523 549 557 565 582
3410 582 600 540 481 485 490 517 544 604 664 677 691 696 702 662 621 588 555 544 534 478 421 503 584 587 589 592 594 595 595 550 504 487 469 528 587 622 657 615 574 559
3405 559 544 575 606 564 522 556 590 634 678 676 674 691 707 678 649 680 711 742 773 777 781 738 650 557 541 616 692 698 703 663 623 639 655 672 688 654 621 633
3400 633 646 630 615 643 670 624 532 496 537 623 663 626 590 593 597 646 696 678 661 646 632 680 775 884 917 854 745 706 712 713 668 623 623 658 646 586
3396 586 527 520 514 508 502 549 596 642 689 702 715 728 741 740 739 784 828 820 812 804 796 775 753 731 710 655 601 592 583 602 620 592 564 541 517 494 470 501 532 564 595
3391 595 588 581 574 568 603 638 674 709 709 709 709 709 715 722 682 643 656 670 684 698 746 794 793 793 768 697 597 589 634 632 590 593 633 672 668 664 698 732 719 707 671 635 600
3386 600 564 662 759 746 640 559 571 601 632 657 681 660 639 644 649 640 585 574 655 736 725 694 709 764 773 695 617 613 608 617 626 681 736 746 756 766 776 728
3381 728 680 678 675 636 596 631 665 636 560 530 592 674 665 637 608 600 593 585 577 586 596 605 615 596 577 605 632 648 664 680 696 673 649 640 677 759 749 688 673 706
3376 706 693 601 509 542 576 567 557 570 630 675 628 575 614 673 731 712 693 673 654 701 748 744 649 558 559 610 661 688 715 696 677 685 694 703 712 727 743 712
3371 712 682 620 557 541 525 535 545 601 656 665 674 684 693 690 688 685 683 692 701 664 627 694 760 750 740 761 782 804 825 817 810 756 703 700 697 694 692 664 636 613 590 550
3366 550 586 682 732 701 670 683 695 715 736 756 777 753 730 706 682 667 651 682 712 734 756 701 646 615 584 661 783 864 867 810 752 756 760 718 676 688
3362 688 700 711 723 718 712 707 701 745 788 772 679 593 583 628 627 605 583 604 625 605 584 641 698 690 682 674 667 632 597 608 619 628 637 646 656 710 765 774 782 718 654 636
3357 636 618 677 737 796 855 835 815 749 683 649 616 628 641 646 652 658 664 644 623 649 674 683 691 699 708 681 654 673 693 675 656 638 620 621 623 624 626 649 672 711 796
3352 796 855 836 761 733 751 769 713 658 623 589 555 521 593 665 661 657 651 645 685 725 750 775 723 671 587 504 528 552 624 697 724 751 747 743 739 735 778 821 818
3347 818 815 753 691 706 721 704 688 671 654 622 590 605 619 593 567 584 601 616 586 535 561 630 653 599 546 581 617 656 694 717 785 827 793 731 715
3343 715 776 836 794 752 710 668 689 709 730 751 771 792 812 833 779 724 670 615 582 548 561 574 574 575 620 712 775 745 637 575 597 618 596 529 501
3338 501 564 673 736 719 656 613 617 668 719 727 735 727 719 733 748 736 724 689 654 617 581 590 600 580 560 532 595 698 755 734 667 650 680 681 682 668 653 641
3334 641 629 681 780 858 844 839 834 832 738 560 427 411 486 548 609 676 743 709 676 719 762 759 755 767 824 870 823 757 737 760 738 698 659 702 746 744 742
3329 742 696 651 651 652 663 675 641 607 578 549 565 582 637 692 643 593 618 689 713 644 550 502 499 496 503 510 563 616 670 723 777 831 830 828 750 672 647 622 670
3324 670 719 712 660 633 683 763 798 756 668 617 643 756 870 908 870 803 782 755 727 703 679 699 720 695 669 655 640 671 702 724 746 744 743 717 690
3320 690 587 484 490 495 547 599 677 755 787 819 897 975 915 855 825 795 719 643 592 540 535 529 550 570 567 564 550 536 522 508 534 559 585 610 662 714 788
3316 788 863 859 855 805 755 835 916 889 863 860 857 780 656 576 603 641 634 611 634 674 715 735 756 731 705 669 633 625 617 609 679 776 828 812 796 777 758 713
3311 713 668 645 623 623 622 668 713 763 813 755 697 674 650 673 695 694 693 691 690 647 605 609 613 597 582 643 704 690 676 662 648 625 601 623 646 635 624 612 601
3306 601 685 769 745 722 677 632 665 697 764 832 823 813 824 834 846 859 827 841 881 828 761 693 665 637 596 555 622 688 741 794 848 901 921 942 917
3302 917 891 876 860 845 830 835 839 801 763 801 886 954 929 875 868 875 882 804 725 693 661 676 691 705 720 736 752 838 925 983 949 895 886 958 1029 1020 919 815
3297 815 757 775 792 752 712 722 824 894 872 836 846 903 960 912 864 857 851 921 991 992 994 995 996 1045 1094 1066 1039 1029 1019 1010 1000 960 919 986 1053 1081 1108 1136
3293 1136 1163 1196 1229 1278 1373 1448 1447 1389 1377 1491 1605 1614 1623 1671 1718 1765 1813 1860 1907 1955 2002 2065 2128 2115 2102 2132 2163 2196 2230 2237 2290 2306 2214 2060 1983
3288 1983 1994 2051 2070 2013 1895 1776 1705 1634 1565 1496 1467 1483 1517 1474 1390 1307 1265 1222 1190 1157 1202 1246 1212 1179 1191 1204 1186 1167 1149 1131 1088 1046 957
3284 957 869 848 827 883 939 979 1020 1014 1009 955 901 878 932 1029 1080 1049 972 948 923 880 791 730 746 787 783 744 705 740 821 861 825 734 643 640 744 904
3280 904 988 968 902 857 813 785 758 807 857 831 806 781 755 733 711 734 758 753 748 742 737 777 816 809 802 787 771 756 740 690 639 588 537 579 622 587 552 532
3275 532 512 492 472 530 589 601 614 625 636 648 659 613 566 597 627 671 715 758 802 803 805 806 808 787 767 792 818 757 696 743 789 760 730 700 670 632 595
3271 595 664 779 820 768 695 622 595 567 616 710 767 732 720 754 773 699 582 558 656 754 777 708 668 720 814 863 843 778 736 694 672 651 676 701
3267 701 746 790 758 726 637 549 567 586 610 634 658 682 746 811 768 724 751 777 803 829 757 686 660 634 695 756 817 878 884 891 897 903 897 891 885 879 896 913 884
3262 884 855 843 832 774 717 717 717 717 717 745 773 801 829 820 810 844 878 878 831 759 779 850 920 889 858 826 794 761 729 692 656 695 781 849 824 778 732 744
3257 744 756 768 780 826 871 894 825 724 669 688 754 752 657 566 567 638 708 708 708 652 596 586 577 640 703 720 737 808 880 957 942 875 808 812 816 836 857 831
3253 831 805 745 684 701 717 718 719 674 629 570 510 497 483 547 611 674 738 727 716 781 847 853 859 833 854 893 841 766 692 666 640 661 681 705 729 677 624
3248 624 590 557 569 581 597 613 629 645 668 690 713 735 734 733 731 730 760 790 743 696 722 748 771 794 728 616 524 524 609 693 784 874 883 891 899 908 883 859 764
3243 764 669 653 731 827 923 941 866 741 661 627 592 560 528 550 572 594 616 682 748 710 672 682 738 773 717 648 579 581 583 602 622 595 568 628 688
3239 688 725 671 585 546 582 663 719 683 629 621 688 755 718 680 676 672 668 664 651 637 624 611 665 719 727 734 719 704 766 828 814 800 786 772 746 721 695 670
3234 670 715 759 727 695 730 764 722 635 590 638 685 641 618 640 657 628 580 532 559 585 619 654 612 570 556 542 574 606 688 770 800 737 634 576
3230 576 569 607 676 746 796 754 703 698 733 722 665 607 592 578 612 646 679 713 634 555 552 550 558 566 574 583 591 599 608 616 572 527 533 630 723 723 643 563 543 522 578 634
3225 634 678 721 765 808 731 653 598 634 684 688 647 606 564 523 557 592 605 618 585 552 599 646 693 740 709 677 646 614 611 607 649 736 828 827 774 720 690
3220 690 660 676 692 667 642 571 500 565 630 694 759 754 749 698 647 596 545 539 534 610 685 708 639 588 583 624 664 674 684 693 703 717 731 699 667 616 565 560
3216 560 555 594 634 673 712 740 768 793 741 654 568 583 599 640 681 722 763 773 784 795 806 779 753 726 699 715 731 701 671 675 680 684 688 659 629 645 662
3211 662 677 692 662 631 616 601 663 724 708 692 676 660 670 679 616 554 518 559 633 708 745 783 775 766 723 680 642 604 608 689 774 781 700 665 707 749 727
3207 727 706 685 663 642 620 645 669 679 688 698 708 716 725 687 650 707 764 774 785 739 692 692 691 689 687 730 774 761 747 733 719 720 720 721 721 747 774 754 734 721
3202 721 708 695 683 641 599 588 654 721 743 687 632 540 448 403 357 411 465 518 572 543 513 530 546 627 707 741 775 757 738 720 701 790 879 829 780
3198 780 751 721 692 663 665 668 670 673 656 639 622 606 594 583 571 560 576 591 606 622 660 698 736 774 698 622 551 481 470 551 657 763 766 770 773 777 784 792 800
3193 800 807 799 790 782 773 795 816 761 706 692 677 662 647 604 561 651 740 795 758 726 694 728 762 796 829 830 831 832 834 826 819 766 713 739 764 744 723 730 736 742 749 765
3188 765 781 849 824 751 678 707 736 730 724 672 621 638 655 673 690 715 739 717 695 676 656 566 476 376 368 473 577 647 639 572 505 518 608 678 748
3183 748 771 794 771 748 720 692 710 728 694 661 704 747 789 830 738 646 607 644 685 725 759 794 829 863 863 862 815 769 804 840 875 910 913 916 896 876 836
3179 836 796 802 808 766 724 759 794 782 771 803 835 731 581 530 587 657 651 649 647 645 643 687 731 806 881 817 754 684 614 682 750 793 835 770 705 694 684
3174 684 674 663 602 541 587 634 707 780 806 833 826 818 764 710 712 714 762 810 820 830 817 804 820 836 806 775 676 577 585 593 597 600 627 654 690 727 764 801 823
3170 823 845 822 798 785 772 736 700 708 717 703 688 668 648 674 700 748 796 798 800 750 701 697 693 693 693 739 785 792 799 806 812 826 839 776 713 768 822 800 778 789 799
3165 799 794 743 702 737 772 808 807 807 761 715 670 625 688 751 731 711 668 625 623 622 621 620 585 550 561 572 567 561 579 596 689 782 799 815 854 893 901 833 760 734
3160 734 754 773 770 767 763 760 720 680 686 692 645 598 628 658 691 724 711 699 698 698 651 559 441 400 493 663 815 859 800 740 706 672 714 757 778 800 822
3155 822 844 837 831 801 772 771 771 817 862 831 800 769 738 722 705 688 672 699 727 755 783 854 926 891 855 813 771 776 780 813 846 745 645 651 733 744 677
3151 677 631 662 692 646 611 652 748 797 768 738 782 826 847 868 812 756 736 717 697 678 671 664 657 650 667 684 701 718 660 603 622 642 632 623 613 604 619 635
3146 635 697 758 744 730 762 794 765 735 752 768 787 807 780 753 769 785 801 816 787 758 729 699 659 619 580 540 565 590 616 641 720 799 878 957 947
3142 947 938 928 919 913 906 900 894 885 876 867 858 836 815 747 680 699 718 737 756 725 693 662 708 776 799 780 808 863 918 900 881 899 917 859 800 765 730 741 752 703
3137 703 654 652 649 657 664 625 587 598 609 666 723 714 705 772 840 855 871 882 893 881 792 703 691 732 772 741 710 730 750 770 790 760 731 701 671 676 681 641 600
3132 600 641 683 725 766 804 842 773 657 540 499 550 648 714 704 637 616 663 710 760 810 858 907 878 850 790 729 668 607 564 520 553 587 631 676
3128 676 649 622 656 767 876 907 889 825 756 733 809 885 918 952 922 893 864 834 887 939 991 1044 993 941 890 839 828 816 805 794 817 841 864 887
3124 887 849 810 772 734 718 703 641 580 630 679 683 687 714 741 767 794 825 855 886 916 869 822 781 739 728 809 906 958 961 918 872 872 902 931 918 904 910
3119 910 917 877 838 771 704 683 662 756 850 920 897 814 731 688 646 662 678 694 710 770 830 782 735 732 728 725 722 722 722 651 580 591 694 842 899 877 856
3115 856 875 894 843 793 820 846 865 885 858 831 838 845 852 859 888 916 1011 1060 1037 922 815 709 688 760 780 800 827 855 882 910 863 817 847 877 877 878
3110 878 807 737 700 755 835 915 885 855 825 795 762 729 773 817 847 876 829 782 793 803 768 733 676 619 638 658 687 717 747 777 759 740 768 796 774
3106 774 753 731 709 687 666 746 826 858 797 789 781 800 820 839 859 844 829 814 799 778 756 781 805 852 899 946 993 1019 1045 1024 1004 953 901 849 798 844
3102 844 890 936 982 941 899 812 724 738 752 766 780 845 909 897 885 857 830 802 775 738 700 765 830 894 867 814 762 739 717 695 673 721 769 740 711
3097 711 717 724 689 655 610 656 697 738 762 786 857 927 959 991 947 902 859 817 881 946 919 891 864 836 855 874 893 912 962 1013 987 960 952 944 936 928 932 935 939
3093 939 942 895 848 878 908 908 908 948 989 984 888 746 695 785 875 863 851 905 958 966 974 961 949 937 924 922 920 874 781 771 854 936 927 851 822 869 915 873 830
3088 830 787 745 726 708 735 762 762 761 807 853 857 861 822 783 826 914 958 909 821 825 878 932 910 887 865 843 857 872 809 747 746 746 792 838 897 956 938 920
3083 920 875 830 832 833 822 811 846 882 821 760 745 731 788 846 944 1042 1064 994 924 947 1012 1077 1040 1004 978 952 926 899 891 882 876 870 874 924 999 983 888 792
3079 792 747 794 820 846 877 909 888 867 892 918 890 863 835 808 831 855 876 897 887 830 790 843 882 874 827 825 824 823 826 828 880 931 906 881 880 879 878 877 848 818
3074 818 788 759 797 836 874 913 914 916 841 766 810 854 898 942 897 853 855 856 911 965 974 982 971 959 991 1023 1010 950 874 874 935 995 984 972 931 890 849 808
3069 808 788 767 746 726 829 932 958 985 945 904 864 824 866 908 874 793 760 803 873 896 903 910 914 918 947 977 960 944 928 913 928 897 857 894 985 1030
3065 1030 992 908 868 873 901 929 960 991 989 988 971 907 835 840 906 972 969 965 961 957 953 948 944 940 868 797 802 807 820 832 890 949 1002 1056 1033 1010 1000 991 981 972 969 967 964 961
3059 961 964 967 970 972 970 968 966 964 984 1003 952 900 869 931 1013 1048 989 930 974 1064 1057 958 881 897 989 1035 1004 974 990 1006 1022 1038 1069 1101 1109 1118 1111 1105 991 877
3054 877 852 827 801 776 824 872 900 837 800 855 907 867 841 862 922 937 893 849 878 908 895 881 868 855 903 952 954 957 948 939 954 968 871 773 790 899
3050 899 1021 1097 1128 1159 1111 1063 1038 1013 1061 1109 1152 1195 1227 1167 1059 997 1014 1076 1116 1156 1171 1185 1154 1123 1126 1128 1108 1088 1056 1024 1099 1174 1257 1340 1377
3046 1377 1413 1354 1295 1259 1223 1246 1269 1269 1270 1283 1297 1382 1466 1471 1384 1296 1301 1343 1385 1356 1327 1271 1215 1181 1148 1160 1173 1185 1197 1242 1288 1287 1286 1275 1263 1251 1240
3041 1240 1298 1357 1273 1097 980 954 1010 1065 1132 1199 1243 1287 1286 1284 1212 1139 1088 1130 1165 1200 1204 1207 1210 1214 1184 1155 1126 1096 998 899 908 917 928 940 1023 1105 1124
3037 1124 1050 1017 1075 1128 1089 1031 973 1024 1076 1081 1087 1110 1132 1109 1086 1130 1175 1173 1171 1152 1132 1113 1093 1138 1183 1251 1319 1343 1367 1314 1261 1283 1305 1304 1303 1299 1294 1296 1297
3032 1297 1303 1402 1501 1507 1437 1367 1367 1368 1376 1383 1345 1306 1267 1227 1234 1241 1244 1248 1252 1255 1186 1117 1093 1070 1075 1080 1084 1089 1095 1100 1029 958 938 918 975 1031 1063 1095 1080 1066 1097 1128 1165
3027 1165 1110 1033 957 958 1051 1141 1184 1183 1181 1230 1279 1276 1180 1104 1073 1088 1102 1079 1055 1031 1007 988 969 996 1022 981 939 920 902 900 898 973 1048 1057 1066 1030 993 1004
3022 1004 1016 1030 1045 1093 1188 1235 1190 1076 1008 1016 1023 988 952 963 974 975 977 1025 1072 1043 1014 1008 1002 964 926 911 896 911 927 841 754 712 761 896 1032 1090
3018 1090 1148 1129 1110 1072 1034 996 958 898 838 800 854 931 962 917 873 878 883 889 894 863 832 908 985 1070 1155 1163 1171 1116 1060 1112 1163 1216 1269 1214 1160 1136 1112
3013 1112 1089 1065 1083 1101 1096 1092 1045 999 1085 1172 1186 1109 1032 1046 1074 1103 1136 1170 1128 1087 1045 1003 1018 1033 1001 970 975 980 1030 1081 1076 1072 1090 1108 1100 1092 1032 1064
3008 1064 1134 1204 1233 1263 1205 1148 1079 1102 1166 1138 1091 1044 1049 1053 981 909 940 971 1047 1124 1135 1147 1082 1016 1057 1098 1067 1037 987 1028 1064 1100 1091 1083 1074 1065 1078
3004 1078 1091 1127 1163 1178 1193 1163 1132 1116 1100 1107 1114 1109 1104 1100 1095 1119 1142 1166 1189 1195 1201 1207 1213 1169 1125 1188 1252 1193 1135 1184 1325 1418 1358 1252 1146 1155 1163 1195 1226
2999 1226 1242 1257 1196 1135 1185 1234 1237 1241 1214 1188 1139 1089 1084 1078 1095 1113 1080 1048 1039 1030 1082 1134 1140 1146 1106 1066 1073 1079 1104 1130 1201 1273 1302 1332 1284 1237 1193 1150 1153 1155
2994 1155 1172 1189 1206 1223 1211 1200 1234 1268 1231 1195 1204 1213 1236 1259 1281 1304 1338 1372 1330 1287 1288 1288 1289 1289 1289 1288 1242 1196 1225 1254 1237 1220 1258 1295 1333 1371 1305 1238
2990 1238 1249 1260 1263 1267 1225 1183 1151 1120 1165 1211 1253 1296 1262 1228 1244 1260 1276 1293 1316 1339 1362 1385 1385 1385 1385 1384 1384 1384 1384 1384 1396 1407 1418 1429 1368 1306 1290 1275 1349
2985 1349 1422 1420 1417 1405 1394 1382 1370 1372 1373 1421 1468 1498 1529 1482 1435 1431 1426 1422 1417 1471 1525 1533 1541 1511 1481 1497 1513 1530 1547 1564 1581 1512 1443 1421 1398 1469 1539 1610 1680
2980 1680 1713 1746 1779 1812 1873 1934 1862 1791 1771 1844 1890 1891 1871 1852 1829 1807 1817 1828 1940 2052 2129 2114 2125 2181 2240 2299 2315 2330 2396 2461 2450 2439 2393 2348
2976 2348 2302 2256 2317 2378 2438 2499 2562 2625 2688 2751 2703 2655 2607 2558 2601 2644 2687 2730 2682 2634 2588 2543 2573 2649 2708 2675 2636 2644 2652 2614 2528 2533 2622 2711 2696 2680
2971 2680 2619 2557 2453 2348 2350 2353 2365 2378 2390 2402 2446 2489 2533 2576 2501 2425 2403 2472 2566 2614 2589 2563 2584 2652 2698 2653 2591 2529 2569 2609 2655 2701 2748 2794
2967 2794 2859 2923 2941 2960 2928 2897 2911 2926 2923 2920 2917 2915 2991 3068 3043 3019 2948 2969 3015 3061 3013 2965 2918 2870 2897 2924 2951 2978 2980 2981 3028 3076 3047 3019 2990 2962 2984
2963 2984 3007 2979 2860 2726 2685 2663 2641 2614 2586 2666 2745 2745 2746 2792 2838 2874 2911 2809 2708 2574 2440 2382 2325 2355 2384 2460 2536 2536 2536 2536 2536 2542 2549 2509 2470
2958 2470 2489 2507 2480 2452 2401 2349 2298 2246 2262 2278 2341 2403 2350 2298 2246 2194 2219 2244 2264 2283 2302 2228 2129 2031 2026 2021 2017 2012 2005 1997 2066 2136 2098 2061 2038 2062 2066 1978
2954 1978 1892 1899 2028 2157 2175 2101 2008 1914 1868 1914 1925 1890 1861 1878 1938 1998 2015 2032 2072 2113 2107 2102 2144 2185 2150 2115 2131 2146 2162 2178 2269 2361 2376 2390 2398
2950 2398 2406 2460 2514 2572 2631 2643 2610 2567 2601 2691 2781 2806 2755 2706 2734 2854 3020 3145 3223 3230 3237 3241 3245 3321 3398 3474 3551 3657 3763 3869 3975 3972 3970 3895
2945 3895 3821 3821 3898 4001 4058 4039 3974 3933 3891 3873 3855 3837 3819 3730 3641 3506 3371 3338 3304 3271 3238 3246 3255 3187 3119 3080 3041 3002 2963 2949 2934 2874 2814 2742
2941 2742 2670 2598 2526 2502 2478 2407 2337 2314 2292 2269 2247 2219 2191 2208 2226 2191 2156 2121 2087 2047 2007 1967 1928 1974 2021 2024 2028 2035 2087 2087 2011 1984 2065 2186 2201 2118
2937 2118 2035 2053 2071 2055 2039 2023 2008 1995 1982 2046 2110 2116 2123 2129 2136 2067 1998 1963 2004 2060 2116 2084 1976 1863 1797 1838 1879 1918 1957 1997 2036 1994 1951 1932 1912
2933 1912 1902 1892 1925 1959 1983 1962 1943 1925 1923 1921 1873 1825 1776 1727 1728 1776 1823 1869 1873 1876 1846 1816 1832 1848 1845 1842 1813 1829 1863 1896 1858 1820 1825 1876 1927 1932 1895 1858 1841
2928 1841 1824 1793 1762 1808 1854 1886 1919 1951 1984 1978 1973 1990 2008 1958 1909 1891 1949 2027 2059 2075 2092 2095 2098 2027 1956 1880 1849 1902 2001 2067 2087 2090 2092 2121 2149 2135 2120
2923 2120 2092 2111 2149 2188 2169 2150 2177 2250 2317 2306 2270 2280 2346 2413 2431 2404 2379 2355 2313 2224 2118 2089 2122 2154 2169 2184 2273 2362 2376 2343 2351 2406 2435 2387
2919 2387 2338 2365 2410 2379 2293 2253 2316 2379 2338 2296 2273 2250 2273 2296 2291 2286 2281 2276 2239 2202 2166 2129 2150 2172 2193 2214 2227 2239 2228 2217 2184 2151 2194 2238 2281 2325
2915 2325 2345 2365 2331 2297 2339 2381 2386 2390 2395 2399 2431 2462 2416 2371 2321 2272 2245 2218 2279 2340 2400 2461 2466 2470 2475 2479 2476 2473 2470 2467 2442 2417 2422 2505 2608 2665 2707 2750 2780 2811
2910 2811 2795 2780 2750 2720 2690 2660 2650 2639 2628 2618 2620 2623 2625 2704 2825 2899 2897 2895 2911 2928 2898 2869 2898 2928 2912 2896 2838 2781 2767 2753 2733 2667 2638 2717 2853 2913
2905 2913 2884 2856 2895 2934 2927 2920 2954 2988 3000 3011 3032 3053 3120 3187 3171 3156 3117 3079 3143 3208 3272 3337 3291 3245 3274 3350 3407 3371 3362 3398 3483 3522 3482 3442 3404 3366
2901 3366 3374 3383 3403 3424 3398 3373 3403 3433 3387 3340 3293 3246 3245 3244 3288 3332 3330 3328 3361 3394 3426 3459 3502 3545 3511 3478 3481 3484 3440 3397 3385 3372 3406 3439 3531 3622 3606 3590
2896 3590 3612 3634 3611 3543 3560 3669 3775 3789 3760 3731 3773 3815 3856 3898 3893 3889 3934 3980 3948 3825 3790 3908 4063 4126 4074 4022 4010 3998 3993 3987 4058 4130 4243
2892 4243 4356 4332 4307 4263 4219 4252 4285 4355 4425 4495 4565 4658 4750 4735 4720 4774 4828 4882 4936 4975 5013 5098 5183 5258 5333 5408 5483 5472 5462 5528 5594 5628 5663 5697
2888 5697 5732 5868 6003 6139 6275 6373 6471 6570 6668 6747 6827 6860 6893 6910 6927 6944 6961 6976 6991 7008 7026 7114 7248 7303 7267 7197 7174 7195 7262 7335 7317 7216
2884 7216 7069 6984 6992 7042 7001 6890 6780 6740 6701 6675 6649 6578 6460 6350 6332 6366 6401 6334 6267 6246 6226 6192 6157 6047 5936 5850 5764 5754 5745 5748 5751 5708 5665
2880 5665 5677 5688 5700 5712 5699 5687 5720 5754 5697 5639 5659 5678 5687 5695 5701 5707 5669 5585 5522 5550 5598 5647 5624 5601 5572 5543 5515 5486 5471 5456 5488 5519 5495 5470 5492 5513
2876 5513 5493 5472 5451 5431 5444 5457 5470 5483 5505 5527 5549 5571 5533 5496 5505 5514 5485 5456 5428 5399 5360 5321 5281 5242 5286 5331 5372 5413 5482 5504 5414 5232 5119 5159
2872 5159 5241 5276 5307 5338 5369 5400 5395 5436 5494 5475 5376 5277 5281 5284 5275 5265 5301 5338 5342 5345 5349 5353 5292 5231 5216 5200 5175 5150 5125 5099 5127 5154 5182 5209 5211 5213 5215 5217 5230 5244
2867 5244 5211 5179 5240 5302 5317 5332 5308 5284 5337 5390 5357 5324 5290 5257 5251 5246 5287 5327 5266 5204 5204 5280 5342 5359 5359 5360 5422 5484 5545 5607 5587 5567 5594 5620 5638 5656 5629
2862 5629 5601 5599 5597 5596 5594 5662 5731 5754 5777 5757 5738 5764 5791 5812 5833 5854 5875 5862 5848 5878 5908 5954 5954 5934 5991 6103 6168 6157 6145 6193 6241 6288 6336 6353 6370 6341
2858 6341 6312 6338 6365 6391 6417 6472 6527 6583 6638 6618 6599 6657 6714 6766 6818 6870 6921 7008 7095 7106 7116 7069 7022 7008 7071 7164 7257 7281 7305 7363 7467 7543 7542 7522
2854 7522 7502 7523 7544 7595 7645 7695 7745 7737 7729 7721 7713 7675 7636 7735 7835 7939 8043 8099 8154 8097 7994 7951 7984 8059 8135 8215 8295 8341 8387 8432 8478 8552 8627 8624 8622
2849 8622 8674 8726 8733 8739 8781 8824 8943 9062 9124 9185 9201 9216 9321 9426 9411 9318 9240 9238 9327 9416 9487 9558 9628 9699 9793 9887 9934 9982 10068 10153 10239 10324 10361 10397
2845 10397 10537 10676 10785 10818 10817 10817 10852 10888 11000 11113 11155 11197 11240 11282 11387 11491 11550 11609 11740 11872 11957 12043 12094 12145 12195 12246 12333 12419 12505 12591
2842 12591 12725 12859 12947 13035 13076 13116 13203 13289 13369 13449 13529 13609 13758 13906 13978 14050 14196 14343 14489 14636 14743 14850 14912 14973 15140 15308 15476
2838 15476 15644 15791 15939 16087 16235 16401 16568 16735 16902 17048 17193 17339 17485 17656 17828 17953 18079 18262 18446 18630 18814 18934 19054
2835 19054 19221 19387 19539 19691 19843 19995 20235 20475 20715 20955 21166 21376 21541 21705 21904 22104 22349 22594 22880 23166 23451 23737 23961
2833 23961 24184 24408 24632 24930 25229 25528 25827 26066 26304 26593 26883 27220 27633 28030 28380 28701 29022 29386 29750 30142 30534 31002 31471
2830 31471 31869 32267 32711 33155 33655 34155 34609 35017 35417 35893 36466 37085 37732 38379 38982 39586 40174 40763 41428 42093 42792 43492 44238
2827 44238 44983 45745 46507 47346 48184 49019 49853 50692 51532 52436 53417 54401 55386 56371 57357 58511 59665 60856 62047 63284 64521
2824 64521 65803 67085 68423 69808 71260 72805 74439 76073 77764 79455 81237 83066 84925 86939 89053 91259 93519
2822 93519 95872 98393 101007 103611 106307 109168 112243 115454 118819 122299 125932 129718 133720 137975 142444 147061 151831
2820 151831 156778 161939 167350 173037 179008 185317 191920 198800 206002 213480 221265 229265 237495 246001 254747 263707 272944
2818 272944 282335 291723 300958 309963 318692 327048 334821 341881 348050 353283 357442 360430 362222 362789 362159 360359 357423
2816 357423 353449 348523 342735 336240 329188 321799 314114 306276 298419 290715 283288 276075 269099 262400 256023 250045 244464
2814 244464 239343 234691 230499 226716 223332 220424 217977 215921 214263 213047 212292 211954 211954 212291 212966 214059 215613 217573 219871
2812 219871 222510 225487 228763 232315 236280 240644 245299 250108 255049 260267 265735 271295 276874 282498 288207 293916 299513
2810 299513 305064 310634 316111 321440 326553 331533 336297 340806 345038 349098 352943 356410 359539 362369 364923 367000 368555
2808 368555 369669 370445 370751 370536 369848 368823 367421 365558 363293 360751 357922 354877 351700 348524 345321 342025 338644 335262
2805 335262 331929 328595 325151 321708 318190 314626 310958 307136 303115 298819 294273 289512 284617 279569 274352 268981 263462
2803 263462 257851 252174 246498 240751 235005 229261 223518 217862 212253 206649 201136 195710 190375 185091 179898 174865 169985
2801 169985 165209 160587 156156 151880 147768 143871 140153 136588 133192 130011 127049 124240 121572 119059 116735 114565 112479
2799 112479 110486 108647 107022 105594 104257 102974 101845 100880 100008 99188 98461 97889 97532 97238 96944 96690 96590 96716 96934 97228
2797 97228 97676 98255 98925 99650 100466 101503 102694 103993 105383 106904 108578 110360 112234 114243 116405 118705 121097 123642
2795 123642 126341 129230 132212 135238 138265 141338 144410 147460 150418 153266 155961 158411 160586 162415 163967 165253 166263
2792 166263 166982 167362 167375 167050 166437 165548 164394 163026 161446 159652 157598 155207 152536 149589 146436 143069 139563 135904 132139
2790 132139 128281 124323 120318 116311 112303 108382 104613 100943 97365 93929 90585 87369 84246 81287 78482 75793 73196
2788 73196 70710 68316 66033 63843 61756 59822 57979 56228 54582 53029 51566 50104 48675 47338 46146 45001 43840
2786 43840 42680 41578 40569 39592 38661 37819 37023 36250 35477 34742 34007 33319 32630 32004 31378 30751 30125 29596 29066 28614 28161 27728
2783 27728 27295 26909 26522 26182 25842 25456 25070 24755 24440 24124 23809 23533 23257 22981 22705 22458 22211 21966 21722 21472 21268 21090 20820
2780 20820 20486 20153 19921 19689 19457 19226 19008 18837 18610 18290 17900 17602 17420 17283 17048 16768 16524 16326 16128 15884 15640 15441 15218
2778 15218 14996 14804 14689 14603 14471 14285 14099 13895 13645 13403 13238 13134 13031 12859 12687 12561 12436 12322 12209 12049 11890 11807 11724 11595
2775 11595 11466 11364 11261 11204 11147 11007 10866 10729 10668 10653 10639 10567 10419 10282 10190 10145 10099 10022 9944 9866 9789 9689 9590 9593 9596 9582 9492 9311 9131
2771 9131 8974 8895 8881 8914 8925 8890 8838 8786 8757 8728 8675 8623 8569 8516 8421 8327 8312 8374 8436 8422 8397 8373 8344 8315 8286 8257 8228 8199 8198 8197 8196 8195 8194 8193 8192 8191 8160 8129
2767 8129 8098 8067 8043 8019 7995 7971 7930 7889 7956 8023 8023 8023 8046 8069 8032 7995 8066 8137 8146 8155 8164 8173 8175 8178 8134 8090 8094 8098 8079 8060 7992 7925 7904 7882 7785 7689 7638 7587 7528
2762 7528 7469 7482 7495 7422 7273 7182 7138 7061 6907 6771 6681 6572 6417 6305 6300 6369 6392 6341 6289 6220 6151 6109 6144 6169 6086 5935 5830 5837 5843 5776 5708 5729
2758 5729 5750 5711 5596 5516 5512 5507 5502 5464 5426 5387 5349 5381 5413 5422 5431 5431 5431 5385 5338 5349 5359 5346 5334 5297 5260 5224 5187 5214 5241 5268 5295 5306 5317 5328 5339 5312 5285
2753 5285 5305 5324 5281 5238 5195 5152 5162 5172 5182 5192 5189 5186 5182 5179 5193 5206 5219 5232 5302 5372 5395 5419 5440 5461 5436 5410 5425 5440 5501 5561 5553 5546 5561 5576 5625 5674 5724
2749 5724 5773 5834 5895 5882 5822 5805 5895 6012 6051 5979 5907 5908 5908 5880 5852 5747 5642 5604 5566 5606 5645 5675 5705 5715 5678 5633 5587 5521 5409 5296 5229 5241 5253
2745 5253 5194 5135 5076 5016 4940 4864 4898 4977 4996 4969 4942 4960 4985 4964 4897 4831 4849 4913 4974 4989 4983 4932 4875 4864 4841 4772 4706 4686 4742 4798 4857 4916 4989 5062 5090
2740 5090 5117 5097 5077 5059 5042 5092 5188 5241 5248 5303 5403 5501 5553 5530 5507 5502 5542 5647 5751 5828 5828 5830 5879 5925 5925 5887 5894 5981 6067 6080 6093 6105 6118 6107 6096 6131
2736 6131 6166 6107 6049 6053 6133 6200 6221 6266 6311 6280 6142 6003 5973 6062 6152 6197 6197 6154 6111 6066 6020 6016 6011 6032 6008 5983 5958 5976 5995 6052 6108 6165 6222 6240 6257
2732 6257 6292 6372 6459 6500 6544 6633 6713 6793 6799 6806 6813 6821 6828 6836 6854 6872 6936 7000 7068 7136 7066 6996 6969 6942 6961 6980 6962 6945 6927 6910 6892 6873 6809 6745 6769 6793 6772
2727 6772 6750 6653 6555 6504 6452 6400 6348 6296 6244 6206 6169 6131 6093 6047 6000 5954 5907 5886 5866 5799 5732 5681 5630 5579 5528 5554 5581 5607 5634 5597 5560 5523 5486 5525
2723 5525 5564 5557 5550 5544 5538 5532 5527 5498 5469 5486 5504 5465 5426 5387 5348 5361 5374 5341 5262 5203 5220 5263 5260 5214 5168 5196 5224 5232 5240 5248 5256 5211 5167 5168 5169 5152 5134 5116 5175 5280
2718 5280 5339 5320 5254 5220 5231 5260 5212 5114 5061 5118 5220 5255 5243 5260 5354 5445 5489 5487 5485 5444 5404 5364 5323 5328 5333 5338 5342 5354 5366 5377 5389 5375 5362 5310 5258 5187 5116
2714 5116 5098 5080 5077 5075 5049 5023 5025 5027 5030 5032 5040 5048 5056 5064 5076 5089 5032 4976 4935 4893 4852 4811 4798 4786 4827 4868 4940 5013 4985 4958 4914 4870 4905 4941 4967 4916 4829 4788 4814
2709 4814 4840 4789 4738 4746 4831 4895 4883 4841 4846 4936 5025 5050 5075 5031 4987 5019 5050 5121 5191 5252 5314 5341 5291 5242 5300 5439 5578 5628 5677 5689 5700 5729 5758 5856
2705 5856 5954 5966 5979 6030 6157 6297 6390 6465 6587 6716 6845 6924 7002 7075 7149 7222 7295 7376 7457 7489 7520 7595 7746 7901 7978 8008 8083 8212 8342 8439
2701 8439 8537 8630 8723 8812 8825 8781 8737 8713 8690 8720 8750 8796 8842 8801 8683 8591 8499 8456 8413 8385 8356 8331 8214 8043 7964 7973 7982 7869 7755 7680 7605 7547 7489
2697 7489 7393 7297 7252 7208 7217 7225 7210 7194 7179 7163 7075 6987 6922 6857 6815 6772 6767 6763 6825 6888 6912 6937 6867 6797 6800 6896 6954 6921 6892 6862 6863 6864 6826 6789 6842 6896 6950 7003
2692 7003 6990 6976 6911 6938 7018 7098 7162 7225 7282 7338 7341 7344 7384 7423 7440 7456 7392 7328 7363 7399 7474 7550 7572 7594 7576 7559 7579 7600 7657 7714 7671 7629 7591 7553 7594
2688 7594 7635 7704 7682 7571 7460 7360 7353 7393 7433 7460 7488 7446 7405 7309 7214 7191 7260 7337 7322 7219 7116 7031 6947 6917 6887 6858 6829 6762 6695 6608 6521 6435
2684 6435 6348 6333 6319 6342 6366 6310 6254 6198 6142 6134 6125 6189 6252 6230 6131 6049 6013 5992 5971 5906 5842 5821 5800 5820 5840 5873 5829 5720 5612 5530 5447 5411 5375 5354
2680 5354 5333 5353 5373 5393 5337 5216 5095 5028 4960 4999 5083 5131 5072 4913 4753 4685 4694 4689 4638 4543 4495 4497 4544 4581 4571 4482 4394 4348 4302 4333 4365 4405 4446 4410
2676 4410 4374 4305 4237 4242 4247 4201 4108 4045 4057 4113 4169 4140 4034 3943 3928 3943 3958 3931 3904 3831 3759 3735 3711 3687 3663 3580 3497 3521 3546 3510 3474 3437 3401 3356 3310
2672 3310 3265 3219 3222 3224 3181 3137 3125 3112 3141 3169 3161 3075 2990 2981 3036 3092 3045 2998 2972 2945 2964 2983 3027 3071 3069 3066 3012 2958 2904 2850 2868 2887 2906 2924 2924 2923 2923 2922 2920 2917
2667 2917 2914 2911 2902 2893 2883 2874 2834 2794 2784 2849 2950 2973 2907 2840 2830 2820 2810 2799 2849 2898 2901 2904 2865 2825 2786 2746 2795 2843 2892 2940 2918 2895 2800 2705 2697 2765 2836 2831
2662 2831 2781 2777 2815 2806 2755 2705 2697 2690 2670 2651 2632 2612 2603 2593 2660 2727 2726 2725 2724 2723 2753 2783 2767 2750 2752 2754 2755 2757 2747 2738 2728 2718 2680 2642 2651 2659 2625 2591 2557 2523 2523 2522 2536
2657 2536 2597 2700 2726 2660 2594 2611 2627 2644 2661 2648 2636 2577 2518 2532 2546 2529 2436 2345 2301 2302 2304 2293 2282 2271 2260 2316 2372 2352 2331 2321 2311 2301 2290 2269 2247
2653 2247 2225 2204 2181 2158 2212 2266 2277 2288 2299 2310 2314 2317 2321 2324 2270 2216 2162 2108 2130 2153 2175 2198 2239 2281 2323 2364 2381 2398 2414 2431 2367 2303 2316 2329 2342 2355
2648 2355 2321 2288 2340 2393 2368 2343 2325 2306 2287 2268 2291 2315 2338 2362 2320 2279 2315 2351 2352 2353 2354 2355 2424 2493 2516 2540 2501 2463 2425 2387 2426 2466 2456 2354 2297 2332
2644 2332 2408 2391 2321 2251 2252 2253 2272 2290 2262 2234 2193 2152 2188 2224 2231 2238 2346 2455 2489 2430 2378 2325 2335 2345 2355 2364 2270 2177 2163 2242 2296 2257 2248 2284 2304 2278
2639 2278 2253 2273 2343 2367 2374 2380 2336 2293 2249 2205 2145 2085 2101 2118 2138 2158 2101 2044 2067 2090 2112 2135 2136 2137 2091 2046 2072 2097 2077 2057 2029 2002 1974 1947 1971 1995
2635 1995 2065 2136 2161 2186 2211 2237 2173 2110 2081 2128 2195 2262 2288 2313 2302 2290 2275 2261 2230 2153 2116 2186 2300 2368 2361 2354 2396 2437 2372 2262 2183 2212 2314 2461
2631 2461 2589 2610 2556 2502 2546 2589 2587 2539 2522 2582 2668 2708 2739 2771 2799 2828 2841 2853 2820 2787 2768 2749 2776 2803 2814 2824 2880 2936 2984 3032 3079 3127 3129 3131 3180
2627 3180 3228 3266 3305 3267 3229 3254 3279 3304 3329 3338 3347 3356 3365 3343 3320 3298 3276 3285 3295 3350 3406 3410 3415 3420 3424 3412 3401 3389 3377 3387 3397 3407 3417 3364 3310 3303 3295 3244 3193 3172
2622 3172 3228 3288 3301 3237 3173 3089 3005 2921 2837 2788 2739 2737 2734 2798 2861 2848 2834 2794 2754 2760 2765 2696 2626 2602 2579 2623 2668 2666 2665 2626 2587 2549 2510 2516 2522 2458 2393 2373
2617 2373 2446 2543 2640 2637 2635 2589 2543 2564 2630 2682 2641 2590 2630 2740 2805 2758 2620 2580 2632 2707 2689 2626 2610 2682 2755 2724 2692 2735 2779 2822 2865 2889 2912 2936
2613 2936 2960 2998 3036 3028 3020 3028 3036 3044 3053 3007 2962 2992 3069 3094 3028 2914 2846 2864 2882 2903 2924 2934 2944 2877 2810 2803 2795 2788 2781 2794 2807 2774 2741 2713 2685 2665 2554 2427
2608 2427 2346 2371 2397 2398 2398 2399 2399 2407 2414 2344 2274 2233 2191 2226 2261 2321 2381 2337 2293 2301 2356 2390 2333 2261 2190 2189 2189 2192 2195 2198 2202 2198 2194 2191 2187 2190 2192 2194 2196 2199 2202 2206 2209 2251 2294 2382 2471
2602 2471 2401 2331 2261 2191 2212 2234 2240 2199 2191 2260 2328 2320 2253 2233 2315 2397 2417 2361 2322 2329 2375 2421 2394 2366 2319 2271 2328 2385 2484 2537 2521 2428 2340 2252 2205 2158
2598 2158 2124 2090 2101 2113 2138 2163 2188 2212 2228 2245 2261 2277 2265 2252 2240 2227 2245 2262 2264 2220 2150 2157 2226 2294 2285 2276 2267 2257 2213 2169 2126 2082 2033 1984 2043 2148
2594 2148 2202 2180 2157 2135 2122 2109 2142 2175 2219 2262 2306 2350 2334 2318 2256 2194 2164 2133 2107 2081 2093 2181 2272 2287 2262 2283 2300 2270 2177 2083 2106 2206 2259 2219
2589 2219 2164 2155 2178 2201 2150 2099 2074 2049 2070 2091 2043 1996 2026 2056 2053 2050 2047 2044 2034 2025 2015 2005 2011 2017 2018 2018 1993 1877 1800 1816 1905 1901 1848 1795 1819 1842 1820 1797 1817
2585 1817 1836 1780 1678 1638 1690 1785 1788 1727 1665 1674 1683 1660 1638 1615 1593 1657 1721 1739 1757 1734 1711 1642 1573 1570 1567 1609 1652 1688 1724 1760 1796 1757 1718 1725 1731 1696 1661
2580 1661 1702 1743 1779 1814 1850 1885 1819 1753 1687 1621 1575 1530 1506 1575 1644 1668 1646 1625 1627 1629 1628 1627 1605 1537 1484 1522 1645 1676 1596 1515 1518 1521 1524 1527 1513 1499 1534 1569
2576 1569 1683 1843 1925 1854 1746 1638 1597 1557 1527 1498 1576 1655 1728 1802 1829 1857 1837 1816 1796 1775 1785 1794 1804 1813 1811 1809 1806 1804 1760 1716 1671 1627 1597 1567 1523
2571 1523 1433 1380 1419 1566 1714 1732 1658 1581 1596 1633 1623 1543 1464 1420 1468 1541 1614 1588 1562 1536 1510 1482 1454 1472 1490 1478 1465 1453 1440 1468 1496 1447 1398
2567 1398 1393 1388 1384 1379 1427 1475 1523 1571 1531 1490 1449 1409 1362 1314 1313 1312 1326 1339 1353 1367 1384 1401 1417 1434 1412 1391 1369 1347 1393 1438 1407 1376 1329 1282 1309 1336 1346
2563 1346 1309 1244 1271 1325 1334 1266 1199 1239 1279 1319 1359 1345 1331 1317 1303 1335 1366 1351 1336 1299 1262 1225 1188 1246 1305 1321 1337 1322 1354 1411 1377 1278 1179 1151 1123
2558 1123 1197 1270 1344 1417 1366 1315 1309 1304 1339 1374 1408 1443 1445 1447 1449 1451 1404 1357 1370 1459 1547 1557 1478 1399 1408 1418 1428 1438 1383 1329 1320 1312 1359 1406 1407 1408 1371 1334 1298 1261
2554 1261 1309 1358 1384 1409 1388 1367 1300 1233 1260 1287 1357 1426 1415 1357 1282 1284 1298 1312 1285 1258 1257 1255 1208 1161 1217 1273 1221 1170 1163 1156 1173 1189 1197 1206 1214 1222 1231 1239 1224 1210
2549 1210 1192 1175 1111 1048 1059 1069 1080 1091 1112 1132 1152 1173 1162 1150 1139 1128 1132 1136 1186 1235 1252 1269 1240 1210 1171 1132 1116 1099 1106 1114 1121 1128 1156 1184 1166 1148 1127
2544 1127 1106 1162 1218 1213 1207 1248 1288 1346 1404 1385 1366 1278 1191 1210 1230 1242 1254 1220 1187 1202 1217 1187 1156 1186 1216 1246 1276 1206 1136 1112 1088 1055 1022 1034 1047
2540 1047 1059 1071 1083 1096 1165 1235 1228 1221 1204 1187 1170 1152 1182 1212 1196 1134 1096 1134 1156 1131 1084 1082 1098 1114 1073 1032 1037 1042 1004 966 1018 1147 1290 1356 1317 1201
2535 1201 1088 1020 1061 1101 1100 1098 1050 1003 1004 1004 1028 1052 1053 1055 1056 1057 1099 1140 1136 1131 1130 1128 1149 1171 1221 1272 1186 1054 970 993 1030 1021 997 1050 1187 1279 1276 1228 1176 1171
2531 1171 1213 1255 1222 1190 1132 1073 1122 1171 1197 1223 1141 1060 982 905 965 1025 1074 1123 1096 1068 1041 1013 1032 1051 1037 1024 1033 1043 1079 1116 1152 1188 1197 1206 1169 1132
2526 1132 1108 1085 1107 1130 1163 1196 1229 1262 1247 1232 1171 1110 1078 1045 1013 981 971 961 997 1033 1135 1237 1247 1181 1145 1156 1166 1130 1119 1184 1222 1153 1020
2522 1020 964 997 1029 1037 1044 1155 1265 1241 1140 1056 1019 996 974 955 935 1043 1150 1211 1272 1228 1184 1140 1095 1043 990 983 976 1024 1072 1120 1168 1179 1190 1202
2518 1202 1213 1200 1186 1101 1015 973 1007 1075 1142 1132 1122 1112 1102 1109 1115 1121 1128 1065 1002 1047 1092 1055 1018 1028 1037 1077 1117 1157 1197 1162 1126 1091 1055 1046 1036 1026 1017 951
2513 951 885 896 952 992 955 918 881 866 852 837 822 873 924 929 933 940 946 953 959 957 955 953 951 1001 1051 1101 1152 1167 1183 1196 1209 1173 1091 991 969 1033 1097 1119 1142
2509 1142 1102 1062 1069 1075 1084 1093 1103 1112 1140 1169 1151 1133 1123 1112 1055 998 986 974 1039 1104 1101 1097 1094 1091 1089 1086 1037 989 980 970 1007 1044 1092 1139 1141 1143 1180 1218 1209 1200 1175 1150
2503 1150 1125 1101 1077 1053 1072 1092 1083 1028 1000 1048 1105 1115 1080 1045 1091 1138 1138 1139 1146 1153 1161 1168 1203 1239 1228 1218 1132 1045 1005 965 1032 1100 1121 1142 1145 1148 1151 1154 1096 1038
2499 1038 1025 1013 986 960 979 999 1024 1049 1028 961 931 977 1085 1193 1235 1277 1242 1207 1114 1021 1004 988 981 973 966 959 1014 1069 1124 1179 1110 1040 971 901 912
2494 912 923 934 945 986 1027 1067 1108 1084 1060 1035 1011 1047 1083 1119 1155 1148 1140 1133 1125 1109 1093 1054 1015 978 942 1013 1083 1080 1076 1072 1068 1099 1129 1113 1097 1110 1122 1158 1193
2489 1193 1186 1178 1141 1149 1148 1071 968 911 949 986 980 974 954 935 916 896 967 1038 1047 980 934 935 950 966 938 909 927 944 937 930 922 915 969 1023 1077 1131 1122 1114 1003 892
2485 892 856 896 970 1045 1074 1103 1086 1069 1004 939 950 962 952 943 910 877 884 891 920 950 968 985 1003 1020 974 928 882 836 851 867 883 898 941 983 1026 1069
2480 1069 1052 1035 1019 1002 1006 1010 1027 1090 1146 1094 973 897 953 1009 991 974 977 979 982 985 971 958 967 976 1032 1087 1066 1045 1031 1017 1006 995 1019 1090 1132 1097 1011 924
2476 924 909 895 917 940 963 986 947 907 868 829 868 907 924 940 916 892 915 937 944 952 959 967 927 888 848 809 822 836 849 863 865 867 847 826 902 978 1021 986
2471 986 958 930 943 956 973 989 959 929 913 897 927 956 886 815 821 827 831 834 837 840 858 876 848 774 722 747 859 971 1035 1022 944 867 825 783 787 791 755 719
2466 719 789 904 941 870 793 793 849 859 792 725 749 773 797 821 801 781 762 742 759 777 794 812 774 737 745 754 778 803 828 853 864 875 887 898 833 768
2462 768 810 852 850 849 862 922 927 856 782 786 785 708 635 640 754 869 866 786 747 755 778 801 858 916 940 887 811 735 700 665 632 598 610 622 675 727 780 833
2457 833 849 865 882 898 868 837 853 869 859 849 839 829 845 861 878 894 875 857 838 820 829 838 847 856 901 946 915 883 861 838 887 936 920 827 776 801 852
2453 852 826 746 711 727 742 714 687 719 751 737 724 759 794 783 772 778 784 789 795 798 801 803 806 812 819 825 831 771 711 715 796 855 914 839 719 622 602 644 685 708 731
2448 731 754 776 777 778 825 871 872 872 826 781 764 747 730 713 735 757 779 802 731 660 666 671 683 694 705 716 729 742 755 768 787 805 778 750 714 678 642 606
2443 606 645 685 724 764 730 697 709 722 743 764 708 652 580 509 576 643 689 734 734 734 760 786 766 745 749 752 755 758 811 864 872 879 865 851 837 823 778 733 764
2438 764 795 862 929 965 924 840 803 811 819 808 797 786 775 780 785 791 796 781 767 753 738 669 600 652 780 890 922 895 868 858 847 837 826 828 830 832 834 786 738
2433 738 690 642 691 740 788 837 827 816 760 703 702 701 746 791 850 908 967 1025 989 952 916 879 848 817 833 848 788 729 746 763 764 765 766 766 758 749 811 874 908
2429 908 851 747 736 767 798 789 780 767 754 741 728 714 701 687 674 687 700 714 727 713 699 685 671 632 593 604 707 810 820 812 804 800 796 793 789 824 859
2424 859 818 776 785 793 761 729 722 807 893 886 863 840 857 874 858 843 787 731 682 725 788 850 853 764 727 690 692 693 694 696 729 762 749 736 714 693 671 649 664
2419 664 679 694 709 682 655 628 600 612 624 636 648 637 626 660 695 691 686 727 769 785 802 772 743 679 616 630 690 711 655 620 631 612 594 622 696 735
2415 735 665 539 490 525 560 553 547 627 707 710 714 730 747 691 636 615 671 729 788 826 863 901 939 906 874 841 809 736 663 591 518 524 530 612 695 785 875
2410 875 932 912 833 755 748 741 728 715 656 597 642 686 728 770 769 723 659 673 771 870 896 923 877 831 786 740 715 691 627 563 606 757 908 951 875
2406 875 800 763 727 752 778 803 828 834 839 772 705 657 685 777 869 868 866 864 862 913 965 939 867 796 801 863 878 855 831 851 870 872 874 873 871 831 744 691 715 772
2401 772 783 786 789 836 883 876 869 890 910 907 904 843 781 804 827 826 825 847 869 874 880 816 752 694 637 586 613 706 752 715 631 626 698 792 887 936 986 951 916 833
2396 833 750 693 712 812 913 933 877 834 837 840 796 744 768 812 779 717 654 702 750 734 718 701 685 674 662 651 640 683 726 731 736 704 672 678 684 692 700 670
2392 670 640 618 596 644 737 821 829 813 798 790 782 720 659 688 718 694 623 617 688 759 752 733 760 786 765 703 686 724 716 655 641 729 816 844 872 862 851 773
2387 773 695 656 693 755 771 790 809 812 740 644 625 676 728 716 703 719 735 728 644 553 508 532 602 627 575 526 554 632 710 682 655 672 765 835 829 794
2383 794 759 757 756 702 648 663 678 693 707 722 737 738 739 760 782 779 731 701 748 817 840 764 687 699 711 723 735 770 804 784 765 747 729 779 830 829 827 803
2378 803 778 720 662 627 669 761 807 800 793 827 861 841 821 774 727 631 535 498 538 619 701 766 832 843 855 779 702 695 687 714 740 697 655 695 736 800 863
2374 863 918 972 1000 952 870 788 739 690 676 663 649 636 647 658 661 618 569 596 657 672 634 597 579 562 553 545 613 681 704 728 751 775 780 786 745 705 743
2369 743 781 819 857 814 772 775 778 765 751 783 815 819 824 828 832 807 782 802 823 773 722 748 775 790 806 822 838 862 886 833 780 717 655 639 622 667 711 756
2364 756 800 808 816 778 740 748 755 763 770 794 818 842 866 816 767 717 667 704 741 732 722 740 758 705 653 662 778 851 817 705 638 615 593 605 617 675 733 740
2360 740 747 755 762 674 586 563 616 638 660 687 714 679 645 653 662 680 652 607 638 692 746 727 709 696 684 717 751 768 785 756 727 751 774 798 822 788 754
2355 754 720 686 684 682 726 770 748 726 778 830 816 756 713 763 820 831 845 905 945 939 890 887 884 881 878 875 847 773 716 752 798 798 753 708 755 803 774 745 709
2350 709 673 637 602 682 762 796 831 835 839 798 756 693 629 672 716 734 752 769 787 837 886 859 831 710 589 551 605 676 701 732 809 892 976 986 995
2346 995 967 939 834 729 743 757 771 785 789 794 798 803 841 879 841 757 716 767 835 857 843 829 811 794 730 666 710 753 829 904 872 839 742 645 624 604
2342 604 673 743 791 746 678 656 681 752 822 845 818 745 702 704 723 743 749 755 761 767 737 707 754 801 857 913 924 934 919 904 889 873 826 778 730 682 715
2337 715 747 733 720 764 807 897 987 973 958 943 929 836 744 728 713 768 823 833 842 872 903 857 810 772 734 773 811 790 769 748 728 749 771 793 814
2333 814 761 708 732 755 817 878 863 848 780 712 720 729 746 763 780 796 822 847 827 806 839 872 858 845 878 912 869 826 852 879 905 932 934 937 939 941 918 894
2328 894 870 846 867 888 909 930 912 894 800 705 615 525 573 622 670 719 722 724 773 822 824 827 794 761 804 848 814 780 746 712 703 694 732 769 815 861 831 800
2324 800 733 666 650 634 588 618 712 806 796 786 776 766 743 720 697 675 718 762 802 843 767 645 583 598 678 758 844 929 872 815 804 839 873 830
2320 830 787 744 689 634 626 617 632 646 661 675 755 834 837 840 803 766 729 692 638 585 578 570 594 618 565 512 494 477 564 651 696 695 671 724 791 781 681 581
2315 581 631 681 685 688 652 616 656 696 723 749 730 710 754 798 735 625 580 612 628 599 562 601 641 680 696 711 681 651 625 599 650 702 724 745 767
2311 767 789 836 883 868 777 662 592 600 607 596 584 572 561 607 653 628 602 614 702 791 803 792 782 766 751 714 676 639 601 556 510 541 573 599 625
2306 625 728 832 901 971 933 895 814 733 726 718 715 666 590 607 677 746 714 682 655 628 601 574 523 473 500 527 564 601 638 675 686 696 706 716 740
2302 740 763 832 901 896 892 816 740 680 712 763 814 804 703 601 592 649 706 723 740 767 793 774 754 710 666 621 577 592 607 668 729 730 732 733 734 683 632
2298 632 626 621 604 586 646 705 705 705 705 705 728 751 771 791 753 669 632 688 783 833 837 841 830 819 731 644 644 645 646 647 678 710 696 637 607 668 783 897 912 927
2293 927 871 814 739 756 797 839 778 717 702 687 672 657 643 628 636 643 651 658 661 663 666 668 702 736 770 804 791 777 718 658 633 608 629 650 684 718 751 785 796
2288 796 806 811 816 842 775 658 542 574 699 777 763 753 742 828 913 967 929 835 741 714 687 660 634 630 626 622 619 617 614 658 702 715 727 693 659 657 655 699
2283 699 743 764 785 729 673 645 616 664 712 724 736 701 667 709 751 747 743 768 794 773 753 747 742 736 730 715 700 731 762 729 696 663 631 648 665 728 791 787
2279 787 782 778 773 797 822 800 778 789 801 812 823 878 932 910 888 820 752 730 708 694 681 668 654 714 774 788 802 840 879 887 818 734 697 679 662 663 742
2274 742 823 828 761 740 796 852 797 743 688 634 612 590 645 700 720 740 761 781 815 848 836 824 763 701 748 794 822 849 831 813 843 874 905 935 942 949
2270 949 909 870 909 949 942 935 909 883 857 831 791 750 710 669 704 739 769 799 852 829 741 653 636 619 602 584 636 688 694 700 707 714 721 728 659 590 598 606 650 694
2265 694 691 689 721 754 827 901 935 893 818 742 778 813 772 731 736 740 745 750 700 650 646 642 737 833 898 886 872 904 932 913 873 833 835 838 815 792 769 746 716 685
2260 685 655 624 594 563 579 594 586 577 670 763 839 822 781 740 744 747 797 847 835 822 810 797 802 807 735 663 691 718 699 680 646 612 625 637 645 652 706 760 760
2255 760 760 760 761 764 767 770 773 790 807 824 841 757 672 612 645 695 745 694 642 606 570 611 651 709 768 724 681 637 686 759 833 848 863 925 986 941 896 851
2250 851 806 766 727 734 740 750 760 723 687 676 665 700 734 738 741 744 748 767 786 760 733 790 847 903 960 925 889 854 818 739 659 604 642 698 753 708 662 670
2246 670 678 686 693 691 688 685 682 665 648 630 613 595 578 520 462 454 538 639 694 636 532 532 623 758 801 794 787 816 846 799 752 733 714 741 768 773 777 758 739 757
2241 757 776 748 720 781 842 826 811 791 772 706 641 649 657 711 765 811 857 827 797 802 807 766 725 695 666 713 761 837 914 853 792 790 789 742 694 671 647 646
2236 646 646 622 599 579 559 653 794 856 825 757 735 736 691 651 702 753 713 624 582 646 711 751 790 784 778 707 636 641 647 639 630 644 659 678 697 693 689 729 768
2231 768 808 848 841 835 851 868 793 717 636 647 699 751 763 774 773 771 816 860 826 792 712 632 590 548 582 617 640 664 664 665 663 662 707 752 727 702 723 744 727
2227 727 709 737 766 847 928 1007 1008 923 837 824 810 795 779 763 747 745 743 764 785 766 748 688 628 572 592 673 707 640 573 593 690 755 743 728 758 802
2222 802 799 797 840 913 941 889 838 785 733 680 628 586 544 609 674 741 807 850 893 862 831 777 723 652 580 586 591 617 643 710 777 817 780 715 695 735 774
2218 774 743 711 618 572 589 683 753 746 716 731 782 832 809 786 761 736 711 686 705 724 742 761 769 777 762 747 752 757 716 674 674 675 675 675 684 693 704 716 726 782
2213 782 855 851 776 702 668 635 592 549 583 617 598 579 694 808 842 800 769 785 784 707 652 674 734 748 747 745 740 734 769 805 820 759 672 631 666 747 805
2208 805 862 879 896 914 931 919 907 968 1028 1045 985 891 798 780 762 817 871 924 900 843 786 775 764 752 741 743 745 793 840 888 936 938 940 937 935 933 931 848 765
2204 765 759 753 778 802 826 851 872 892 867 841 855 870 884 898 891 884 923 1009 1058 1030 943 901 888 829 772 762 810 858 802 746 737 728 742 756 749 742 735 728 783 837
2199 837 846 855 839 824 808 793 832 871 834 796 787 777 810 844 913 936 908 880 890 900 893 840 807 821 832 797 772 747 766 784 790 796 799 849 916 984 1008 1032
2194 1032 1043 1053 1083 1114 1105 1051 1000 948 943 937 932 926 888 850 786 769 828 887 898 863 800 737 722 753 780 808 838 868 904 941 931 921 946 970 948 927 918
2190 918 909 923 937 943 950 933 916 969 1021 1026 984 954 971 1032 1093 1071 1003 958 959 985 1012 1035 1104 1191 1232 1167 1101 1057 1059 1082 1104 1092 1079 1021 962 887 812 758
2185 758 749 818 888 914 940 981 1021 1041 1016 1012 1009 1004 923 856 866 904 943 948 953 958 963 943 923 904 884 897 910 999 1089 1101 1113 1125 1137 1108 1079 1049 1020 1054 1088
2180 1088 1015 942 926 911 941 972 1019 1067 1059 959 855 751 749 747 793 838 838 838 907 976 941 905 877 894 940 894 845 842 862 790 663 582 610 683 763
2176 763 798 815 832 828 824 819 815 825 835 799 718 673 720 815 864 835 805 773 741 745 749 800 850 824 797 771 745 800 855 830 712 642 663 787 818 757 696
2171 696 676 655 649 644 684 724 724 724 770 816 767 718 750 873 934 902 825 795 811 827 846 865 851 836 862 887 912 844 755 713 754 794 837 881 894 907
2167 907 875 842 844 846 848 850 873 897 874 851 926 1001 969 891 872 930 944 881 799 795 907 1018 1053 1011 965 920 895 870 845 820 841 862 883 905 880 855
2163 855 906 958 954 950 899 849 887 925 916 908 922 936 904 871 869 866 864 861 830 798 874 950 967 984 956 927 872 818 806 795 811 782 732 759 837 869 794 719 687
2158 687 655 622 590 658 726 763 723 694 711 728 699 678 734 834 856 841 827 884 941 937 933 945 1002 1036 993 888 784 773 763 752 741 746 751 756 761 693
2153 693 626 696 813 871 853 852 896 932 921 893 864 856 847 881 915 925 890 868 939 1050 1069 1007 945 944 942 940 938 955 971 988 1004 992 980 968 956 986 1016
2149 1016 1047 1077 1047 1018 989 959 975 991 961 930 940 949 958 967 918 870 827 785 701 709 802 942 1010 987 941 896 859 821 860 945 1009 981 932 882 884 885 933
2144 933 981 1026 1072 1010 949 910 872 880 888 842 796 827 858 918 977 960 943 889 834 856 879 907 935 963 992 964 937 910 882 855 828 877 926 912 898 930
2140 930 962 965 967 969 972 983 994 959 924 920 916 988 1105 1207 1216 1203 1190 1159 1127 1049 972 983 995 1006 1018 1010 1002 1041 1079 1068 1056 1045 1033 1018 1003 1034 1066 1090
2135 1090 1115 1139 1163 1152 1140 1128 1116 1104 1092 1080 1069 1093 1117 1141 1165 1231 1298 1287 1277 1197 1117 1113 1110 1124 1138 1106 1074 1051 1029 1083 1137 1159 1180 1125 1070
2131 1070 1043 1016 1067 1117 1116 1115 1114 1114 1114 1114 1069 1023 1038 1053 1068 1082 1109 1135 1161 1187 1186 1185 1184 1184 1220 1256 1293 1329 1254 1179 1104 1029 999 968 938 907 922 937 951
2126 951 966 1010 1054 1021 988 992 997 1001 1006 998 990 982 974 957 939 963 987 1003 943 856 816 884 998 1025 975 923 872 815 758 730 701 749 797 862 928 948 967 934
2122 934 901 868 835 844 854 817 781 818 856 850 844 868 939 964 897 835 866 891 869 803 783 810 838 858 879 945 1011 1016 1020 1024 1029 1004 980 910 839 834 829 823 818 821 825
2117 825 828 832 845 858 871 884 801 718 635 552 611 670 729 788 807 826 822 818 844 871 851 831 822 813 826 840 794 747 777 808 785 762 693 623 668 713 712 711 700
2112 700 689 754 820 883 945 985 1025 981 938 971 1005 958 911 864 817 853 888 924 959 983 1006 984 961 976 991 960 929 851 773 771 770 730 691 670 742 816
2107 816 797 734 717 765 812 787 761 788 816 843 871 922 974 918 862 821 781 789 797 825 900 955 917 871 826 798 769 734 698 709 719 756 792 828 865 864
2103 864 863 938 1014 1009 1003 952 900 897 894 967 1040 987 933 925 918 869 820 748 676 712 749 808 867 836 806 821 836 829 822 815 808 800 793 862 930 939 948 911 874 836 798 760
2098 760 722 705 689 718 748 824 901 932 962 962 962 1039 1116 1120 1124 1082 1040 1024 1007 945 883 852 821 866 912 864 817 792 767 789 812 811 810 809 808 808 807 783 758 734
2093 734 710 761 813 818 823 789 755 798 841 847 852 812 772 697 622 624 626 702 777 807 836 803 770 737 705 720 736 797 859 833 806 803 800 851 903 850 797 831 912
2088 912 976 947 897 893 934 975 970 966 961 956 990 1023 1011 999 981 962 944 926 909 893 922 951 902 854 882 910 904 898 938 978 1012 1046 1004 961 916 871 931 990
2084 990 979 922 878 928 930 841 758 766 852 937 952 966 972 978 982 985 919 808 744 772 834 850 823 842 927 967 896 826 812 798 830 862 832 803 773 744 774
2079 774 804 835 865 856 847 792 737 746 755 764 774 834 894 908 922 962 1002 992 890 837 877 935 993 963 932 902 872 904 936 968 999 971 943 914 886 885 883 882
2074 882 880 924 968 1012 1056 979 901 869 837 860 882 904 927 979 1031 1033 943 865 880 945 1009 970 931 892 853 854 854 855 856 899 942 985 1028 982 936 890 844 867
2070 867 891 961 1031 1032 1032 1032 1033 986 939 967 994 993 946 945 1035 1122 1118 1032 947 973 999 1005 920 829 830 850 870 868 866 910 955 954 953 952 952 969 986 927 867 815 762 817
2065 817 872 927 983 993 1002 998 993 988 984 984 984 907 831 824 818 811 805 863 921 982 1043 1097 1198 1254 1157 1017 923 962 1001 989 976 1010 1044 1069 1095 1121 1147 1088 1028
2060 1028 969 909 940 971 1002 1032 1050 1067 1038 1010 968 927 932 937 969 1000 986 972 1000 1028 980 931 862 794 771 749 757 765 774 782 800 818 836 854 788 722 764
2055 764 805 856 906 910 915 959 1004 974 898 865 940 1052 1163 1141 1011 898 862 925 988 978 969 926 882 884 887 928 970 1012 1053 1040 1027 967 908 924 941
2051 941 957 974 949 925 901 876 818 760 810 859 876 893 909 926 896 867 883 900 913 926 940 953 978 1002 950 898 881 863 846 828 856 884 911 939 961
2047 961 984 1007 1029 1052 1074 1097 1119 1122 1126 1129 1132 1082 1033 983 933 948 963 933 902 894 886 878 870 870 870 828 787 790 871 997 1047 1000 952 974 995 973 904 895 963 991
2042 991 1020 1004 989 955 875 769 755 778 800 829 857 856 856 809 763 813 864 838 812 852 893 887 881 869 857 846 834 834 835 940 1046 1073 1055 1051 1139 1215 1199
2037 1199 1102 1005 972 940 984 1028 1084 1141 1060 934 856 870 937 1004 1014 1025 1035 1045 1018 991 918 845 914 983 975 967 970 974 977 980 965 949 933 917 950 983 971
2033 971 958 1013 1068 1123 1178 1126 1073 1020 967 950 933 915 898 968 1037 1057 984 862 832 851 871 850 829 808 787 797 807 816 826 849 872 849 826 829 831 834
2028 834 837 853 869 884 900 847 794 842 891 902 821 781 832 935 945 844 743 749 755 760 766 803 840 878 915 850 784 725 665 705 838 973 1016 1005 1040
2024 1040 1099 1065 998 977 1001 1024 1031 1037 1043 1050 1000 949 945 941 892 843 902 961 965 969 972 976 978 979 1026 1074 1084 1094 1104 1114 1077 1040 1000 960 956 905 900 987 1123 1167 1100
2019 1100 1033 1022 1012 1004 997 991 1032 1058 992 931 962 1012 1062 1099 1136 1225 1222 1146 1070 1095 1165 1180 1103 984 910 914 1009 1081 1108 1097 1087 1073 1060 1030 1000 971
2015 971 941 900 859 865 870 897 923 949 976 1024 1073 1075 1078 1087 1096 1105 1114 1137 1160 1183 1205 1166 1126 1087 1047 1066 1085 1150 1215 1197 1178 1160 1141 1189 1237 1284 1332 1299 1266
2010 1266 1233 1200 1160 1120 1080 1040 1040 1040 1143 1246 1264 1206 1144 1083 1044 1006 967 929 907 885 925 1041 1140 1193 1169 1145 1176 1207 1238 1269 1239 1208 1178 1147
2006 1147 1125 1103 1127 1151 1169 1187 1206 1224 1138 1053 1063 1149 1208 1268 1286 1304 1266 1227 1235 1242 1265 1288 1265 1242 1182 1121 1168 1216 1203 1191 1194 1243 1245 1171 1097 1099 1127
2001 1127 1110 1077 1044 1030 1016 1002 988 1008 1028 1089 1150 1181 1136 1059 1028 1046 1018 973 1004 1094 1138 1105 1072 1096 1119 1143 1167 1170 1174 1070 966 964 963 962 960 988
1997 988 1016 1044 1072 1086 1099 1113 1127 1059 991 953 993 1058 1078 1082 1086 1098 1110 1046 982 987 993 998 1004 985 966 994 1021 1003 985 967 949 969 990 1010 1030 1069 1107 1038
1992 1038 969 948 926 905 883 933 984 988 993 957 921 930 940 940 939 938 938 923 907 967 1072 1132 1084 1010 1013 1065 1117 1035 954 899 844 866 888 997 1105 1137 1169
1988 1169 1145 1121 1097 1073 1019 965 910 856 864 872 926 981 961 941 921 902 933 964 949 934 880 826 818 810 792 774 757 739 809 879 948 1018 1007 996 985 975
1983 975 967 960 952 945 988 1030 1073 1115 1072 1029 986 943 955 968 906 845 875 952 960 861 791 799 859 873 845 818 788 757 772 787 848 908 957 1006 947 888 841 794
1979 794 793 792 755 718 789 906 999 1015 969 924 905 887 868 849 894 939 983 1028 1030 1032 989 945 924 903 885 867 895 970 1018 990 895 847 901 955 947 862 777
1974 777 768 863 957 1022 1011 991 971 946 921 933 945 1004 1062 1092 1121 1074 1027 960 894 904 914 953 991 984 976 999 1023 1046 1069 1026 983 940 896 850 804 866
1970 866 927 944 962 979 996 1023 1050 1076 1103 1137 1171 1159 1147 1081 1015 1051 1088 1090 1015 941 943 966 989 940 891 924 956 988 1020 994 968 1044 1120 1144 1091 982
1965 982 918 930 989 1050 1065 1066 1067 1142 1218 1228 1239 1143 1046 950 854 866 877 867 856 923 989 1009 1029 1050 1070 1121 1172 1176 1181 1196 1210 1224 1239 1204 1170 1206 1243
1961 1243 1279 1223 1174 1124 1147 1170 1147 1124 1172 1220 1192 1163 1225 1287 1348 1410 1393 1375 1358 1340 1334 1328 1399 1470 1498 1526 1508 1489 1509 1528 1624 1720 1727 1733 1740 1747 1704
1956 1704 1661 1612 1655 1738 1821 1910 1999 2096 2193 2214 2235 2227 2220 2166 2112 2099 2085 2149 2212 2288 2363 2393 2422 2397 2372 2347 2322 2315 2308 2348 2387 2358 2329 2301 2272 2229
1952 2229 2186 2143 2101 2058 2015 1972 1929 1901 1872 1843 1814 1759 1703 1648 1592 1562 1531 1500 1470 1510 1550 1566 1489 1391 1294 1297 1301 1295 1288 1281 1275 1298 1320 1297 1274 1242 1210
1947 1210 1178 1146 1120 1093 1067 1040 1038 1035 1078 1122 1140 1157 1175 1193 1159 1125 1091 1057 1047 1036 1072 1108 1124 1140 1112 1037 959 973 1071 1169 1109 1049 1064 1078 1068
1943 1068 1012 1002 1083 1125 1075 985 987 1027 1068 1068 1068 1037 1005 928 851 876 902 928 953 955 957 1035 1114 1144 1174 1128 1081 987 893 792 784 846 908 930 952 961 970 979
1938 979 988 924 860 902 990 1061 1040 967 893 824 756 768 872 971 978 936 893 880 866 853 839 851 862 874 886 899 912 880 847 949 1051 1041 940 898
1934 898 949 971 947 955 1009 1045 990 898 898 917 936 924 911 945 978 1013 1047 1081 1116 1064 1013 1008 1003 955 907 966 1117 1261 1251 1134 1017 975 933 937 941 984
1930 984 1028 994 961 937 914 890 866 878 891 903 915 939 962 963 963 915 866 894 922 969 1016 1063 1110 1089 1068 1047 1026 985 943 901 859 896 933 924 915 874 833
1925 833 838 843 890 936 1035 1041 979 917 896 874 808 741 782 823 752 681 665 741 822 903 913 922 922 921 943 966 961 957 929 902 889 876 940 1004 996 989 975 1054 1144 1233
1920 1233 1221 1209 1093 977 916 948 972 995 1002 1009 1032 1055 1073 1091 1117 1051 990 930 960 990 943 896 901 906 911 916 907 897 841 786 872 958 1021 1085 1080 1075 1047 1019
1916 1019 1038 1058 1031 1005 957 910 909 907 907 906 906 905 881 856 877 898 944 990 1014 1037 1041 1046 1005 963 970 976 937 898 934 970 982 995 996 996 951 905 940 975 1013 1051
1911 1051 1064 1123 1185 1155 1074 993 986 1072 1131 1098 1046 994 1013 1033 1030 1026 1010 993 999 1006 1036 1066 1020 974 1002 1031 1014 952 945 1029 1131 1187 1204 1221 1211 1202 1154
1906 1154 1105 1134 1163 1093 1022 955 888 921 999 1030 969 918 913 923 933 943 953 948 897 837 868 948 981 978 976 970 964 904 844 806 860 916 925 859 747 682 709
1902 709 788 868 889 909 930 951 949 946 989 1078 1116 1077 1012 993 1031 1070 1035 1000 1032 1065 1097 1129 1109 1089 1070 1050 1013 976 985 994 1032 1070 1154 1238 1234 1230 1226 1222 1166
1897 1166 1109 1053 997 1039 1082 1078 1075 1097 1119 1141 1162 1170 1177 1185 1193 1198 1204 1209 1215 1161 1107 1130 1153 1159 1166 1219 1271 1237 1204 1170 1136 1164 1193 1218 1243 1209 1129 1106 1159 1237
1892 1237 1269 1255 1241 1261 1281 1300 1320 1310 1301 1292 1282 1310 1338 1366 1394 1391 1388 1313 1238 1230 1299 1368 1360 1286 1212 1240 1269 1292 1314 1337 1360 1310 1260 1287 1313 1334 1355
1888 1355 1376 1397 1468 1540 1534 1529 1507 1485 1540 1595 1567 1539 1557 1575 1587 1598 1609 1621 1593 1566 1556 1592 1609 1579 1577 1651 1769 1810 1791 1772 1744 1716 1687 1659 1687
1883 1687 1714 1695 1677 1703 1729 1756 1782 1787 1793 1795 1797 1793 1743 1645 1546 1489 1478 1515 1552 1556 1514 1452 1390 1361 1332 1349 1366 1408 1451 1417 1337 1296 1332 1394 1410 1439 1467
1879 1467 1490 1512 1526 1493 1414 1335 1281 1303 1358 1414 1469 1523 1561 1552 1538 1570 1675 1781 1838 1818 1795 1773 1784 1795 1809 1822 1873 1970 2085 2122 2069 2017 2010 2049
1875 2049 2100 2151 2202 2253 2310 2321 2281 2241 2193 2146 2055 1965 1916 1914 1914 1869 1818 1814 1824 1757 1657 1557 1557 1556 1537 1471 1432 1393 1422 1452 1481 1511 1528 1544 1561 1578
1870 1578 1542 1506 1470 1434 1414 1395 1329 1263 1253 1242 1277 1312 1355 1397 1393 1390 1296 1202 1108 1014 1034 1053 1072 1091 1096 1101 1152 1203 1221 1238 1256 1274 1191 1108 1102 1096 1073
1866 1073 1050 1057 1142 1205 1222 1224 1226 1222 1219 1169 1120 1161 1203 1199 1194 1220 1247 1273 1299 1208 1117 1072 1028 1004 980 960 941 984 1103 1221 1264 1242 1220 1240 1259 1192 1125
1861 1125 1118 1187 1260 1255 1222 1189 1210 1231 1251 1272 1296 1320 1298 1276 1152 1027 967 983 1014 1044 1079 1114 1115 1116 1116 1117 1171 1224 1170 1117 1104 1092 1079 1066 1043 1020
1857 1020 997 974 986 997 1008 1020 1015 1011 1006 1001 1088 1174 1215 1255 1284 1313 1342 1371 1286 1201 1161 1122 1097 1072 1041 1102 1231 1359 1379 1307 1261 1261 1276 1290 1288 1285 1329
1852 1329 1372 1366 1361 1323 1332 1367 1311 1232 1154 1193 1232 1225 1218 1271 1323 1326 1236 1210 1276 1359 1395 1400 1450 1523 1505 1445 1385 1325 1266 1157 1140 1210 1280 1262 1245 1227 1210
1848 1210 1229 1249 1309 1370 1411 1359 1288 1263 1275 1287 1262 1237 1187 1228 1290 1306 1241 1175 1214 1253 1244 1234 1239 1290 1290 1198 1149 1193 1251 1217 1169 1167 1167 1167 1170 1173 1201 1229
1843 1229 1150 1070 1032 994 1033 1072 1080 1088 1050 1012 984 955 1001 1046 1031 969 922 967 1070 1082 1043 1005 1045 1085 1048 1011 1057 1102 1105 1107 1158 1254 1275 1204 1113 1115
1839 1115 1166 1218 1194 1170 1146 1123 1043 964 961 959 1017 1075 1131 1186 1120 1007 934 968 1026 1038 980 968 1004 1040 1004 969 990 1056 1094 1055 1012 969 968 966 988 1011
1834 1011 987 963 948 934 920 905 907 908 910 911 996 1081 1132 1107 1017 927 838 826 907 1034 1109 1107 1047 1034 1066 1099 1079 1060 1056 1098 1114 1054 971 933 954 1020 1089
1830 1089 1113 1097 1081 1062 1043 995 946 898 849 909 970 984 998 1038 1078 1118 1158 1158 1158 1158 1159 1129 1099 1069 1040 1089 1138 1141 1144 1118 1091 1110 1130 1113 1097 1035 972
1825 972 947 923 944 965 969 974 978 983 990 998 1005 1013 1045 1078 1110 1143 1182 1222 1215 1208 1160 1112 1066 1021 1048 1120 1222 1231 1187 1189 1231 1227 1089 952 926 992 1097 1156 1171
1821 1171 1185 1174 1164 1153 1142 1145 1147 1103 1059 1068 1077 1086 1095 1086 1077 1068 1058 1058 1057 1102 1148 1138 1127 1117 1107 1142 1177 1212 1246 1277 1308 1339 1370 1401 1433 1388 1343 1316 1289 1261
1816 1261 1234 1250 1266 1236 1206 1145 1085 1071 1057 1122 1188 1253 1318 1318 1317 1271 1224 1227 1229 1185 1141 1145 1149 1139 1082 1075 1161 1249 1245 1164 1174 1265 1356 1314 1273 1277 1282 1260 1239
1811 1239 1217 1195 1242 1288 1258 1228 1175 1123 1117 1111 1106 1101 1099 1096 1094 1139 1168 1106 983 951 1031 1110 1095 1079 1140 1202 1220 1238 1250 1262 1176 997 917 989 1116 1150
1806 1150 1138 1127 1166 1204 1240 1276 1239 1156 1120 1177 1254 1285 1271 1257 1250 1244 1237 1231 1248 1266 1237 1209 1250 1292 1226 1160 1138 1116 1141 1165 1181 1197 1136 1075 1107 1139
1802 1139 1171 1203 1228 1254 1177 1101 1125 1241 1283 1232 1113 1040 1072 1151 1198 1153 1090 1074 1093 1112 1088 1064 1060 1057 1130 1203 1192 1182 1094 1007 1021 1034 1048 1062
1798 1062 1047 1032 1093 1155 1169 1184 1198 1212 1250 1287 1217 1147 1141 1135 1132 1129 1174 1265 1336 1315 1237 1159 1121 1084 1114 1145 1176 1206 1130 1053 1057 1153 1174 1103 1035 1059 1089
1793 1089 1072 1014 1003 1034 1065 1053 1041 1037 1032 1028 1023 1094 1164 1101 1038 1037 1112 1190 1191 1151 1157 1209 1262 1226 1191 1155 1120 1157 1195 1186 1178 1164 1151 1137 1124 1102 1079 1134 1188
1789 1188 1251 1314 1300 1286 1298 1310 1293 1199 1107 1091 1130 1123 1054 985 959 932 977 1022 1066 1111 1097 1083 1146 1209 1254 1299 1236 1174 1151 1127 1150 1173 1162 1150 1139
1784 1139 1128 1062 995 1006 1017 1007 997 1016 1112 1250 1311 1313 1315 1373 1431 1381 1332 1281 1231 1257 1283 1261 1239 1217 1194 1214 1234 1254 1274 1319 1363 1379 1318 1262 1282
1780 1282 1386 1490 1536 1475 1387 1377 1454 1578 1664 1643 1582 1521 1530 1538 1568 1598 1521 1443 1358 1274 1327 1381 1425 1469 1436 1403 1413 1423 1387 1351 1345 1339 1378 1418 1402
1776 1402 1385 1369 1352 1325 1298 1317 1336 1360 1384 1301 1218 1240 1262 1284 1306 1303 1300 1297 1294 1322 1349 1331 1313 1246 1179 1190 1200 1211 1222 1279 1336 1287 1238 1189 1140 1141 1142
1771 1142 1189 1236 1243 1249 1224 1245 1242 1147 1055 1055 1151 1247 1269 1198 1127 1149 1189 1230 1204 1178 1153 1127 1106 1085 1141 1197 1246 1294 1235 1176 1145 1114 1129 1144 1154 1164
1767 1164 1174 1184 1171 1158 1191 1224 1185 1147 1108 1069 1081 1092 1147 1201 1222 1197 1144 1182 1272 1316 1255 1148 1065 1074 1132 1143 1079 1014 1028 1133 1267 1308 1269
1763 1269 1230 1242 1254 1266 1278 1280 1283 1240 1197 1165 1133 1148 1162 1174 1186 1198 1209 1193 1176 1113 1050 1048 1047 1046 1044 1078 1111 1144 1177 1146 1115 1129 1144 1176 1208 1169 1130
1758 1130 1138 1238 1338 1346 1290 1233 1217 1201 1173 1146 1195 1244 1239 1233 1228 1222 1246 1271 1249 1227 1208 1189 1217 1244 1255 1266 1323 1380 1378 1376 1327 1279 1229 1179 1175 1171 1150 1129
1754 1129 1107 1086 1107 1129 1150 1172 1166 1161 1155 1150 1144 1138 1132 1127 1104 1082 1137 1191 1198 1204 1210 1217 1223 1229 1236 1242 1270 1298 1250 1202 1191 1181 1171 1161 1126 1092 1164 1237 1304 1371 1361 1351
1749 1351 1308 1265 1223 1180 1226 1273 1273 1273 1258 1243 1273 1304 1205 1106 1084 1062 1135 1208 1281 1354 1331 1309 1286 1263 1238 1214 1235 1256 1251 1245 1197 1148 1136 1169 1206 1196
1744 1196 1178 1206 1279 1352 1348 1299 1275 1251 1248 1245 1242 1240 1217 1195 1173 1151 1147 1144 1141 1138 1126 1114 1076 1084 1141 1199 1214 1229 1249 1270 1291 1311 1289 1266 1290 1313 1279 1245 1257
1739 1257 1315 1298 1203 1138 1179 1280 1335 1315 1295 1262 1229 1214 1245 1266 1242 1218 1239 1302 1319 1260 1201 1191 1228 1239 1250 1268 1286 1305 1323 1308 1293 1278 1263 1286
1735 1286 1308 1285 1261 1264 1267 1271 1274 1248 1223 1243 1263 1287 1310 1331 1352 1390 1382 1353 1325 1329 1332 1318 1258 1192 1171 1231 1337 1402 1421 1391 1362 1317 1271 1226 1180 1168 1157
1731 1157 1145 1133 1142 1152 1204 1257 1293 1284 1254 1225 1240 1256 1271 1287 1267 1248 1229 1209 1255 1301 1342 1384 1359 1258 1156 1132 1167 1201 1134 1066 1076 1087 1174 1261
1727 1261 1280 1299 1318 1337 1375 1414 1345 1275 1291 1306 1321 1336 1347 1358 1323 1288 1350 1411 1427 1443 1404 1364 1253 1141 1081 1097 1147 1197 1263 1330 1289 1247 1208
1722 1208 1169 1176 1183 1221 1260 1252 1244 1261 1277 1293 1309 1367 1425 1453 1403 1349 1341 1348 1355 1398 1442 1408 1374 1341 1307 1350 1393 1447 1500 1508 1515 1479 1443 1407 1372 1317 1262 1315 1368
1718 1368 1356 1344 1331 1319 1375 1432 1412 1392 1341 1290 1316 1388 1430 1395 1334 1273 1277 1357 1441 1524 1580 1636 1692 1749 1694 1639 1584 1529 1464 1399 1266 1180 1221 1338
1714 1338 1441 1497 1449 1401 1350 1299 1290 1281 1272 1263 1312 1361 1411 1460 1444 1428 1365 1303 1255 1207 1235 1264 1319 1375 1353 1332 1324 1316 1353 1391 1370 1348 1373 1397 1410 1422 1389
1709 1389 1356 1356 1356 1356 1357 1417 1478 1432 1385 1362 1338 1361 1383 1409 1435 1461 1487 1470 1454 1438 1421 1462 1502 1496 1490 1479 1467 1456 1444 1437 1431 1470 1510 1535 1560 1585 1610 1586
1704 1586 1561 1537 1512 1512 1512 1511 1511 1545 1580 1568 1556 1559 1562 1565 1567 1579 1591 1602 1614 1623 1631 1640 1649 1672 1696 1674 1651 1633 1614 1596 1577 1608 1640 1625 1610 1578 1546 1591 1635 1646
1700 1646 1657 1667 1678 1731 1783 1790 1797 1800 1803 1806 1809 1875 1940 2012 1991 1896 1800 1820 1916 1970 1946 1894 1842 1872 1902 1932 1962 1921 1881 1841 1801 1852 1903 1954 2006 1966 1926
1695 1926 1932 1938 1981 2024 2067 2110 2100 2090 2127 2163 2200 2237 2225 2213 2226 2193 2143 2169 2215 2261 2312 2363 2460 2557 2547 2536 2601 2666 2685 2703 2740 2777 2768 2759 2781 2803
1691 2803 2825 2847 2866 2885 2904 2923 2910 2897 2887 2876 2932 3033 3148 3187 3148 3064 3000 2936 2915 2894 2826 2759 2739 2719 2698 2678 2679 2680 2681 2682 2690 2698 2660 2622 2550 2477
1686 2477 2404 2332 2337 2342 2300 2259 2218 2177 2182 2187 2201 2215 2229 2243 2226 2208 2119 2030 1978 2003 2078 2075 2041 2053 2062 2026 1946 1911 1956 2000 1991 1983 1974 1965 1963 1961 2035 2110 2089 2069
1681 2069 1971 1874 1784 1694 1741 1789 1869 1948 1982 2015 2037 2060 2082 2104 2021 1938 1962 1986 1966 1946 1926 1906 1938 1970 1956 1942 1969 1996 2024 2051 2041 2031 2021 2011
1677 2011 1993 1976 1959 1941 1994 2047 2100 2152 2201 2250 2254 2257 2186 2115 2090 2066 2002 1939 1952 2012 2034 1979 1944 1956 2005 2053 2105 2157 2176 2195 2137 2080 1977 1874
1673 1874 1847 1821 1835 1849 1909 1969 1953 1936 1963 1990 1976 1917 1883 1926 2006 2040 2058 2076 2058 2040 1976 1912 1917 1922 1928 1933 1932 1932 1931 1931 1948 1965 1936 1907 1923 1939 1955 1971
1668 1971 1977 1983 1988 1994 2063 2132 2063 1994 1971 1948 1910 1825 1785 1822 1884 1900 1921 1941 1959 1976 1990 2003 2000 1950 1878 1852 1874 1896 1979 2062 2117 2094 2016 2015 2101 2187 2137
1664 2137 2042 2003 2041 2089 2091 2077 2064 2062 2060 2056 2051 2031 1965 1926 1962 2025 2042 1985 1928 1913 1945 1951 1957 1927 1897 1870 1843 1850 1903 1974 2044 2059 2029 2024 2020 2056 2092 2154 2170
1659 2170 2185 2200 2213 2225 2211 2197 2183 2170 2177 2184 2217 2205 2175 2145 2189 2233 2279 2324 2320 2269 2201 2133 2113 2139 2145 2150 2158 2166 2131 2097 2082 2114 2165 2216 2224 2232 2222 2213 2221 2276
1654 2276 2342 2363 2308 2253 2236 2265 2271 2277 2311 2391 2472 2506 2454 2402 2365 2374 2375 2330 2312 2370 2433 2419 2378 2383 2438 2447 2378 2308 2333 2358 2382 2407 2425 2443 2461 2479 2483 2487
1649 2487 2490 2494 2514 2535 2601 2667 2656 2646 2635 2624 2644 2665 2700 2781 2860 2863 2804 2745 2776 2807 2841 2875 2904 2979 3025 2995 2886 2776 2783 2867 2922 2901 2856 2857 2921 2985
1645 2985 3052 3118 3159 3200 3241 3281 3324 3366 3363 3360 3434 3509 3507 3505 3464 3423 3489 3555 3566 3577 3588 3599 3686 3773 3752 3731 3780 3829 3832 3835 3822 3810 3798 3785 3774 3763 3751
1641 3751 3740 3766 3793 3773 3753 3757 3762 3766 3770 3739 3708 3785 3861 3931 4000 3962 3925 3957 3989 4021 4054 4100 4146 4239 4331 4382 4432 4436 4440 4482 4524 4566 4608 4644 4679 4760 4842
1636 4842 4864 4886 4949 5012 5003 4916 4847 4824 4784 4745 4708 4672 4667 4662 4611 4560 4534 4509 4484 4459 4384 4308 4233 4158 4187 4217 4172 4127 4140 4199 4232 4188 4148 4153 4156 4113 4065
1632 4065 4062 4139 4215 4240 4265 4244 4222 4243 4263 4329 4395 4403 4411 4420 4428 4445 4461 4524 4587 4634 4682 4683 4684 4668 4652 4560 4467 4386 4305 4331 4357 4338 4320 4347 4420 4446 4396 4315
1627 4315 4233 4263 4293 4323 4353 4336 4319 4345 4371 4373 4330 4314 4376 4439 4501 4523 4544 4600 4656 4712 4768 4813 4859 4904 4950 5040 5131 5176 5220 5236 5252 5269 5285 5338 5392
1623 5392 5519 5647 5746 5800 5882 6041 6262 6482 6631 6779 6895 7011 7080 7150 7347 7544 7741 7938 8101 8264 8351 8437 8485 8533 8581 8629 8727
1619 8727 8825 8845 8758 8639 8520 8471 8422 8302 8182 8063 7943 7804 7665 7526 7387 7270 7153 6963 6772 6671 6615 6531 6370 6181 5992
1616 5992 5890 5865 5883 5855 5751 5646 5598 5550 5502 5454 5384 5315 5246 5177 5140 5103 5020 4937 4922 4907 4848 4790 4801 4858 4891 4848 4821 4872 4963 4978 4947 4915 4925
1612 4925 4935 4929 4923 4871 4818 4801 4785 4798 4766 4723 4756 4815 4828 4809 4791 4815 4840 4870 4900 4885 4869 4781 4692 4742 4792 4773 4754 4734 4715 4724 4733 4742 4751 4797 4843 4844 4844 4885
1608 4885 4925 4965 5006 5053 5100 5101 5103 5040 4978 4919 4936 5021 5106 5118 5131 5125 5118 5112 5106 5122 5138 5153 5169 5127 5084 5041 4998 5036 5074 5112 5150 5144 5139 5133 5128 5172 5216 5260 5305
1603 5305 5288 5270 5253 5236 5240 5244 5177 5110 5097 5176 5280 5384 5415 5446 5376 5305 5280 5347 5491 5543 5509 5475 5513 5550 5528 5507 5485 5463 5455 5447 5484 5522 5589 5655 5722
1599 5722 5788 5815 5842 5870 5897 5887 5876 5866 5856 5869 5883 5943 6003 6016 6030 6044 6057 6136 6215 6294 6373 6390 6407 6377 6348 6356 6364 6418 6473 6566 6659 6675 6691 6712 6733
1594 6733 6754 6775 6764 6753 6875 6996 7057 7026 7000 6975 7001 7027 7008 6988 7006 7023 7118 7212 7275 7337 7400 7463 7523 7584 7568 7551 7599 7647 7694 7742 7748 7753 7805 7856
1590 7856 7866 7876 7886 7896 7939 7982 8024 8067 8158 8249 8264 8278 8299 8320 8300 8280 8288 8373 8487 8554 8591 8627 8669 8664 8633 8678 8783 8887 8893 8854 8844 8910 9007 9104
1586 9104 9159 9215 9219 9223 9230 9237 9308 9426 9561 9620 9597 9575 9625 9675 9693 9712 9807 9902 9956 10010 10064 10117 10174 10230 10241 10251 10355 10458 10561 10664 10736 10808 10903
1582 10903 10998 11009 11020 11077 11134 11269 11403 11491 11580 11643 11706 11813 11919 11938 11910 11950 12098 12262 12348 12379 12456 12571 12639 12665 12736 12912 13087 13188 13290
1578 13290 13385 13479 13620 13761 13900 14040 14225 14410 14593 14776 14913 15050 15203 15355 15462 15568 15730 15891 15976 16061 16154 16248 16341 16435 16515 16596
1575 16596 16722 16849 16902 16955 17111 17267 17362 17381 17423 17541 17660 17779 17903 18027 18217 18407 18551 18695 18841 18986 19155 19324 19472 19620
1572 19620 19768 19917 20066 20216 20366 20515 20774 21033 21292 21550 21713 21876 22039 22202 22414 22625 22837 23049 23380 23710 24041 24372 24702
1569 24702 25032 25363 25693 26012 26330 26649 26968 27278 27589 27899 28210 28499 28788 29100 29412 29807 30202 30644 31085 31544 32002 32323 32598
1567 32598 32936 33367 33850 34333 34778 35223 35745 36266 36786 37307 37852 38489 39144 39800 40458 41116 41728 42294 42911 43620 44371 45122 45832
1564 45832 46543 47350 48157 48888 49618 50299 50980 51638 52296 52958 53621 54228 54742 55218 55693 56186 56679 57222 57766 58263 58761 59345 59929
1561 59929 60541 61154 61763 62464 63221 63978 64761 65545 66358 67217 68211 69358 70581 71713 72752 73791 74975 76251 77528 78852
1559 78852 80272 81785 83329 84874 86510 88239 90015 91792 93551 95402 97363 99417 101511 103651 105889 108219 110620
1556 110620 113112 115624 118181 120810 123592 126494 129549 132711 135965 139347 142820 146458 150249 154179 158200 162421 166856
1554 166856 171532 176361 181331 186579 192143 197984 204059 210410 217072 224072 231451 239230 247459 256088 265169 274649 284615
1552 284615 295102 306150 317781 329957 342715 356077 370144 384937 400496 416781 433834 451720 470497 490206
1551 490206 510867 532512 555170 578902 603708 629463 656108 683581 711945 741049 770614 800321 829874 858952
1549 858952 887017 913456 937592 958847 976694 990647 1000272 1005361 1005816 1001620 992850 979756 962764 942311 918880
1547 918880 892949 865084 835932 805951 775596 745241 715164 685609 656792 628865 601950 575988 551009 527105
1545 527105 504336 482704 462184 442677 424079 406432 389698 373853 358791 344496 330914 318038 305822 294250
1544 294250 283264 272861 262995 253590 244601 236012 227925 220298 213084 206208 199543 193154 187070 181325 175920 170792
1542 170792 165846 161054 156407 151976 147740 143720 139861 136216 132695 129265 125943 122836 119874 117005 114189 111466 108921
1540 108921 106468 104061 101746 99573 97493 95479 93466 91560 89746 87936 86126 84347 82721 81208 79696 78233 76770
1537 76770 75384 73998 72682 71367 70128 68890 67722 66554 65463 64372 63266 62160 61048 60028 59103 58178 57335 56493
1535 56493 55639 54785 53931 53077 52362 51647 50932 50218 49633 49048 48463 47878 47312 46747 46181 45615 45055 44494 43934 43374 42940 42506 42072
1532 42072 41638 41157 40675 40193 39711 39249 38786 38330 37873 37445 37109 36772 36344 35918 35492 35106 34720 34384 34049 33790 33531 33218 32904
1530 32904 32637 32369 32121 31872 31624 31376 31195 31015 30835 30654 30487 30321 30154 29987 29781 29574 29368 29162 28982 28802 28545 28289 28115
1527 28115 27942 27688 27343 27052 26854 26696 26446 26174 25902 25673 25444 25273 25147 25053 24867 24647 24520 24465 24364 24162 23914 23714 23606
1524 23606 23531 23456 23432 23409 23372 23336 23299 23263 23175 23086 23075 23063 23093 23122 23151 23181 23246 23312 23307 23302 23382 23554 23704 23807 23924 24087 24328 24570 24798 25027
1520 25027 25255 25484 25789 26094 26400 26705 26992 27279 27643 28007 28343 28680 28908 29137 29292 29447 29522 29444 29290 29182 29087 28901 28523 28098
1517 28098 27694 27291 26826 26362 25943 25525 25118 24711 24351 23990 23558 23126 22741 22355 22066 21777 21565 21353 21159 20965 20727 20442 20162
1515 20162 19975 19841 19707 19552 19398 19289 19181 19056 18931 18806 18681 18553 18425 18405 18384 18332 18281 18306 18330 18319 18307 18342 18376 18379 18382 18434 18579 18672
1511 18672 18673 18679 18778 18873 18969 19070 19171 19264 19356 19403 19449 19473 19498 19522 19546 19517 19489 19414 19339 19212 19084 19001 18964 18880 18705 18486 18359 18309 18260 18079 17897
1507 17897 17773 17649 17571 17493 17389 17285 17135 16985 16780 16574 16473 16372 16246 16074 15922 15862 15872 15882 15821 15760 15685 15610 15489 15368 15311 15253
1504 15253 15196 15138 15079 15020 14961 14902 14908 14915 14921 14927 14993 15058 15123 15188 15170 15152 15134 15115 15008 14901 14870 14840 14744 14648 14552 14457 14331 14205 14034 13862 13723 13584
1500 13584 13522 13460 13347 13235 13122 13010 12918 12827 12735 12644 12560 12476 12345 12215 12184 12152 12121 12089 12061 12033 12005 11977 11961 11944 11928 11911 11850 11788 11726 11665 11685
1497 11685 11705 11649 11547 11506 11557 11656 11709 11663 11617 11645 11673 11683 11693 11657 11621 11645 11668 11646 11623 11633 11644 11700 11756 11785 11813 11765 11717 11713 11708 11704 11700 11676 11653 11675 11698
1492 11698 11702 11705 11709 11713 11739 11765 11745 11725 11687 11649 11688 11727 11720 11712 11652 11684 11711 11737 11662 11586 11614 11641 11668 11696 11708 11721 11734 11746 11680 11614 11594 11575 11601 11628 11609 11590 11560
1488 11560 11531 11455 11379 11373 11368 11362 11356 11339 11322 11310 11299 11329 11451 11568 11684 11733 11783 11832 11881 11887 11894 11894 11986 12074 12162 12178 12195 12214 12232 12291 12350 12427 12412 12311 12210
1483 12210 12181 12152 12123 12094 12119 12144 12169 12194 12149 12104 12013 11922 11922 11922 11922 11922 11970 12018 12066 12114 12092 12070 12008 11945 11956 12059 12111 12162 12155 12147 12165 12275 12458 12642 12689
1479 12689 12645 12593 12634 12694 12754 12794 12834 12875 12915 12874 12833 12868 12904 12886 12869 12902 13026 13247 13375 13394 13366 13423 13573 13722 13780 13802 13870 13983 14096 14171
1476 14171 14247 14323 14398 14467 14536 14559 14582 14569 14556 14497 14438 14334 14230 14126 14021 13942 13863 13793 13630 13412 13239 13137 13035 12842 12558 12319 12172
1472 12172 12045 11918 11719 11521 11385 11250 11161 11072 10986 10901 10815 10730 10668 10606 10544 10482 10423 10364 10304 10245 10208 10172 10181 10190 10185 10180 10174 10169 10142 10114 10090 10065 10126 10233
1468 10233 10325 10325 10278 10322 10472 10622 10711 10707 10730 10798 10865 10932 11048 11164 11286 11407 11452 11497 11554 11610 11667 11723 11682 11640 11553 11466 11452 11439 11429 11419 11348 11323
1464 11323 11324 11233 11092 10950 10908 10913 10856 10707 10586 10512 10447 10381 10296 10210 10169 10127 10039 9951 9918 9884 9927 9971 9926 9881 9836 9791 9763 9735 9708 9680 9631 9582 9610
1460 9610 9638 9692 9746 9723 9700 9665 9629 9640 9651 9686 9722 9757 9792 9795 9797 9799 9802 9805 9809 9793 9776 9875 10019 10131 10167 10128 10043 9985 10004 10107 10257 10365 10473 10593
1456 10593 10759 10939 11042 11082 11076 11067 11105 11164 11270 11429 11588 11690 11793 11849 11906 11969 12032 12095 12158 12218 12278 12379 12480 12520 12482 12422 12439 12520 12602 12643
1452 12643 12683 12773 12863 12930 12997 13116 13235 13431 13627 13816 14005 14148 14290 14506 14721 14959 15198 15404 15611 15771 15931 16087 16242 16443
1449 16443 16644 16809 16974 17031 17088 17233 17378 17522 17667 17734 17802 17829 17855 17964 18150 18342 18488 18624 18759 18846 18932 19057 19182 19330 19478
1446 19478 19631 19784 20014 20244 20367 20490 20689 20889 21107 21325 21497 21669 21903 22138 22418 22698 22891 23084 23226 23459 23753 24046 24290
1443 24290 24442 24513 24584 24603 24622 24606 24591 24529 24468 24371 24275 24072 23868 23705 23542 23354 23073 22784 22494 22245 21995 21719 21443 21243 21044 20876
1440 20876 20708 20495 20281 19986 19692 19474 19256 19075 18894 18666 18439 18248 18057 17860 17755 17698 17640 17450 17260 17122 16984 16892 16800 16725
1437 16725 16649 16527 16406 16283 16161 16016 15871 15696 15521 15346 15172 14937 14701 14395 14089 13854 13710 13538 13365 13116 12866 12546 12225
1435 12225 11987 11841 11690 11538 11374 11210 11046 10881 10752 10623 10393 10162 9966 9863 9730 9598 9515 9432 9361 9197 9005 8905 8886 8867
1432 8867 8733 8598 8510 8421 8404 8386 8326 8265 8184 8150 8091 7956 7793 7707 7680 7653 7559 7464 7478 7491 7436 7381 7326 7271 7232 7194 7232 7270 7290 7310 7223 7136
1428 7136 7079 7022 7073 7124 7119 7114 7063 7012 6952 6891 6907 6923 7001 7080 7097 7037 6967 6944 6936 6928 6829 6731 6740 6749 6769 6788 6807 6827 6795 6764 6687 6609 6607 6605 6557 6508 6436 6364
1423 6364 6297 6229 6202 6251 6326 6355 6314 6227 6166 6181 6212 6242 6201 6113 6043 6050 6087 6124 6150 6176 6125 6075 6018 5960 5926 5893 5820 5748 5811 5874 5862 5805 5776 5824 5867
1419 5867 5910 5912 5914 5884 5854 5825 5795 5832 5869 5861 5852 5884 5916 5947 5979 5944 5909 5920 5931 5930 5930 5883 5837 5878 5918 5959 6000 6006 6012 6095 6178 6123 6069 6015 5960 5899 5838 5854
1414 5854 5870 5875 5880 5839 5798 5776 5754 5778 5802 5826 5849 5796 5743 5723 5702 5759 5815 5761 5708 5700 5693 5679 5665 5650 5636 5632 5627 5669 5711 5759 5808 5810 5812 5738 5664 5649 5711 5780
1409 5780 5772 5735 5698 5688 5678 5668 5659 5669 5678 5642 5606 5664 5721 5756 5790 5806 5822 5884 5946 5963 5981 5952 5924 5938 5953 5945 5936 5947 5957 5991 6024 5969 5915 5891 5943 6037 6084
1405 6084 6024 5964 5958 5952 5991 6031 5983 5936 5888 5840 5860 5881 5901 5922 5968 6015 6061 6107 6081 6055 6028 6002 5961 5920 5879 5839 5812 5786 5759 5733 5775 5817 5782 5748 5677
1401 5677 5606 5594 5659 5726 5717 5653 5634 5683 5732 5738 5743 5767 5791 5738 5686 5655 5625 5671 5718 5699 5679 5637 5595 5544 5492 5401 5311 5289 5374 5499 5577 5580 5537 5491 5491 5498 5505
1396 5505 5469 5434 5379 5324 5293 5261 5317 5373 5352 5331 5337 5344 5396 5448 5418 5388 5312 5236 5179 5122 5173 5223 5290 5357 5317 5276 5240 5203 5144 5085 5091 5098 5089 5034 5008 5059 5112
1392 5112 5120 5083 5047 5054 5061 5032 5003 4974 4945 4967 4989 5011 5033 5007 4981 4954 4928 4943 4958 4997 5035 5087 5140 5115 5091 5025 4959 4939 4919 4913 4907 4924 4941 4918 4894 4871 4848
1387 4848 4815 4782 4726 4670 4734 4797 4783 4770 4783 4796 4788 4781 4789 4843 4890 4862 4782 4702 4694 4687 4656 4626 4595 4564 4629 4693 4681 4668 4684 4700 4727 4662 4580 4590 4619 4648 4587
1383 4587 4525 4541 4556 4549 4541 4528 4607 4704 4801 4736 4578 4449 4473 4513 4552 4558 4563 4614 4665 4601 4537 4550 4563 4527 4491 4532 4573 4563 4552 4565 4577 4536 4494 4453 4411
1378 4411 4396 4381 4413 4444 4413 4381 4372 4364 4374 4384 4349 4313 4345 4378 4456 4535 4535 4535 4489 4443 4433 4424 4486 4548 4570 4501 4483 4465 4493 4522 4504 4486 4436 4387 4393 4491 4543
1374 4543 4595 4607 4618 4568 4518 4467 4417 4402 4387 4394 4402 4437 4472 4461 4450 4484 4519 4599 4679 4645 4611 4600 4588 4553 4517 4482 4446 4477 4509 4438 4368 4331 4387 4468 4549
1370 4549 4561 4574 4541 4507 4492 4476 4460 4444 4483 4522 4515 4508 4424 4341 4334 4328 4394 4460 4480 4501 4447 4394 4369 4421 4497 4497 4411 4371 4416 4461 4433 4404 4422 4440 4411 4383 4387
1365 4387 4392 4442 4493 4517 4541 4518 4496 4494 4492 4536 4580 4596 4612 4551 4491 4536 4581 4626 4671 4666 4661 4579 4498 4490 4482 4474 4466 4496 4526 4485 4443 4454 4541 4611 4635 4638 4641 4595 4549 4589
1360 4589 4630 4671 4711 4732 4754 4729 4704 4692 4680 4667 4655 4616 4576 4614 4651 4722 4793 4864 4935 4948 4961 4975 4988 4955 4921 4934 4947 4959 4972 4939 4905 4902 4898 4895 4891 4864
1356 4864 4838 4811 4785 4753 4721 4797 4873 4862 4851 4882 4913 4918 4846 4774 4779 4825 4872 4815 4759 4694 4629 4672 4715 4733 4751 4766 4781 4770 4714 4637 4637 4673 4663 4654 4692 4770
1351 4770 4802 4786 4770 4829 4888 4947 5006 5002 4999 4995 4992 4973 4954 5012 5070 5141 5212 5175 5138 5155 5172 5143 5114 5056 4998 5014 5030 5023 4969 4971 5049 5144 5161 5119 5078 5111 5144
1347 5144 5131 5117 5141 5165 5189 5213 5316 5420 5416 5412 5409 5406 5449 5493 5510 5527 5547 5568 5660 5799 5881 5886 5882 5924 5965 5961 5988 6092 6222 6306 6338 6371 6447 6523 6541
1342 6541 6559 6653 6747 6869 6991 7113 7235 7417 7598 7746 7817 7853 7888 7965 8042 8105 8167 8230 8293 8358 8424 8489 8555 8665 8774 8884 8994 9104
1339 9104 9214 9247 9280 9290 9300 9413 9526 9606 9608 9628 9694 9793 9892 9947 10003 10095 10186 10278 10369 10489 10609 10706 10803 10894 10985 11029 11074 11178 11282 11340 11398
1335 11398 11450 11501 11576 11651 11654 11658 11615 11526 11473 11496 11551 11605 11576 11547 11540 11534 11440 11345 11250 11155 11100 11045 10989 10934 10864 10795 10648 10502 10386 10269 10153 10036 9960
1331 9960 9884 9764 9597 9453 9417 9393 9370 9287 9203 9120 9036 8932 8828 8723 8619 8548 8477 8406 8335 8242 8150 8034 7918 7809 7699 7636 7573 7479 7386
1328 7386 7293 7200 7144 7088 7032 6976 6853 6729 6606 6482 6391 6300 6231 6163 6058 5953 5894 5835 5819 5804 5681 5512 5405 5375 5399 5377 5266 5108 4954
1324 4954 4877 4892 4907 4881 4809 4762 4793 4820 4770 4646 4522 4440 4357 4342 4326 4357 4387 4337 4287 4237 4187 4109 4031 4000 3968 3987 4005 3947 3889 3828 3766 3750 3734
1320 3734 3711 3687 3710 3733 3710 3687 3618 3549 3533 3518 3526 3534 3549 3564 3533 3502 3421 3341 3306 3272 3212 3152 3199 3247 3283 3318 3331 3344 3357 3371 3307 3244 3150 3056 3008
1316 3008 2960 2807 2654 2639 2777 2853 2838 2781 2770 2758 2746 2759 2773 2860 2948 2990 3031 2991 2951 2888 2825 2866 2907 2901 2896 2929 2963 2973 2983 2923 2862 2825 2787 2796
1312 2796 2805 2813 2822 2748 2674 2647 2619 2697 2776 2829 2790 2756 2723 2692 2614 2561 2599 2686 2726 2658 2590 2626 2662 2674 2687 2699 2711 2660 2608 2634 2659 2650 2641 2631 2622 2577 2532
1307 2532 2533 2534 2578 2622 2562 2502 2414 2372 2413 2501 2534 2521 2511 2546 2578 2610 2599 2587 2575 2562 2547 2532 2502 2427 2351 2322 2329 2336 2346 2356 2331 2306 2256 2251 2237 2223 2212
1303 2212 2200 2247 2293 2319 2299 2227 2155 2101 2092 2100 2108 2118 2129 2203 2277 2348 2419 2441 2417 2347 2277 2242 2283 2355 2427 2407 2341 2301 2261 2217 2173 2129 2085 2064 2043 2024
1298 2024 2006 1951 1942 2015 2088 2141 2195 2245 2296 2301 2260 2217 2220 2218 2171 2126 2127 2127 2126 2129 2131 2095 2060 1998 1983 2001 2019 2066 2067 2010 1954 1945 1982 1965 1947 1950 1999 2083 2122 2112
1293 2112 2103 2041 1980 1978 2053 2099 2068 2009 1950 1915 1881 1864 1893 1951 1962 1956 1951 1959 1968 1951 1980 1987 1995 1959 1923 1932 1942 1951 1960 1936 1912 1888 1863 1932 2001 1993 1985 1987 1989 1991 1994 1998 2002 1960
1288 1960 1918 1923 1928 1933 1939 1899 1859 1838 1910 1998 1994 1970 1947 1951 1956 1884 1811 1835 1859 1883 1907 1904 1901 1898 1895 1934 1973 1966 1959 1912 1866 1774 1681 1651 1622 1669 1716 1786 1856 1819 1781
1283 1781 1818 1854 1845 1835 1810 1785 1760 1735 1721 1707 1692 1678 1698 1718 1739 1759 1755 1752 1749 1745 1779 1814 1802 1790 1811 1833 1854 1876 1860 1844 1829 1813 1825 1837 1849 1860 1796
1278 1796 1733 1715 1697 1708 1720 1731 1742 1786 1830 1874 1918 1935 1952 1891 1831 1727 1623 1626 1629 1617 1605 1593 1581 1633 1685 1660 1635 1626 1616 1653 1689 1685 1681 1676 1672 1641 1611
1274 1611 1603 1596 1681 1767 1763 1682 1618 1630 1699 1768 1738 1663 1613 1640 1677 1668 1587 1552 1595 1638 1607 1530 1481 1508 1562 1569 1568 1567 1609 1651 1624 1597 1570 1543 1598 1653 1632 1610
1269 1610 1600 1591 1604 1617 1615 1612 1568 1524 1498 1548 1627 1660 1642 1624 1603 1583 1561 1539 1592 1644 1613 1535 1487 1515 1602 1690 1736 1782 1763 1744 1748 1753 1745 1736 1728 1720 1683 1647 1610
1264 1610 1574 1562 1551 1496 1441 1489 1583 1638 1585 1493 1447 1506 1565 1602 1640 1677 1714 1669 1625 1580 1535 1494 1452 1434 1415 1460 1504 1502 1500 1494 1488 1559 1629 1596 1563 1530
1260 1530 1497 1474 1452 1452 1452 1392 1333 1378 1423 1473 1478 1496 1607 1694 1688 1633 1577 1560 1543 1526 1509 1504 1500 1496 1492 1461 1429 1444 1459 1558 1656 1698 1649 1588 1527 1537 1547 1559
1255 1559 1570 1536 1501 1554 1606 1582 1557 1532 1507 1505 1503 1490 1476 1462 1448 1412 1376 1339 1303 1340 1377 1460 1543 1565 1588 1534 1480 1491 1502 1513 1524 1513 1502 1492 1481
1251 1481 1495 1509 1546 1582 1535 1487 1485 1483 1492 1502 1466 1429 1421 1413 1383 1352 1326 1301 1299 1297 1255 1213 1165 1209 1297 1384 1370 1356 1356 1355 1378 1401 1394 1388 1335 1283 1376 1469 1482 1403
1246 1403 1361 1411 1461 1419 1372 1418 1477 1491 1438 1384 1334 1283 1284 1377 1473 1477 1442 1452 1457 1416 1364 1312 1334 1355 1308 1261 1260 1259 1259 1259 1259 1259 1325 1391 1411 1432 1455 1479 1426
1241 1426 1373 1354 1335 1361 1388 1380 1372 1364 1356 1325 1294 1309 1324 1347 1371 1394 1417 1391 1364 1338 1311 1328 1345 1316 1286 1363 1440 1471 1349 1176 1095 1152 1209 1297 1384
1237 1384 1365 1345 1316 1287 1335 1382 1408 1434 1511 1496 1373 1250 1177 1196 1254 1312 1326 1248 1128 1100 1153 1205 1225 1245 1311 1376 1347 1319 1391 1464 1485 1414 1383
1233 1383 1444 1502 1468 1384 1299 1284 1269 1300 1331 1380 1430 1402 1374 1378 1382 1386 1390 1407 1423 1394 1364 1389 1414 1486 1557 1539 1522 1458 1395 1356 1317 1356 1394 1422 1450 1432
1229 1432 1414 1423 1432 1394 1357 1357 1357 1311 1266 1295 1325 1355 1385 1348 1311 1317 1324 1402 1434 1402 1293 1153 1088 1115 1187 1241 1218 1169 1166 1164 1162 1163 1164 1208 1253 1220 1187 1169 1151
1224 1151 1179 1207 1258 1309 1284 1258 1197 1137 1153 1169 1230 1291 1353 1414 1403 1392 1335 1278 1254 1229 1164 1098 1109 1197 1268 1293 1249 1205 1164 1122 1151 1257 1363
1220 1363 1392 1361 1329 1370 1410 1389 1368 1347 1325 1290 1254 1218 1183 1174 1166 1158 1150 1183 1216 1146 1077 1097 1194 1290 1310 1288 1266 1285 1305 1290 1275 1263 1251 1278 1352 1401
1216 1401 1374 1306 1316 1385 1454 1443 1431 1420 1408 1343 1279 1245 1288 1305 1275 1248 1267 1272 1231 1172 1114 1155 1195 1235 1276 1280 1285 1336 1387 1408 1429 1373 1318 1275 1232 1236
1211 1236 1239 1241 1244 1246 1248 1259 1269 1325 1381 1319 1256 1193 1131 1126 1121 1163 1204 1286 1368 1317 1266 1255 1335 1416 1405 1431 1458 1531 1512 1400 1287 1276 1265 1259 1253 1246 1240 1227 1214
1206 1214 1200 1187 1137 1086 1081 1077 1151 1225 1351 1384 1298 1212 1201 1281 1360 1347 1284 1221 1184 1147 1156 1165 1182 1199 1217 1234 1214 1194 1220 1246 1288 1331 1327 1324 1309 1294 1349
1202 1349 1405 1385 1272 1205 1231 1293 1354 1315 1275 1239 1203 1243 1284 1295 1306 1271 1236 1253 1270 1288 1305 1293 1282 1219 1247 1292 1336 1309 1283 1265 1247 1229 1211 1182
1198 1182 1153 1124 1095 1138 1182 1226 1270 1230 1190 1150 1110 1161 1212 1217 1222 1261 1301 1340 1380 1367 1353 1340 1327 1296 1265 1235 1204 1188 1171 1155 1138 1154 1170 1232 1294
1193 1294 1281 1267 1253 1239 1236 1232 1228 1225 1181 1137 1139 1187 1213 1163 1112 1138 1184 1184 1168 1153 1170 1186 1203 1219 1208 1197 1140 1082 1007 931 917 980 1065 1103 1065 1027 1071
1189 1071 1114 1157 1201 1216 1232 1201 1170 1099 1027 1001 975 978 981 984 987 1034 1080 1126 1172 1204 1236 1268 1299 1314 1329 1297 1266 1236 1206 1177 1147 1188 1228 1192 1155 1100
1185 1100 1044 1066 1087 1125 1162 1200 1237 1210 1182 1108 1034 1047 1059 1071 1083 1122 1162 1095 1027 1017 1008 983 912 873 910 1004 1052 1070 1088 1149 1210 1197 1184 1168 1152
1180 1152 1109 1021 980 1031 1126 1176 1180 1184 1189 1194 1199 1204 1219 1235 1204 1173 1217 1261 1229 1196 1244 1291 1262 1234 1182 1130 1124 1118 1172 1226 1172 1118 1072 1027 1027 1027 1057 1088 1103
1175 1103 1073 1035 1089 1163 1236 1223 1164 1079 1087 1135 1183 1160 1137 1122 1108 1093 1079 1106 1133 1159 1186 1147 1109 1076 1043 1059 1166 1273 1288 1224 1159 1135 1111 1107
1171 1107 1103 1130 1112 1081 1142 1220 1252 1212 1172 1206 1239 1208 1178 1147 1116 1083 1049 1061 1074 1115 1156 1089 1023 1001 980 958 936 966 995 1024 1053 1077 1101 1125 1150
1167 1150 1160 1171 1136 1100 1042 983 971 959 1009 1059 1109 1159 1161 1163 1212 1260 1236 1211 1187 1162 1104 1046 1034 1022 1062 1101 1141 1181 1211 1242 1227 1211 1213 1215 1171 1127
1163 1127 1154 1181 1208 1236 1164 1093 1067 1042 1049 1057 1111 1165 1161 1157 1153 1150 1176 1202 1197 1238 1275 1235 1110 1031 1053 1121 1135 1072 1023 1021 1034 1047 1038 1030 1067 1104 1130 1156 1182
1158 1182 1208 1227 1246 1265 1284 1225 1167 1108 1049 1030 1012 1039 1066 1137 1208 1203 1198 1172 1147 1122 1097 1139 1181 1190 1122 1046 971 998 1025 1068 1110 1107 1104 1132 1160 1142 1124
1153 1124 1165 1205 1246 1287 1299 1312 1248 1138 1080 1099 1143 1142 1106 1071 1079 1087 1096 1105 1114 1122 1137 1152 1120 1089 1075 1060 1046 1032 1016 1000 1030 1060 1124 1188 1178 1168 1167 1212
1149 1212 1242 1181 1082 1075 1149 1222 1248 1273 1252 1231 1208 1184 1161 1137 1098 1058 1096 1133 1128 1122 1119 1116 1119 1168 1243 1226 1164 1101 1141 1180 1184 1187 1205 1269 1271 1181 1047 1006
1144 1006 1047 1088 1058 1028 1029 1030 1077 1123 1135 1146 1112 1077 1089 1100 1188 1277 1277 1277 1201 1125 1059 993 1004 1015 1024 1033 1043 1052 1085 1118 1152 1185 1179 1174 1168 1162 1175 1189 1202 1216
1139 1216 1191 1167 1142 1118 1114 1111 1153 1196 1191 1186 1135 1084 1112 1139 1167 1195 1153 1112 1071 1029 1043 1056 1070 1083 1093 1103 1067 1030 1072 1113 1078 1043 1007 972 982 993
1135 993 1019 1046 1073 1099 1049 998 978 1035 1097 1114 1053 993 1018 1044 1069 1095 1130 1165 1246 1327 1284 1240 1200 1159 1218 1322 1367 1335 1266 1197 1169 1141 1128 1115
1131 1115 1101 1088 1079 1069 1106 1143 1161 1178 1196 1214 1162 1111 1166 1222 1206 1190 1174 1158 1184 1211 1238 1264 1272 1279 1287 1294 1302 1310 1318 1326 1317 1309 1298 1286 1230 1128 1057 1063 1098 1179
1126 1179 1281 1308 1230 1152 1146 1140 1152 1163 1172 1180 1162 1099 1061 1099 1161 1177 1116 1055 1068 1081 1141 1200 1233 1267 1254 1241 1257 1272 1288 1304 1305 1306 1308 1309 1291 1274 1256 1239
1121 1239 1250 1262 1196 1131 1103 1074 1123 1171 1234 1297 1283 1269 1270 1271 1271 1272 1256 1240 1224 1209 1239 1269 1300 1330 1289 1249 1254 1260 1268 1276 1239 1201 1226 1252 1231 1211 1246 1280
1116 1280 1269 1257 1262 1267 1318 1369 1372 1376 1379 1383 1393 1403 1367 1331 1292 1252 1289 1326 1313 1300 1333 1366 1346 1327 1236 1146 1062 1070 1163 1303 1419 1442 1413 1384 1278 1173
1112 1173 1113 1053 1051 1048 1092 1136 1171 1206 1239 1271 1249 1181 1133 1177 1233 1289 1319 1395 1451 1415 1326 1238 1218 1199 1179 1160 1222 1284 1269 1255 1223 1191 1205 1220 1209
1108 1209 1198 1187 1177 1254 1332 1333 1333 1309 1284 1259 1234 1230 1225 1267 1308 1367 1426 1434 1351 1265 1271 1353 1388 1325 1262 1276 1383 1432 1389 1273 1203 1204 1251 1275 1299 1271 1243
1103 1243 1261 1280 1292 1305 1272 1238 1273 1308 1342 1377 1351 1324 1251 1178 1185 1192 1245 1298 1393 1487 1443 1399 1370 1341 1311 1282 1266 1250 1336 1423 1464 1428 1363 1344 1346 1348
1099 1348 1353 1359 1372 1386 1354 1322 1366 1411 1409 1407 1437 1466 1449 1432 1489 1547 1497 1448 1436 1425 1413 1402 1389 1375 1362 1349 1328 1307 1332 1357 1397 1438 1371 1258 1220 1259
1094 1259 1278 1250 1224 1198 1215 1233 1274 1315 1356 1397 1425 1454 1482 1510 1455 1400 1348 1373 1443 1513 1554 1519 1472 1425 1373 1321 1338 1355 1418 1481 1456 1430 1405 1380
1090 1380 1414 1447 1404 1361 1351 1340 1317 1247 1189 1238 1358 1477 1519 1484 1446 1408 1409 1409 1410 1410 1433 1456 1432 1409 1353 1297 1318 1339 1310 1281 1206 1130 1154 1178 1156
1086 1156 1134 1133 1132 1207 1282 1357 1432 1484 1536 1511 1486 1460 1435 1494 1553 1552 1475 1410 1422 1460 1453 1443 1480 1516 1506 1476 1492 1525 1558 1556 1553 1550 1547 1560 1574 1633 1693 1633
1081 1633 1573 1591 1608 1559 1511 1539 1567 1600 1633 1643 1653 1637 1621 1651 1681 1640 1598 1580 1561 1530 1499 1545 1591 1691 1791 1866 1940 1886 1785 1741 1774 1799 1779
1077 1779 1745 1789 1880 1970 2066 2161 2184 2208 2231 2255 2298 2341 2276 2212 2234 2255 2300 2345 2380 2415 2496 2577 2586 2596 2628 2660 2629 2598 2613 2674 2709 2667 2622 2624 2660
1073 2660 2697 2690 2683 2757 2830 2826 2823 2777 2732 2763 2794 2828 2862 2820 2777 2768 2758 2726 2693 2646 2599 2655 2711 2660 2533 2462 2498 2558 2571 2563 2602 2631 2583 2479 2421 2411
1069 2411 2401 2292 2183 2163 2220 2236 2175 2148 2199 2242 2178 2034 1937 1944 1952 1912 1872 1891 1986 2061 2059 1967 1874 1873 1872 1917 1962 1913 1865 1862 1860 1856 1852 1870 1889 1946 2003
1064 2003 1983 1963 1932 1901 1916 1977 2035 2015 1965 1915 1950 1985 1944 1902 1858 1815 1817 1820 1807 1795 1855 1915 1920 1849 1779 1816 1888 1882 1793 1704 1739 1851 1916 1905 1906 1907 1880
1060 1880 1854 1833 1812 1869 1925 1932 1939 1901 1862 1830 1798 1766 1734 1757 1781 1848 1915 1898 1835 1777 1797 1837 1878 1877 1876 1935 1993 1974 1956 1962 1969 1976 1982 2038 2093 2102 2112 2167 2223
1055 2223 2229 2142 2010 1971 1981 1992 1980 1967 1955 1943 1929 1914 1906 1898 1819 1833 1958 2083 2102 2029 2008 1987 2008 2029 2003 1978 2005 2033 2060 2087 2083 2079 2074 2070 2114 2157
1050 2157 2155 2152 2147 2142 2183 2224 2242 2261 2280 2299 2329 2358 2311 2264 2316 2368 2378 2234 2075 2069 2197 2325 2370 2415 2460 2505 2518 2531 2591 2650 2634 2617 2647 2676 2607
1046 2607 2539 2516 2493 2459 2425 2437 2448 2475 2501 2567 2634 2674 2623 2623 2623 2663 2702 2665 2628 2653 2678 2774 2870 2908 2854 2805 2756 2759 2762 2765 2768 2828 2889 3000 3020 2937 2853
1042 2853 2819 2877 2937 2997 2987 2976 2934 2893 2851 2810 2871 2933 2995 3057 3099 3142 3108 3074 3113 3153 3148 3096 3012 3020 3137 3253 3326 3308 3312 3362 3421 3434 3430 3425 3436 3447
1037 3447 3503 3605 3687 3677 3583 3490 3517 3545 3618 3692 3746 3799 3807 3814 3821 3828 3835 3842 3870 3898 3850 3801 3837 3872 3908 3944 3958 3973 4063 4200 4324 4356 4305 4254 4286 4317
1033 4317 4302 4288 4374 4461 4502 4543 4590 4638 4639 4640 4622 4603 4584 4566 4542 4518 4551 4675 4843 5012 5045 4985 4928 4964 5018 5073 5120 5167 5215 5262 5315 5368 5467 5566
1029 5566 5600 5634 5667 5701 5746 5791 5837 5882 5955 6029 6088 6101 6075 6142 6292 6443 6539 6636 6686 6736 6762 6787 6890 6992 7023 7055 7132 7210 7289 7369 7402 7435
1025 7435 7544 7653 7716 7779 7803 7826 7927 8027 8134 8242 8349 8456 8535 8613 8640 8759 8912 9065 9147 9229 9335 9441 9547 9653 9755 9857
1022 9857 9958 10060 10178 10296 10414 10532 10691 10850 10963 11076 11283 11490 11650 11811 11979 12147 12315 12483 12658 12833 13084 13336 13576
1019 13576 13817 13981 14145 14371 14596 14867 15139 15398 15657 15870 16083 16371 16660 16995 17329 17702 18074 18447 18820 19160 19501 19848 20195
1016 20195 20562 21021 21481 21848 22247 22646 23146 23647 24229 24811 25399 25987 26611 27328 27998 28668 29317 30057 30884 31711 32456 33201 34063
1013 34063 35018 35992 36967 38054 39142 40274 41406 42599 43884 45222 46651 48147 49644 51244 52936 54702 56561 58480
1011 58480 60552 62749 64946 67218 69581 72131 74896 77795 80787 83892 86996 90224 93666 97316 101119 104971 108823
1009 108823 112742 116754 120770 124832 128986 133186 137402 141619 145885 150150 154366 158582 162715 166848 170934 174927 178845
1007 178845 182672 186337 189848 193191 196381 199398 202201 204835 207316 209660 211789 213692 215319 216660 217725 218525 219048
1005 219048 219330 219274 218877 218081 216975 215593 213974 212139 210086 207817 205384 202736 199872 196854 193664 190320 186769 183065
1002 183065 179222 175288 171201 167021 162811 158601 154329 150057 145785 141512 137265 133017 128704 124436 120262 116179 112166
1000 112166 108198 104331 100556 96850 93190 89599 86099 82738 79470 76369 73422 70667 68065 65578 63183 60873 58655
998 58655 56576 54650 52851 51098 49330 47607 46006 44558 43127 41696 40364 39123 37968 36858 35812 34813 33860 32954
996 32954 32076 31199 30357 29606 28945 28329 27693 27012 26333 25701 25104 24507 23965 23516 23068 22574 22066 21557 21116 20675 20234 19793 19360
993 19360 18926 18539 18152 17894 17637 17333 17029 16696 16364 16077 15790 15454 15118 14872 14704 14528 14276 13971 13713 13519 13372 13227 13036
990 13036 12782 12529 12334 12216 12099 11937 11728 11519 11360 11201 11064 10928 10752 10575 10399 10223 10152 10081 9963 9846 9734 9622 9434 9245
988 9245 9144 9042 8964 8886 8778 8670 8563 8455 8336 8218 8099 7981 7924 7868 7812 7755 7711 7667 7577 7487 7317 7146 6992 6945 6943 6942 6870 6798 6732
984 6732 6666 6622 6579 6552 6524 6451 6378 6362 6346 6284 6222 6201 6179 6134 6090 6011 5932 5807 5682 5635 5587 5585 5584 5560 5536 5466 5397 5331 5266 5200 5135 5049 4963 4953 4944
980 4944 4943 4943 4919 4896 4859 4823 4743 4664 4555 4493 4497 4577 4668 4712 4648 4585 4531 4477 4423 4369 4342 4314 4263 4213 4167 4120 4094 4114 4167 4220 4167 4067 4026 4031 4033 3989
975 3989 3939 3889 3818 3747 3689 3708 3756 3757 3697 3637 3651 3664 3670 3676 3636 3596 3572 3549 3525 3501 3416 3331 3294 3303 3335 3321 3287 3300 3379 3458 3458 3413 3379 3346 3309 3273 3255
971 3255 3236 3221 3206 3215 3271 3298 3248 3143 3038 2977 2916 2891 2912 2953 2993 2956 2918 2929 2985 3030 3029 3011 2992 2939 2886 2879 2872 2891 2910 2878 2800 2753 2706 2702 2698 2706 2714 2721
966 2721 2729 2749 2769 2789 2809 2802 2796 2771 2701 2639 2624 2582 2540 2521 2547 2574 2555 2536 2518 2520 2521 2492 2463 2508 2553 2552 2505 2463 2422 2405 2435 2515 2596 2577 2559 2518 2476 2418
962 2418 2360 2379 2397 2422 2447 2426 2405 2351 2297 2265 2326 2423 2474 2450 2426 2405 2385 2350 2269 2176 2176 2228 2281 2253 2226 2199 2172 2168 2164 2114 2064 2047 2030 2089 2148 2162
957 2162 2175 2157 2185 2210 2142 2058 2020 2069 2118 2094 2069 2008 1947 1880 1906 1958 2011 1962 1913 1934 1954 1951 1948 1984 2021 2034 2047 2084 2121 2083 1998 1961 2016 2027 1947 1840
953 1840 1826 1892 1959 1951 1944 1936 1929 1903 1878 1929 1980 1998 2016 1988 1960 1993 2026 2010 1901 1810 1812 1833 1809 1783 1850 1960 1977 1891 1804 1758 1712 1697 1681 1712 1742 1735 1728
948 1728 1828 1928 1914 1901 1934 1967 1972 1977 1936 1895 1911 1927 1944 1960 1945 1930 1937 1945 1938 1931 1877 1824 1837 1850 1840 1831 1789 1747 1751 1755 1742 1729 1762 1795 1744 1693 1719 1745
944 1745 1730 1716 1724 1733 1752 1771 1813 1855 1843 1830 1895 1959 1966 1972 2025 2078 2101 2125 2125 2126 2123 2120 2117 2115 2116 2117 2118 2119 2164 2209 2208 2207 2196 2186 2277 2368 2358 2255 2198 2234 2333 2433
938 2433 2461 2489 2494 2498 2503 2507 2534 2560 2510 2460 2477 2493 2552 2611 2598 2539 2556 2665 2774 2790 2726 2707 2738 2677 2572 2560 2663 2766 2767 2768 2802 2835 2822 2810 2764
934 2764 2719 2696 2673 2629 2586 2588 2590 2606 2622 2506 2390 2321 2344 2362 2379 2410 2441 2453 2373 2220 2160 2180 2246 2263 2189 2113 2128 2144 2084 1996 1907 1898 1888 1832 1777
930 1777 1767 1757 1794 1830 1803 1776 1706 1636 1691 1793 1866 1862 1783 1704 1667 1629 1691 1753 1739 1678 1661 1721 1779 1759 1680 1600 1562 1524 1507 1489 1472 1455 1495 1535 1530
926 1530 1524 1517 1510 1503 1496 1502 1507 1513 1518 1500 1481 1463 1445 1408 1372 1382 1392 1381 1371 1407 1443 1479 1515 1506 1496 1456 1416 1452 1488 1466 1444 1468 1492 1486 1481 1475 1469 1454 1439 1470 1501 1534
920 1534 1568 1525 1482 1392 1302 1246 1266 1317 1368 1378 1388 1362 1337 1311 1285 1254 1222 1220 1294 1391 1411 1372 1333 1378 1424 1392 1361 1366 1370 1375 1380 1426 1472 1442 1365 1351 1413
916 1413 1473 1456 1373 1291 1250 1209 1246 1283 1320 1358 1314 1271 1227 1184 1167 1149 1209 1268 1287 1306 1325 1344 1382 1420 1325 1230 1193 1232 1276 1244 1158 1149 1225 1301 1279
912 1279 1181 1129 1153 1227 1301 1303 1305 1237 1169 1178 1186 1207 1227 1247 1267 1265 1264 1262 1260 1256 1251 1247 1243 1253 1263 1227 1191 1227 1262 1298 1334 1370 1406 1335 1263 1251 1238 1226 1213 1218 1223 1227
906 1227 1232 1235 1238 1317 1397 1394 1391 1388 1385 1343 1302 1306 1310 1349 1388 1380 1373 1344 1315 1286 1257 1215 1172 1238 1303 1298 1294 1289 1285 1256 1226 1243 1260 1284 1308 1332 1356 1356 1356 1353 1351 1371 1346 1298
901 1298 1327 1383 1363 1287 1258 1314 1369 1351 1333 1344 1355 1321 1286 1300 1315 1329 1343 1327 1311 1318 1325 1302 1279 1209 1140 1189 1239 1242 1245 1253 1260 1268 1275 1230 1184 1185 1186 1256 1326 1319
896 1319 1312 1324 1337 1349 1361 1322 1283 1244 1205 1259 1313 1343 1374 1410 1447 1395 1267 1181 1203 1236 1269 1272 1275 1278 1281 1353 1425 1454 1376 1253 1207 1280 1352 1370 1388 1360
892 1360 1332 1281 1230 1256 1282 1304 1325 1323 1321 1331 1341 1375 1408 1430 1453 1399 1345 1280 1215 1196 1177 1134 1090 1070 1050 1162 1275 1387 1500 1457 1413 1370 1327 1310
888 1310 1293 1276 1259 1284 1310 1313 1315 1286 1256 1272 1289 1294 1299 1304 1310 1366 1422 1433 1443 1505 1567 1583 1599 1604 1609 1614 1619 1564 1509 1530 1552 1563 1575 1540 1505 1485 1465 1491 1517 1528
883 1528 1539 1526 1514 1533 1553 1496 1439 1431 1423 1415 1407 1351 1295 1316 1337 1330 1324 1317 1310 1352 1394 1389 1385 1396 1407 1395 1383 1356 1330 1285 1240 1200 1237 1308 1378 1343 1308 1296 1283 1338
878 1338 1393 1401 1410 1361 1311 1339 1366 1341 1316 1292 1267 1305 1343 1358 1374 1416 1459 1425 1391 1354 1317 1357 1397 1406 1416 1403 1389 1379 1369 1382 1395 1427 1459 1469 1478 1485 1492 1453
873 1453 1415 1367 1320 1276 1231 1274 1363 1398 1355 1305 1332 1413 1448 1406 1363 1364 1365 1369 1372 1376 1379 1375 1370 1343 1315 1308 1301 1340 1379 1414 1450 1409 1367 1351 1335 1319 1302 1235 1168 1209
868 1209 1249 1268 1286 1228 1170 1192 1214 1235 1257 1241 1225 1255 1286 1268 1250 1233 1215 1274 1334 1348 1361 1346 1331 1316 1301 1281 1261 1286 1312 1309 1306 1304 1301 1296 1292 1242 1192 1182
864 1182 1172 1162 1152 1203 1255 1230 1205 1207 1208 1210 1212 1186 1160 1181 1201 1265 1330 1302 1197 1077 1004 1011 1065 1129 1192 1258 1325 1303 1282 1260 1238 1219 1199 1256 1313 1367
859 1367 1420 1397 1374 1371 1368 1262 1156 1124 1168 1195 1176 1181 1186 1188 1190 1181 1173 1164 1155 1132 1109 1137 1164 1212 1337 1462 1510 1475 1441 1388 1289 1185 1189 1268 1346 1301 1256 1211
855 1211 1166 1192 1217 1243 1268 1235 1201 1244 1287 1319 1352 1308 1264 1240 1215 1267 1319 1266 1213 1205 1198 1185 1171 1157 1143 1075 1006 984 961 960 959 1003 1048 1092 1137 1181 1225
850 1225 1233 1241 1203 1165 1126 1087 1049 1010 956 902 986 1070 1101 1133 1164 1195 1234 1274 1267 1261 1229 1197 1298 1399 1403 1316 1226 1227 1225 1177 1135 1139 1161 1183 1208 1233 1273 1312
845 1312 1306 1300 1295 1289 1213 1137 1120 1195 1319 1396 1392 1341 1314 1287 1267 1247 1272 1343 1388 1341 1303 1265 1268 1272 1275 1278 1280 1282 1329 1377 1337 1298 1259 1220 1204 1187 1247 1352 1407
841 1407 1369 1339 1310 1305 1301 1250 1200 1185 1170 1257 1344 1393 1349 1332 1360 1386 1412 1395 1378 1361 1344 1373 1402 1446 1491 1532 1573 1543 1468 1468 1560 1594 1535 1437 1431 1455 1480
836 1480 1434 1388 1354 1320 1310 1299 1324 1349 1352 1354 1398 1441 1462 1482 1428 1373 1389 1405 1417 1336 1233 1221 1257 1292 1257 1221 1222 1223 1246 1270 1294 1319 1236 1152 1159 1166 1172 1179
832 1179 1214 1250 1286 1322 1283 1244 1228 1213 1197 1182 1213 1244 1279 1314 1303 1293 1308 1323 1338 1353 1353 1352 1305 1258 1256 1254 1298 1343 1279 1216 1198 1181 1178 1176 1219 1263 1317 1372
827 1372 1403 1435 1441 1448 1408 1369 1357 1346 1311 1276 1300 1324 1348 1372 1338 1303 1246 1189 1206 1223 1285 1348 1333 1318 1280 1242 1299 1356 1337 1317 1331 1346 1383 1420 1432 1444
822 1444 1433 1422 1422 1423 1400 1378 1352 1327 1347 1368 1391 1414 1437 1460 1404 1348 1292 1236 1262 1288 1291 1294 1370 1445 1465 1393 1320 1246 1243 1241 1241 1240 1217 1194 1163 1132 1177 1223 1314
818 1314 1404 1449 1493 1437 1381 1281 1228 1227 1318 1460 1556 1552 1501 1468 1480 1477 1427 1420 1460 1484 1416 1354 1337 1320 1303 1257 1303 1394 1439 1439 1440 1435 1431 1319 1208 1161 1114
813 1114 1143 1173 1222 1271 1274 1276 1304 1332 1283 1189 1099 1100 1215 1376 1467 1466 1412 1358 1371 1385 1392 1400 1380 1268 1156 1136 1197 1258 1220 1182 1218 1300 1364 1337 1308 1325
809 1325 1387 1448 1505 1561 1510 1459 1463 1467 1425 1383 1416 1448 1458 1468 1449 1430 1388 1347 1345 1343 1318 1293 1335 1377 1374 1370 1421 1472 1447 1421 1399 1376 1353 1331 1285 1240 1272 1303
804 1303 1323 1344 1364 1384 1449 1514 1534 1553 1511 1469 1427 1385 1454 1523 1533 1466 1411 1434 1456 1401 1328 1332 1395 1458 1482 1505 1529 1553 1567 1580 1548 1516 1486 1457 1473
800 1473 1490 1482 1474 1512 1551 1566 1581 1596 1611 1597 1583 1569 1555 1507 1458 1456 1453 1378 1302 1273 1244 1280 1315 1351 1387 1368 1350 1331 1312 1368 1424 1403 1383 1401 1419 1422 1379
795 1379 1339 1375 1442 1510 1515 1521 1527 1533 1514 1494 1475 1456 1442 1428 1491 1554 1521 1488 1501 1514 1527 1540 1554 1567 1537 1506 1429 1352 1377 1402 1427 1452 1416 1381 1345 1310 1339
791 1339 1369 1399 1428 1437 1446 1408 1371 1383 1395 1453 1511 1484 1458 1477 1497 1475 1454 1477 1547 1590 1542 1519 1543 1583 1577 1528 1524 1572 1620 1563 1506 1422 1337 1278 1311 1404 1497
786 1497 1520 1542 1519 1497 1474 1452 1459 1466 1474 1481 1500 1520 1540 1560 1501 1442 1405 1460 1537 1569 1554 1492 1431 1415 1442 1469 1463 1366 1265 1257 1364 1425 1380 1289 1260 1323 1357
782 1357 1345 1317 1289 1257 1226 1286 1345 1359 1372 1372 1372 1327 1281 1312 1344 1376 1408 1399 1391 1385 1380 1365 1396 1413 1338 1268 1290 1331 1372 1346 1320 1295 1269 1306 1343 1333 1324 1283
777 1283 1242 1278 1313 1325 1337 1349 1361 1389 1417 1368 1319 1262 1204 1285 1366 1443 1520 1460 1399 1359 1320 1280 1240 1265 1289 1313 1338 1343 1348 1353 1358 1386 1414 1441 1469 1442 1415
773 1415 1388 1361 1333 1305 1323 1340 1359 1378 1397 1416 1419 1422 1425 1428 1418 1409 1384 1313 1235 1234 1294 1355 1404 1452 1501 1550 1552 1553 1509 1465 1435 1405 1375 1345 1331 1316 1301 1287 1245
768 1245 1204 1239 1274 1314 1354 1348 1342 1322 1301 1327 1352 1380 1407 1434 1462 1429 1395 1408 1421 1465 1508 1551 1518 1453 1434 1523 1611 1575 1540 1504 1469 1426 1383 1416 1450 1447
763 1447 1445 1443 1441 1398 1356 1359 1363 1372 1381 1390 1400 1411 1422 1387 1352 1351 1351 1350 1350 1291 1232 1219 1206 1235 1263 1246 1228 1251 1274 1297 1320 1297 1275 1253 1231 1214 1197 1282 1366 1442 1411
758 1411 1338 1264 1287 1386 1485 1508 1486 1465 1485 1506 1478 1450 1422 1394 1381 1367 1431 1494 1527 1561 1518 1475 1490 1506 1507 1461 1403 1422 1471 1520 1496 1472 1448 1424 1397
754 1397 1371 1391 1411 1361 1310 1264 1219 1213 1284 1412 1494 1498 1456 1408 1406 1400 1347 1323 1376 1449 1476 1457 1438 1451 1463 1476 1489 1497 1505 1513 1521 1490 1459 1427 1396 1367 1337 1354
749 1354 1371 1426 1481 1533 1586 1522 1412 1390 1444 1506 1522 1563 1605 1628 1573 1559 1545 1509 1427 1399 1448 1534 1543 1497 1497 1525 1552 1536 1520 1515 1511 1521 1578 1648 1640 1604 1614
745 1614 1653 1647 1569 1538 1629 1766 1777 1680 1582 1561 1598 1634 1664 1695 1680 1664 1684 1704 1724 1744 1678 1613 1624 1635 1700 1765 1754 1742 1763 1785 1760 1735 1754 1772 1814
741 1814 1856 1860 1865 1824 1782 1753 1724 1742 1759 1733 1707 1727 1747 1781 1815 1849 1883 1826 1769 1758 1747 1802 1857 1866 1875 1849 1823 1899 1975 2007 1946 1840 1825 1874 1922 1977
736 1977 2031 2016 2001 1986 1971 1962 1953 1921 1890 1982 2075 2060 2045 2065 2085 2059 2033 2045 2057 2069 2081 2079 2076 2074 2072 2067 2062 2057 2053 2059 2066 2073 2080 2090 2100 2110 2120 2134 2148 2208 2268 2306
731 2306 2345 2307 2268 2278 2287 2273 2260 2280 2300 2320 2340 2347 2354 2362 2369 2374 2379 2384 2389 2393 2398 2403 2408 2411 2414 2417 2420 2448 2475 2457 2438 2451 2464 2454 2443 2439 2435 2478 2520 2545 2571 2522 2474 2510
726 2510 2591 2655 2628 2603 2625 2664 2657 2593 2530 2510 2490 2509 2528 2649 2770 2874 2885 2872 2858 2895 2931 2897 2862 2854 2937 3041 3098 3075 3052 3072 3093 3147 3202 3186
722 3186 3169 3211 3344 3404 3371 3253 3181 3190 3245 3331 3418 3507 3597 3652 3708 3764 3820 3828 3837 3846 3855 3875 3896 3916 3937 3991 4045 4099 4153 4177 4200 4301 4401 4492 4584
717 4584 4568 4551 4551 4550 4626 4702 4824 4946 4961 4975 4965 4955 5052 5149 5294 5438 5536 5635 5691 5747 5884 6113 6317 6429 6552 6676 6826 6977 7173
714 7173 7370 7581 7793 7958 8124 8273 8422 8618 8813 9065 9318 9570 9822 10061 10300 10539 10778 10987 11195 11328 11460 11644 11827
711 11827 12011 12195 12344 12492 12595 12698 12821 12945 13069 13192 13378 13564 13673 13781 14004 14226 14402 14532 14675 14894 15114 15333 15561
708 15561 15789 15971 16153 16321 16489 16641 16747 16876 17081 17312 17497 17624 17751 17922 18092 18346 18600 18854 19108 19334 19559 19831 20102
705 20102 20391 20680 20913 21100 21213 21250 21214 21133 21048 20964 20769 20574 20310 20046 19785 19523 19302 19127 18970 18735 18446 18157 17940 17722 17565
702 17565 17407 17249 17092 16873 16654 16492 16407 16324 16132 15868 15604 15423 15242 14958 14674 14455 14312 14172 13956 13741 13571 13417 13263 13109
699 13109 12954 12799 12644 12474 12304 12179 12055 11964 11872 11689 11428 11169 10957 10790 10623 10460 10298 10045 9715 9413 9188 9022 8856 8624
696 8624 8392 8206 8021 7803 7585 7302 7064 6912 6851 6723 6503 6283 6156 6135 6069 5889 5709 5603 5497 5416 5335 5254 5174 5098 5022 4946 4870
693 4870 4820 4771 4721 4671 4625 4578 4531 4484 4355 4227 4144 4061 4066 4072 4031 3991 3965 3940 3914 3889 3844 3799 3754 3710 3636 3562 3534 3506 3497 3488 3433 3378 3333 3288 3244 3199
689 3199 3145 3092 3140 3188 3189 3098 3013 2927 2885 2843 2847 2851 2838 2826 2813 2801 2743 2685 2650 2706 2798 2843 2780 2671 2609 2593 2625 2657 2709 2762 2709 2657 2616 2621 2655 2597
684 2597 2491 2431 2416 2401 2355 2309 2308 2308 2329 2349 2370 2391 2346 2302 2303 2305 2295 2284 2274 2263 2198 2133 2145 2156 2123 2089 2010 1930 1912 1893 1921 1948 1981 2014 2024 2034
680 2034 2006 1978 2053 2128 2168 2131 2061 1991 1918 1845 1778 1787 1871 2002 2134 2221 2240 2213 2106 2000 1930 1936 1946 1955 1976 1997 2017 1962 1897 1879 1938 1996 1997 1998 1999 2000
676 2000 1949 1898 1893 1888 1873 1858 1844 1829 1859 1888 1902 1870 1825 1856 1944 1986 1945 1904 1937 1970 1899 1828 1804 1779 1761 1743 1771 1798 1800 1802 1804 1806 1834 1862 1844 1826 1815 1803
671 1803 1792 1781 1781 1781 1782 1782 1780 1779 1819 1858 1886 1838 1763 1735 1769 1850 1910 1924 1914 1903 1890 1876 1899 1921 1898 1874 1863 1853 1842 1831 1815 1798 1784 1771 1781 1837 1870 1825
666 1825 1769 1788 1852 1840 1742 1691 1747 1803 1776 1749 1795 1842 1847 1807 1811 1908 1926 1852 1735 1665 1629 1639 1702 1766 1784 1803 1821 1840 1857 1874 1891 1908 1923 1939 1955
662 1955 1970 1989 2008 2004 2000 2022 2045 1990 1936 1946 1956 1921 1885 1905 1925 1945 1964 1964 1963 1962 1962 1991 2020 2049 2078 2056 2034 2057 2081 2066 2050 2011 1972 1982 1992 2002 2011 1985
657 1985 1959 1976 1993 1999 1958 1932 1998 2120 2150 2100 2050 2023 1997 2015 2080 2130 2088 1999 1955 2023 2092 2163 2235 2269 2303 2260 2218 2210 2201 2147 2093 2148 2203 2182 2160 2153
653 2153 2146 2185 2224 2237 2249 2215 2181 2177 2173 2246 2318 2329 2339 2303 2268 2307 2347 2387 2427 2391 2355 2310 2358 2408 2412 2376 2387 2447 2508 2439 2369 2365 2437 2510 2506 2506 2506 2504 2456
648 2456 2402 2348 2368 2387 2451 2514 2577 2641 2640 2639 2642 2644 2669 2739 2810 2835 2803 2770 2732 2740 2805 2870 2892 2914 2966 3017 3048 3034 2998 2962 2926 2890 2867 2891 2931 2972 2956
644 2956 2894 2861 2828 2847 2912 2954 2950 2902 2855 2824 2840 2902 2964 2981 2952 2874 2843 2863 2930 2973 3015 3014 3014 3024 3034 3024 3014 3039 3109 3197 3209 3162 3115 3142 3215 3232
639 3232 3203 3159 3115 3151 3232 3310 3342 3304 3220 3190 3237 3316 3349 3336 3323 3352 3381 3359 3291 3223 3155 3135 3161 3211 3260 3236 3211 3223 3235 3204 3173 3198 3269 3297 3279
635 3279 3255 3276 3318 3314 3312 3311 3261 3164 3068 3049 3090 3132 3146 3160 3151 3143 3099 3055 3088 3121 3138 3156 3174 3192 3144 3096 3094 3092 3085 3078 3025 2972 3013 3054 3018 2982 2937 2893 2894 2895
630 2895 2916 2937 2934 2932 2955 2978 2924 2869 2812 2755 2743 2732 2778 2824 2870 2916 2911 2905 2884 2817 2742 2743 2773 2757 2718 2724 2754 2738 2692 2693 2742 2791 2800 2809 2818 2827 2722 2618 2636
625 2636 2732 2802 2826 2827 2782 2690 2551 2470 2464 2536 2608 2638 2669 2629 2589 2596 2602 2652 2703 2679 2656 2699 2788 2822 2779 2721 2740 2783 2780 2761 2742 2827 2913 2922 2931 2868 2804 2785
621 2785 2841 2927 2966 2974 2982 2987 2992 2965 2937 2956 2975 2937 2900 2936 2972 2977 2936 2900 2941 3022 3103 3082 3060 3026 2993 3067 3140 3230 3319 3300 3282 3230 3179 3173 3167 3220 3273 3326
616 3326 3379 3365 3351 3383 3416 3405 3394 3429 3464 3541 3617 3740 3863 3885 3907 3929 3951 3956 3962 4013 4065 4196 4327 4381 4436 4430 4425 4496 4568 4628 4687 4793 4899 4993
612 4993 5087 5135 5182 5230 5278 5372 5465 5593 5721 5802 5884 5972 6060 6149 6237 6249 6260 6349 6437 6557 6676 6750 6823 6864 6904 6922 6939 7006 7073 7186 7299 7446
608 7446 7594 7762 7884 7922 7869 7844 7866 8008 8242 8490 8585 8540 8496 8528 8652 8738 8825 8917 9009 9105 9201 9297 9393 9464 9534 9681 9873 9995 10025 10007
604 10007 10035 10114 10193 10252 10312 10286 10260 10249 10283 10323 10270 10195 10120 10146 10172 10193 10213 10190 10076 9936 9796 9744 9691 9661 9631 9527 9423 9364 9351 9331 9218
600 9218 9084 8950 8883 8816 8748 8681 8565 8448 8331 8214 8149 8084 7973 7862 7756 7650 7621 7591 7504 7416 7372 7327 7286 7200 7081 7055 7054 6961 6818
597 6818 6675 6609 6542 6429 6316 6191 6066 5963 5861 5780 5699 5618 5538 5542 5546 5474 5402 5307 5213 5119 5024 4943 4861 4780 4698 4712 4727 4741 4755 4689 4623 4557
593 4557 4490 4422 4353 4361 4369 4365 4361 4335 4308 4258 4209 4205 4202 4162 4123 4038 3952 3913 3873 3880 3887 3901 3916 3829 3742 3706 3762 3868 3929 3909 3890 3821 3752 3657 3561 3573 3585 3603
588 3603 3621 3593 3566 3598 3630 3616 3602 3564 3525 3510 3495 3445 3395 3419 3443 3425 3362 3336 3417 3515 3536 3500 3463 3483 3502 3445 3388 3369 3349 3375 3402 3400 3397 3395 3393 3400 3406 3412
584 3412 3419 3419 3419 3419 3419 3400 3381 3408 3435 3456 3477 3421 3365 3276 3187 3205 3223 3252 3282 3311 3341 3352 3364 3344 3371 3414 3381 3260 3140 3103 3144 3167 3144 3097 3049 3004
579 3004 2959 2948 3014 3062 3065 3054 3043 3030 3016 2961 2905 2895 2886 2903 2921 2984 3048 2997 2947 2942 2938 2956 2974 2992 3010 3025 3041 3056 3071 3062 3053 3044 3035 3035 3036 2990 2945 2921 2898 2803
574 2803 2707 2734 2837 2895 2875 2817 2759 2697 2634 2654 2674 2617 2560 2573 2585 2598 2611 2562 2512 2467 2423 2428 2511 2576 2595 2580 2564 2546 2528 2528 2528 2528 2528 2532 2536 2493 2451 2447
570 2447 2443 2393 2343 2316 2289 2294 2252 2206 2253 2316 2334 2294 2254 2257 2260 2278 2295 2266 2238 2172 2107 2126 2236 2314 2347 2334 2321 2331 2340 2304 2267 2237 2208 2255 2302 2315 2328
565 2328 2264 2200 2138 2077 2061 2045 2030 2016 2007 1998 1961 2016 2120 2177 2103 1982 1910 1930 1939 1948 2003 2058 2066 1982 1922 1907 1903 1853 1806 1805 1851 1897 1900 1903 1882 1862 1841 1820
561 1820 1830 1839 1802 1765 1826 1886 1873 1860 1835 1856 1909 1869 1808 1838 1918 1998 1997 1996 1994 1993 1971 1950 1929 1907 1943 1979 1938 1898 1878 1858 1885 1911 1886 1860 1789 1717 1712 1706
556 1706 1746 1787 1827 1867 1831 1795 1766 1737 1786 1834 1811 1788 1811 1834 1830 1826 1778 1731 1780 1876 1923 1879 1840 1847 1924 2002 2014 1933 1879 1871 1870 1869 1871 1873 1911 1948 1879 1764
551 1764 1707 1743 1769 1796 1821 1846 1871 1895 1926 1957 1987 2018 1975 1933 1937 1940 1965 1989 1936 1883 1858 1832 1852 1872 1916 1960 1927 1894 1865 1836 1807 1777 1791 1804 1817 1831
547 1831 1835 1838 1888 1938 1953 1968 1937 1906 1886 1867 1924 1981 2068 2155 2110 2064 2052 2131 2184 2192 2155 2119 2157 2195 2199 2203 2162 2120 2155 2190 2270 2351 2346 2340 2335 2329 2361 2392 2423
542 2423 2454 2543 2631 2670 2617 2534 2543 2632 2722 2721 2720 2720 2719 2740 2760 2781 2802 2811 2821 2759 2697 2593 2580 2653 2771 2859 2855 2860 2865 2826 2787 2748 2709 2713 2717 2828 2940 3012
537 3012 3084 3079 3074 3074 3074 3074 3074 3049 3024 3076 3128 3137 3146 3155 3163 3202 3241 3279 3318 3337 3357 3376 3395 3412 3429 3446 3462 3442 3421 3476 3577 3665 3662 3605 3548 3515 3482 3450 3417 3434
533 3434 3450 3421 3391 3333 3275 3294 3312 3324 3335 3341 3347 3315 3192 3049 2906 2891 2968 3070 3171 3158 3145 3131 3118 3071 3025 2978 2931 2927 2922 2918 2913 2905 2897 2888 2880 2883 2887 2890 2893
528 2893 2883 2873 2863 2853 2891 2929 2921 2913 2913 2914 2960 3007 2967 2927 2888 2848 2827 2805 2784 2763 2779 2795 2765 2735 2737 2738 2740 2742 2745 2748 2751 2754 2731 2707 2661 2615 2660 2705 2674 2642 2661
523 2661 2679 2626 2526 2481 2589 2683 2685 2601 2517 2507 2497 2524 2598 2652 2613 2549 2485 2491 2498 2529 2559 2590 2621 2568 2515 2540 2564 2571 2579 2609 2640 2642 2645 2601 2558 2553 2549 2544 2540
518 2540 2557 2574 2592 2609 2563 2517 2547 2578 2595 2612 2606 2600 2529 2458 2464 2470 2470 2471 2486 2547 2578 2518 2463 2455 2460 2465 2473 2481 2475 2468 2415 2363 2464 2566 2590 2615 2679 2744 2762 2780
513 2780 2749 2717 2686 2655 2638 2621 2650 2679 2707 2735 2656 2577 2511 2445 2410 2330 2223 2207 2306 2405 2444 2483 2519 2556 2553 2504 2475 2538 2595 2652 2608 2564 2505 2447 2526
509 2526 2606 2604 2602 2600 2598 2587 2577 2612 2648 2682 2715 2672 2629 2641 2652 2664 2676 2674 2673 2692 2711 2686 2615 2593 2662 2738 2769 2773 2870 3003 3044 3005 2965 2994 3022 3073 3124 3133
504 3133 3143 3198 3253 3244 3234 3179 3123 3089 3054 3095 3182 3230 3185 3065 2991 3014 3083 3130 3176 3205 3235 3220 3158 3113 3159 3228 3297 3294 3291 3311 3331 3407 3483 3482 3481 3477 3473 3514
500 3514 3556 3577 3597 3572 3547 3598 3649 3627 3604 3686 3814 3866 3826 3789 3845 3894 3898 3884 3916 3968 4020 4056 4138 4225 4221 4194 4214 4305 4350 4344 4339 4376 4414 4398 4382 4412
495 4412 4441 4463 4484 4582 4680 4690 4699 4709 4718 4713 4708 4704 4699 4700 4701 4701 4702 4680 4657 4635 4612 4602 4591 4512 4432 4394 4355 4385 4416 4391 4365 4317 4269 4229 4190 4065 3941 3882 3824
490 3824 3788 3752 3671 3590 3509 3428 3372 3316 3260 3204 3131 3058 2985 2912 2943 2973 2963 2875 2768 2660 2602 2543 2547 2551 2554 2558 2507 2457 2429 2402 2328 2253 2233 2258 2274 2212
486 2212 2133 2099 2087 2074 2065 2055 2043 2031 2019 2007 1978 1950 1922 1894 1903 1913 1922 1932 1972 2011 1982 1952 1923 1894 1827 1760 1725 1690 1739 1789 1786 1784 1696 1609 1591 1573 1555
481 1555 1537 1576 1614 1653 1691 1678 1666 1717 1769 1759 1672 1562 1528 1544 1559 1526 1493 1544 1596 1609 1622 1618 1613 1608 1603 1568 1533 1497 1462 1454 1446 1416 1385 1417 1448 1426 1404
477 1404 1436 1469 1501 1533 1556 1579 1587 1504 1439 1420 1422 1425 1429 1433 1475 1517 1471 1425 1448 1471 1439 1406 1374 1341 1329 1317 1305 1293 1384 1474 1517 1468 1441 1415 1421 1427 1465 1503
472 1503 1503 1458 1414 1462 1576 1598 1518 1438 1422 1406 1379 1352 1378 1405 1428 1452 1469 1487 1470 1362 1301 1332 1433 1441 1331 1220 1231 1242 1256 1270 1317 1409 1476
468 1476 1451 1426 1447 1475 1503 1540 1576 1543 1511 1483 1455 1481 1506 1507 1508 1489 1469 1520 1617 1687 1664 1607 1551 1543 1534 1521 1509 1519 1529 1578 1628 1596 1564 1572 1626 1643 1568
464 1568 1480 1484 1562 1639 1686 1732 1741 1749 1776 1803 1884 1965 1945 1926 1906 1886 1914 1943 1892 1842 1845 1941 2054 2120 2114 2062 1987 1912 1879 1847 1837 1828 1812 1797 1828 1858 1786
459 1786 1713 1663 1613 1552 1490 1474 1459 1422 1385 1425 1465 1500 1534 1546 1558 1554 1550 1470 1390 1330 1270 1287 1304 1329 1355 1307 1258 1283 1353 1378 1311 1252 1285 1312 1294 1247
455 1247 1247 1264 1280 1290 1300 1287 1274 1251 1227 1250 1273 1284 1296 1307 1318 1278 1239 1245 1252 1183 1115 1154 1194 1170 1147 1169 1192 1177 1163 1172 1181 1237 1292 1210 1083 997 1003
450 1003 1062 1120 1132 1144 1156 1168 1079 990 954 1011 1112 1168 1177 1139 1119 1145 1192 1192 1137 1083 1133 1228 1242 1163 1139 1115 1072 1030 1037 1136 1217 1205 1196 1234 1239 1153 1052
446 1052 1105 1237 1276 1209 1141 1119 1098 1099 1100 1137 1174 1134 1094 1090 1086 1082 1078 1050 1022 1041 1059 1100 1140 1158 1176 1227 1279 1274 1178 1112 1046 1050 1055 1080 1104 1083 1061 1082 1102
441 1102 1123 1144 1133 1123 1112 1101 1086 1071 1055 1040 1003 965 1035 1106 1110 1114 1118 1122 1105 1088 1071 1054 1067 1079 1092 1105 1093 1082 1116 1150 1170 1190 1164 1138 1141 1143 1099 1055
436 1055 1094 1133 1095 1057 1089 1121 1164 1115 1080 1136 1181 1226 1206 1186 1144 1101 1085 1070 1054 1039 1054 1069 1084 1100 1086 1071 1080 1089 1041 993 991 989 954 919 960 1002 981
432 981 960 940 919 950 980 965 949 958 966 998 1030 1057 1084 1086 997 911 825 872 918 937 956 1021 1086 1058 1029 1001 973 956 939 922 905 932 959 1032 1105 1052 999
427 999 992 986 974 962 1022 1128 1161 1041 958 967 1075 1184 1160 1136 1048 961 899 928 962 995 1032 1068 1073 1032 962 984 1041 1052 1049 1045 1046 1047 1047 1048 1049 1050 1051 1052 1097 1142
422 1142 1080 1018 973 928 929 930 976 1023 1069 1115 1106 1096 1041 985 952 919 845 771 738 797 907 971 989 1007 1021 1036 1054 1071 1017 964 918 964 1058 1106 1084 1017
418 1017 1020 1069 1089 1062 1065 1067 1032 997 962 927 944 962 934 905 925 945 964 984 1006 1029 975 920 921 921 876 830 858 886 915 943 954 965 1022 1079 1091 1103 1069
414 1069 1034 1015 996 933 870 883 943 978 936 911 962 992 975 940 906 945 984 998 1012 980 948 913 877 887 898 881 864 893 922 925 928 931 934 921 909 942 976
409 976 1023 1071 1042 1013 991 969 992 1016 1003 991 978 965 968 970 973 976 910 845 810 852 899 900 886 872 872 871 794 717 755 792 830 868 882 896 955 1015 1043 1071 1022
404 1022 974 921 868 816 763 784 804 824 844 848 852 856 860 870 879 935 991 1048 1106 1025 944 939 935 930 925 954 982 1011 1040 1029 1018 1008 997 998 998 999 1000 1022 1044 1066 1088
399 1088 1116 1145 1127 1110 1074 1037 1004 970 977 1030 1062 1003 901 799 798 798 842 887 932 976 1020 1063 1061 1058 1019 980 941 902 972 1043 1036 1030 1027 1025 1022 1020 988 957 972
394 972 986 991 996 1048 1099 1049 999 949 899 917 935 953 971 942 913 885 856 885 914 943 971 972 974 975 976 1021 1066 1007 947 957 1014 1025 944 868 884 945 960 919
390 919 878 840 802 784 858 953 1001 980 959 936 912 896 880 865 849 814 780 823 866 846 826 806 787 786 786 785 785 789 794 798 802 792 782 848 915 911 908 904 900 894 887 880 874
385 874 857 841 871 900 873 847 896 946 911 875 883 891 901 866 830 840 864 888 912 936 959 937 868 846 875 904 888 826 787 795 819 844 826 809 834 860 876
380 876 846 816 832 877 921 895 869 881 939 971 1003 991 979 967 955 956 957 958 958 976 993 1007 1022 1027 986 929 873 859 921 984 1047 1053 1013 973 979 975 972 971 970 1020 1070
375 1070 1074 1078 1074 1069 1065 1060 1015 969 929 888 880 949 1018 1010 969 927 884 841 800 804 891 977 992 1007 1047 1042 946 851 843 911 927 865 826 833 866 898 903 954 1018 1005 935
370 935 911 963 1014 1008 926 854 858 918 979 1015 1005 974 944 956 967 979 914 825 782 851 966 1051 1137 1118 1099 1101 1103 1105 1107 1103 1099 1095 1092 1076 1061 1046 1031 1061 1091 1120
365 1120 1150 1135 1120 1034 948 939 1023 1110 1104 1061 1064 1108 1105 1043 982 1025 1068 1111 1154 1197 1240 1209 1178 1146 1115 1113 1112 1110 1109 1139 1169 1239 1310 1361 1320 1254 1188 1146 1104
360 1104 1062 1019 1068 1117 1166 1215 1249 1282 1316 1349 1409 1468 1482 1495 1521 1546 1572 1597 1560 1522 1530 1539 1569 1600 1630 1661 1689 1717 1698 1680 1686 1691 1743 1795 1780 1766 1752
356 1752 1737 1729 1721 1784 1847 1856 1773 1716 1705 1714 1723 1734 1746 1769 1792 1738 1685 1707 1729 1798 1866 1846 1826 1806 1786 1804 1823 1841 1860 1873 1885 1898 1911 1922 1933 1944 1955
351 1955 2007 2058 2064 2069 2119 2170 2266 2363 2367 2372 2451 2576 2616 2547 2499 2528 2588 2648 2637 2625 2637 2649 2614 2580 2596 2611 2550 2489 2452 2415 2454 2494 2491 2488 2486 2483 2462 2440
347 2440 2419 2397 2326 2254 2260 2265 2226 2187 2195 2248 2261 2197 2154 2156 2169 2181 2151 2120 2153 2185 2218 2251 2324 2398 2395 2391 2343 2295 2247 2198 2242 2286 2330 2374 2417 2461 2459 2457 2490
342 2490 2523 2449 2374 2409 2444 2402 2361 2335 2309 2237 2165 2112 2059 2053 2046 2058 2069 2035 2001 1959 1917 1951 1986 2044 2102 2083 2064 2050 2037 2024 2011 1977 1943 1909 1875 1894
337 1894 1913 1886 1859 1812 1765 1718 1671 1665 1659 1699 1740 1767 1795 1776 1758 1738 1718 1743 1769 1811 1854 1819 1785 1739 1693 1647 1601 1565 1529 1493 1456 1455 1453 1528 1604 1627 1651
333 1651 1629 1607 1578 1549 1520 1491 1423 1354 1362 1370 1357 1345 1406 1466 1457 1401 1328 1332 1373 1413 1458 1503 1513 1523 1486 1450 1475 1500 1464 1351 1222 1139 1133 1127 1153 1180 1206
328 1206 1233 1293 1354 1337 1275 1211 1223 1236 1248 1260 1272 1283 1295 1247 1199 1228 1257 1239 1222 1205 1188 1141 1094 1093 1093 1072 1052 1077 1103 1201 1299 1364 1352 1301 1250 1199
324 1199 1148 1079 1086 1187 1333 1379 1318 1243 1168 1137 1106 1075 1044 1079 1114 1103 1092 1059 1026 1070 1114 1165 1216 1190 1164 1180 1195 1211 1226 1246 1266 1179 1092 1034
320 1034 976 965 953 1011 1070 1051 1033 1003 973 990 1006 1049 1093 1183 1272 1220 1168 1115 1063 1105 1147 1189 1232 1232 1233 1204 1097 963 876 869 909 952 995 1041 1086
316 1086 1016 945 952 958 979 999 1020 1041 1042 1042 1043 1044 1039 1034 983 932 887 841 841 842 871 900 929 958 941 923 905 887 899 911 923 935 949 962 1022 1081 1005 930 900 870
311 870 893 915 1014 1114 1120 1126 1132 1139 1107 1075 1114 1152 1138 1016 935 962 1056 1074 1008 942 894 922 1007 1093 1146 1091 977 940 964 988 971 954 998 1042 1025 931
306 931 866 846 873 900 942 983 978 973 916 858 847 835 835 834 834 834 836 838 841 843 851 859 867 875 889 903 960 1016 956 849 794 830 903 976 978 980 986 992 999 1005 1014 1022 1030 1039 970 902 883
301 883 957 1050 1050 1001 952 896 841 785 729 792 854 870 886 971 1055 1117 1087 1017 994 1013 1032 973 868 784 791 826 861 856 851 835 819 762 705 694 774 858 849
296 849 812 820 905 989 1030 1071 1067 1062 1021 980 940 899 872 845 817 790 848 905 917 929 934 940 946 952 978 1004 953 902 842 781 767 753 747 740 734 728 730 733 781 830 830 830 784
291 784 738 737 736 735 734 755 775 781 741 690 731 825 919 924 929 933 938 915 891 868 845 880 916 952 987 936 885 881 876 822 768 791 814 797 780 762 745 774 803 832 861
286 861 815 769 768 813 852 798 748 789 896 1002 1007 1012 979 945 911 878 912 947 935 923 871 819 874 929 923 918 912 907 902 898 939 980 954 927 900 873 875 877 879 881 887
281 887 894 901 907 955 1002 974 899 868 929 1007 1039 976 912 891 871 857 843 830 816 784 752 766 781 807 832 812 792 798 805 811 817 840 863 839 816 865 913 886 813
276 813 770 819 885 905 893 881 866 851 923 994 1020 1045 970 895 819 744 729 715 772 829 883 861 806 750 791 831 851 825 805 786 807 827 844 815 768
272 768 722 708 740 746 752 734 716 771 827 848 823 781 815 890 966 995 979 931 883 806 775 824 873 874 829 769 709 694 725 763 755 702 648 674 745 790 836
267 836 873 909 898 841 812 829 864 898 888 878 826 773 751 776 775 774 777 780 768 709 690 748 785 776 743 709 719 728 763 798 832 867 852 837 821 806 810 813 776
262 776 738 729 797 865 856 782 708 722 812 882 905 880 810 752 740 777 813 819 824 830 836 781 726 717 754 772 712 672 679 708 738 724 710 751 792 786 781 761 740 673
257 673 607 621 635 649 663 682 700 719 738 766 793 821 848 859 869 834 798 719 641 669 698 664 630 642 653 699 744 744 743 709 675 641 607 687 767 801
253 801 834 794 753 758 763 782 800 773 745 693 640 665 689 785 882 886 813 748 728 723 719 737 756 772 787 731 628 585 618 688 758 725 693 725 757 788 820
249 820 819 817 815 814 826 839 851 864 870 877 884 891 838 785 733 680 708 736 764 792 774 756 737 719 685 650 616 581 602 623 689 756 799 841 838 835 796 757 763 770 751
244 751 731 757 783 857 930 942 878 809 785 808 831 814 796 779 761 765 769 773 776 701 626 628 630 579 528 530 624 708 746 739 732 718 703 689 674 645 615 632 649 697
239 697 745 794 842 844 845 847 849 827 806 831 855 858 860 817 773 705 637 646 655 683 712 731 797 862 834 758 729 743 757 774 790 786 782 732 681 722 763 804 845 849 852
234 852 856 859 858 858 857 856 877 898 896 894 856 818 826 834 811 789 767 745 775 806 788 770 753 691 625 652 718 784 772 668 580 538 546 600 673 747 746 745 781 817 807
229 807 796 759 722 730 739 822 906 937 875 774 718 738 759 793 828 816 805 745 686 672 659 587 515 476 515 612 709 809 831 783 734 681 628 592 557
224 557 598 640 688 736 738 740 704 668 708 749 750 751 706 661 666 671 676 681 695 709 722 736 722 708 694 680 743 807 837 790 691 592 564 537 606 675 697 720 655
220 655 590 632 674 725 775 749 723 733 743 776 809 801 792 783 775 727 679 677 675 690 706 765 871 920 861 763 712 697 682 647 612 648 684 674 664 667 669 672 675 696
215 696 717 738 759 777 794 765 736 673 609 623 636 722 809 818 828 803 777 798 819 801 783 811 839 840 840 818 796 810 823 791 759 787 816 844 872 854 835
210 835 791 792 817 842 796 750 720 735 768 800 757 667 617 675 827 933 929 879 848 816 782 748 791 834 832 829 816 803 744 685 647 609 617 625 678 730 763
206 763 749 720 691 662 634 612 637 679 720 751 735 672 608 610 658 706 708 715 722 726 730 705 680 658 636 622 655 690 679 666 699 776 806 743 680 634 635 643 651 662
201 662 673 693 714 717 674 615 602 610 617 635 699 763 781 781 782 780 778 776 774 772 769 785 801 817 833 799 765 748 777 777 730 687 689 706 723 700 676 655 679 721 763 742
196 742 676 609 588 612 636 662 688 703 718 733 748 738 729 719 710 738 766 793 821 773 725 723 721 735 749 718 686 727 767 762 756 737 717 743 769 740 711 681
191 681 652 639 626 659 692 684 675 624 572 629 733 788 751 700 695 704 714 733 752 725 698 661 624 593 561 550 631 732 787 729 671 611 550 473 395 374
187 374 444 555 665 677 688 701 759 800 750 688 673 703 733 739 745 751 758 778 799 820 841 787 733 787 840 842 843 799 754 721 688 732 775 784 793 816 885 982
182 982 987 908 829 816 803 835 868 878 887 820 753 715 676 684 692 685 679 718 757 766 775 784 793 785 777 792 808 753 698 720 742 745 749 706 663 631 599 614 628 636 645 630 615
177 615 653 692 707 722 683 644 652 659 696 733 815 898 801 703 652 600 599 597 641 686 674 663 651 639 620 600 603 607 702 798 817 837 785 733 758 783 813 842
172 842 826 810 750 691 631 572 605 639 673 706 649 591 534 476 515 553 592 630 671 712 753 794 756 718 727 735 756 778 753 728 694 660 672 683 746 809
168 809 764 719 675 630 609 588 596 604 611 619 614 609 650 691 706 721 736 751 750 749 748 747 787 828 869 909 903 896 890 883 839 794 795 796 778 760 718 677 645 613 658 703 727
162 727 752 776 800 740 681 698 715 739 762 786 810 782 754 726 698 684 670 702 779 834 796 767 738 712 686 637 588 610 632 654 675 684 693 655 618 555
158 555 491 453 506 604 702 721 649 591 579 612 645 612 578 591 604 667 730 747 765 727 690 698 707 711 715 719 724 698 673 690 708 703 652 645 731 812 800 677 554
153 554 569 585 600 616 655 695 734 774 775 777 779 781 741 700 703 706 701 650 614 669 713 665 603 587 622 658 651 644 698 753 761 769 707 645 606 567 537 507 472 528 591
148 591 654 646 638 654 670 686 702 682 662 596 530 552 573 548 524 615 707 740 696 661 703 769 789 748 707 663 619 600 582 639 697 689 680 672 663 628 593 588 660
143 660 737 768 752 737 671 605 539 473 544 615 686 757 740 723 706 689 671 652 634 616 591 567 542 517 541 565 636 752 900 971 948 880 859 884
139 884 923 886 781 676 612 548 568 588 651 715 710 659 591 599 688 777 824 872 902 932 855 778 721 665 608 552 600 648 696 744 737 730 723 716 723 731 738 745 697
134 697 649 650 651 707 809 868 820 734 648 633 617 649 681 713 745 687 630 572 514 441 368 433 498 587 677 717 758 751 699 664 721 783 798 767 690 615
130 615 587 631 675 703 638 554 515 548 580 615 650 750 850 813 730 689 740 762 738 691 643 639 635 666 696 680 665 661 656 652 648 708 768 752 735 763 790
126 790 772 753 739 726 715 704 740 822 857 799 665 578 566 554 540 527 594 753 866 886 827 767 789 811 787 762 801 839 831 823 805 786 768 750 721
121 721 692 695 651 588 617 699 781 773 766 758 751 741 730 720 710 786 862 800 738 714 691 713 735 752 768 739 710 695 681 713 745 691 636 659 681 752 824 815
117 815 713 654 687 737 742 720 744 796 757 680 696 730 765 783 801 820 838 775 713 727 742 745 749 753 757 711 665 694 770 785 707 673 730 778 733 673 660
112 660 679 698 677 656 693 776 839 810 726 642 660 677 700 724 670 617 565 513 568 623 651 679 706 734 712 691 716 740 746 752 711 670 669 667 665 664 657 651 690
107 690 730 675 621 643 665 679 693 706 720 738 756 728 699 724 749 771 792 743 649 528 499 563 628 621 615 656 697 689 588 495 494 574 654 629 605 627
103 627 649 623 597 617 637 607 577 597 710 790 779 779 779 771 763 756 748 718 688 659 629 622 614 607 599 657 715 726 738 670 602 611 620 651 682 710 738 705 627 574 598
98 598 672 701 627 553 564 650 720 744 763 783 841 899 872 768 665 638 632 626 625 623 660 697 626 556 562 568 574 580 553 526 575 625 634 642 604 567 570 572 621 670 702
93 702 733 693 652 622 669 745 775 739 703 711 718 666 614 608 602 643 684 725 765 788 810 786 762 733 705 630 555 647 739 767 718 693 669 640 611 567 524 556
88 556 589 644 699 754 809 790 771 753 734 681 627 574 521 543 566 589 612 666 721 729 738 727 715 704 693 636 579 660 741 711 681 651 621 588 555 522 489
84 489 484 480 476 471 515 559 556 554 549 544 585 625 664 702 694 686 726 765 805 845 804 764 723 682 762 841 887 856 790 723 698 673 701 730 753 777 801 749 663 577 608
79 608 638 669 699 749 798 758 641 545 527 598 669 717 764 735 660 615 646 661 629 572 560 595 583 558 578 647 715 719 723 728 732 747 762 774 786 715 597
74 597 509 497 527 556 591 625 641 658 643 675 723 695 636 578 583 589 553 517 540 639 739 762 755 748 690 633 616 600 630 660 666 673 726 779 740 702 740 778
70 778 792 806 744 681 716 750 785 819 768 717 713 708 686 665 689 714 715 716 718 719 724 728 733 738 726 714 702 691 712 733 795 857 839 729 622 606 630 699 771 797
65 797 744 644 562 572 638 703 729 754 728 701 675 648 668 688 708 727 685 642 600 557 570 583 641 700 733 766 799 832 796 761 725 690 721 753 680
60 680 607 646 731 767 712 632 598 609 620 615 611 652 694 711 727 698 669 636 604 531 458 452 537 626 622 593 611 671 730 706 637 615 685 750 769 743 717 694
56 694 671 648 625 645 665 685 705 708 710 712 715 700 686 695 704 651 599 593 587 667 747 782 816 769 722 752 782 787 792 774 756 772 789 728 668 682 696 710 725 717 710 680
51 680 649 662 675 642 609 631 652 673 694 690 685 727 768 775 782 765 749 778 807 790 773 780 788 795 803 808 813 819 824 777 730 706 682 716 749 736 677 652 703 758 766 718
45 718 669 664 659 677 695 736 776 718 659 647 634 634 634 611 588 628 668 661 655 703 751 768 709 656 648 656 665 682 699 693 687 638 588 615 642 657 672 641 611 580 550
40 550 627 705 717 729 695 661 617 574 639 703 761 820 802 784 757 730 750 769 823 877 875 781 666 552 548 637 706 776 774 773 775 778 827 875 877 878 856 834 800
36 800 766 691 617 608 691 769 846 814 782 750 718 732 745 736 726 696 666 682 698 683 668 698 729 705 680 702 723 801 879 850 820 800 780 760 739 730 720
31 720 787 854 855 857 898 940 958 884 833 874 921 968 944 919 922 925 951 976 934 892 900 1000 1072 1052 981 911 867 823 804 877 985 1093 1099 1105 1080 1056 1078 1100
27 1100 1081 1062 997 931 907 882 858 833 871 909 947 984 994 1004 1013 1023 941 859 854 849 841 834 850 866 933 1000 991 981 907 834 791 824 913 957 923 890 909 928
22 928 989 1049 1109 1091 1041 990 1005 1020 958 897 913 929 945 961 968 974 934 895 867 839 811 783 788 793 753 712 732 751 817 883 901 919 866 812 773 810 881 952
17 952 923 894 819 744 749 755 760 765 728 690 652 614 672 731 789 847 835 823 811 799 782 764 818 873 910 870 797 724 723 722 675 628 641 655 715 774 766 758 749 741 780
12 780 820 783 746 732 718 705 691 662 634 713 792 799 806 813 820 787 755 722 689 729 769 810 850 864 879 893 907 887 867 801 735 711 687 622 556 554 629 704
8 704 702 734 766 792 819 824 829 834 839 798 758 794 830 769 707 753 799 801 803 805 807 813 819 825 831 822 813 850 887 878 870 821 771 732 769 840 910 913 916 918 921 934 947 960 973 923 874
2 874 901 928 917 905 893 881 874 867 860 853 870 887 903 920 947 975 894 814 808 802 795 789 778 768 758 748 829 909 900 814 728 719 738 758 753 748 743 738 749 761 849 937 972
-3 972 1006 994 983 962 942 922 902 837 771 752 733 736 739 819 899 935 970 929 888 844 800 814 904 997 983 901 865 907 950 949 948 896 844 854 940 1064 1142
-8 1142 1112 1083 1078 1074 1046 1019 1011 1004 951 897 922 947 994 1042 1024 1006 988 970 986 1002 1019 1035 1021 1007 994 980 982 985 1064 1143 1223 1303 1276 1249 1264 1279 1218 1157
-13 1157 1157 1158 1144 1083 1056 1104 1196 1212 1164 1116 1140 1163 1141 1118 1142 1165 1193 1222 1204 1186 1216 1247 1277 1308 1339 1371 1380 1389 1310 1232 1199 1167 1206 1245 1238 1230 1246 1262
-17 1262 1278 1294 1257 1219 1205 1191 1272 1352 1387 1422 1436 1450 1418 1386 1326 1265 1269 1350 1450 1550 1590 1554 1475 1397 1390 1383 1443 1502 1485 1468 1444 1421 1398 1375 1360
-22 1360 1344 1329 1313 1230 1147 1171 1196 1256 1316 1330 1343 1342 1342 1295 1248 1182 1115 1095 1075 1096 1117 1067 1016 1044 1148 1227 1198 1140 1128 1191 1254 1220 1186 1105 1025
-26 1025 1031 1036 1088 1140 1135 1130 1149 1167 1157 1146 1092 1038 1073 1153 1149 1068 962 933 933 932 929 926 969 1012 998 984 1016 1047 993 939 930 922 975 1029 1037 1044 1001 958 992 1026 1000
-31 1000 973 924 874 913 953 946 939 925 912 944 977 942 907 896 884 919 955 1013 1071 1111 1150 1144 1138 1127 1117 1130 1143 1110 1077 1029 935 865 873 937 955 934 913
-35 913 965 1018 1011 1004 997 990 884 777 794 887 928 924 904 884 813 741 746 752 774 797 816 834 824 738 650 607 595 630 718 806 831 857 836 815 798 781 811 840
-40 840 813 787 760 734 746 758 771 783 780 776 819 861 858 855 829 802 823 843 760 678 668 734 834 934 930 926 900 873 874 875 900 924 950 977 926 876 815 754
-45 754 697 641 593 621 713 806 833 861 842 824 786 748 733 717 690 662 681 699 725 751 776 802 830 858 840 822 806 790 850 911 872 833 794 755 757 759
-49 759 807 855 912 969 976 982 928 797 671 622 677 809 903 919 894 915 948 905 741 577 517 565 609 653 722 791 824 780 734 764 794 778 764 796
-53 796 837 831 831 831 809 786 717 648 682 717 728 740 761 783 804 826 847 868 887 905 854 756 704 743 835 834 753 672 712 752 711 578 511 536 611 686 663
-58 663 640 617 594 608 622 636 650 674 698 699 700 709 718 681 644 616 587 582 577 576 576 529 482 546 610 650 691 711 732 712 692 700 799 899 906 837 768 739 710 735
-63 735 761 710 659 633 607 626 646 629 611 594 576 544 511 556 600 618 635 576 516 555 593 632 670 685 699 643 586 540 586 651 671 657 643 698 752
-67 752 785 725 645 612 662 712 720 727 728 729 750 772 726 635 592 640 688 691 648 605 600 595 591 586 676 766 748 730 664 599 538 477 492 585 680 775 801 827 780 732
-72 732 756 827 871 839 761 730 714 698 687 676 742 808 764 720 735 827 888 873 829 831 853 797 716 681 698 715 659 602 653 703 707 711 732 753 750 748 709 670
-76 670 654 638 674 710 669 582 544 582 651 720 732 745 712 679 691 702 668 634 635 636 637 638 670 702 734 766 704 642 657 717 746 698 644 636 652 622 549 476
-81 476 508 617 709 755 755 756 777 798 857 916 837 758 757 755 754 753 764 775 786 796 759 721 707 692 708 723 664 559 513 575 676 731 752 772 836 899 916
-86 916 932 902 872 756 640 631 622 606 590 620 650 687 725 762 800 745 690 635 579 582 584 587 589 601 612 623 634 626 618 611 603 608 613 618 624 630 637 644 650 596 541 509 477
-91 477 492 507 510 606 715 733 670 607 618 628 639 649 604 559 490 422 510 599 606 522 459 488 593 652 633 613 638 662 652 643 588 532 588 644 623 511
-95 511 422 487 648 764 748 640 631 714 810 814 707 599 627 655 683 710 679 647 572 498 521 590 614 546 488 522 603 591 558 616 689 715 658 601
-99 601 618 634 699 764 752 739 690 641 638 635 619 603 587 571 610 650 666 683 758 834 823 720 592 464 468 472 478 484 490 496 510 525 540 554 591 628 665 701
-104 701 638 575 558 541 563 586 608 630 602 573 545 516 530 544 557 571 580 588 596 605 589 574 561 548 601 700 743 708 649 636 669 702 662 623 661 698 699
-109 699 700 655 611 590 569 594 619 626 634 642 650 627 604 581 558 472 386 437 489 555 621 611 600 548 496 521 546 547 548 549 551 496 442 495 548 563 577 592 607
-113 607 614 621 628 635 603 571 616 661 668 674 678 682 618 508 438 475 560 599 593 588 593 597 555 513 532 551 570 588 611 633 609 586 614 642 624 606 585 564 543 523
-118 523 465 408 458 509 547 585 623 661 702 742 707 671 635 599 609 619 613 607 601 594 585 576 610 644 592 494 424 432 453 475 502 528 569 610 605 600 532 464 473 481
-123 481 517 553 588 624 591 557 524 490 477 464 466 514 579 567 494 420 406 391 453 515 606 697 681 665 610 555 500 446 509 571 634 697 679 661 644
-127 644 626 642 659 676 692 672 651 671 692 670 572 473 451 505 559 542 524 562 600 593 585 581 577 614 652 673 617 533 494 532 569 609 649 647 644 595 546 600
-132 600 654 661 669 696 723 690 581 445 385 386 386 354 322 336 350 384 418 453 487 525 563 555 546 545 543 542 540 532 524 516 508 502 497 492 487 456 426 441 457 477 497 475 452
-137 452 415 425 483 540 581 575 595 616 625 634 615 641 721 755 714 672 613 599 636 674 675 677 676 675 657 594 530 512 566 619 596 528 513 545 548 550 575 600 581
-142 581 563 554 591 628 619 614 608 600 592 592 592 577 516 477 516 582 648 634 573 541 510 527 590 611 585 571 603 636 622 601 625 650 629 558 533 587 641 639 636 677
-147 677 717 707 650 620 589 567 545 569 593 593 592 592 591 573 554 612 670 645 619 640 660 617 574 531 489 514 539 564 589 540 490 579 667 635 603 615 626
-151 626 605 539 517 588 657 633 593 598 615 586 554 568 619 578 489 447 508 570 558 546 546 545 545 545 557 569 535 501 487 472 503 534 511 487 510 533 509
-156 509 485 462 438 493 548 557 566 597 627 658 689 677 666 654 643 646 650 577 504 499 493 533 573 575 576 578 579 595 611 580 550 543 535 605 674 663 651 640 629 606 584
-161 584 562 539 491 443 441 439 465 491 515 538 516 447 399 442 545 647 678 710 686 663 640 616 622 627 562 496 482 559 657 708 669 630 588 545 556 568
-165 568 556 544 585 627 592 557 591 624 633 550 458 366 353 431 513 549 535 475 434 394 427 460 489 518 525 531 565 599 610 621 657 693 653 612 580 548
-170 548 470 392 397 401 366 331 339 440 535 584 613 595 531 513 619 771 820 715 641 614 602 591 608 718 819 766 616 512 485 504 502 499 523
-174 523 546 564 582 599 617 614 612 586 560 586 611 642 581 501 420 441 462 464 465 513 561 594 627 614 601 616 630 599 568 573 579 585 590 560 530 499 469 476 482 512
-179 512 542 589 637 608 578 539 500 536 619 700 690 599 507 525 590 594 522 467 411 356 301 273 321 350 379 408 437 450 418 417 492 622 705 690 629
-183 629 592 554 525 497 514 532 557 582 584 586 562 538 537 536 601 666 654 643 633 623 660 696 649 602 601 599 540 480 420 361 361 362 409 456 542 629 639 648 682
-188 682 716 690 588 487 462 559 655 689 723 681 638 619 600 626 653 564 474 407 341 391 442 492 543 552 562 572 582 574 566 558 550 569 587 559 531 563
-192 563 595 627 659 684 708 730 675 587 500 546 591 619 647 598 548 518 488 458 428 392 356 397 484 570 580 526 426 377 374 389 403 457 510 518 525 543
-197 543 560 562 518 480 520 559 521 425 376 433 491 527 564 600 637 598 559 597 635 616 596 599 603 601 599 597 596 543 490 484 477 504 532 536 541 495 448 479 509 555
-201 555 601 665 729 740 674 608 619 651 683 674 665 667 669 671 673 626 579 578 577 627 676 617 513 415 394 494 640 695 642 549 503 532 562 594 627 700 774
-206 774 771 769 744 719 622 525 469 491 515 538 490 441 392 343 338 333 374 415 458 501 468 388 351 390 460 530 506 482 459 435 468 501 554 607 570 486 432
-211 432 454 514 573 615 656 641 625 533 440 383 325 314 303 278 253 330 407 493 488 488 488 555 623 644 665 641 616 631 647 716 694 585 475 449 423
-215 423 443 463 476 489 478 468 478 488 538 588 639 599 503 407 444 481 524 475 475 476 517 558 535 512 561 609 688 674 667 660 688 717 638 559 618 677 711
-219 711 654 629 604 528 359 253 300 393 487 522 556 591 626 569 511 460 408 381 445 504 563 559 555 575 594 547 501 531 561 548 535 499 463 470 477 439
-224 439 400 423 445 491 537 544 551 559 566 551 536 520 505 578 651 647 643 613 582 557 532 483 525 562 599 569 540 533 526 447 368 428 487 502 516 531 546 470 394
-229 394 394 395 418 441 463 486 501 516 531 546 512 478 521 610 632 578 498 464 449 434 468 549 573 520 484 495 529 518 458 399 400 401 403 404 468 532 519 506
-233 506 492 477 448 372 315 335 385 435 447 458 470 482 449 415 382 349 378 408 437 467 444 420 443 466 447 427 408 389 448 507 567 626 609 592 591
-237 591 636 680 648 586 523 532 542 552 561 557 552 590 629 597 519 501 560 659 758 815 873 864 855 800 746 714 682 650 618 617 616 615 614 614 614 537 460 450 441 431 422 453
-243 453 484 468 453 444 435 432 429 407 477 549 530 478 473 540 607 593 533 487 533 569 512 415 411 470 530 518 507 538 569 600 631 622 614 559 505 524 543 516 489
-247 489 442 394 424 454 456 458 461 463 472 480 417 354 380 497 615 641 615 590 559 528 533 538 543 548 541 535 528 522 508 494 481 467 430 393 464 535 514 494 519 545 557
-252 557 569 535 501 477 453 531 609 626 551 471 482 526 477 358 330 405 479 482 486 535 585 632 678 630 536 416 388 440 493 505 517 551 585 574 562
-257 562 513 463 491 518 553 587 575 563 606 649 692 735 735 734 688 642 529 416 358 393 480 566 551 536 494 452 457 461 441 422 402 382 425 468 464 461 483
-261 483 506 528 551 532 514 495 477 501 524 548 572 592 611 631 651 629 607 538 470 498 527 509 492 509 526 543 560 534 507 481 455 447 440 433 426 451 477
-266 477 502 528 577 627 599 572 525 478 431 384 395 405 416 426 396 366 360 447 537 627 615 603 571 539 554 568 584 601 617 633 574 514 403 384 432
-270 432 480 487 495 553 611 623 635 650 666 636 605 568 531 571 611 631 652 672 693 648 603 559 514 493 472 452 431 471 512 506 500 471 441 488 535 598 661
-274 661 645 584 573 608 640 627 621 615 606 597 554 511 544 578 617 656 648 641 589 537 502 513 524 489 437 384 408 432 412 392 425 503 538 527 540 598 627 580
-279 580 520 506 533 515 467 420 418 417 410 450 466 405 329 329 415 455 419 383 394 452 512 571 573 497 372 294 300 352 443 580 735 812 774 689 672 701
-284 701 679 581 503 472 440 409 401 439 452 465 481 497 515 533 551 569 529 490 529 614 623 586 552 564 549 534 522 511 476 442 483 570 613 548 457 444
-288 444 504 564 524 485 479 519 559 553 472 391 338 362 440 471 426 335 287 316 375 435 411 387 409 431 512 593 597 601 559 517 552 633 645 581 538 540 560
-292 560 580 573 612 670 652 606 605 639 626 566 506 563 620 632 643 579 516 457 398 385 448 499 504 504 580 654 652 558 465 428 468 500 486 503 519 567 614
-297 614 615 616 568 520 519 517 610 704 690 675 662 649 636 623 575 527 525 522 447 371 402 480 524 492 477 508 559 564 521 479 507 536 565 593 555 516 555 593
-302 593 562 532 501 471 486 502 517 533 496 459 482 581 657 655 595 534 496 459 467 476 476 476 476 476 491 507 476 445 435 424 490 556 599 641 607 573 536 500
-306 500 464 428 465 502 539 577 592 607 545 484 494 503 513 523 583 643 626 609 615 620 626 631 602 573 544 516 518 521 478 434 478 521 564 607 637 668 622 576
-311 576 553 529 551 573 559 544 601 657 674 599 521 536 581 580 506 433 463 540 597 562 497 432 408 384 401 418 435 452 475 498 475 452 424 395 443
-315 443 492 519 546 574 601 653 705 620 534 545 556 567 578 526 473 381 288 319 443 566 597 559 521 478 434 396 357 365 373 389 405 422 438 432 426 420
-320 420 414 427 441 454 467 419 372 324 276 223 170 224 278 365 453 495 536 519 503 532 561 505 450 394 338 336 334 332 330 390 449 453 364 315 266 258 249 269 290
-324 290 356 423 447 471 496 520 520 519 519 519 470 421 448 476 456 436 415 395 451 506 537 475 410 344 380 416 423 430 478 525 558 498 393 379 454 529 560
-329 560 498 479 551 643 735 697 658 548 439 374 401 453 505 488 471 454 437 443 450 457 464 455 445 436 426 396 367 383 399 376 353 324 387 459 532 533 534 575
-334 575 616 656 697 710 723 634 546 471 487 560 633 580 528 475 423 369 316 395 474 512 459 472 578 669 606 475 437 473 509 505 501 509 517 449 380 378
-338 378 376 374 372 417 461 512 471 463 456 519 583 629 675 676 676 645 613 628 643 584 525 512 499 477 455 433 411 393 375 403 431 400 369 339 308 384 460 535
-343 535 611 596 582 567 552 543 534 485 436 373 403 483 563 579 503 408 314 319 416 508 599 585 571 557 543 573 603 633 662 614 566 518 470 444 417 437
-347 437 457 431 406 482 558 664 677 610 543 488 525 557 588 560 531 502 474 439 405 447 489 520 551 582 612 606 599 633 666 616 474 343 365 407
-351 407 449 500 551 553 555 551 547 621 603 529 455 458 461 464 467 474 481 511 542 583 625 621 616 559 501 490 478 512 547 504 461 423 384 391 398 476 554 555 556 507 457 431 405
-356 405 403 400 352 304 333 362 345 328 310 291 349 408 408 409 410 411 398 386 373 361 364 367 416 465 411 357 379 446 462 386 310 326 429 485 466 447 464 481
-361 481 425 368 406 489 497 412 371 422 544 574 497 421 447 472 470 467 441 415 469 522 499 476 495 513 532 551 512 473 435 396 372 348 400 453 445 437 429
-366 429 421 423 425 427 428 392 356 397 438 446 453 461 469 455 441 405 368 381 394 450 505 455 359 314 361 463 564 565 565 572 580 610 641 646 651 610 569 533 497 390 283
$$ [...]
-1604F62
##END=	
##END=	
