##TITLE=	Jul05-2016.10.fid
AD33

##JCAMP-DX=	6.0	$$ MestReNova 14.1.1-24571
##DATA TYPE=	LINK
##BLOCK_ID=	1
##BLOCKS=	1    
##ORIGIN=	Mestrelab Research S.L.
##OWNER=	hrzepa
##$MNOVA/LINK_BLOCK_TYPE=	ITEM	$$ NMR Spectrum
##$MNOVA/ITEM/POLYGON=	(XY..XY)
5321,5835
8722,5835
8722,8208
5321,8208
5321,5835
##$MNOVA/ITEM/Z=	0
##$MNOVA/ITEM/ANGLE=	0
##TITLE=	Jul05-2016.10.fid
##JCAMP-DX=	6.0	$$ MestReNova 14.1.1-24571
##BLOCK_ID=	2
##DATA TYPE=	NMR SPECTRUM
##DATA CLASS=	XYDATA
##NUMDIM=	1
##ORIGIN=	Bruker BioSpin GmbH
##OWNER=	nmr
##.OBSERVE FREQUENCY=	400.20240119999999706
##.OBSERVE NUCLEUS=	^1H
##.SOLVENT NAME=	DMSO
##.PULSE SEQUENCE=	zg30
##LONGDATE=	2016/07/05 15:02:00.000
##.ACQUISITIONMODE=	SIMULTANEOUS (DQD)
##$ORIGINAL FORMAT=	Bruker XWIN-NMR
##$MNOVA/SCALES_VERSION=	9
##$PARAMETER FILE=	(acqus, ASCII, /Users/hrzepa/Downloads/Polysiphenol%20SI%20NMR%20Original%20Data/3/3a%20-%201H%20-%20400C.16.07.05.010/10/acqus, 0)
$$ ##TITLE= Parameter file, TOPSPIN		Version 3.2
$$ ##JCAMPDX= 5.0
$$ ##DATATYPE= Parameter Values
$$ ##NPOINTS= 11	$$ modification sequence number
$$ ##ORIGIN= Bruker BioSpin GmbH
$$ ##OWNER= nmr
$$ $$ 2016-07-05 15:02:59.068 +0100  nmr@CZC2439F63
$$ $$ /opt/topspin/data/brad/nmr/Jul05-2016/10/acqus
$$ $$ process /opt/topspin3.2/prog/mod/shimcntl
$$ ##$ACQT0= -2.20588235294118
$$ ##$AMP= (0..31)
$$ 100 100 100 100 100 100 100 100 100 100 100 100 100 100 100 100 100 100
$$ 100 100 100 100 100 100 100 100 100 100 100 100 100 100
$$ ##$AMPCOIL= (0..19)
$$ 0 0 0 0 0 0 0 0 0 0 0 0 0 0 0 0 0 0 0 0
$$ ##$ANAVPT= -1
$$ ##$AQSEQ= 0
$$ ##$AQ_mod= 3
$$ ##$AUNM= <au_zg>
$$ ##$AUTOPOS= <51 >
$$ ##$BF1= 400.2
$$ ##$BF2= 400.2
$$ ##$BF3= 400.2
$$ ##$BF4= 400.2
$$ ##$BF5= 400.2
$$ ##$BF6= 400.2
$$ ##$BF7= 400.2
$$ ##$BF8= 400.2
$$ ##$BYTORDA= 0
$$ ##$CAGPARS= (0..11)
$$ 0 0 0 0 0 0 0 0 0 0 0 0
$$ ##$CFDGTYP= 0
$$ ##$CFRGTYP= 9
$$ ##$CHEMSTR= <none>
$$ ##$CNST= (0..63)
$$ 1 1 145 1 1 1 1 1 1 1 1 1 1 1 1 1 1 1 1 1 1 1 1 1 1 1 1 1 1 1 1 1 1 1 1
$$ 1 1 1 1 1 1 1 1 1 1 1 1 1 1 1 1 1 1 1 1 1 1 1 1 1 1 1 1 1
$$ ##$CPDPRG= (0..8)
$$ <> <> <> <> <mlev> <mlev> <mlev> <mlev> <mlev>
$$ ##$D= (0..63)
$$ 0 1 0 0 0 0 0 0 0 0.06 0 0 0 0 0 0 0.0002 0 0 0 0 0 0 0 0 0 0 0 0 0 0 0
$$ 0 0 0 0 0 0 0 0 0 0 0 0 0 0 0 0 0 0 0 0 0 0 0 0 0 0 0 0 0 0 0 0
$$ ##$DATE= 1467727378
$$ ##$DE= 6.5
$$ ##$DECBNUC= <off>
$$ ##$DECIM= 2496
$$ ##$DECNUC= <off>
$$ ##$DECSTAT= 4
$$ ##$DIGMOD= 1
$$ ##$DIGTYP= 12
$$ ##$DQDMODE= 0
$$ ##$DR= 22
$$ ##$DS= 2
$$ ##$DSPFIRM= 0
$$ ##$DSPFVS= 20
$$ ##$DTYPA= 0
$$ ##$EXP= <proton>
$$ ##$F1LIST= <111111111111111>
$$ ##$F2LIST= <222222222222222>
$$ ##$F3LIST= <333333333333333>
$$ ##$FCUCHAN= (0..9)
$$ 0 2 0 0 0 0 0 0 0 0
$$ ##$FL1= 90
$$ ##$FL2= 90
$$ ##$FL3= 90
$$ ##$FL4= 90
$$ ##$FOV= 20
$$ ##$FQ1LIST= <freqlist>
$$ ##$FQ2LIST= <freqlist>
$$ ##$FQ3LIST= <freqlist>
$$ ##$FQ4LIST= <freqlist>
$$ ##$FQ5LIST= <freqlist>
$$ ##$FQ6LIST= <freqlist>
$$ ##$FQ7LIST= <freqlist>
$$ ##$FQ8LIST= <freqlist>
$$ ##$FRQLO3= 12442.5500000119
$$ ##$FRQLO3N= 2
$$ [...]
$$ ##$Sgu3PowerLevels= (0..7)
$$ 0 0 0 0 0 0 0 0
$$ ##$Sgu4PowerLevels= (0..7)
$$ 0 0 0 0 0 0 0 0
$$ ##$Sgu5PowerLevels= (0..7)
$$ 0 0 0 0 0 0 0 0
$$ ##$Sgu6PowerLevels= (0..7)
$$ 0 0 0 0 0 0 0 0
$$ ##$Sgu7PowerLevels= (0..7)
$$ 0 0 0 0 0 0 0 0
$$ ##$Sgu8PowerLevels= (0..7)
$$ 0 0 0 0 0 0 0 0
$$ ##$SguType= 3
$$ ##$ShimPowMaxUA= (0..63)
$$ 130000 130000 130000 130000 130000 130000 130000 130000 130000 130000 130000
$$ 130000 130000 130000 130000 130000 130000 130000 130000 130000 0 0 0 0
$$ 0 0 0 0 0 0 0 0 0 0 0 0 0 0 0 0 0 0 0 0 0 0 0 0 0 0 0 0 0 0 0 0 0 0 0 0
$$ 0 0 0 0
$$ ##$ShimPowMaxUC= (0..63)
$$ 130000 130000 130000 130000 130000 130000 130000 130000 130000 130000 130000
$$ 130000 130000 130000 130000 130000 130000 130000 130000 130000 0 0 0 0
$$ 0 0 0 0 0 0 0 0 0 0 0 0 0 0 0 0 0 0 0 0 0 0 0 0 0 0 0 0 0 0 0 0 0 0 0 0
$$ 0 0 0 0
$$ ##$ShimPowMaxUG= (0..63)
$$ 524287 524287 524287 524287 524287 524287 524287 524287 524287 524287 524287
$$ 524287 524287 524287 524287 524287 524287 524287 524287 524287 0 0 0 0
$$ 0 0 0 0 0 0 0 0 0 0 0 0 0 0 0 0 0 0 0 0 0 0 0 0 0 0 0 0 0 0 0 0 0 0 0 0
$$ 0 0 0 0
$$ ##$ShimPowRcbType= 3
$$ ##$ShimPowRes= (0..63)
$$ 1e-20 1e-20 1e-20 1e-20 1e-20 1e-20 1e-20 1e-20 1e-20 1e-20 1e-20 1e-20
$$ 1e-20 1e-20 1e-20 1e-20 1e-20 1e-20 1e-20 1e-20 0 0 0 0 0 0 0 0 0 0 0 0
$$ 0 0 0 0 0 0 0 0 0 0 0 0 0 0 0 0 0 0 0 0 0 0 0 0 0 0 0 0 0 0 0 0
$$ ##$ShimPowRng0= (0..63)
$$ 1 1 1 1 1 1 1 1 1 1 1 1 1 1 1 1 1 1 1 1 0 0 0 0 0 0 0 0 0 0 0 0 0 0 0 0
$$ 0 0 0 0 0 0 0 0 0 0 0 0 0 0 0 0 0 0 0 0 0 0 0 0 0 0 0 0
$$ ##$ShimPowRng1= (0..63)
$$ 1 1 1 1 1 1 1 1 1 1 1 1 1 1 1 1 1 1 1 1 0 0 0 0 0 0 0 0 0 0 0 0 0 0 0 0
$$ 0 0 0 0 0 0 0 0 0 0 0 0 0 0 0 0 0 0 0 0 0 0 0 0 0 0 0 0
$$ ##$ShimPowRng2= (0..63)
$$ 1 1 1 1 1 1 1 1 1 1 1 1 1 1 1 1 1 1 1 1 0 0 0 0 0 0 0 0 0 0 0 0 0 0 0 0
$$ 0 0 0 0 0 0 0 0 0 0 0 0 0 0 0 0 0 0 0 0 0 0 0 0 0 0 0 0
$$ ##$ShimPowRng3= (0..63)
$$ 1 1 1 1 1 1 1 1 1 1 1 1 1 1 1 1 1 1 1 1 0 0 0 0 0 0 0 0 0 0 0 0 0 0 0 0
$$ 0 0 0 0 0 0 0 0 0 0 0 0 0 0 0 0 0 0 0 0 0 0 0 0 0 0 0 0
$$ ##$ShimSysFunc= (0..63)
$$ 1 2 3 4 5 7 9 11 15 16 8 10 12 14 6 17 13 18 19 20 0 0 0 0 0 0 0 0 0 0
$$ 0 0 0 0 0 0 0 0 0 0 0 0 0 0 0 0 0 0 0 0 0 0 0 0 0 0 0 0 0 0 0 0 0 0
$$ ##$ShimSysMatrix= 0
$$ ##$ShimSysType= 1
$$ ##$TFXNUM= 0
$$ ##$TRIPLO2= 0
$$ ##$VTU= 2
$$ ##$VTUETH= <149.236.99.20>
$$ ##$VTUTY= <no>
$$ ##$WBREFAM= (0..15)
$$ 135.5 97.7 100 100 100 100 100 100 100 100 100 100 100 100 100 100
$$ ##$WBREFLM= (0..15)
$$ 0 0 0 0 0 0 0 0 0 0 0 0 0 0 0 0
$$ ##$WBREFPH= (0..15)
$$ 72.26 -67.22 0 0 0 0 0 0 0 0 0 0 0 0 0 0
$$ ##$WBSGU= (0..15)
$$ 0 0 0 0 0 0 0 0 0 0 0 0 0 0 0 0
$$ ##$XFAC= 2
$$ ##END=
$$ 
##$DECIM=	2496
##$DSPFVS=	20
##XUNITS=	HZ
##YUNITS=	ARBITRARY UNITS
##FIRSTX=	6407.6102564186803647
##LASTX=	-1605.0879904638193238
##DELTAX=	-0.12226593800080109986
##XFACTOR=	1
##YFACTOR=	0.014083162028923873477
##FIRSTY=	11.316205024719238281
##MINY=	-1.2286130189895629883
##MAXY=	14401.521484375
##NPOINTS=	65536
##XYDATA=	(X++(Y..Y))
$$ [...]
$$ plain form
2260 1137 1196 1234 1272 1169 1066 1096 1127 1157 1187 1149 1110 1149 1188 1158 1128 1145 1162 1123 1083 1044 1004 1035 1067 1098 1129 1099 1068 960 852 873 894 916
2256 916 937 981 1024 1068 1112 1095 1078 1060 1043 1048 1054 1059 1064 1124 1183 1165 1147 1078 1009 1018 1027 1094 1161 1228 1295 1261 1228 1194 1161 1151 1141 1131 1120 1003 886 877 869 896
2251 896 923 1028 1133 1136 1138 1141 1143 1197 1251 1196 1141 1081 1021 1039 1057 1052 1046 994 941 967 992 940 887 903 918 981 1043 995 947 899 852 951 1050 1071 1092 1005 918
2247 918 909 900 953 1007 1014 1021 1012 1002 992 983 1026 1069 1034 999 998 996 995 994 1000 1006 1036 1066 1085 1104 1020 937 908 974 987 1000 1032 1064 1103 1047 998 950 901 852 820 882 968
2242 968 1055 1117 1178 1214 1156 1075 994 1016 1038 1076 1115 1075 1035 985 934 931 927 981 1035 1089 1142 1162 1182 1155 1128 1091 1053 1063 1073 1095 1117 1140 1162 1097 1032 1076
2237 1076 1120 1102 1084 1019 954 925 896 866 837 858 878 945 1013 1048 1084 1073 1061 1027 993 1006 1019 967 916 836 849 943 1038 1061 1083 1130 1178 1199 1128 1045
2233 1045 962 903 843 845 940 1035 1037 983 929 915 902 946 991 1036 1080 1079 1078 1124 1169 1172 1175 1137 1099 1074 1143 1231 1320 1310 1208 1081 1049 1059 1070 1043 1016 1083
2229 1083 1197 1238 1124 995 960 1001 995 942 935 1065 1195 1239 1188 1113 1038 1003 967 956 944 912 881 931 1075 1145 1122 1058 1088 1138 1188 1166 1143 1158
$$ packed form
2260A137N9L8L8j03j03L0L1L0L0l8l9L9L9l0l0J7J7l9m0l9m0L1L2L1L1l0l1j08j08K1K1K2
2256I16K1M4M3M4M4j7j7j8j7NONNO0N9j8j8o9o9RRO7O7O7O7l4l3l4l3j0j0j0j1j17j17rqK7
2251H96K7J05J05LKLKN4N4n5n5o0o0J8J8non2n3K6K5n2n3J6J5O3O2m8m8m8m7R9R9K1K1q7q7
2247I18rrN3N4PPrj0j0rM3M3l5l5jkjjOOL0L0J9J9q4q3k9O6J3J3L2L2L9n6m9m8m9m9l2O2Q6
2242I68Q7O2O1L6n8q1q1K2K2L8L9m0m0n0n1lmN4N4N4N3K0K0k7k7l7l8J0J0K2K2K3K2o5o5M4
2237A076M4j8j8o5o5k9k9l0k9K1K0O7O8L5L6j1j2l4l4J3J3n2n1q0J3R4R5K3K2M7M8K1p1q3
2233A045q3n9o0KR5R5Kn4n4j4j3M4M5M5M4jjM6M5LLl8l8k5O9Q8Q9j0j02j27l2J0J1k7k7O7
2229A083J14M1j14j29l5M1on3pJ30J30M4n1p5p5l5l6j1j2l2l1N0J44P0k3o4L0N0N0k2k3J5
$$ plain form
2225 1158 1172 1187 1201 1179 1156 1134 1111 1151 1192 1154 1116 1070 1023 1055 1086 1178 1270 1278 1191 1149 1153 1154 1109 1060 1058 1074 1090 1061 1032 982 932 923 962 1030 1004 944 932
2220 932 996 1060 1100 1140 1179 1219 1216 1214 1211 1208 1160 1111 1086 1060 1091 1122 1106 1090 1061 1031 1002 972 961 950 1016 1083 1088 1093 1075 1056 1089 1122 1108 1094 1056 1019 1091 1163
2216 1163 1174 1185 1172 1159 1177 1196 1237 1279 1263 1248 1185 1122 1107 1091 1150 1209 1195 1134 1070 1100 1123 1147 1129 1112 1080 1048 992 937 923 910 943 977 1066 1155
2212 1155 1198 1240 1274 1307 1232 1111 1052 1088 1097 1059 1008 1004 1049 1093 1120 1148 1128 1108 1061 1015 1014 1014 1017 1020 1070 1120 1116 1113 1110 1107 1090 1074 1057 1040 1036 1033 1076 1119 1026 933
2207 933 917 902 948 993 1039 1085 1016 948 954 961 892 777 741 799 869 892 936 1073 1186 1206 1113 1020 996 972 971 970 1020 1070 1120 1170 1187 1204 1173 1143 1149 1155
2202 1155 1115 1074 1100 1126 1105 1084 1056 1028 1079 1129 1140 1151 1085 1018 954 891 878 959 1078 1103 1045 939 884 876 891 952 1032 1112 1086 1059 1046 1033 1020 1007
2198 1007 1030 1054 1054 1054 1088 1123 1138 1059 1015 1065 1187 1215 1162 1109 1127 1191 1226 1166 1115 1111 1163 1261 1314 1273 1194 1163 1145 1128 1039 951 915 974 1026 1031 1022 1013 1013
2194 1013 1014 1038 1063 1116 1170 1221 1272 1233 1147 1079 1104 1150 1150 1135 1120 1132 1144 1156 1168 1220 1273 1216 1159 1127 1096 1088 1079 1088 1096 1128 1160 1097 1034 1080 1127 1179 1232
$$ packed form
2225A158J4J5J4k2k3k2k3M0M1l8l8m6m7L2L1R2R2Qq7m2MJm5m9kJ6J6k9k9n0n0rL9O8k6o0j2
2220I32O4O4M0M0L9M0lkllm8m9k5k6L1L1j6j6k9l0k9l0j1j1O6O7NNj8j9L3L3j4j4l8l7P2P2
2216A163J1J1j3j3J8J9M1M2j6j5o3o3j5j6N9N9j4o1o4L0K3K4j8j7l2l2n6n5j4j3L3L4Q9Q9
2212A155M3M2L4L3p5j21n9L6Rl8n1mM5M4K7K8k0k0m7m6j%LLN0N0mlllj7j6j7j7mlM3M3r3r3
2207I33j6j5M6M5M6M6o9o8OPo9j15l6N8P0K3M4J37J13K0r3r3k4k4jjN0N0N0N0J7J7l1l0OO
2202A155m0m1K6K6k1k1k8k8N1N0J1J1o6o7o4o3j3Q1J19K5n8j06n5qJ5O1Q0Q0k6k7j3j3j3j3
2198A007K3K4%%L4L5J5p9m4N0J22K8n3n3J8O4L5o0n1mN2R8N3m1p9l1j8j7q9q8l6N9N2Nrr%
2194A013JK4K5N3N4N1N1l9q6o8K5M6%j5j5J2J2J2J2N2N3n7n7l2l1qrRQL2L2o3o3M6M7N2N3
$$ plain form
2189 1232 1235 1238 1183 1082 1026 1064 1147 1136 1080 1070 1124 1178 1188 1198 1292 1386 1364 1248 1126 1051 1052 1054 1124 1193 1240 1286 1207 1129 1097 1065 1045 1026 1021 1062 1102
2185 1102 1049 951 947 1040 1134 1120 1013 902 884 949 1014 1059 1104 1102 1100 1071 1042 1060 1077 1079 1080 1058 1036 1016 996 976 956 999 1043 1087 1130 1075 1020 1016 1105 1231
2181 1231 1263 1156 1049 999 1042 1080 1117 1089 1061 1033 1005 1073 1140 1183 1131 1101 1072 1036 1000 943 885 931 977 998 925 904 884 983 1082 1103 1124 1122 1120 1117 1115
2176 1115 1020 926 940 955 1044 1134 1229 1231 1168 1105 1083 1061 1027 993 1038 1082 1122 1162 1124 1086 1030 974 1000 1120 1211 1209 1187 1165 1120 1076 1078 1081 1094 1108 1121 1135
2172 1135 1135 1135 1088 1041 983 925 867 809 842 876 909 943 1014 1085 1108 1132 1101 1069 1116 1162 1079 996 939 975 1065 1155 1110 1065 1091 1117 1144 1170 1155 1140 1126
2168 1126 1111 1121 1131 1182 1234 1289 1250 1186 1122 1106 1090 1073 1057 1121 1185 1202 1219 1173 1127 1081 1035 1041 1047 1093 1140 1206 1179 1069 960 937 1008 1027 1045 1087
2163 1087 1130 1125 1121 1104 1088 1125 1067 998 928 905 883 826 863 981 1100 1115 1036 1004 1066 1118 1169 1087 1004 949 895 950 1004 1031 1057 1084 1110 1088 1065 1142
2159 1142 1219 1262 1149 1024 993 1036 1080 1082 1084 1148 1212 1198 1183 1195 1206 1217 1228 1264 1299 1226 1152 1100 1049 1044 1039 1091 1142 1147 1152 1169 1186 1157 1127 1135 1143 1105 1066
$$ packed form
2189A232LLn5j01n6L8Q3j1n6j0N4N4J0J0R4R4k2j16j22p5JKP0O9M7M6p9p8l2l2k0j9nM1M0
2185A102n3r8mR3R4j4j07j11j8O5O5M5M5kkk9k9J8J7KJk2k2k0k0k0k0M3M4M4M3n5n5mQ9J26
2181A231L2j07j07n0M3L8L7k8k8k8k8O8O7M3n2l0k9l6l6n7n8M6M6K1p3k1k0R9R9K1K1kklk
2176A115r5r4J4J5Q9R0R5Ko3o3k2k2l4l4M5M4M0M0l8l8n6n6K6J20R1kk2k2m5m4KLJ3J4J3J4
2172A135%%m7m7n8n8n8n8L3L4L3L4P1P1K3K4l1l2M7M6q3q3n7L6R0R0m5m5K6K6K7K6j5j5j4
2168A126j5J0J0N1N2N5l9o4o4j6j6j7j6O4O4J7J7m6m6m6m6OOM6M7O6k7j10j09k3P1J9J8M2
2163A087M3nmj7j6L7n8o9p0k3k2n7L7J18J19J5p9l2O2N2N1q2q3n5n4N5N4K7K6K7K6k2k3P7
2159A142P7M3j13j25l1M3M4KKO4O4j4j5J2J1J1J1L6L5p3p4n2n1nnN2N1NNJ7J7k9l0QQl8l9
$$ plain form
2155 1066 1086 1105 1125 1144 1090 1035 980 926 949 971 1041 1111 1125 1139 1106 1074 1056 1039 1069 1098 1130 1162 1146 1131 1194 1256 1263 1175 1102 1030 1060 1091 1092 1092 1093 1094 1090
2150 1090 1086 1082 1078 1116 1155 1193 1231 1230 1228 1226 1225 1204 1183 1209 1234 1292 1350 1299 1248 1148 1048 1088 1129 1111 1093 1075 1057 1054 1051 1048 1045 1095 1146 1150 1154 1157 1159 1162 1165 1182 1198 1215
2145 1215 1231 1276 1321 1319 1317 1320 1323 1216 1110 1065 1020 1084 1148 1228 1307 1247 1186 1205 1224 1321 1418 1383 1347 1265 1183 1095 1006 1027 1048 1102 1156 1163 1170 1159 1148 1090
2141 1090 1032 998 963 1038 1112 1118 1124 1177 1230 1275 1320 1318 1316 1321 1325 1283 1241 1294 1346 1399 1451 1421 1390 1313 1236 1267 1298 1329 1360 1319 1279 1238 1198 1171 1144 1164 1184
2136 1184 1225 1266 1260 1254 1261 1267 1274 1281 1352 1424 1417 1411 1399 1388 1423 1458 1568 1678 1672 1573 1517 1508 1499 1443 1378 1408 1455 1455 1449 1443 1481 1519 1481 1444 1328 1213 1176 1140 1150
2131 1150 1160 1184 1208 1232 1255 1260 1264 1191 1117 1125 1132 1140 1148 1197 1245 1294 1343 1316 1290 1310 1330 1342 1355 1321 1241 1178 1209 1262 1315 1293 1271 1249 1227 1194 1162 1176 1190
2127 1190 1242 1294 1236 1179 1136 1093 1097 1101 1050 999 995 991 974 957 963 1062 1176 1243 1198 1059 965 964 1046 1127 1135 1142 1102 1063 1008 953 977 1000 1009 1017 1026 1034 1130 1226 1275
2122 1275 1324 1301 1278 1209 1094 1018 1035 1102 1121 1089 1057 1069 1081 1070 1060 1096 1132 1049 965 1048 1130 1183 1143 1156 1168 1166 1164 1203 1242 1217 1099 955 811
$$ packed form
2155A066K0J9K0J9n4n5n5n4K3K2P0P0J4J4l3l2j8j7L0K9L2L2j6j5O3O2Pq8p3p2L0L1J%JJm
2150A090mmmL8L9L8L8jkkjk1k1K6K5N8N8n1n1j00j00M0M1j8j8j8j8llllN0N1MMLKLLJ7J6J7
2145A215J6M5M5kkLLj07j06m5m5O4O4Q0P9o0o1J9J9R7R7l5l6q2q2q8q9K1K1N4N4PPj1j1n8
2141A090n8l4l5P5P4OON3N3M5M5kkNMm2m2N3N2N3N2l0l1p7p7L1L1L1L1m1m0m1m0k7k7K0K0
2136A184M1M1ooPOPPP1P2poj2j1L5L5J10J10or9n6rrn6o5L0M7%ooL8L8l8l7j16j15l7l6J0
2131A150J0K4K4K4K3NMp3p4QPQQM9M8M9M9k7k6K0K0J2J3l4q0o3L1N3N3k2k2k2k2l3l2J4J4
2127A190N2N2n8n7m3m3MMn1n1mmj7j7OR9J14O7m5j39r4jQ2Q1QPm0l9n5n5K4K3RQRQR6R6M9
2122A275M9k3k3o9j15p6J7O7J9l2l2J2J2j1j0L6L6q3q4Q3Q2N3m0J3J2kkL9L9k5j18j44j44
$$ plain form
2118 811 783 754 776 892 1020 1054 1037 1021 977 933 936 939 1002 1065 1051 1036 1085 1134 1104 1075 1088 1101 1114 1127 1201 1276 1303 1331 1290 1250 1163 1076 1016 957 944
2114 944 931 990 1050 1084 1024 990 955 921 887 913 1033 1100 1167 1229 1290 1301 1218 1120 1115 1214 1220 1135 1051 1133 1214 1253 1292 1285 1277 1296 1316 1289 1261 1190 1119 1157
2109 1157 1195 1136 1078 1097 1117 1083 1050 1017 984 964 945 972 999 1045 1091 1136 1182 1193 1203 1214 1225 1261 1297 1286 1275 1181 1088 1051 1107 1149 1192 1193 1195 1186 1178 1169 1161
2105 1161 1131 1101 1072 1042 1050 1058 1020 981 995 1009 1023 1036 1056 1076 1142 1209 1220 1232 1243 1254 1207 1160 1113 1066 1014 963 989 1015 1041 1066 1089 1111 1127 1097 1037
2101 1037 1071 1136 1155 1131 1153 1199 1198 1180 1162 1164 1166 1122 1077 1111 1145 1102 1012 959 1000 1089 1177 1201 1132 1088 1092 1151 1210 1195 1133 1098 1157 1233 1262 1216 1171 1122
2096 1122 1073 1093 1113 1133 1153 1089 1024 959 894 947 1000 1009 1017 1071 1172 1252 1238 1227 1216 1184 1106 1006 1000 1051 1101 1108 1161 1241 1227 1131 1035 1046 1151 1223 1202
2092 1202 1192 1182 1184 1186 1110 1033 1010 986 1010 1033 1071 1109 1100 1091 1126 1161 1196 1231 1251 1271 1245 1218 1177 1136 1173 1210 1211 1213 1215 1217 1171 1125 1079 1033 1003 973 1052 1131
2087 1131 1114 1096 1126 1155 1194 1233 1163 1093 1064 1036 1054 1072 1136 1200 1264 1328 1238 1147 1129 1110 1056 908 834 916 1059 1202 1151 1101 1108 1115 1123 1130 1180 1231 1328
$$ packed form
2118H11k8k9K2J16J28L4j7j6m4m4LLO3O3j4j5M9M9l0k9J3J3J3J3P4P5K7K8m1m0q7q7o0n9j3
2114I44j3N9O0L4o0l4l5l4l4K6J20O7O7O2O1J1q3r8nR9Oq5q4Q2Q1L9L9pqJ9K0k7k8p1p1L8
2109A157L8n9n8J9K0l4l3l3l3k0j9K7K7M6M6M5M6J1J0J1J1L6L6j1j1r4r3l7N6M2M3JKrqrq
2105A161l0l0k9l0QQl8l9J4J4J4J3K0K0O6O7J1J2J1J1m7m7m7m7n2n1K6K6K6K5K3K2J6l0o0
2101A037L4O5J9k4K2M6jj8j8KKm4m5L4L4m3r0n3M1Q9Q8K4o9m4MN9N9j5o2l5N9P6K9m6m5m9
2096A122m9K0K0K0K0o4o5o5o5N3N3RQN4J01Q0j4j1j1l2p8j00oN1N0PN3Q0j4r6r6J1J05P2k1
2092A202j0j0KKp6p7k3k4K4K3L8L8rrL5L5L5L5K0K0k6k7m1m1L7L7JKKKm6m6m6m6l0l0P9P9
2087A131j7j8L0K9L9L9p0p0k9k8J8J8O4O4O4O4r0r1j8j9n4j48p4Q2J43J43n1n0PPQPN0N1R7
$$ plain form
2083 1328 1426 1389 1351 1314 1277 1222 1166 1189 1211 1176 1140 1151 1161 1095 1028 962 895 872 849 874 898 1001 1105 1100 1094 1128 1161 1148 1134 1069 1003 1047 1091 1164
2079 1164 1237 1232 1227 1161 1095 1139 1183 1140 1098 1134 1170 1196 1223 1204 1184 1173 1162 1151 1140 1202 1264 1279 1295 1286 1277 1268 1259 1226 1193 1160 1127 1137 1147 1157 1167 1155 1142
2074 1142 1130 1118 1047 976 905 834 872 911 949 987 998 1009 1020 1031 1081 1131 1181 1230 1201 1172 1143 1113 1075 1037 1046 1055 1078 1102 1079 1055 1049 1043 1084 1124 1157 1190
2070 1190 1114 1037 1001 966 977 987 1019 1050 1035 1020 1047 1075 1102 1130 1164 1199 1124 1002 959 993 1007 974 954 934 958 982 1045 1108 1125 1141 1097 1053 1087 1121
2066 1121 1168 1215 1216 1216 1189 1162 1135 1108 1124 1140 1155 1171 1108 1044 1059 1074 1110 1145 1181 1217 1159 1101 1121 1188 1214 1161 1152 1221 1284 1238 1136 1112 1211 1310 1336
2061 1336 1361 1308 1255 1202 1149 1208 1268 1249 1231 1198 1164 1178 1192 1192 1193 1237 1281 1250 1171 1119 1145 1202 1212 1145 1077 1072 1066 1108 1150 1116 1083 1050 1017 1018 1019 1067 1115
2057 1115 1176 1236 1188 1093 1012 1025 1058 1044 995 992 1069 1147 1154 1161 1215 1269 1256 1244 1232 1220 1207 1195 1183 1170 1159 1148 1184 1219 1200 1180 1161 1141 1188 1235 1259 1283
2052 1283 1247 1212 1129 1047 1026 1004 1034 1157 1268 1285 1189 1093 1098 1102 1083 1065 1093 1122 1128 1133 1166 1198 1184 1169 1118 1066 1090 1113 1102 1043 982 1014 1140 1265
$$ packed form
2083A328R8l7l8l7l7n5n6K3K2l5l6J1J0o6o7o6o7k3k3K5K4J03J04noL4L3j3j4o5o6M4M4P3
2079A164P3nno6o6M4M4m3m2L6L6K6K7j9k0j1j1j1j1O2O2J5J6rrrrl3l3l3l3J0J0J0J0j2j3
2074A142j2j2p1p1p1p1L8L9L8L8J1J1J1J1N0N0N0M9k9k9k9l0l8l8RRK3K4k3k4ooM1M0L3L3
2070A190p6p7l6l5J1J0L2L1j5j5K7K8K7K8L4L5p5j22m3L4J4l3k0k0K4K4O3O3J7J6m4m4L4L4
2066A121M7M7J%k7k7k7k7J6J6J5J6o3o4J5J5L6L5L6L6n8n8K0O7K6n3rO9O3m6j02k4R9R9K6
2061A336K5n3n3n3n3N9O0j9j8l3l4J4J4%JM4M4l1p9n2K6N7J0o7o8noM2M2l4l3l3l3JJM8M8
2057A115O1O0m8r5q1J3L3j4m9lP7P8PPN4N4j3j2j2j2j3j2j2j3j1j1L6L5j9k0j9k0M7M7K4K4
2052A283l6l5q3q2k1k2L0J23J11J7r6r6NMj9j8K8K9ONL3L2j4j5n1n2K4K3j1n9o1L2J26J25
$$ plain form
2048 1265 1281 1202 1161 1167 1166 1119 1102 1086 1066 1046 1037 1029 1020 1012 1019 1027 1035 1043 1011 979 1025 1071 1085 1099 1066 1033 1113 1192 1225 1258 1198 1139 1102 1066 1052 1039 1039 1087 1111 1042
2043 1042 956 916 985 1054 1080 1105 1154 1202 1251 1299 1303 1306 1309 1312 1293 1275 1334 1394 1391 1389 1308 1228 1171 1115 1137 1159 1150 1141 1133 1124 1121 1119 1116 1113 1194 1276 1279 1282 1213 1144 1075 1006
2038 1006 1001 996 944 893 950 1008 1019 1030 1056 1081 1083 1085 1065 1045 1071 1098 1086 1075 1063 1051 1041 1031 998 964 1026 1087 1102 1117 1086 1056 984 991 1118 1292 1368 1335
2034 1335 1248 1208 1182 1156 1148 1139 1131 1123 1102 1081 1037 993 934 875 925 976 1012 1049 1085 1121 1131 1140 1126 1112 1139 1165 1239 1312 1272 1231 1235 1238 1150 1015 981 1056 1154
2029 1154 1175 1170 1213 1249 1238 1148 1057 1019 981 942 904 908 911 1017 1123 1190 1147 1093 1086 1131 1177 1202 1228 1215 1202 1142 1083 1085 1088 1067 1047 1065 1083 1054 1025 1009
2025 1009 993 977 961 1031 1100 1170 1239 1214 1189 1164 1139 1126 1114 1148 1182 1150 1119 1110 1102 1124 1145 1063 981 927 967 1032 1097 1162 1228 1216 1204 1200 1197 1193 1190 1137 1085
2020 1085 1079 1073 1099 1125 1074 1022 1035 1047 1106 1166 1202 1238 1227 1216 1279 1342 1349 1262 1158 1053 1021 988 1001 1013 985 957 998 1134 1222 1217 1180 1142 1177 1212 1172
2016 1172 1132 1139 1146 1109 1072 1012 951 962 974 1032 1090 1073 1056 1038 1021 1097 1172 1169 1167 1105 1043 1028 1013 1038 1062 1087 1112 1162 1212 1096 981 922 957 1017 1077
$$ packed form
2048A265J6p9m1Ojm7j7j6k0k0rqrqPQQQl2l2M6M6J4J4l3l3Q0P9L3L3o0n9l7l6j4j3%M8K4o9
2043A042q6m0O9O9K6K5M9M8M9M8MLLLj9j8N9O0lkq1q0n7n6K2K2rrqrlkllQ1Q2LLo9o9o9o9
2038A006nnn2n1N7N8J1J1K6K5KKk0k0K6K7j2j1j2j2j0j0l3l4O2O1J5J5l1l0p2PJ27J74P6l3
2034A335q7m0k6k6qrqqk1k1m4m4n9n9N0N1L6L7L6L6J0Rj4j4K7K6P4P3m0m1MLq8j35l4P5R8
2029A154K1nM3L6j1r0r1l8l8l9l8MLJ06J06O7m3n4pM5M6K5K6j3j3o0n9KLk1k0J8J8k9k9j6
2025A009j6j6j6P0O9P0O9k5k5k5k5j3j2L4L4l2l1rqK2K1q2q2n4M0O5O5O5O6j2j2mlmln3n2
2020A085ooK6K6n1n2J3J2N9O0L6L6j1j1O3O3Pq7j04j05l2l3J3J2k8k8M1J36Q8nl7l8L5L5m0
2016A172m0PPl7l7o0o1J1J2N8N8j7j7j8j7P6P5lko2o2j5j5K5K4K5K5N0N0j16j15n9L5O0O0
$$ plain form
2012 1077 1104 1130 1134 1137 1150 1163 1200 1236 1200 1164 1206 1248 1254 1259 1187 1114 1172 1231 1242 1254 1249 1244 1239 1234 1201 1169 1122 1028 971 1007 1066 1125 1139 1153 1144 1134 1162 1189 1170
2007 1170 1105 1020 1029 1060 1091 1102 1113 1171 1229 1242 1255 1244 1233 1177 1120 1141 1163 1153 1143 1157 1171 1129 1087 1068 1050 1101 1152 1149 1053 968 929 968 1007 1042 1077
2003 1077 1067 1009 956 996 1054 1064 1016 967 1056 1145 1193 1241 1242 1244 1184 1125 1060 1089 1136 1183 1189 1196 1219 1242 1265 1288 1265 1242 1219 1196 1114 1032 949 867 864 861 882
1998 882 903 921 939 1003 1068 1131 1194 1275 1355 1395 1340 1206 1119 1169 1265 1257 1154 1075 1090 1187 1284 1298 1312 1280 1202 1116 1124 1211 1299 1276 1160 1067 1068 1114 1161
1994 1161 1167 1172 1136 1101 1112 1123 1127 1131 1136 1140 1190 1240 1265 1196 1070 945 932 1013 1081 1150 1146 1142 1146 1150 1154 1158 1130 1102 1074 1046 1047 1048 1049 1050 1094 1139 1106 1073 1107 1140 1174
1989 1174 1208 1180 1153 1172 1191 1166 1142 1070 998 1014 1031 1047 1063 1077 1090 1104 1118 1029 940 846 845 927 1008 1096 1183 1161 1138 1074 1011 958 1000 1066 1133 1139 1145 1151
1985 1151 1157 1188 1219 1250 1280 1225 1170 1043 916 891 959 1078 1198 1206 1122 1037 1046 1082 1118 1113 1108 1165 1221 1196 1077 990 997 1023 1049 1076 1102 1140 1084 1003 1016
1980 1016 1079 1143 1136 1129 1169 1209 1228 1246 1192 1139 1114 1183 1247 1310 1240 1169 1146 1122 1118 1113 1109 1105 1060 1014 968 923 961 999 1084 1169 1248 1327 1240 1153 1097 1135 1136 1043
$$ packed form
2012A077K7K6MLJ3J3L7L6l6l6M2M2ONp2p3N8N9J1J2nnnnl3l2m7r4n7L6N9N9J4J4rj0K8K7j9
2007A170o5q5RL1L1J1J1N8N8J3J3j1j1n6n7K1K2j0j0J4J4m2m2j9j8N1N1lr6q5l9L9L9L5L5
2003A077j0n8n3M0N8J0m8m9Q9Q9M8M8JKo0n9o5K9M7M7OPK3K3K3K3k3k3k3k3q2q2q3q2llK1
1998H82K1J8J8O4O5O3O3Q1Q0M0n5j34q7N0R6qj03p9J5R7R7J4J4l2p8q6QQ7Q8k3j16r3JM6M7
1994A161ONl6l5J1J1MMNMN0N0K5o9j26j25j3Q1O8O9mmMMMMk8k8k8k8JJJJM4M5l3l3L4L3L4
1989A174L4k8k7J9J9k5k4p2p2J6J7J6J6J4J3J4J4q9q9r4jQ2Q1Q8Q7k2k3o4o3n3M2O6O7OOO
1985A151OL1L1L1L0n5n5j27j27k5O8J19J20Qq4q5RL6L6nnN7N6k5j19q7PK6K6K7K6L8n6q1J3
1980A016O3O4ppM0M0J9J8n4n3k5O9O4O3p0p1k3k4mnmmm5m6m6m5L8L8Q5Q5P9P9q7q7n6L8Jr3
$$ plain form
1976 1043 984 1080 1245 1316 1251 1187 1194 1202 1195 1188 1181 1174 1218 1262 1306 1349 1319 1289 1306 1322 1300 1277 1255 1233 1253 1274 1191 1108 1084 1153 1269 1291 1257 1222 1181 1141
1971 1141 1089 1036 990 943 833 816 944 1071 1087 1009 1030 1051 1083 1115 1100 1085 1127 1169 1257 1346 1268 1190 1106 1116 1134 1153 1177 1202 1177 1152 1174 1196 1177
1967 1177 1158 1139 1120 1122 1124 1079 1034 1073 1113 1153 1193 1174 1156 1137 1118 1121 1124 1173 1223 1184 1144 1064 984 990 1091 1138 1186 1123 1060 1076 1091 1102 1114 1172 1230 1226 1222
1963 1222 1218 1214 1164 1115 1112 1109 1155 1201 1200 1200 1134 1068 1080 1092 1122 1151 1175 1198 1214 1136 1011 980 1037 1095 1158 1221 1204 1187 1170 1153 1181 1208 1188 1169 1112 1056 1077
1958 1077 1099 1091 1083 1075 1068 1074 1079 1085 1091 1229 1366 1385 1310 1232 1153 1179 1204 1127 1050 1024 1091 1215 1245 1193 1141 1138 1135 1203 1272 1234 1103 972 934 1047 1160 1223
1954 1223 1191 1180 1168 1150 1133 1151 1169 1114 1060 1051 1135 1219 1210 1119 1029 1073 1118 1131 1144 1157 1170 1158 1145 1205 1265 1303 1247 1140 1033 1005 1070 1160 1250 1276
1950 1276 1302 1281 1260 1215 1170 1203 1237 1230 1223 1216 1209 1190 1171 1079 987 971 1048 1119 1190 1160 1130 1178 1226 1251 1275 1222 1169 1095 1022 1089 1156 1208 1261 1313 1365 1381
1945 1381 1397 1334 1272 1273 1274 1275 1276 1196 1116 1035 955 969 983 998 1012 1091 1171 1204 1237 1311 1384 1411 1438 1398 1357 1317 1276 1256 1236 1169 1102 1118 1133 1101 1069 1070 1072
$$ packed form
1976A043n9R6J65P1o5o4PQppppM4M4M4M3l0l0J7J6k2k3k2k2K0K1q3q3k4O9J16K2l4l5m1m0
1971A141n2n3m6m7j10j7J28J27J6p8K1K1L2L2j5j5M2M2Q8Q9p8p8q4J0J8J9K4K5k5k5K2K2j9
1967A177j9j9j9KKm5m5L9M0M0M0j9j8j9j9LLM9N0l9m0q0q0OJ01M7M8o3o3J6J5J1J2N8N8mm
1963A222mmn0m9llM6M6j%o6o6J2J2L0K9K4K3J6p8j25l1N7N8O3O3j7j7j7j7K8K7k0j9n7n6K1
1958A077K2qqqpONOOJ38J37J9p5p8p9K6K5p7p7k6O7J24L0n2n2llO8O9l8j31j31l8J13J13O3
1954A223l2j1j2j8j7J8J8n5n4rQ4Q4rr1r0M4M5J3J3J3J3j2j3O0O0L8n6j07j07k8O5R0R0K6
1950A276K6k1k1m5m5L3L4ppppj9j9r2r2j6P7P1P1l0l0M8M8K5K4n3n3p4p3O7O7N2N3N2N2J6
1945A381J6o3o2JJJJq0q0q1q0J4J4J5J4P9Q0L3L3P4P3K7K7m0m1m0m1k0k0o7o7J6J5l2l2JK
$$ plain form
1941 1072 1151 1231 1252 1273 1215 1158 1145 1132 1119 1105 1197 1289 1303 1316 1308 1299 1290 1281 1289 1297 1304 1312 1311 1310 1308 1307 1247 1187 1173 1160 1178 1197 1216 1234 1233 1231 1229 1227 1239 1251 1185 1119
1936 1119 1147 1175 1157 1138 1081 1024 1013 1002 1055 1107 1050 993 998 1003 1007 1012 1024 1035 1094 1153 1176 1200 1223 1247 1188 1130 1118 1106 1136 1165 1188 1212 1302 1299 1240 1180 1170
1931 1170 1159 1195 1231 1205 1179 1154 1128 1113 1098 983 962 1125 1288 1348 1252 1124 1090 1103 1116 1081 1046 1089 1132 1138 1143 1149 1155 1128 1101 1075 1048 1113 1177 1139
1927 1139 1100 1062 1118 1168 1218 1228 1239 1203 1167 1115 1064 1090 1116 1087 1057 1028 998 1030 1062 1048 1033 986 939 943 1040 1187 1241 1213 1185 1202 1218 1235 1252 1267
1923 1267 1282 1297 1312 1310 1308 1260 1211 1195 1179 1162 1146 1176 1205 1188 1170 1204 1237 1193 1148 1114 1080 1047 1013 1056 1098 1213 1328 1405 1389 1316 1242 1256 1271 1238
1919 1238 1205 1188 1171 1232 1293 1280 1268 1209 1150 1042 934 848 918 1070 1222 1296 1276 1290 1303 1311 1319 1286 1254 1221 1189 1230 1272 1235 1199 1172 1145 1164 1184
1915 1184 1173 1163 1152 1142 1139 1135 1235 1335 1442 1455 1380 1306 1282 1259 1282 1305 1265 1225 1185 1145 1106 1067 1132 1196 1269 1248 1201 1154 1179 1205 1230 1255 1248 1241 1233
1910 1233 1226 1243 1261 1278 1295 1261 1228 1194 1160 1194 1228 1262 1295 1285 1275 1265 1255 1256 1258 1125 992 1012 1125 1237 1257 1226 1196 1206 1217 1267 1318 1322 1325 1362 1399
$$ packed form
1941A072P9Q0K1K1n8n7j3j3j3j4R2R2J4J3qrrrQQPQjjkjo0o0j4j3J8J9J9J8jkkkJ2J2o6o6
1936A119K8K8j8j9n7n7j1j1N3N2n7n7NNMNJ2J1N9N9K3K4K3K4n9n8j2j2L0K9K3K4R0ln9o0j0
1931A170j1L6L6k6k6k5k6j5j5j15k1J63J63O0r6j28l4J3J3l5l5M3M3ONOOk7k7k6k7O5O4l8
1927A139l9l8N6N0N0J0J1l6l6n2n1K6K6k9l0k9l0L2L2j4j5m7m7MR7J47N4k8k8J7J6J7J7J5
1923A267J5J5J5kkm8m9j6j6j7j6L0K9j7j8L4L3m4m5l4l4l3l4M3M2J15J15P7j6p3p4J4J5l3
1919A238l3j7j7O1O1j3j2n9n9j08j08q6P0J52J52P4k0J4J3QQl3l2l3l2M1M2l7l6k7k7J9K0
1915A184j1j0j1j0lmJ00J00J07J3p5p4k4k3K3K3m0m0m0m0l9l9O5O4P3k1m7m7K5K6K5K5ppq
1910A233pJ7J8J7J7l4l3l4l4L4L4L4L3j0j0j0j0JKj33j33K0J13J12K0l1l0J0J1N0N1MLL7L7
$$ plain form
1906 1399 1442 1392 1304 1216 1263 1310 1333 1356 1275 1195 1186 1270 1302 1334 1312 1290 1315 1339 1320 1301 1204 1107 1149 1190 1185 1179 1176 1173 1169 1166 1190 1213 1237 1261 1223 1186 1195 1204 1195
1901 1195 1186 1177 1168 1215 1262 1258 1160 1068 1069 1153 1236 1159 1081 1113 1144 1144 1143 1143 1142 1129 1116 1150 1183 1216 1249 1204 1159 1185 1211 1284 1357 1310 1263 1216 1169 1105 1041 978 914
1896 914 982 1049 1117 1184 1177 1171 1164 1158 1174 1191 1208 1225 1174 1124 1208 1292 1290 1194 1099 1097 1168 1239 1238 1238 1244 1250 1209 1168 1143 1118 1093 1067 1087 1107 1179 1158 1099 1040 1115 1191
1892 1191 1175 1160 1145 1129 1171 1213 1209 1204 1255 1306 1332 1264 1182 1101 1123 1145 1189 1234 1232 1230 1247 1265 1235 1206 1186 1166 1192 1219 1208 1196 1185 1174 1145 1117 1135 1154
1887 1154 1129 1104 1080 1055 1149 1242 1311 1285 1204 1123 1177 1230 1298 1366 1324 1283 1211 1139 1114 1089 1077 1065 1053 1041 1051 1062 1072 1083 1098 1113 1129 1144 1193 1243
1883 1243 1345 1353 1323 1292 1333 1375 1345 1316 1286 1256 1266 1276 1286 1296 1282 1269 1208 1148 1218 1288 1302 1222 1142 1063 1086 1110 1175 1240 1197 1153 1127 1100 1152 1204
1879 1204 1234 1265 1186 1108 1011 915 959 1003 1110 1216 1244 1272 1258 1244 1230 1217 1218 1220 1269 1318 1325 1333 1341 1349 1329 1309 1249 1188 1155 1215 1281 1254 1151 1143 1216 1289
1874 1289 1257 1225 1240 1255 1261 1266 1272 1278 1324 1371 1371 1371 1324 1277 1230 1183 1154 1124 1095 1065 992 919 986 1053 1066 1078 1132 1185 1217 1155 1146 1137 1141 1146 1150 1155 1200 1245 1244 1243 1237 1232
$$ packed form
1906A399M3n0q8q8M7M7K3K3q1q0rQ4L2L2k2k2K5K4j9j9r7r7M2M1nollmlK4K3K4K4l8l7RRr
1901A195rrrM7M7mr8r2JQ4Q3p7p8L2L1%j%jj3j3L4L3L3L3m5m5K6K6P3P3m7m7m7m7o4o4o3o4
1896I14O8O7O8O7popoJ6J7J7J7n1n0Q4Q4kr6r5kP1P1j%OOm1m1k5k5k5k6K0K0P2k1n9n9P5P6
1892A191j6j5j5j6M2M2mnN1N1K6o8q2q1K2K2M4M5kkJ7J8l0k9k0k0K6K7j1j2j1j1k9k8J8J9
1887A154k5k5k4k5R4R3O9k6q1q1N4N3O8O8m2m1p2p2k5k5j2j2j2j2J0J1J0J1J5J5J6J5M9N0
1883A243J02Ql0l1M1M2l0k9l0l0J0J0J0J0j4j3o1o0P0P0J4q0q0p9K3K4O5O5m3m4k6k7N2N2
1879A204L0L1p9p8r7r6M4M4J07J06K8K8j4j4j4j3JKM9M9PQQQk0k0o0o1l3O0O6k7j03qP3P3
1874A289l2l2J5J5ONOOM6M7%%m7m7m7m7k9l0k9l0p3p3O7O7J3J2N4N3L2o2rrMNMNM5M5jjon
$$ plain form
1869 1232 1227 1221 1165 1109 1078 1141 1212 1283 1250 1217 1209 1201 1192 1184 1114 1044 1084 1123 1156 1189 1149 1109 1039 1061 1110 1158 1184 1209 1282 1354 1347 1340 1260 1180 1050 1013 1095 1177
1865 1177 1233 1288 1297 1306 1334 1362 1390 1418 1348 1278 1215 1151 1100 1144 1234 1231 1110 990 982 1069 1108 1147 1192 1237 1221 1206 1190 1175 1147 1119 1086 1146 1200 1253 1203
1860 1203 1153 1136 1119 1180 1241 1252 1264 1197 1130 1114 1097 1080 1063 1161 1258 1309 1359 1360 1360 1288 1216 1157 1192 1220 1249 1244 1239 1234 1230 1161 1091 1163 1234 1218 1202 1186 1170
1856 1170 1134 1097 1108 1118 1061 1005 1030 1149 1165 1088 1017 1039 1109 1178 1176 1173 1223 1273 1245 1218 1217 1216 1216 1215 1195 1175 1155 1135 1193 1252 1263 1275 1212 1150 1134 1119 1182
1851 1182 1245 1308 1372 1320 1268 1164 1153 1184 1216 1206 1197 1230 1264 1225 1186 1164 1236 1307 1285 1264 1242 1293 1344 1362 1379 1350 1320 1279 1238 1244 1250 1309 1369 1351 1332
1847 1332 1289 1247 1204 1161 1123 1085 1094 1103 1102 1101 1100 1100 1106 1113 1198 1283 1273 1263 1253 1244 1253 1262 1271 1281 1258 1235 1290 1345 1354 1364 1373 1382 1295 1208 1171 1229 1272 1221 1183 1144 1146 1149 1170
1842 1170 1286 1346 1312 1227 1143 1119 1095 1070 1046 1091 1135 1179 1223 1246 1269 1245 1220 1186 1152 1164 1176 1159 1143 1126 1109 1130 1152 1174 1195 1243 1291 1292 1294 1282 1269
1838 1269 1257 1245 1118 991 957 1002 1062 1075 1072 1069 1045 1021 997 973 1056 1139 1175 1211 1204 1197 1236 1276 1246 1216 1187 1157 1083 1009 1027 1123 1179 1157 1155 1199 1226 1206
$$ packed form
1869A232non6n6l1O3P1P1l3l3qqrqp0p0M0L9L3L3m0m0p0K2M9M8K6K5P3P2ppq0q0j30l7Q2Q2
1865A177N6N5RRK8K8K8K8p0p0o3o4n1M4R0lj21j20qQ7L9L9M5M5j6j5j6j5k8k8l3O0N4N3n0
1860A203n0j7j7O1O1J1J2o7o7j6j7j7j7R8R7N1N0J%p2p2n9L5K8K9nnnmo9p0P2P1j6j6j6j6
1856A170l6l7J1J0n7n6K5J19J6p7p1K2P0O9klN0N0k8k7jj%jk0k0k0k0N8N9J1J2o3o2j6j5O3
1851A182O3O3O4n2n2j04j1L1L2j0rL3L4l9l9k2P2P1k2k1k2N1N1J8J7k9l0m1m1OON9O0j8j9
1847A332m3m2m3m3l8l8RRjjj%OPQ5Q5j0j0j0rRRRJ0k3k3N5N5RJ0RRq7q7l7N8M3n1l8l9KLK1
1842A170J16O0l4q5q4k4k4k5k4M5M4M4M4K3K3k4k5l4l4J2J2j7j6j7j7K1K2K2K1M8M8JKj2j3
1838A269j2j2j27j27l4M5O0J3llk4k4k4k4Q3Q3L6L6ppL9M0l0l0k9l0p4p4J8R6N6k2kM4K7k0
$$ plain form
1833 1206 1142 1125 1169 1214 1256 1298 1275 1173 1088 1051 1048 1045 1061 1123 1200 1198 1138 1126 1172 1218 1189 1160 1186 1212 1236 1259 1200 1095 1049 1082 1129 1177 1224 1271 1286
1829 1286 1223 1139 1164 1275 1338 1294 1250 1309 1368 1349 1330 1331 1333 1334 1335 1302 1268 1312 1356 1314 1271 1229 1186 1162 1138 1113 1089 1123 1157 1144 1132 1147 1162 1250 1338 1406
1824 1406 1396 1320 1245 1183 1120 1105 1090 1121 1153 1137 1122 1187 1252 1239 1226 1215 1204 1271 1338 1433 1527 1513 1498 1449 1400 1398 1396 1371 1347 1322 1298 1246 1194 1142 1090
1820 1090 1174 1258 1295 1332 1362 1392 1344 1296 1257 1217 1256 1295 1294 1293 1292 1291 1256 1222 1140 1059 998 938 1048 1159 1238 1317 1286 1255 1195 1134 1151 1168 1205 1242 1279
1816 1279 1316 1295 1273 1252 1230 1214 1198 1228 1259 1212 1166 1166 1167 1179 1191 1249 1308 1258 1209 1206 1203 1239 1274 1309 1345 1335 1325 1316 1306 1303 1301 1220 1139 1196 1254 1234 1213 1215
1811 1215 1216 1218 1220 1211 1202 1192 1183 1209 1234 1259 1284 1285 1286 1287 1288 1245 1203 1207 1211 1204 1196 1142 1087 1108 1129 1149 1170 1155 1141 1126 1112 1152 1192 1154 1116 1194 1271 1270 1269 1242 1215 1188
1806 1188 1161 1156 1151 1193 1236 1251 1266 1203 1141 1127 1113 1202 1292 1317 1249 1135 1113 1171 1229 1189 1150 1161 1265 1312 1358 1320 1189 1057 1020 1091 1163 1215 1174
1802 1174 1083 992 1004 1016 1014 1012 964 915 964 1013 1015 1017 1053 1089 1167 1244 1299 1260 1196 1132 1113 1093 1073 1053 1080 1106 1132 1158 1147 1137 1126 1116 1159 1202 1198 1195 1210
$$ packed form
1833A206o4j7M4M5M2M2k3j02q5l7llJ6O2P7ko0j2M6M6k9k9K6K6K4K3n9j05m6L3M7M8M7M7J5
1829A286o3q4K5J11O3m4m4N9N9j9j9JKJJl3l4M4M4m2m3m2m3k4k4k5k4L4L4j3j2J5J5Q8Q8O8
1824A406j0p6p5o2o3j5j5L1L2j6j5O5O5j3j3j1j1O7O7R5R4j4j5m9m9kkk5k4k5k4n2n2n2n2
1820A090Q4Q4L7L7L0L0m8m8l9m0L9L9jjjjl5l4q2q1o1o0J10J11P9P9l1l1o0o1J7J7L7L7L7
1816A279L7k1k2k1k2j6j6L0L1m7m6%JJ2J2N8N9n0m9llL6L5L5L6j0j0rj0lkq1q1N7N8k0k1K
1811A215JKKrrj0rK6K5K5K5JJJJm3m2MMpqn4n5K1K1K0K1j5j4j5j4M0M0l8l8P8P7jjk7k7k7
1806A188k7nnM2M3J5J5o3o2j4j4Q9R0K5o8j14k2N8N8m0l9J1J04M7M6l8j31j32l7P1P2N2m1
1802A174r1r1J2J2kkm8m9M9M9KKL6L6P8P7N5l9o4o4j9k0k0k0K7K6K6K6j1j0j1j0M3M3mlJ5
$$ plain form
1798 1210 1225 1241 1256 1225 1195 1164 1134 1129 1125 1120 1115 1201 1286 1293 1300 1297 1294 1213 1131 1132 1133 1134 1135 1153 1172 1190 1208 1187 1165 1144 1122 1150 1179 1254 1329 1407 1484 1484 1484 1465 1446
1793 1446 1380 1314 1372 1429 1409 1389 1343 1296 1250 1204 1203 1203 1202 1202 1198 1194 1190 1186 1231 1276 1242 1209 1168 1127 1164 1201 1257 1313 1259 1205 1176 1146 1117 1087 1114 1141 1168 1195
1788 1195 1229 1264 1251 1239 1209 1179 1149 1119 1077 1035 1102 1169 1207 1245 1283 1321 1318 1314 1264 1214 1181 1148 1115 1082 1059 1035 1064 1093 1126 1253 1379 1412 1348 1283
1784 1283 1263 1337 1401 1370 1320 1270 1301 1332 1285 1239 1188 1137 1133 1129 1168 1207 1292 1378 1379 1380 1303 1225 1202 1178 1154 1131 1228 1325 1309 1200 1102 1097 1040 982 934 979
1779 979 1050 1120 1152 1185 1170 1156 1078 1000 1000 1000 1015 1031 1046 1061 1087 1113 1067 1021 1067 1208 1337 1309 1285 1261 1279 1204 1137 1070 1106 1142 1177 1212 1258 1210 1169
1775 1169 1205 1314 1345 1255 1166 1212 1259 1286 1313 1341 1368 1384 1401 1371 1340 1281 1221 1240 1258 1250 1243 1235 1227 1258 1289 1244 1152 1086 1129 1212 1248 1225 1202 1223 1244 1253
1771 1253 1261 1270 1278 1288 1297 1260 1222 1167 1112 1198 1283 1279 1275 1268 1261 1188 1069 979 967 1048 1130 1186 1163 1116 1116 1158 1153 1109 1064 1126 1188 1195 1201 1207 1214 1209 1204 1247 1289 1285 1281 1278 1274 1275
1765 1275 1277 1278 1279 1290 1301 1265 1229 1178 1126 1122 1117 1118 1120 1121 1122 1123 1125 1126 1127 1179 1230 1172 1113 1108 1103 1099 1094 1120 1146 1172 1199 1245 1292 1307 1245 1176 1153 1177 1202 1196 1190 1231 1273 1295
$$ packed form
1798A210J5J6J5l1l0l1l0nmnnQ6Q5PPllq1q2JJJJJ8J9J8J8k1k2k1k2K8K9P5P5P8P7%%j9j9
1793A446o6o6N8N7k0k0m6m7m6m6j%j%mmmmM5M5l4l3m1m1L7L7N6N6n4n4k9l0k9l0K7K7K7K7
1788A195L4L5j3j2l0l0l0l0m2m2O7O7L8L8L8L8lmn0n0l3l3l3l3k3k4K9K9L3J27J26L3o4o5
1784A283k0P4O4l1n0n0L1L1m7m6n1n1mmL9L9Q5Q6JJp7p8k3k4k4k3R7R7j6j09r8nn7n8m8M5
1779I79P1P0L2L3j5j4p8p8%%J5J6J5J5K6K6m6m6M6J41J29k8k4k4J8p5o7o7L6L6L5L5M6m8m1
1775A169L6J09L1r0q9M6M7K7K7K8K7J6J7l0l1n9o0J9J8qpqqL1L1m5r2o6M3Q3L6k3k3K1K1R
1771A253QRQJ0Rl7l8n5n5Q6Q5mmppp3j19r0j2Q1Q2N6k3m7%M2nm4m5O2O2POOPnnM3M2mmlmJ
1765A275KJJJ1J1l6l6n1n2mnJKJJJKJJN2N1n8n9nnmnK6K6K6K7M6M7J5o2o9k3K4K5ooM1M2K2
$$ plain form
1760 1295 1318 1340 1363 1303 1242 1229 1216 1261 1306 1304 1302 1342 1382 1422 1462 1446 1429 1413 1396 1503 1611 1605 1505 1359 1306 1304 1302 1258 1214 1169 1125 1115 1104 1141 1178
1756 1178 1176 1174 1219 1264 1287 1310 1254 1199 1220 1241 1263 1284 1241 1198 1160 1123 1056 1084 1167 1251 1249 1247 1291 1381 1484 1493 1423 1354 1294 1329 1384 1392 1356 1320 1328 1335 1331 1327 1323
1751 1323 1319 1310 1301 1291 1282 1212 1143 1186 1323 1414 1411 1389 1367 1356 1344 1333 1321 1343 1364 1338 1313 1289 1266 1242 1219 1219 1219 1267 1314 1279 1244 1210 1175 1191 1207 1270 1333
1746 1333 1275 1218 1238 1305 1344 1290 1233 1270 1316 1269 1176 1130 1195 1261 1283 1305 1370 1435 1475 1420 1377 1333 1330 1327 1278 1230 1228 1226 1204 1183 1161 1139 1187 1234 1235 1236 1216
1742 1216 1195 1253 1311 1336 1362 1364 1366 1316 1265 1238 1211 1253 1295 1291 1286 1254 1223 1300 1378 1407 1437 1442 1448 1418 1387 1397 1407 1395 1289 1206 1217 1277 1338 1326 1314 1312 1310 1332
1737 1332 1353 1326 1298 1223 1148 1126 1103 1081 1059 1143 1227 1264 1301 1336 1370 1417 1370 1306 1336 1383 1337 1245 1154 1103 1053 1055 1058 1138 1219 1187 1155 1129 1103 1099 1187 1270
1733 1270 1353 1341 1329 1420 1511 1518 1432 1375 1318 1292 1266 1263 1261 1325 1389 1376 1362 1343 1324 1382 1441 1372 1303 1312 1321 1275 1229 1287 1344 1341 1245 1190 1228 1273 1225 1157 1089
1728 1089 1121 1154 1186 1219 1270 1321 1325 1329 1319 1308 1251 1193 1244 1295 1299 1303 1316 1330 1343 1356 1283 1210 1214 1219 1257 1294 1379 1463 1416 1369 1369 1416 1450 1407 1364 1320 1301 1282
$$ packed form
1760A295K3K2K3o0o1j3j3M5M5kkM0M0M0M0j6j7j6j7J07J08oj00j46n3kkm4m4m5m4j0j1L7L7
1756A178kkM5M5K3K3n6n5K1K1K2K1m3m3l8l7o7K8Q3Q4kkM4R0J03Rp0o9o0L5N5Ql6l6QPmmm
1751A323mrrj0rp0o9M3J37R1lk2k2j1j2j1j2K2K1k6k5k4k3k4k3%%M8M7l5l5l4l5J6J6O3O3
1746A333n8n7K0O7L9n4n7L7M6m7r3m6O5O6K2K2O5O5M0n5m3m4llm9m8kkk2k1k2k2M8M7JJk0
1742A216k1N8N8K5K6KKn0n1k7k7M2M2mnl2l1P7P8K9L0NOl0l1J0J0j2j06q3J1O0O1j2j2kkK2
1737A332K1k7k8p5p5k2k3k2k2Q4Q4L7L7L5L4M7m7o4L0M7m6r2r1n1n0KLQ0Q1l2l2k6k6mQ8Q3
1733A270Q3j2j2R1R1Pq6n7n7k6k6lkO4O4j3j4j9j9N8N9o9o9RRm6m6N8N7lr6n5L8M5m8o8o8
1728A089L2L3L2L3N1N1MMj0j1n7n8N1N1MMJ3J4J3J3p3p3MNL8L7Q5Q4m7m7%M7L4m3m3m4j9j9
$$ plain form
1724 1282 1307 1332 1308 1236 1220 1283 1365 1370 1314 1258 1263 1267 1318 1369 1371 1373 1298 1222 1177 1132 1192 1251 1277 1225 1194 1240 1307 1328 1306 1332 1379 1427 1430 1434 1438 1442 1400 1358 1355
1719 1355 1352 1302 1253 1264 1276 1311 1347 1307 1267 1250 1234 1232 1230 1181 1132 1184 1235 1239 1244 1202 1159 1164 1168 1173 1178 1160 1142 1108 1075 1120 1165 1210 1254 1221 1188 1217 1246 1298 1350
1714 1350 1345 1339 1330 1322 1306 1244 1206 1246 1355 1386 1325 1265 1274 1282 1291 1300 1280 1261 1241 1222 1179 1137 1095 1052 1076 1100 1124 1148 1159 1170 1182 1193 1209 1225 1242 1258 1340 1422
1709 1422 1395 1367 1366 1366 1287 1208 1180 1153 1172 1191 1251 1310 1291 1273 1292 1311 1331 1350 1336 1322 1308 1295 1260 1225 1299 1374 1425 1476 1480 1484 1479 1474 1469 1464 1446 1429 1364 1299
1705 1299 1238 1176 1224 1271 1324 1378 1322 1266 1304 1341 1332 1323 1338 1353 1368 1383 1330 1277 1303 1328 1282 1236 1269 1301 1329 1357 1338 1319 1270 1221 1219 1217 1269 1322 1375 1428
1700 1428 1445 1462 1369 1277 1302 1328 1307 1285 1348 1411 1427 1442 1465 1487 1431 1375 1348 1322 1373 1425 1356 1288 1298 1308 1307 1305 1303 1301 1326 1351 1376 1401 1369 1337 1352 1367
1696 1367 1401 1434 1420 1406 1376 1346 1316 1285 1258 1230 1280 1331 1234 1137 1096 1150 1161 1172 1236 1300 1378 1455 1480 1505 1537 1475 1388 1301 1293 1285 1380 1475 1531 1493 1502 1511
1692 1511 1521 1439 1356 1367 1408 1449 1387 1324 1387 1449 1434 1418 1420 1422 1477 1437 1315 1193 1179 1258 1348 1344 1321 1298 1351 1403 1408 1414 1401 1388 1322 1350 1402 1453 1432 1412
$$ packed form
1724A282K5K5k4p2j6O3Q2Nn6n6NMN1N1KKp5p6m5m5O0N9K6n2l1M6O7K1k2K6M7M8LMMMm2m2l
1719A355ln0m9J1J2L5L6m0m0j7j6kkm9m9N2N1MNm2m3NMNNj8j8l4l3M5M5M5M4l3l3K9K9N2N2
1714A350norqj6o2l8M0J09L1o1o0RQRRk0j9k0j9m3m2m2m3K4K4K4K4J1J1J2J1J6J6J7J6Q2Q2
1709A422k7k8j%p9p9k8k7J9J9O0N9j9j8J9J9K0J9j4j4j4j3l5l5P4P5N1N1MMnnnnj8j7o5o5
1705A299o1o2M8M7N3N4n6n6L8L7rrJ5J5J5J5n3n3K6K5m6m6L3L2K8K8j9j9m9m9kkN2N3N3N3
1700A428J7J7r3r2K5K6k1k2O3O3J6J5K3K2n6n6k7k6N1N2o9o8J0J0jkkkK5K5K5K5l2l2J5J5
1696A367L4L3j4j4l0l0l0l1k7k8N0N1r7r7m1N4J1J1O4O4P8P7K5K5L2o2q7q7qqR5R5N6l8RR
1692A511J0q2q3J1M1M1o2o3O3O2j5j6KKN5m0j22j22j4P9R0mk3k3N3N2NOj3j3o6K8N2N1k1k0
$$ plain form
1687 1412 1367 1323 1226 1222 1308 1393 1375 1357 1404 1451 1419 1388 1379 1371 1362 1353 1394 1435 1429 1422 1377 1332 1287 1242 1326 1409 1437 1370 1318 1266 1255 1244 1311 1377 1334 1291 1265 1239
1683 1239 1212 1186 1155 1124 1140 1156 1172 1188 1157 1126 1170 1214 1258 1302 1288 1273 1259 1244 1267 1289 1359 1428 1471 1514 1557 1600 1536 1472 1408 1343 1353 1363 1420 1477
1678 1477 1421 1365 1356 1348 1344 1340 1336 1332 1382 1432 1372 1313 1304 1294 1363 1431 1440 1448 1410 1371 1359 1347 1335 1322 1382 1442 1424 1406 1349 1292 1234 1177 1160 1142 1234 1326 1306 1286 1265
1674 1265 1245 1311 1377 1443 1509 1520 1530 1494 1458 1440 1422 1404 1386 1299 1212 1203 1194 1308 1423 1365 1308 1247 1185 1171 1156 1222 1287 1274 1261 1262 1263 1311 1358 1357 1355 1245
1669 1245 1134 1132 1131 1176 1222 1260 1298 1290 1281 1282 1284 1285 1286 1304 1321 1339 1357 1382 1408 1324 1240 1211 1182 1232 1281 1308 1336 1317 1298 1286 1273 1308 1343 1406 1470 1395 1272
1665 1272 1232 1285 1286 1287 1342 1444 1498 1458 1376 1341 1352 1363 1352 1342 1331 1321 1352 1383 1371 1358 1364 1417 1496 1481 1441 1402 1435 1468 1476 1484 1446 1407 1466 1524 1532 1446 1373
1660 1373 1393 1413 1340 1266 1286 1300 1313 1306 1392 1481 1476 1374 1319 1340 1362 1326 1290 1301 1312 1310 1309 1307 1305 1342 1380 1417 1454 1480 1506 1455 1357 1271 1279 1371 1463 1456 1448 1394
1656 1394 1340 1262 1184 1185 1185 1265 1345 1379 1412 1400 1388 1375 1363 1380 1398 1369 1339 1320 1300 1281 1261 1245 1229 1260 1291 1297 1303 1263 1222 1236 1249 1310 1370 1355 1341 1326
$$ packed form
1687A412m5m4r7mQ6Q5j8j8M7M7l2l1rqrrM1M1opm5m5m5m5Q4Q3K8o7n2n2j1j1O7O6m3m3k6k6
1683A239k7k6l1l1J6J6J6J6l1l1M4M4M4M4j4j5j4j5K3K2P0O9M3M3M3M3o4o4o4o5J0J0N7N7
1678A477n6n6rqmmmmN0N0o0n9rj0O9O8RQl8l9j2j2j2j3O0O0j8j8n7n7n8n7j7j8R2R2k0k0k1
1674A265k0O6O6O6O6J1J0l6l6j8j8j8j8q7q7rrJ14J15n8n7o1o2j4j5O6O5j3j3JJM8M7jkj10
1669A245j11kjM5M6L8L8qrJKJJJ8J7J8J8K5K6q4q4k9k9N0M9K7K8j9j9j2j3L5L5O3O4p5j23
1665A272m0N3JJN5J02N4m0q2l5J1J1j1j0j1j0L1L1j2j3ON3P9j5m0l9L3L3QQl8l9N9N8Qq6p3
1660A373K0K0p3p4K0J4J3pQ6Q9nj02n5K1K2l6l6J1J1kjkkL7L8L7L7K6K6n1r8q6QR2R2pqn4
1656A394n4p8p8J%Q0Q0L4L3j2j2j3j2J7J8k9l0j9k0j9k0j6j6L1L1OOm0m1J4J3O1O0j5j4j5
$$ plain form
1651 1326 1311 1352 1394 1388 1383 1395 1407 1419 1431 1404 1377 1396 1416 1400 1385 1394 1402 1424 1446 1417 1295 1211 1221 1339 1456 1460 1370 1309 1248 1189 1131 1098 1158 1212 1265
1647 1265 1247 1228 1232 1236 1240 1244 1324 1403 1432 1367 1323 1373 1410 1448 1500 1553 1611 1575 1563 1551 1533 1515 1494 1473 1458 1442 1361 1373 1410 1447 1402 1356 1358 1359 1366 1373 1380 1387 1410
1642 1410 1433 1456 1478 1458 1438 1418 1398 1392 1386 1380 1374 1346 1317 1289 1260 1229 1198 1245 1292 1310 1328 1304 1281 1295 1403 1511 1525 1421 1318 1380 1442 1489 1535 1535 1535
1638 1535 1540 1544 1525 1506 1435 1364 1371 1379 1401 1423 1374 1324 1275 1321 1391 1462 1472 1482 1414 1346 1315 1284 1331 1378 1415 1451 1487 1524 1528 1532 1464 1396 1362 1422 1530 1592 1573
1633 1573 1507 1464 1421 1448 1476 1511 1500 1442 1476 1565 1654 1615 1577 1498 1418 1355 1385 1441 1403 1331 1306 1358 1410 1386 1362 1415 1469 1451 1433 1462 1490 1447 1403 1407 1410
1629 1410 1350 1291 1316 1435 1498 1515 1540 1565 1556 1546 1537 1527 1508 1490 1549 1608 1637 1667 1778 1982 2124 2171 2225 2279 2255 2137 2020 1949 1911 1826 1741 1703
1625 1703 1675 1600 1529 1504 1506 1509 1514 1519 1540 1561 1535 1509 1447 1384 1457 1529 1537 1451 1406 1455 1472 1396 1278 1255 1370 1484 1520 1463 1402 1389 1421 1453 1409 1365 1368 1371
1621 1371 1347 1322 1298 1274 1301 1328 1309 1289 1339 1389 1361 1333 1329 1324 1366 1409 1455 1502 1502 1502 1438 1374 1358 1341 1423 1506 1588 1670 1647 1624 1601 1578 1522 1466 1488 1510
$$ packed form
1651A326j5M1M2onJ2J2J2J2k7k7J9K0j6j5RQK2K2k9j22q4J0J18J17Mr0o1o1n9n8l3O0N4N3
1647A265j8j9MMMMQ0P9K9o5m4N0L7L8N2N3N8l6j2j2j8j8k1k1j5j6q1J2L7L7m5m6KJPPPPK3
1642A410K3K3K2k0k0k0k0ooook8k9k8k9l1l1M7M7J8J8k4k3J4J08J08J4j04j03O2O2M7M6%%
1638A535NMj9j9p1p1PQK2K2m9n0m9M6P0P1J0J0o8o8l1l1M7M7L7L6L6L7MMo8o8l4O0J08O2j9
1633A573o6m3m3K7K8L5j1n8L4Q9Q9l9l8p9q0o3L0N6l8p2k5N2N2k4k4N3N4j8j8K9K8m3m4ML
1629A410o0n9K5J19O3J7K5K5rj0rj0j9j8N9N9K9L0J11K04J42M7N4N4k4j18j17p1l8q5q5l8
1625A703k8p5p1k5KLNNK1K1k6k6o2o3P3P2Qq6m5M9J7p6j18k3J15J14L6n7o1j3L2L2m4m4LL
1621A371k4k5k4k4K7K7j9k0N0N0k8k8mnM2M3M6M7%%o4o4j6j7Q2Q3Q2Q2k3k3k3k3n6n6K2K2
$$ plain form
1616 1510 1482 1454 1450 1445 1468 1491 1537 1583 1590 1597 1558 1518 1526 1534 1495 1456 1491 1526 1561 1597 1559 1520 1482 1444 1454 1463 1473 1482 1463 1444 1503 1562 1595 1628 1638 1648 1549 1449
1612 1449 1428 1407 1407 1406 1484 1562 1581 1600 1572 1545 1423 1302 1321 1340 1399 1457 1469 1481 1441 1401 1439 1477 1497 1517 1538 1558 1595 1632 1668 1705 1731 1757 1783 1810
1607 1810 1762 1714 1644 1573 1554 1536 1565 1593 1626 1659 1614 1569 1547 1525 1504 1482 1516 1551 1562 1573 1521 1470 1497 1523 1493 1463 1479 1496 1544 1593 1564 1534 1436 1337
1603 1337 1285 1234 1268 1303 1338 1373 1440 1506 1548 1496 1433 1370 1468 1565 1639 1620 1647 1674 1690 1611 1509 1501 1525 1550 1471 1392 1335 1279 1300 1322 1344 1367 1389 1412
1599 1412 1452 1493 1424 1355 1363 1372 1458 1545 1619 1693 1658 1623 1576 1529 1586 1642 1672 1609 1467 1419 1490 1561 1581 1508 1459 1411 1435 1458 1515 1572 1551 1530 1507 1485 1540
1595 1540 1596 1615 1635 1672 1709 1715 1627 1569 1510 1540 1571 1554 1537 1558 1579 1647 1714 1700 1685 1694 1702 1733 1763 1715 1667 1597 1528 1567 1607 1593 1579 1565 1551 1548 1544 1564 1584
1590 1584 1528 1473 1443 1506 1603 1700 1659 1524 1398 1366 1416 1465 1514 1563 1611 1660 1573 1485 1392 1392 1427 1462 1496 1531 1558 1492 1425 1453 1499 1544 1607 1716 1825
1586 1825 1778 1624 1471 1446 1514 1557 1553 1561 1570 1622 1675 1673 1672 1671 1670 1690 1711 1732 1752 1793 1833 1795 1757 1801 1846 1812 1779 1749 1720 1737 1754 1772 1790 1761 1732 1705 1678
$$ packed form
1616A510k8k8mnK3K3M6M6PPl9m0QQl9l9L5L5L5L6l8l9l8l8J0RJ0Rj9j9N9N9L3L3J0J0r9j00
1612A449k1k1%jP8P8J9J9k8k7j22j21J9J9N9N8J2J2m0m0L8L8K0K0K1K0L7L7L6L7K6K6K6K7
1607A810m8m8p0p1j9j8K9K8L3L3m5m5k2k2k1k2L4L5J1J1n2n1K7K6l0l0J6J7M8M9k9l0r8r9
1603A337n2n1L4L5L5L5O7O6M2n2o3o3R8R7P4j9K7K7J6p9j02qK4K5p9p9n7n6K1K2K2K3K2K3
1599A412M0M1o9o9QRQ6Q7P4P4l5l5m7m7N7N6L0o3j42m8P1P1K0p3m9m8K4K3N7N7k1k1k3k2N5
1595A540N6J9K0L7L7Oq8n8n9L0L1j7j7K1K1O8O7j4j5RQL1L0m8m8p0o9L9M0j4j4j4j4lmK0K0
1590A584n6n5l0O3R7R7m1j35j26l2N0M9M9M9M8M9q7q8r3%L5L5L4L5K7o6o7K8M6M5O3J09J09
1586A825m7j54j53k5O8M3mQRN2N3kjjjK0K1K1K0M1M0l8l8M4M5l4l3l0k9J7J7J8J8k9k9k7k7
$$ plain form
1582 1678 1651 1624 1641 1658 1676 1693 1714 1736 1710 1684 1721 1757 1746 1735 1687 1638 1698 1759 1755 1751 1715 1726 1740 1661 1585 1603 1627 1650 1648 1692 1775 1765 1675 1586 1575 1658
1577 1658 1741 1731 1726 1721 1711 1700 1693 1687 1757 1874 1937 1906 1826 1793 1791 1789 1790 1791 1825 1859 1893 1927 1957 1987 1938 1890 1904 1918 1947 2023 2101 2086 1985 1885 1904 1923 1941
1573 1941 1960 1926 1891 1857 1822 1842 1861 1880 1899 1929 1960 2037 2114 2068 2022 1976 1930 1984 2038 1983 1928 1947 1966 1985 2004 2090 2177 2155 2132 2131 2130 2129 2128 2256 2383
1569 2383 2433 2483 2551 2619 2787 2955 3096 3082 2921 2760 2646 2533 2497 2461 2443 2424 2359 2294 2369 2445 2379 2314 2326 2337 2396 2454 2457 2460 2462 2465 2536 2606 2536
1565 2536 2466 2523 2581 2592 2602 2618 2634 2696 2758 2794 2831 2867 2903 2930 2957 3032 3106 3215 3325 3434 3543 3658 3774 3686 3599 3626 3654 3681 3709 3709 3709 3819
1561 3819 3929 4046 4163 4234 4304 4371 4438 4504 4571 4714 4856 5046 5236 5418 5601 5784 5966 6176 6387 6597 6807 7148 7490 8035 8580
1558 8580 9266 9952 10601 11250 11979 12865 13858 14944 16187 17648 19355 21342 23747 26744 30564 35352 41400 49165 59142
1555 59142 71646 86924 105165 125729 145761 159800 162197 150955 129445 104429 81753 63977 50852 41225
$$ packed form
1582A678k7k7J7J7J8J7K1K2k6k6L7L6j1j1m8m9O0O1mml6J1J4p9p6J8K4K3kM4Q3j0r0q9j1Q3
1577A658Q3j0nnj0j1poP0J17O3l1q0l3kkJJL4L4L4L4L0L0m9m8J4J4K9P6P8j5j01j00J9J9J8
1573A941J9l4l5l4l5K0J9J9J9L0L1P7P7m6m6m6m6N4N4n5n5J9J9J9J9Q6Q7k2k3jjjjJ28J27
1569B383N0N0O8O8J68J68J41j4j61j61j14j13l6l6j8j9o5o5P5P6o6o5J2J1N9N8LLKLP1P0p0
1565B536p0N7N8J1J0J6J6O2O2L6L7L6L6K7K7P5P4J09J10J09J09J15J16q8q7K7K8K7K8%%J10
1561C819J10J17J17P1P0O7O7O6O7J43J42J90J90J82J83J83J82K10K11K10K10L41L42N45N45
1558H580O86O86O49O49P29Q86R93J086J243J461J707J987K405K997L820M788O048P765R977
1555E9142J2504J5278J8241K0564K0032J4039K397j1242k1510k5016k2676j7776j3125r627
$$ plain form
1554 41225 34127 28968 25214 22424 20227 18398 16726 15129 13533 12040 10703 9569 8591 7691 6947 6370 5950 5561 5172
1551 5172 4862 4553 4322 4090 4011 3932 3833 3641 3481 3415 3399 3384 3329 3275 3174 3072 3007 2942 2805 2668 2517 2460 2428 2397 2299 2202 2155 2201 2297
1548 2297 2299 2162 2026 1940 1948 1951 1953 2010 2067 2042 1924 1809 1789 1756 1724 1739 1755 1770 1786 1785 1784 1711 1639 1561 1577 1587 1597 1599 1600 1583 1471 1389 1400 1494 1587 1630
1543 1630 1673 1639 1604 1557 1511 1511 1511 1558 1604 1610 1616 1620 1717 1861 1912 1849 1787 1765 1744 1732 1720 1689 1564 1458 1446 1485 1523 1524 1525 1525 1526 1591 1657 1697 1644 1604 1564
1539 1564 1525 1485 1412 1432 1510 1587 1535 1484 1567 1650 1726 1710 1745 1781 1898 2015 2044 1979 1913 1846 1852 1857 1860 1863 1865 1868 1808 1749 1745 1836 1924 2013 1998 1983 2003 2023 2043
1534 2043 2063 2044 2026 2055 2084 2152 2220 2211 2201 2208 2215 2228 2241 2260 2372 2516 2660 2810 3054 3365 3675 3960 4400 5092 6064 7335 8823 10343
1531 10343 11520 12027 11629 10396 8695 7028 5704 4747 4009 3414 2976 2676 2469 2331 2193 2108 2022 2029 2035 1995 1955 1904 1853 1802 1751
1528 1751 1744 1737 1710 1590 1534 1572 1610 1554 1500 1540 1630 1720 1715 1710 1705 1699 1697 1695 1745 1795 1816 1929 2090 2157 2114 2070 2130 2191 2102 2014 1973 1932 1909 1887 1912 1936 1893
$$ packed form
1554D1225p098n159l754k790k197j829j672j597j596j493j337j134r78r00p44n77m20l89l89
1551E172l10l09k31k32p9p9r9j92j60o6j6j5n5n4j01j02o5o5j37j37j51n7l2l1r8r7m7M6R6
1548B297Kj37j36q6QLKN7N7k5j18j15k0l3l2J5J6J5J6jjp3p2p8J6J0J0KJj7j12q2J1R4R3M3
1543A630M3l4l5m7m6%%M7M6OOMR7J44N1o3o2k2k1j2j2l1j25j06j2L9L8JJ%JO5O6M0n3m0m0
1539A564l9m0p3K0P8P7n2n1Q3Q3P6j6L5L6J17J17K9o5o6o7ONLLKLo0n9mR1Q8Q9j5j5K0K0K0
1534B043K0j9j8K9K9O8O8rj0PPJ3J3J9J12J44J44J50K44L11L10K85M40O92R72J271J488J520
1531A0343J177N07l98j233j701j667j324r57p38n95m38l00k07j38j38q5q6POm0m0n1n1n1n1
1528A751ppk7j20n6L8L8n6n4M0R0R0nnnokkN0N0K1J13J61O7m3m4O0O1q9q8m1m1k3k2K5K4m3
$$ plain form
1523 1893 1850 1806 1763 1756 1748 1718 1687 1759 1831 1852 1780 1665 1643 1672 1702 1701 1700 1745 1791 1777 1763 1750 1736 1762 1788 1861 1934 1895 1856 1895 1934 1989 2044 2026 2009 2036
1519 2036 2157 2376 2689 3110 3532 3881 3887 3572 3164 2787 2503 2283 2158 2125 2093 1993 1893 1752 1611 1486 1455 1543 1630 1616 1601 1610 1618
1516 1618 1675 1732 1836 1940 2008 2077 2120 2070 1930 1789 1721 1652 1622 1593 1539 1486 1420 1353 1427 1501 1587 1672 1711 1750 1751 1753 1802 1850 1784 1719 1731 1743 1702
1511 1702 1660 1665 1670 1715 1759 1828 1896 1820 1744 1746 1749 1696 1643 1591 1538 1527 1516 1505 1494 1505 1517 1552 1587 1578 1569 1638 1707 1619 1531 1583 1729 1769 1652 1518 1539 1636
1507 1636 1732 1760 1788 1780 1773 1662 1551 1466 1476 1511 1545 1502 1459 1463 1466 1457 1447 1516 1584 1583 1581 1533 1484 1376 1269 1327 1385 1425 1372 1325 1278 1255 1232 1257 1281 1366
1503 1366 1452 1513 1575 1547 1519 1538 1556 1563 1569 1623 1676 1584 1492 1457 1515 1525 1535 1597 1659 1672 1684 1800 1916 1967 1923 1910 1896 1904 1912 1937 1963 1892 1726 1608
1499 1608 1584 1588 1592 1578 1565 1604 1643 1683 1722 1706 1689 1644 1692 1733 1774 1774 1774 1803 1832 1814 1797 1767 1736 1706 1676 1660 1643 1737 1830 1877 1925 1863 1801 1738 1676 1692
1494 1692 1707 1687 1666 1718 1770 1749 1635 1573 1511 1525 1540 1632 1724 1726 1728 1730 1732 1662 1593 1658 1723 1719 1622 1565 1602 1625 1555 1532 1602 1653 1611 1549 1487 1530 1572 1609
$$ packed form
1523A893m3m4m3pql0l1P2P2K1p2j15k2K9L0jjM5M6j4j4j3j4K6K6P3P3l9l9L9L9N5N5j8j7K7
1519B036J21K19L13M21M22L49Ol15m08l77k84k20j25l3l2j00j00j41j41j25l1Q8Q7j4j5RQ
1516A618N7N7J04J04O8O9M3n0j40j41o8o9l0k9n4n3o6o7P4P4Q6Q5L9L9JKM9M8o6o5J2J2m1
1511A702m2NNM5M4O9O8p6p6KLn3n3n2n3j1j1j1j1J1J2L5L5rrO9O9q8q8N2J46M0j17j34K1R7
1507A636R6K8K8qpj11j11q5J0L5L4m3m3MLrj0O9O8jkm8m9j08j07N8N8M0n3m7m7k3k3K5K4Q5
1503A366Q6O1O2k8k8J9J8PON4N3r2r2l5N8J0J0O2O2J3J2J16J16N1m4j3j4QQK5K6p1j66j18
1499A608k4MMj4j3L9L9M0L9j6j7m5M8M1M1%%K9K9j8j7l0l1l0l0j6j7R4R3M7M8o2o2o3o2J6
1494A692J5k0k1N2N2k1j14o2o2J4J5R2R2KKKKp0o9O5O5mr7n7L7K3p0k3P0N1m2o2o2M3M2L7
$$ plain form
1490 1609 1646 1704 1668 1638 1608 1561 1514 1513 1513 1525 1537 1549 1561 1545 1528 1553 1578 1650 1629 1582 1536 1487 1438 1415 1486 1549 1612 1603 1594 1608 1622 1682 1742 1750 1758 1765 1773 1724
1485 1724 1675 1627 1578 1527 1476 1440 1561 1696 1738 1670 1602 1593 1583 1620 1657 1679 1702 1724 1747 1749 1751 1795 1838 1864 1797 1802 1901 2052 2109 2147 2185 2233 2282 2320 2359
1481 2359 2284 2054 1864 1830 1841 1759 1608 1551 1549 1547 1544 1542 1597 1559 1443 1420 1497 1573 1578 1583 1643 1703 1685 1667 1614 1562 1509 1456 1486 1515 1544 1574 1572 1570 1522 1473
1476 1473 1448 1423 1398 1373 1436 1500 1517 1535 1543 1551 1559 1568 1583 1597 1612 1627 1623 1618 1607 1597 1640 1589 1532 1569 1616 1569 1481 1486 1535 1584 1560 1537 1581 1626 1671 1715 1685 1655
1472 1655 1572 1583 1667 1750 1762 1774 1820 1866 1913 1959 1954 1948 1937 2019 2138 2257 2272 2288 2344 2401 2494 2588 2634 2524 2361 2199 2097 1995 1846 1697 1656
1468 1656 1616 1601 1679 1771 1863 1852 1841 1842 1844 1736 1628 1622 1616 1656 1696 1742 1787 1697 1608 1580 1646 1706 1765 1743 1720 1697 1674 1668 1662 1786 1910 2005 1944 1839 1828
1464 1828 1892 1955 1884 1813 1740 1668 1621 1667 1727 1787 1743 1699 1688 1677 1642 1608 1646 1684 1644 1604 1541 1478 1460 1441 1474 1460 1373 1379 1513 1647 1674 1607 1586 1658
1460 1658 1773 1841 1855 1822 1761 1746 1753 1713 1626 1586 1606 1578 1507 1483 1589 1695 1688 1588 1517 1494 1485 1476 1531 1585 1593 1601 1598 1596 1550 1504 1527 1596 1617 1545 1471 1444
$$ packed form
1490A609L7N8l6l0l0m7m7j%J2J2J2J2j6j7K5K5P2k1m7m6m9m9k3P1O3O3rrJ4J4O0O0QQPQm9
1485A724m9m8m9n1n1l6J21J35M2o8o8rj0L7L7K2K3K2K3KKM4M3K6o7NR9J51N7L8L8M8M9L8L9
1481B359p5k30j90l4J1q2j51n7kklkN5l8j16k3P7P6NNO0O0j8j8n3n2n3n3L0K9K9L0kkm8m9
1476A473k5k5k5k5O3O4J7J8QQQRJ5J4J5J5mnj1j0M3n1n7L7M7m7q8NM9M9k4k3M4M5M5M4l0l0
1472A655q3J1Q4Q3J2J2M6M6M7M6noj1Q2J19J19J5J6N6N7R3R4M6j10j63j62j02j02j49j49m1
1468A656m0j5P8R2R2j1j1JKj08j08ooM0M0M6M5r0q9k8O6O0N9k2k3k3k3ooJ24J24R5o1j05j1
1464A828O4O3p1p1p3p2m7M6O0O0m4m4j1j1l5l4L8L8m0m0o3o3j8j9L3j4q7OJ34J34K7o7k1P2
1460A658J15O8J4l3o1j5Pm0q7m0K0k8p1k4J06J06pj00p1k3rrN5N4QQlkm6m6K3O9K1p2p4k7
$$ plain form
1455 1444 1495 1545 1575 1605 1588 1571 1622 1673 1677 1681 1651 1620 1636 1652 1743 1835 1849 1862 1783 1704 1672 1639 1667 1695 1717 1738 1768 1703 1615 1621 1736 1850 1830 1810 1874
1451 1874 1938 1997 2055 2087 2026 1915 1851 1947 2089 2120 2057 1951 1845 1780 1715 1740 1765 1743 1721 1761 1801 1858 1915 1984 1960 1847 1735 1755 1775 1816 1856
1447 1856 1920 1937 1921 2000 2189 2284 2204 2124 2105 2087 2021 1956 2009 2063 1981 1900 1991 2175 2260 2188 2214 2333 2467 2602 2844 3086 3220 3074 2797
1443 2797 2520 2344 2262 2337 2411 2379 2252 2146 2133 2084 2036 2039 2041 2020 1999 2012 2026 1992 1959 1963 1967 1931 1894 1850 1898 1877 1855 1842 1923 1956 1896 1834 1771 1781
1439 1781 1791 1814 1837 1872 1814 1785 1849 1932 2016 1997 1977 1916 1856 1806 1849 1975 2101 2174 2154 1990 1825 1727 1722 1689 1655 1656 1656 1610 1564 1598 1632 1615 1505
1435 1505 1470 1528 1581 1539 1494 1448 1444 1439 1466 1492 1519 1546 1601 1656 1629 1508 1454 1493 1573 1560 1570 1581 1585 1590 1568 1545 1547 1548 1539 1530 1506 1388 1298 1364 1534 1703
1431 1703 1726 1655 1558 1462 1464 1466 1468 1470 1482 1494 1466 1437 1404 1464 1524 1490 1440 1389 1338 1288 1326 1458 1542 1534 1489 1445 1395 1345 1371 1397 1351 1304 1331 1450 1570
1427 1570 1597 1585 1573 1514 1456 1482 1601 1683 1609 1493 1470 1494 1517 1508 1499 1536 1574 1576 1578 1477 1376 1315 1348 1407 1465 1491 1518 1544 1570 1600 1631 1611 1497 1466
$$ packed form
1455A444N1N0L0L0j7j7N1N1MMl0l1J6J6R1R2J4J3p9p9l2l3K8K8K2K1L0o5q8OJ15J14k0k0O4
1451A874O4N9N8L2o1j11o4R6J42L1o3j06j06o5o5K5K5k2k2M0M0N7N7O9k4j13j12K0K0M1M0
1447A856O4J7j6P9J89R5q0q0j9j8o6o5N3N4q2q1R1J84Q5p2K6J19J34J35K42K42J34j46k77
1443B797k77j76q2P5P4l2j27j06j3m9m8LKk1k1J3J4l4l3MMl6l7m4M8k1k2j3Q1L3o0o2o3J0
1439A781J0K3K3L5n8k9O4Q3Q4j9k0o1o0n0M3J26J26P3k0j64j65r8nl3l4J%m6m6L4L4j7j10
1435A505l5N8N3m2m5m6mnK7K6K7K7N5N5k7j21n4L9Q0j3J0J1MNk2k3KJrrk4j18r0O6J70J69
1431A703K3p1r7r6KKKKJ2J2k8k9l3O0O0l4n0n1n1n0L8J32Q4qm5m4n0n0K6K6m6m7K7J19J20
1427A570K7j2j2n9n8K6J19Q2p4j16k3K4K3rrL7L8KKj01j01o1L3N9N8K6K7K6K6L0L1k0j14l1
$$ plain form
1422 1466 1528 1585 1548 1551 1555 1553 1550 1567 1583 1580 1483 1450 1512 1573 1541 1438 1429 1445 1462 1459 1550 1589 1627 1656 1684 1765 1753 1628 1502 1449 1396 1429 1461 1494 1527 1555
1418 1555 1584 1566 1455 1359 1420 1524 1535 1489 1536 1656 1682 1639 1596 1657 1717 1738 1759 1833 1813 1753 1693 1706 1718 1692 1667 1688 1709 1630 1551 1612 1673 1681 1688 1695
1414 1695 1703 1678 1653 1731 1810 1854 1805 1705 1604 1549 1587 1605 1576 1567 1651 1780 1814 1789 1765 1746 1633 1550 1561 1679 1752 1750 1749 1792 1835 1813 1791 1816 1840 1825
1410 1825 1810 1795 1779 1733 1688 1689 1690 1664 1639 1619 1600 1624 1743 1861 1886 1845 1804 1758 1711 1674 1638 1679 1721 1753 1786 1818 1851 1806 1761 1719 1677 1675 1720 1692 1570
1405 1570 1460 1507 1688 1775 1769 1810 1918 1933 1841 1750 1761 1773 1801 1828 1858 1889 1877 1912 1979 1953 1839 1820 1913 2007 2011 2014 1998 1889 1759 1722 1797 1825 1767
1401 1767 1757 1826 1895 1908 1922 1944 1872 1775 1723 1780 1838 1830 1823 1816 1809 1735 1662 1668 1627 1569 1605 1724 1796 1788 1826 1937 1954 1872 1837 1910 1983 1968 1953 2015 2078 2043
1397 2043 2008 2020 2032 1952 1871 1900 1928 1950 1972 2046 2027 1928 1828 1832 1836 1832 1827 1900 1973 1875 1776 1789 1802 1768 1780 1868 1863 1733 1650 1770 1937 1977 1970 2038 2107
1393 2107 2005 1902 1909 1916 1901 1887 1919 1951 1876 1801 1803 1806 1747 1687 1768 1849 1822 1795 1877 1960 1884 1808 1842 1875 1811 1746 1788 1829 1802 1727 1733 1832 1856 1834 1861 1935
$$ packed form
1422A466O2N7l7LMklJ7J6lr7l3O2O1l2j03rJ6J7lR1L9L8K9K8Q1j2j25j26n3n3L3L2L3L3K8
1418A555K9j8j11r6O1J04J1m6M7J20K6m3m3O1O0K1K1P4k0o0o0J3J2k6k5K1K1p9p9O1O1QPP
1414A695Qk5k5P8P9M4m9j00j01n5L8J8k9rQ4J29L4k5k4j9j13q3J1J18P3kjM3M3k2k2K5K4j5
1410A825j5j5j6m6m5JJk6k5k0j9K4J19J18K5m1m1m6m7l7l6M1M2L2L3L2L3m5m5m2m2kM5k8j22
1405A570j10M7J81Q7oM1J08J5r2r1J1J2K8K7L0L1j2L5O7k6j14j9R3R4MLj6j09j30l7P5K8n8
1401A767j0O9O9J3J4K2p2r7n2N7N8qpppp4p3Om1n8L6J19P2qL8J11J7q2l5P3P3j5j5O2O3l5
1397B043l5J2J2q0q1K9K8K2K2P4j9r9j00MMmnP3P3r8r9J3J3l4J2Q8nj30q3J20J67M0pO8O9
1393B107j02j03PPj5j4L2L2p5p5KLn9o0Q1Q1k7k7Q2Q3p6p6L4L3o4o5M2M1k7p5OR9K4k2K7P4
$$ plain form
1388 1935 1947 1913 1980 2048 2002 1863 1799 1829 1833 1790 1829 1914 1938 1916 1971 2074 2098 2076 2082 2089 2028 1967 2015 2064 2015 1967 1997 2027 1950 1872 1903 1981 1967 1860
1384 1860 1854 1894 1840 1692 1681 1764 1826 1795 1842 1982 2007 1938 1898 1905 1859 1765 1755 1838 1876 1867 1905 1990 2003 1922 1917 2005 2001 1903 1884 1958 1917 1782 1693 1760 1817
1380 1817 1828 1851 1874 1872 1869 1944 2020 1992 1964 1980 1997 1962 1881 1876 1966 2025 1991 2016 2040 1991 1942 1975 2102 2138 2081 2032 2030 1985 1940 2004 2068 2039 1963 1995 2121
1376 2121 2061 1907 1859 1966 2043 2026 2036 2140 2146 2058 2023 2081 2091 2101 2194 2333 2379 2331 2413 2589 2570 2333 2136 2096 2015 1934 1996 2213 2323 2213
1372 2213 2155 2190 2206 2129 2156 2278 2324 2214 2146 2235 2281 2171 2107 2200 2253 2149 2093 2192 2273 2198 2162 2219 2178 2043 2009 2132 2165 2043 1992 2161
1368 2161 2310 2271 2126 2168 2225 2095 2012 2116 2299 2295 2293 2291 2269 2154 2146 2325 2426 2339 2180 2208 2262 2221 2175 2316 2377 2250 2100 2137 2217 2111
1365 2111 2082 2241 2378 2329 2232 2323 2448 2386 2220 2242 2358 2380 2402 2518 2627 2548 2417 2474 2560 2458 2310 2349 2493 2450 2335 2407 2538 2575
1361 2575 2534 2587 2618 2462 2347 2419 2476 2346 2224 2414 2583 2564 2475 2573 2770 2779 2638 2591 2671 2564 2403 2430 2524 2431 2291 2338 2443 2362 2327
$$ packed form
1388A935J2l4O7O8m6j39o4L0Mm3L9Q5K4k2N5J03K4k2OPo1o1M8M9m9m8L0L0p7p8L1P8j4j07
1384A860oM0n4j48j1Q3O2l1M7J40K5o9m0Pm6r4j0Q3L8rL8Q5J3q1nQ8mr8j9P4m1j35q9O7N7
1380A817J1K3K3klP5P6k8k8J6J7l5q1nR0N9l4K5K4m9m9L3J27L6n7m9km5m5O4O4k9p6L2J26
1376B121o0j54m8J07P7j7J0J04Oq8l5N8J0J0R3J39M6m8Q2J76j9k37j97m0q1q1O2K17J10j10
1372B213n8L5J6p7K7J22M6j10o8Q9M6j10o4R3N3j04n6R9Q1p5l6N7m1j35l4J23L3j22n1J69
1368B161J49l9j45M2N7j30q3J04J83mkkk2j15qJ79J01q7j59K8N4m1m6J41O1j27j50L7Q0j06
1365B111k9J59J37m9r7R1J25o2j66K2J16K2K2J16J09p9j31N7Q6j02j48L9J44m3j15P2J31L7
1361B575m1N3L1j56j15P2N7j30j22J90J69j9q9R8J97Rj41m7Q0j07j61K7R4r3j40M7J05q1l5
$$ plain form
1358 2327 2479 2671 2675 2602 2715 2853 2802 2643 2671 2783 2707 2585 2650 2772 2707 2563 2607 2820 2847 2764 2868 2983 2910 2806 2890 3121 3040 2818
1354 2818 2909 3159 3222 3152 3269 3555 3653 3656 3753 3798 3532 3174 3128 3292 3143 2830 2830 3029 3040 2887 2922 3056 3002 2738 2786 3068 3163 3031
1351 3031 3087 3344 3414 3218 3210 3389 3381 3170 3146 3355 3376 3226 3263 3519 3587 3359 3318 3521 3536 3349 3348 3557 3578 3303 3214 3451 3500 3377 3441
1347 3441 3799 3969 3748 3715 3946 3990 3768 3734 4023 4125 4017 4095 4406 4405 4076 4059 4420 4595 4348 4288 4623 4646 4248 4162 4550 4750
1344 4750 4631 4699 5124 5362 5170 5166 5610 5743 5391 5352 5773 6006 5787 5755 6190 6312 5920 5839 6327 6628 6360 6279 6812 7158 6864
1341 6864 6757 7322 7699 7467 7423 8030 8450 8222 8182 8867 9240 8879 8831 9561 10103 9858 9800 10679 11371 11205 11227 12188 12962 12816 12856
1338 12856 13905 14767 14693 14931 16343 17442 17413 17695 19435 21019 21306 21935 24139 26187 26728 27673 30626 33578 34878 36770
1336 36770 41201 45850 48861 53026 60753 69260 76437 86517 103264 123475 145535 177988 229471 299774 395185
$$ packed form
1358B327J52J92Mp3J13J38n1j59K8J12p6j22O5J22o5j44M4K13K7q3J04J15p3j04Q4K31q1k22
1354B818R1K50O3p0J17K86R8LR7M5k66l58m6J64j49l13%J99J1j53L5J34n4k64M8K82R5j32
1351C031N6K57P0j96qJ79qk11k4K09K1j50L7K56O8k28m1K03J5j87jK09K1k75q9K37M9j23O4
1347C441L58J70k21l3K31M4k22l4K89J02j08P8L11jl29j7L61J75k47o0L35K3l98q6L88K00
1344D750j19O8M25K38j92mM44J33l52l9M21K33k19l2M35J22l92q1M88L01k68q1N33L46k94
1341F864j07N65L77k32m4O07M20k28m0O85L73l61m8P30N42k45n8Q79O92j66K2R61P74j46M0
1338A2856J049Q62p4K38J412J099k9K82J740J584K87O29K204K048N41R45K953K952J300J892
1336C6770M431M649L011M165P727Q507P177J0080J6747K0211K2060L2453N1483P0303R5411
$$ plain form
1334 395185 540126 741379 938168 1022605 935480 728102 511205 355008 256955 188858 139892 109949
1332 109949 91273 74333 59608 50995 45784 39211 32638 29402 27696 24229 20356 18843 18298 16208 13712 13053 13112
1330 13112 11688 9795 9451 9763 8775 7319 7167 7544 6769 5526 5363 5731 5149 4161 4187 4682 4206 3262 3208 3684 3346 2603
1327 2603 2664 3130 2824 2113 2130 2616 2445 1868 1845 2227 2058 1545 1641 2079 1886 1288 1235 1588 1523 1114 1169 1505 1334 882 965 1391
1324 1391 1368 939 877 1158 1114 789 826 1144 1081 738 784 1111 1066 740 800 1140 1116 748 650 895 876 639 734 1047 1011 694 670 927
1321 927 924 640 653 947 914 599 582 845 877 629 647 945 1011 795 842 1169 1174 836 701 909 1008 827 759 972 1031 809 767 942
1317 942 949 737 688 921 1030 859 805 969 957 727 692 937 1033 848 752 875 881 731 777 1041 1141 960 923 1105 1160 997 943 1107
1314 1107 1178 1030 1042 1398 1762 1845 1887 1929 1766 1322 1009 977 965 796 795 1012 1047 800 631 744 869 776 679 738 745 595 540 765
$$ packed form
1334C95185J44941K01253J96789Q4437q7125k07378k16897j56197r8053o8097m8966k9943
1332A09949j8676j6940j4725q613n211o573o573l236j706l467l873j513n45k090k496o59N9
1330A3112j424j893l44L12r88j456j52L77p75j243j63L68n82r88K6M95m76r44n4M76l38p43
1327B603O1M66l06p11J7M86j71n77k3L82j69n13R6M38j93n98n3L53o5m09N5L36j71m52Q3M26
1324A391k3m29o2K81m4l25L7L18o3l43M6L27m5l26O0L40k4l68r8K45j9k37R5L13l6l17k4K57
1321I27lk84J3K94l3l15j7K63L2k48J8K98O6k16M7L27Nl38j35K08R9j81o8K13N9k22m2J75
1317I42Pk12m9K33J09j71n4J64j2k30l5K45R6j85r6J23Oj50M6K64J00j81l7J82N5j63n4J64
1314A107P1j48J2L56L64Q3M2M2j63m44l13l2j2j69jK17L5k47j69J13J25r3r7N9Pj50n5K25
$$ plain form
1311 765 899 752 567 662 782 747 716 840 914 769 624 698 840 826 769 868 945 865 887 1066 1150 955 770 804 830 700 612 743
1307 743 848 734 644 772 946 902 791 837 906 882 822 919 954 834 713 748 788 673 568 683 804 770 735 856 956 838 715
1304 715 811 953 876 760 799 891 827 716 760 891 865 788 868 963 839 673 725 878 937 891 938 1066 1039 937 929 972 922 837 908 1024
1300 1024 1046 994 1035 1096 1063 1027 1084 1155 1069 968 961 1001 885 765 801 880 803 726 805 997 1033 907 876 909 895 854 908 946 890 800 865 966
1296 966 973 933 987 1103 1062 948 927 999 977 951 1019 1130 1084 995 1000 1046 999 873 841 925 915 867 974 1129 1128 969 904 957 1010 990 1017 1056 1000
1292 1000 939 970 1087 1049 936 916 957 905 813 878 1045 1056 904 845 893 848 767 843 1011 1084 1018 951 965 978 929 974 1059 988 814 796 949
1288 949 1102 1119 1136 1166 1102 994 1041 1195 1193 1001 903 1047 1191 1168 1146 1163 1180 1144 1108 1154 1106 1006 999 1124 1156 1075 994 1046 1097 1008 920 975
1285 975 1031 1002 974 1054 1041 908 776 874 972 960 949 976 1004 922 841 876 912 900 889 935 981 919 856 957 1059 1021 982 923 863 751 732 828
$$ packed form
1311G65J34j47j85R5J20l5l1J24P4j45j45P4J42j4n7R9P7q0K2J79Q4j95j85L4K6j30q8J31
1307G43J05j14r0J28J74m4j11M6O9k4o0R7L5j20j21L5M0j15j05J15J21l4l5J21J00j18j23
1304G15R6J42p7j16L9R2o4j11M4J31k6p7Q0R5j24j66N2J53N9m6M7J28k7j02qM3n0q5P1J16
1300A024K2n2M1O1l3l6N7P1q6j01pM0j16j20L6P9p7p7P9J92L6j26l1L3j4m1N4L8n6r0O5J01
1296I66Pm0N4J16m1j14k1P2k2k6O8J11m6q9NM6m7j26l2Q4j0m8J07J55jj59o5N3N3k0K7L9n6
1292A000o1L1J17l8j13k0M1n2r2O5J67J1j52n9M8m5q1P6J68P3o6o7J4J3m9M5Q5p1j74j8J53
1288I49J53J7J7L0o4j08M7J54kj92r8J44J44k3k2J7J7l6l6M6m8j00pJ25L2q1q1N2N1q9q8N5
1285I75N6k9k8Q0j3j33j32R8R8j2j1K7K8q2q1L5L6j2j1M6M6o2o3J01J02l8l9n9o0j12j9R6
$$ plain form
1281 828 924 853 783 890 996 1056 1116 1127 1138 1102 1066 1124 1183 1101 1018 1079 1139 1090 1041 1052 1063 965 867 919 971 945 919 945 972 889 807 896 985 996
1276 996 1007 1086 1166 1073 981 1035 1089 1065 1041 1155 1268 1294 1226 1203 1180 1151 1122 1113 1104 1095 1085 1104 1122 1062 1002 1103 1204 1192 1087 1052 1112 1112 1113 1170 1227
1272 1227 1201 1082 993 997 1019 1089 1230 1277 1209 1140 1132 1124 1040 957 1027 1143 1176 1116 1137 1158 1126 1094 1149 1204 1150 1097 1127 1157 1109 1061 1112 1163 1137 1064
1268 1064 1105 1240 1297 1260 1252 1289 1276 1168 1126 1177 1196 1168 1187 1206 1201 1197 1261 1373 1432 1398 1381 1364 1265 1118 1051 1077 1094 1111 1159 1207 1145 1084 1124 1164
1264 1164 1129 1094 1138 1228 1242 1162 1123 1179 1199 1219 1241 1264 1209 1153 1156 1159 1084 963 935 1001 997 946 953 1054 1082 1063 1139 1262 1302 1249 1234 1267 1247 1134
1260 1134 1123 1206 1210 1121 1085 1143 1195 1200 1219 1285 1331 1283 1264 1291 1241 1143 1150 1251 1308 1271 1191 1205 1193 1134 1151 1262 1274 1131 1034 1093 1222 1303 1317 1331
1256 1331 1269 1160 1148 1291 1391 1335 1224 1206 1234 1214 1176 1184 1199 1120 1058 1091 1141 1144 1137 1176 1216 1209 1211 1260 1261 1168 1134 1195 1279 1269 1244 1313 1427 1495 1511
1251 1511 1528 1466 1405 1362 1365 1354 1249 1228 1300 1360 1264 1147 1124 1177 1183 1208 1281 1304 1234 1127 1113 1151 1142 1125 1203 1280 1264 1200 1184 1216 1156 1079 1096 1160
$$ packed form
1281H28R6p1p0J07J06O0O0J1J1l6l6N8N9q2q3O1O0m9m9J1J1r8r8N2N2k6k6K6K7q3q2Q9Q9J1
1276I96J1P9Q0r3r2N4N4k4k4J14J13K6o8k3k3k9k9rrrj0J9J8o0o0J01J01j2j05l5O0%JN7N7
1272A227k6j19q9MK2P0J41M7o8o9qqq4q3P0J16L3o0K1K1l2l2N5N5n4n3L0L0m8m8N1N1k6p3
1268A064M1J35N7l7qL7j3j08m2N1J9k8J9J9nmO4J12N9l4j7j7r9j47o7K6J7J7M8M8o2o1M0M0
1264A164l5l5M4R0J4q0l9N6K0K0K2K3n5n6LLp5j21k8O6mn1PJ01K8j9P6J23M0n3j5L3k0j13
1260A134j1Q3Mq9l6N8N2NJ9O6M6m8j9K7n0r8PJ01N7l7q0J4j2n9J7J11J2j43r7N9J29Q1J4J4
1256A331o2j09j2J43J00n6j11j8K8k0l8QJ5p9o2L3N0LpL9M0pKM9Jr3l4O1Q4j0k5O9J14O8J6
1251A511J7o2o1m3Lj1j05k1P2O0r6j17k3N3OK5P3K3p0j07j4L8rj7P8P7j6o4j6L2o0p7J7O4
$$ plain form
1247 1160 1130 1052 1068 1135 1202 1217 1231 1257 1189 1080 1065 1130 1148 1148 1194 1285 1328 1311 1294 1321 1348 1311 1275 1244 1213 1172 1225 1324 1330 1276 1221 1207 1194 1195 1196 1197
1243 1197 1198 1190 1182 1252 1323 1270 1218 1244 1270 1313 1355 1352 1301 1273 1337 1446 1461 1383 1306 1331 1357 1332 1307 1282 1257 1267 1277 1242 1159 1083 1101 1173 1244 1228 1211 1195
1238 1195 1179 1202 1225 1249 1272 1264 1256 1326 1397 1441 1485 1452 1373 1275 1270 1319 1368 1374 1379 1343 1307 1304 1395 1449 1347 1237 1219 1281 1296 1269 1334 1400 1372 1304 1282 1340
1234 1340 1398 1401 1451 1528 1511 1396 1281 1301 1320 1276 1231 1264 1298 1286 1274 1263 1251 1282 1313 1272 1231 1192 1247 1279 1263 1230 1244 1305 1319 1275 1278 1330 1381 1373 1364
1230 1364 1361 1358 1329 1394 1508 1575 1564 1506 1426 1298 1172 1139 1222 1305 1320 1334 1349 1364 1361 1358 1355 1353 1302 1251 1207 1162 1151 1234 1364 1400 1313 1225 1272 1319 1317 1315
1225 1315 1267 1218 1181 1144 1216 1289 1277 1265 1299 1334 1384 1435 1407 1379 1354 1329 1350 1372 1351 1329 1355 1380 1383 1386 1436 1486 1397 1309 1329 1350 1315 1280 1323 1366 1311
1221 1311 1255 1247 1238 1239 1240 1240 1241 1250 1258 1370 1482 1481 1387 1292 1292 1300 1308 1369 1429 1390 1351 1358 1411 1402 1299 1197 1188 1190 1145 1062 1026 1070 1159 1208 1210 1206 1249 1309 1370 1363 1357 1351 1345
1216 1345 1317 1289 1307 1326 1324 1322 1326 1329 1326 1417 1507 1504 1463 1422 1484 1547 1511 1476 1440 1405 1412 1419 1427 1434 1364 1293 1363 1433 1442 1451 1461 1470 1410 1351 1400 1450 1457 1465 1519 1573 1510 1447
$$ packed form
1247A160l0p8J6O7O7J5J4K6o8j09j5O5J8%M6R1M3j7j7K7K7l7l6l1l1m1N3R9On4n5j4j3JJJ
1243A197JqqP0P1n3n2K6K6M3M2ln1k8O4J09J5p8p7K5K6k5k5k5k5J0J0l5q3p6J8P2P1j6j7j6
1238A195j6K3K3K4K3qqP0P1M4M4l3p9r8nM9M9ONl6l6lR1N4j02j10j8O2J5k7O5O6k8o8k2N8
1234A340N8LN0P7j7j15j15K0J9m4m5L3L4j2j2j1j2L1L1m1m1l9N5L2j6l3J4O1J4m4LN2N1qr
1230A364llk9O5J14O7j1n8q0j28j26l3Q3Q3J5J4J5J5lllkn1n1m4m5j1Q3J30L6q7q8M7M7kk
1225A315m8m9l7l7P2P3j2j2L4L5N0N1k8k8k5k5K1K2k1k2K6K5LLN0N0q9q8K0K1l5l5M3M3n5
1221A311n6qrJJ%JRQJ12J12jr4r5%QQO1O0l9l9PN3rj03j02rKm5q3l6M4Q9M9KmM3O0O1pooo
1216A345k8k8J8J9kkMLlR1R0lm1m1O2O3l6l5l6l5PPQPp0p1P0P0RRJ0Ro0n9M9N0PQN4N4o3o3
$$ plain form
1211 1447 1428 1408 1394 1333 1317 1396 1482 1475 1480 1484 1493 1501 1463 1425 1434 1443 1379 1316 1282 1342 1485 1580 1564 1548 1530 1511 1456 1401 1452 1504 1428 1306 1267 1321 1352 1383 1460
1206 1460 1538 1564 1496 1481 1466 1425 1384 1399 1508 1616 1725 1789 1854 1783 1665 1624 1677 1663 1555 1406 1351 1364 1376 1391 1406 1415 1376 1355 1428 1490 1505 1523
1202 1523 1588 1674 1713 1670 1581 1509 1484 1507 1531 1472 1413 1432 1452 1435 1418 1407 1396 1339 1376 1495 1614 1599 1491 1426 1456 1466 1430 1445 1554 1609 1571 1459
1198 1459 1393 1392 1437 1459 1482 1429 1376 1401 1426 1436 1446 1454 1461 1460 1412 1384 1450 1446 1442 1445 1447 1446 1445 1442 1438 1428 1371 1285 1293 1302 1264 1205 1240 1319 1399 1432 1464 1474 1389 1305 1314 1383
1193 1383 1452 1479 1507 1506 1504 1503 1501 1492 1482 1519 1556 1611 1665 1583 1500 1474 1494 1544 1501 1419 1384 1426 1469 1489 1509 1576 1643 1599 1554 1588 1622 1589 1556 1537 1565 1574 1489
1189 1489 1404 1413 1437 1415 1378 1341 1378 1415 1452 1489 1478 1467 1456 1445 1400 1356 1362 1462 1557 1559 1540 1522 1522 1521 1517 1514 1556 1552 1515 1572 1611 1557 1457 1403 1470 1537 1560
1184 1560 1582 1529 1476 1422 1369 1370 1370 1370 1371 1359 1348 1337 1325 1351 1376 1401 1426 1440 1453 1420 1387 1397 1408 1490 1573 1542 1417 1364 1405 1458 1419 1384 1444 1556 1668
1180 1668 1646 1624 1599 1575 1551 1527 1495 1463 1478 1493 1508 1522 1537 1551 1543 1535 1516 1590 1687 1690 1673 1657 1631 1604 1572 1540 1529 1423 1318 1306 1348 1390 1329 1267 1292
$$ packed form
1211A447j9k0j4o1j6P9Q6pNMRQl8l8RRo4o3l4O0J43R5j6j6j8j9n5n5N1N2p6j22l9N4L1L1P7
1206A460P8K6o8j5j5m1m1J5J09J08J09O4O5p1j18m1N3j4j08j49n5J3J2J5J5Rl9k1P3O2J5J8
1202A523O5Q6L9m3q9p2k5K3K4n9n9J9K0j7j7j1j1n7L7J19J19j5j08o5L0J0l6J5J09N5l8j12
1198A459o6jM5K2K3n3n3K5K5J0J0QPjm8k8O6mmLKjjlmj0n7q6QRl8n9L5P9Q0L3L2J0q5q4RO9
1193A383O9K7K8jkjkrj0L7L7N5N4q2q3k6K0N0m3q2l5M2M3K0K0O7O7m4m5L4L4l3l3j9K8Rq5
1189A489q5RK4k2l7l7L7L7L7L7j1j1j1j1m5m4OJ00R5Kj9j8%jmlM2ml7N7L9n4j00n4O7O7K3
1184A560K2n3n3n4n3J%%Jj2j1j1j2K6K5K5K5J4J3l3l3J0J1Q2Q3l1j25n3M1N3l9l5O0J12J12
1180A668k2k2k5k4k4k4l2l2J5J5J5J4J5J4qqj9P4R7Lj7j6k6k7l2l2j1j06j05j2M2M2o1o2K5
$$ plain form
1175 1292 1317 1342 1367 1440 1514 1510 1505 1489 1473 1404 1429 1457 1485 1472 1458 1547 1636 1585 1534 1500 1466 1432 1398 1394 1390 1386 1382 1408 1433 1411 1390 1398 1406 1461 1516 1570 1625 1571
1171 1571 1516 1504 1491 1525 1559 1576 1592 1531 1469 1366 1262 1267 1273 1272 1272 1350 1521 1613 1549 1473 1491 1563 1542 1474 1500 1598 1603 1526 1450 1416 1382 1348 1314 1362 1411
1167 1411 1460 1509 1535 1562 1510 1458 1485 1512 1539 1566 1524 1483 1389 1388 1426 1463 1460 1456 1506 1555 1495 1435 1470 1505 1540 1575 1592 1609 1578 1548 1553 1559 1517 1476 1500 1525 1503
1162 1503 1481 1491 1502 1466 1430 1397 1365 1352 1433 1564 1601 1556 1510 1508 1506 1504 1502 1490 1478 1466 1454 1474 1495 1468 1441 1411 1380 1349 1318 1365 1411 1410 1410 1529 1648 1617
1158 1617 1492 1419 1346 1267 1188 1285 1383 1370 1358 1382 1406 1331 1255 1317 1535 1675 1659 1643 1627 1649 1670 1668 1667 1557 1352 1267 1338 1421 1410 1357 1399 1459 1520
1154 1520 1534 1548 1567 1494 1428 1362 1337 1312 1348 1383 1419 1455 1481 1507 1534 1560 1614 1667 1643 1618 1547 1476 1452 1427 1461 1496 1483 1470 1523 1575 1634 1599 1539 1480
1149 1480 1461 1443 1431 1419 1407 1395 1403 1411 1465 1519 1509 1500 1490 1480 1537 1594 1605 1615 1566 1517 1515 1513 1534 1555 1498 1441 1443 1444 1398 1352 1379 1405 1385 1365 1405 1446 1492 1445
1145 1445 1439 1434 1446 1458 1496 1534 1601 1574 1559 1544 1524 1503 1530 1557 1564 1478 1409 1433 1498 1469 1423 1377 1403 1428 1451 1474 1497 1520 1489 1458 1474 1490 1541 1591 1619 1646
$$ packed form
1175A292K5K5K5P3P4mnj6j6o9K5K8K8j3j4Q9Q9n1n1l4l4l4l4mmmmK6K5k2k1QQN5N5N4N5n4
1171A571n5j2j3L4L4J7J6o1o2j03j04NOj%P8J71R2o4p6J8P2k1o8K6R8Np7p6l4l4l4l4M8M9
1167A411M9M9K6K7n2n2K7K7K7K7m2m1r4jL8L7lmN0M9o0o0L5L5L5L5J7J7l1l0NOm2m1K4K5k2
1162A503k2J0J1l6l6l3l2j3Q1J31L7m5m6kkkkj2j2j2j2K0K1k7k7l0l1l1l1M7M6j%J19J19l1
1158A617j25p3p3p9p9R7R8j3j2K4K4p5p6O2K18J40j6j6j6K2K1kjj10k05q5P1Q3j1n3M2O0O1
1154A520J4J4J9p3o6o6k5k5L6L5L6L6K6K6K7K6N4N3k4k5p1p1k4k5L4L5j3j3N3N2N9l5o0n9
1149A480j9j8j2j2j2j2QQN4N4j0rj0j0N7N7J1J0m9m9kkK1K1n7n7KJm6m6K7K6k0k0M0M1M6m7
1145A445onJ2J2L8L8O7k7j5j5k0k1K7K7Pq6o9K4O5k9m6m6K6K5K3K3K3K3l1l1J6J6N1N0K8K7
$$ plain form
1140 1646 1598 1550 1465 1380 1294 1365 1488 1612 1589 1566 1684 1896 1986 1921 1787 1747 1752 1757 1689 1622 1634 1647 1613 1578 1500 1422 1422 1422 1480 1539 1519 1500 1538 1577
1136 1577 1590 1509 1485 1460 1453 1446 1482 1518 1566 1520 1396 1365 1416 1467 1558 1648 1739 1830 1766 1701 1657 1707 1728 1671 1559 1495 1499 1503 1464 1378 1318 1337 1389 1442 1501
1132 1501 1607 1687 1689 1635 1627 1666 1705 1709 1713 1717 1721 1696 1672 1632 1545 1473 1480 1549 1617 1605 1592 1603 1613 1601 1589 1655 1720 1689 1657 1625 1593 1567 1540 1471 1402 1330 1335 1433
1127 1433 1530 1562 1515 1489 1541 1601 1614 1581 1547 1547 1547 1547 1547 1595 1643 1645 1646 1647 1648 1625 1603 1571 1540 1555 1571 1542 1513 1487 1539 1611 1683 1651 1618 1620 1622 1623 1625 1583 1541 1577
1122 1577 1612 1582 1551 1536 1568 1619 1592 1507 1469 1521 1573 1581 1589 1621 1652 1637 1621 1600 1579 1636 1693 1727 1761 1717 1673 1645 1617 1566 1515 1538 1562 1570 1531 1499 1546 1589
1118 1589 1555 1516 1477 1511 1545 1566 1586 1606 1627 1531 1434 1454 1567 1720 1825 1819 1718 1623 1622 1609 1596 1597 1599 1647 1695 1666 1636 1606 1576 1630 1684 1631 1579 1546
1114 1546 1561 1607 1560 1513 1560 1580 1553 1525 1590 1710 1829 1854 1880 1827 1775 1749 1723 1698 1672 1624 1576 1574 1573 1499 1425 1492 1559 1600 1641 1682 1724 1687 1650 1613
1110 1613 1576 1535 1494 1500 1506 1501 1496 1537 1579 1648 1717 1646 1529 1476 1517 1532 1500 1488 1522 1530 1538 1604 1717 1810 1809 1761 1713 1737 1761 1727 1693 1619 1544 1465 1479 1545 1564
$$ packed form
1140A646m8m8q5q5q6P1J23J24k3k3J18K12R0o5j34m0NNo8o7J2J3l4l5p8p8%%N8N9k0j9L8L9
1136A577J3q1k4k5ppL6L6M8m6j24l1N1N1R1R0R1R1o4o5m4N0K1n7j12o4MMl9q6o0J9N2N3N9
1132A501J06Q0Kn4qL9L9MMMMk5k4m0q7p2PO9O8j2j3J1J0j2j2O6O5l1l2l2l2k6k7o9o9p2NR8
1127A433R7L2m7k6N2O0J3l3l4%%%%M8M8KJJJk3k2l2l1J5J6k9k9k6N2P2P2l2l3KKJKm2m2L6
1122A577L5l0l1j5L2N1k7q5l8N2N2QQL2L1j5j6k1k1N7N7L4L4m4m4k8k8n1n1K3K4Ql9l2M7M3
1118A589l4l9l9L4L4K1K0K0K1r6r7K0J13J53J05oj01r5jj3j3JKM8M8k9l0l0l0N4N4n3n2l3
1114A546J5M6m7m7M7K0k7k8O5J20J19K5K6n3n2k6k6k5k6m8m8kjp4p4O7O7M1M1M1M2l7l7l7
1110A613l7m1m1OOnnM1M2O9O9p1j17n3M1J5l2j2L4QQO6J13R3jm8m8K4K4l4l4p4p5p9J4O6J9
$$ plain form
1105 1564 1525 1486 1522 1558 1548 1538 1575 1613 1605 1597 1589 1582 1589 1596 1602 1609 1620 1631 1642 1653 1649 1645 1641 1637 1630 1623 1569 1515 1533 1552 1523 1495 1524 1554 1584 1614 1627 1639 1651 1664 1642
1100 1642 1619 1675 1731 1723 1716 1636 1556 1525 1587 1696 1711 1676 1640 1646 1652 1614 1576 1647 1718 1699 1679 1660 1640 1625 1609 1641 1672 1673 1674 1722 1770 1761 1753 1792 1831 1822 1813 1757 1701
1095 1701 1719 1736 1754 1772 1744 1716 1734 1753 1771 1789 1854 1918 1849 1781 1790 1799 1829 1860 1891 1921 1875 1828 1782 1735 1756 1777 1798 1819 1821 1822 1777 1731 1727 1723 1795 1866 1833
1091 1833 1753 1693 1727 1768 1808 1776 1745 1730 1715 1702 1690 1703 1763 1807 1759 1652 1640 1739 1886 1938 1897 1838 1826 1791 1756 1723 1691 1695 1699 1657 1614 1649 1683 1718
1087 1718 1752 1705 1657 1610 1563 1551 1540 1638 1736 1776 1816 1856 1896 1883 1871 1858 1845 1755 1664 1683 1702 1713 1724 1734 1745 1737 1728 1767 1805 1759 1714 1687 1755 1817 1785
1082 1785 1812 1839 1833 1826 1773 1720 1720 1720 1720 1720 1727 1734 1813 1892 1982 1979 1950 1921 1918 1916 1913 1910 1850 1789 1723 1750 1866 1982 2016 1956 1916 1876 1908 1941 1944 1948 1999 2050 2044 2038 2032 2026 1997
1077 1997 1968 2042 2116 2159 2109 2054 2091 2195 2204 2173 2235 2408 2582 2714 2846 2946 3045 3066 3087 3098 3108 3071 3035 2983 2931 2967 3096 3304 3513 3854
1074 3854 4195 4491 4568 4467 4209 3949 3689 3518 3439 3462 3642 3942 4242 4596 4951 5266 5487 5522 5338 4970 4509 4047 3679 3492
$$ packed form
1105A564l9l9L6L6j0j0L7L8qqqpPPOPJ1J1J1J1mmmmppn4n4J8J9k9k8K9L0L0L0J3J2J2J3k2
1100A642k3N6N6qpq0q0l1O2J09J5l5l6OOl8l8P1P1j9k0j9k0j5j6L2L1JJM8M8rqL9L9rrn6n6
1095A701J8J7J8J8k8k8J8J9J8J8O5O4o9o8RRL0L1L1L0m6m7m6m7K1K1K1K1KJm5m6mmP2P1l3
1091A833q0o0L4M1M0l2l1j5j5j3j2J3O0M4m8j07j2R9J47N2m1n9j2l5l5l3l2MMm2m3L5L4L5
1087A718L4m7m8m7m7j2j1R8R8M0M0M0M0j3j2j3j3r0r1J9J9J1J1J0J1qrL9L8m6m5k7O8O2l2
1082A785K7K7opn3n3%%%%PPP9P9R0lk9k9lkllo0o1o6K7J16J16L4o0m0m0L2L3LMN1N1ooook9
1077A997k9P4P4M3n0n5L7J04Rl1O2J73J74J32J32J00R9K1K1J1J0l7l6n2n2L6J29K08K09L41
1074C854L41K96P7j01k58k60k60j71p9K3J80L00L00L54L55L15K21L5j84l68m61m62l68j87
$$ plain form
1071 3492 3461 3508 3556 3722 3888 4106 4325 4543 4605 4451 4141 3831 3520 3296 3072 2935 2893 2869 2846 2911 3069 3216 3270 3236 3202 3050 2804
1067 2804 2558 2406 2326 2245 2217 2189 2180 2172 2116 2061 2034 2006 1979 1952 1954 1956 1959 1961 1964 1967 1923 1880 1894 1909 1924 1939 1921 1904 1840 1776 1806 1836 1914 1991 2023 2056 2041
1063 2041 2027 2030 2033 2036 2039 2029 2019 2009 1999 1950 1901 1846 1885 1918 1951 1880 1810 1862 1914 1967 2019 2021 2022 2024 2025 2040 2054 2068 2083 2118 2153 2079 2005 2004 2003 2002 2001 2020 2039 2059
1058 2059 2078 2033 1988 1989 2085 2207 2174 2041 2002 2133 2265 2231 2196 2153 2110 2066 2023 2102 2181 2204 2132 2108 2083 2107 2131 2194 2256 2202 2147 2157 2167 2153 2139
1054 2139 2145 2150 2132 2114 2132 2151 2169 2187 2169 2151 2133 2114 2141 2169 2196 2223 2199 2176 2152 2128 2150 2171 2198 2225 2218 2304 2367 2337 2236 2136 2203 2270 2347 2330 2255
1050 2255 2180 2114 2141 2202 2262 2261 2260 2259 2258 2257 2256 2255 2254 2276 2297 2295 2293 2320 2348 2336 2324 2282 2240 2203 2167 2191 2308 2426 2449 2420 2390 2471 2552 2569 2586 2548 2510 2428
1045 2428 2346 2329 2405 2462 2519 2542 2566 2627 2689 2680 2672 2591 2511 2448 2479 2503 2528 2488 2448 2480 2511 2543 2575 2567 2559 2497 2435 2535 2634 2676 2623 2535 2540 2619 2699 2724
1041 2724 2750 2705 2661 2655 2649 2643 2637 2531 2426 2422 2512 2631 2595 2503 2412 2506 2601 2615 2535 2480 2425 2434 2444 2515 2586 2655 2630 2614 2597 2629 2661 2660 2660 2683 2705 2788 2870
$$ packed form
1071C492l1M7M8J66J66K18K19K18O2j54l10l10l11k24k24j37m2k4k3O5J58J47N4l4l4j52k46
1067B804k46j52q0q1k8k8rqn6n5k7k8k7k7KKLKLLm4m3J4J5J5J5j8j7o4o4L0L0P8P7L2L3j5
1063B041j4LLLLj0j0j0j0m9m9n5L9L3L3p1p0N2N2N3N2KJKJJ5J4J4J5L5L5p4p4jjjjJ9J9K0
1058B059J9m5m5JR6J22l3j33l9J31J32l4l5m3m3m4m3P9P9K3p2k4k5K4K4O3O2n4n5J0J0j4j4
1054B139ONj8j8J8J9J8J8j8j8j8j9K7K8K7K7k4k3k4k4K2K1K7K7pQ6O3l0j01j00O7O7P7j7p5
1050B255p5o6K7O1O0jjjjjjjjK2K1kkK7K8j2j2m2m2l7l6K4J17J18K3k9l0Q1Q1J7J7l8l8q2
1045B428q2j7P6N7N7K3K4O1O2rqq1q0o3L1K4K5m0m0L2L1L2L2qqo2o2J00R9M2n3q8NP9Q0K5
1041B724K6m5m4ooooj06j05mR0J19l6r2r1R4R5J4q0n5n5RJ0P1P1O9k5j6j7L2L2j%K3K2Q3Q2
$$ plain form
1036 2870 2882 2894 2904 2914 2838 2762 2746 2729 2752 2775 2844 2913 2956 2904 2848 2885 3037 3190 3239 3194 3117 3039 3041 3042 3098 3154 3148 3142 3097 3052 3069 3085 3078 3072 3062 3053 3098
1031 3098 3144 3167 3191 3175 3159 3192 3225 3257 3290 3327 3364 3347 3329 3310 3291 3326 3361 3340 3318 3296 3274 3303 3333 3432 3531 3581 3631 3626 3622 3688 3754 3734 3714 3751 3788
1027 3788 3786 3783 3802 3821 3863 3905 3936 3966 4020 4074 4144 4215 4299 4290 4203 4116 4139 4163 4153 4143 4156 4169 4218 4266 4354 4442 4505 4568 4584 4600 4527 4453 4380 4307 4352 4397
1023 4397 4488 4580 4615 4650 4613 4576 4558 4634 4710 4693 4631 4570 4643 4716 4614 4513 4499 4579 4629 4679 4687 4696 4761 4827 4892 4958 4967 4975 5031 5087 5109 5131 5153 5175 5208
1018 5208 5241 5345 5450 5581 5617 5598 5578 5640 5702 5811 5920 5951 5982 6039 6189 6336 6482 6556 6631 6733 6836 6986 7136 7153 7170 7290 7411
1015 7411 7491 7479 7513 7641 7858 8076 8299 8522 8761 9000 9240 9479 9737 9996 10432 11025 11774 12523 13243 13745 13836 13585 13224 13082
1012 13082 13140 13291 13497 13796 14248 14793 15434 16293 17439 18584 19496 19877 19864 19850 20132 20757 21463 22262 23296 24673 26308 28036
1010 28036 30026 32422 35133 37939 40885 44237 48347 53550 60452 69757 82043 97887 117842 142103 169181 195322
$$ packed form
1036B870J2J2J0J0p6p6j6j7K3K3O9O9M3n2n6L7J52J53M9m5p7p8KJN6N6oom5m5J7J6poj0rM5
1031C098M6K3K4j6j6L3L3L2L3L7L7j7j8j9j9L5L5k1k2k2k2K9L0R9R9N0N0nmO6O6k0k0L7L7
1027C788klJ9J9M2M2L1L0N4N4P0P1Q4rq7q7K3K4j0j0J3J3M9M8Q8Q8O3O3J6J6p3p4p3p3M5M5
1023D397R1R2L5L5l7l7j8P6P6j7o2o1P3P3j02j01j4Q0N0N0QRO5O6O5O6RQN6N6K2K2K2K2L3
1018E208L3J04J05J31L6j9k0O2O2J09J09L1L1N7J50J47J46P4P5J02J03J50J50J7J7J20J21
1015G411Q0j2L4J28K17K18K23K23K39K39K40K39K58K59M36N93P49P49P20N02R1k51l61j42
1012A3082N8J51K06K99M52N45O41Q59J146J145R12L81j3j4K82O25P06P99J034J377J635J728
1010B8036J990K396K711K806K946L352M110N203O902R305J2286J5844J9955K4261K7078K6141
$$ plain form
1008 195322 214910 223074 218985 206469 192010 180735 174687 174445 181076 195760 219270 252331 295839 348523 402603
1006 402603 444013 459244 444327 407765 364524 327260 301293 287122 284749 295148 318842 355612 406052 470076
1004 470076 540654 598998 622199 598749 538159 463571 395413 342297 304350 280186 269567 271440 284237 307506
1002 307506 340949 380080 413406 426565 411073 370253 316888 264803 221768 189385 166676 152697 146395 146187
1001 146187 151035 160411 172721 183752 187604 180350 162546 138329 113051 90399 71805 57292 46087 37632 31238
999 31238 26255 22334 19242 16837 14940 13354 11952 10862 9912 8963 8128 7294 6631 5968 5509 5050 4603 4155 3773 3577
996 3577 3355 3132 2866 2601 2444 2288 2100 1912 1724 1536 1449 1362 1323 1283 1216 1150 1083 1016 936 856 776 695 613 530 495 459 510 561 540 519
993 519 420 414 402 390 367 344 356 274 164 147 180 214 200 185 217 250 217 185 159 132 101 164 273 288 230 171 154 136 164 193 180 167 127 181 235
$$ packed form
1008A95322J9588Q164m089j2516j4459j1275o048k42O631J4684K3510L3061M3508N2684N4080
1006D02603M1410J5231j4917l6562m3241l7264k5967j4171k373J0399K3694L6770N0440O4024
1004D70076P0578N8344K3201k3450o0590p4588o8158n3116l7947k4164j0619J873J2797K3269
1002C07506L3443L9131L3326J3159j5492m0820n3365n2085m3035l2383k2709j3979o302k08
1001A46187M848R376J2310J1031L852p254j7804k4217k5278k2652j8594j4513j1205q455o394
999C1238m983l921l092k405j897j586j402j090r50r49q35q34o63o63m59m59m47m48l82j96
996C577k22k23k66k65j57j56j88j88j88j88q7q7l9m0o7o6o7o7q0q0q0q1q2q3l5l6N1N1k1k1
993E19r9oj2j2k3k3J2q2j10j7L3L4j4j5L2L3l3l2k6k7l1O3J09J5n8n9j7j8K8K9j3j3m0N4N4
$$ plain form
988 235 195 148 101 101 101 57 106 212 318 330 342 313 285 198 206 270 334 341 349 466 582 656 729 755 782 797 812 779 747 666 585 556 528 537 641 768
984 768 801 741 680 661 642 586 530 521 511 501 490 411 331 268 360 496 538 479 420 496 572 475 377 389 400 377 354 403 452 427 308 201 94 56
980 56 112 194 275 251 227 249 272 190 109 105 102 66 31 42 53 61 69 77 86 64 42 -1 -46 -67 -87 -29 28 119 209 306 308 236 165 196 228 256 284 289 293 233
975 233 173 191 209 196 182 215 248 220 191 241 290 325 360 348 336 363 390 417 444 384 324 343 361 297 233 216 199 255 310 395 386 373 359 418 477 331
971 331 185 184 277 351 333 366 400 423 353 323 388 472 463 410 356 314 366 442 519 482 445 455 558 614 514 377 333 374 415 438 462 431 400 395 483
966 483 550 617 612 607 558 510 508 506 495 485 475 465 460 455 528 600 669 738 729 720 675 630 631 633 624 615 606 597 554 511 571 631 654 584 519 455 469 483 473 464 336 209
961 209 200 285 370 454 498 541 544 547 590 634 630 532 434 430 507 584 620 656 564 473 406 434 528 623 557 492 469 539 556 574 527 480 512 543 568 594 619 645
957 645 541 437 328 312 386 461 495 528 512 495 582 668 700 639 630 621 634 648 661 675 587 499 468 530 543 555 593 725 782 746 659 572 494 416
$$ packed form
988B35m0m7m7%%m4M9J06J06J2J2k9k8q7QO4O4PQJ17J16P4P3K6K7J5J5l3l2q1q1k9k8RJ04J27
984G68L3o0o1j9j9n6n6rj0j0j1p9q0o3R2J36M2n9n9P6P6r7r8J2J1k3k3M9M9k5j19j07j07l8
980E6N6Q2Q1k4k4K2K3q2q1mll6l5J1J1QQQRk2k2m3m5k1k0N8N7R1R0R7Kp2p1L1L2K8K8NMo0
975B33o0J8J8j3j4L3L3k8k9N0M9L5L5j2j2K7K7K7K7o0o0J9J8o4o4j7j7N6N5Q5rj3j4N9N9j46
971C31j46jR3P4j8L3L4K3p0l0O5Q4rn3n4m2N2P6P7l7l7J0J03N6j00j37m4M1M1K3K4l1l1nQ8
966D83O7O7nnm9m8kkj1j0j0j0nnP3P2O9O9rrm5m5JKrrrrm3m3O0O0K3p0o5o4J4J4j0rj28j27
961B09rQ5Q5Q4M4M3LLM3M4mr8r8mP7P7L6L6r2r1o7K8R4R5o6o5k3P0J7J8m7m7L2L1K5K6K5K6
957F45j04j04j09j6P4P5L4L3j6j7Q7Q6L2o1rrJ3J4J3J4q8q8l1O2J3J2L8J32N7l6q7q7p8p8
$$ plain form
952 416 354 448 595 649 687 725 738 750 710 763 843 922 867 813 729 645 639 633 640 648 656 664 640 616 593 569 612 654 697 740 741 742 743 745 828 911 947 983 937 891
947 891 798 705 666 627 667 706 753 800 737 674 631 588 623 658 729 801 879 863 711 560 521 577 584 591 604 617 611 606 651 790 920 956 911 865 773
943 773 681 670 754 805 762 678 689 688 687 640 686 778 870 890 910 826 742 708 768 860 858 815 865 969 1072 1072 1072 1078 1084 1043 1002 1016 1031 1148 1266 1434
939 1434 1508 1576 1738 1935 2038 1966 1893 1824 1755 1633 1605 1693 1781 1838 1894 2141 2544 2976 3315 3494 3454 3203 2953 2763 2574 2410 2340 2435
935 2435 2531 2589 2741 3082 3579 4064 4393 4464 4255 3810 3364 2955 2640 2387 2290 2365 2440 2519 2691 3007 3324 3441 3340 3099 2859 2604
932 2604 2350 2110 1870 1739 1609 1622 1636 1650 1663 1790 1916 1989 1907 1742 1576 1448 1320 1239 1157 1179 1201 1129 964 845 819 863 907 931
929 931 954 931 860 807 847 886 878 852 826 801 730 656 676 789 903 882 861 860 859 786 712 668 716 843 970 1068 1010 877 838 931 1024 985 946 961
925 961 1022 1004 892 830 816 816 816 869 922 924 832 813 887 958 936 846 802 835 868 924 981 959 937 906 875 827 779 745 805 862 872 824 776 775 868 968
$$ packed form
952D16o2R4J47N4L8L8J3J2m0N3Q0P9n5n4q4q4ooPQQQk4k4k3k4M3M2M3M3JJJKQ3Q3L6L6m6m6
947H91r3r3l9l9M0L9M7M7o3o3m3m3L5L5P1P2P8j6j52j51l9N6PPJ3J3onM5J39J30L6m5m6r2
943G73r2j1Q4N1m3q4J1jjm7M6R2R2K0K0q4q4l4O0R2km3N0J04J03%%OOm1m1J4J5J17J18J68
939A434P4O8J62J97J03p2p3o9o9j22k8Q8Q8N7N6K47M03M32L39J79m0k51k50j90j89j64p0R5
935B435R6N8J52L41M97M85L29P1k09m45m46m09l15k53r7P5P5P9J72L16L17J17j01k41k40k55
932B604k54k40k40j31j30J3J4J4J3J27J26P3q2j65j66j28j28q1q2K2K2p2j65j19k6M4M4K4
929I31K3k3p1n3M0L9qk6k6k5p1p4K0J13J14k1k1jjp3p4m4M8J27J27R8n8j33l9R3R3l9l9J5
925I61O1j8j12o2j4%%N3N3Kr2j9P4P1k2r0m4L3L3N6N7k2k2l1l1m8m8l4O0N7J0m8m8jR3J00
$$ plain form
920 968 975 899 824 831 839 870 902 952 1002 1005 1009 987 965 920 874 897 920 942 965 990 1015 962 909 888 867 893 918 898 878 861 844 924 1052 1106 1004 860
916 860 809 867 925 943 961 1026 1090 1097 1103 1109 1115 1090 1066 1041 1016 967 917 914 911 893 875 828 874 949 1025 966 906 958 1010 1085 1160 1181 1203 1116 1028 1039 1051 1015
911 1015 979 1044 1109 1148 1094 1064 1034 1003 973 947 1015 1029 1044 1043 1043 1089 1135 1064 994 1002 1010 1037 1063 1043 1023 1019 1015 964 913 889 865 864 864 906 948 912 876 868 861 901
906 901 940 977 1013 1002 992 943 895 870 845 864 883 975 1066 1138 1117 1013 909 886 956 1020 1084 1092 1100 973 847 786 818 907 996 1014 1031 1049 1066 1059 1051
902 1051 1043 1035 1084 1133 1104 1075 1110 1145 1129 1020 978 1029 1075 1027 980 933 886 839 804 863 875 887 853 913 967 1021 1030 1039 1048 1058 1013 968 1001 1034 1050 1066 1058
897 1058 1050 1007 963 920 877 869 862 932 1003 984 966 924 882 928 974 1020 1067 1032 996 1008 1020 1029 1037 1000 962 939 915 892 869 840 812 861 910 843 777 792 901
893 901 994 993 974 954 1027 1101 1093 991 891 886 962 1038 1058 1078 1052 1026 1016 1007 997 988 991 993 1043 1092 1091 1089 1064 1039 989 938 935 932 1012 1092 1090 995 984 1067 1191 1221
888 1221 1186 1151 1110 1069 1015 961 1017 1072 1069 1065 1109 1152 1229 1306 1359 1413 1480 1547 1693 1838 1897 1956 2061 2167 2246 2325 2410 2402 2231 2061 1966 1965 1914 1768
$$ packed form
920I68Pp6p5PQL1L2N0N0LMk2k2m5m6K3K3K2K3K5K5n3n3k1k1K6K5k0k0j7j7Q0J28N4j02j44
916H60n1N8N8J8J8O5O4POOOk5k4k5k5m9n0llj8j8m7M6P5P6n9o0N2N2P5P5K1K2q7q8J1J2l6
911A015l6O5O5L9n4l0l0l1l0k6O8J4J5j%M6M6p1p0QQK7K6k0k0mmn1n1k4k4j%M2M2l6l6qpM0
906I01L9L7L6j1j0m9m8k5k5J9J9R2R1P2k1j04j04k3P0O4O4QQj27j26o1L2Q9Q9J8J7J8J7pq
902A051qqM9M9k9k9L5L5j6j09m2N1M6m8m7m7m7m7l5N9J2J2l4O0N4N4RRRJ0m5m5L3L3J6J6q
897A058qm3m4m3m3qpP0P1j9j8m2m2M6M6M6M7l5l6J2J2RQl7l8k3k4k3k3k9k8M9M9o7o6J5J09
893I01R3jj9k0P3P4qj02j00nP6P6K0K0k6k6j0rj0rLKN0M9jkk5k5n0n1llQ0Q0kr5j1Q3J24L0
888A221l5l5m1m1n4n4N6N5lmM4M3P7P7N3N4O7O7J46J45N9N9J05J06P9P9Q5qj71j70r5jn1j46
$$ plain form
884 1768 1634 1501 1429 1356 1284 1212 1221 1231 1194 1157 1115 1074 1078 1083 1135 1187 1213 1146 1049 952 1022 1091 1086 1081 1070 1153 1195 1237 1238 1239 1264 1288 1234 1180 1171 1162 1199 1237
879 1237 1215 1193 1218 1243 1227 1210 1211 1212 1251 1196 1115 1034 1047 1059 1072 1084 1047 1010 1019 1029 1044 1059 1075 1090 1115 1141 1119 1098 1188 1279 1229 1179 1188 1197 1128 1059 1005
875 1005 951 920 889 961 1033 1055 982 866 842 845 847 842 931 1014 1097 1114 1131 1124 1118 1089 1060 1077 1095 1125 1156 1140 1124 1075 1027 1025 1023 1001 980 1037 1093 1116 1139 1083
870 1083 1028 1074 1120 1115 1017 991 1059 1168 1183 1179 1175 1212 1249 1218 1188 1181 1174 1217 1260 1302 1345 1332 1319 1330 1340 1296 1252 1287 1321 1287 1253 1172 1091 1092 1093 1140 1188 1199
865 1199 1209 1172 1089 1030 1049 1097 1099 1042 1032 1097 1115 1081 1046 1087 1128 1100 1072 1091 1110 1100 1091 1081 1072 1041 1009 1056 1103 1179 1255 1225 1195 1181 1214 1264 1237 1135
861 1135 1033 1067 1101 1097 1093 1089 1085 1072 1059 1069 1079 1142 1206 1194 1183 1189 1242 1257 1163 1035 985 1081 1178 1190 1124 1102 1158 1211 1217 1177 1136 1112 1088 1064 1041 1063 1086
856 1086 1109 1132 1117 1102 1133 1165 1143 1122 1100 1078 1046 1014 1059 1105 1092 1079 1113 1147 1179 1211 1165 1119 1099 1080 1107 1134 1128 1122 1038 954 926 899 949 1000 1034 1068
852 1068 1102 1136 1145 1155 1118 1081 1054 1027 1047 1067 1126 1185 1221 1257 1228 1200 1219 1237 1164 1090 1095 1099 1098 1097 1073 1049 1049 1050 1097 1145 1220 1295 1293 1290 1230 1171 1112 1052 1027
$$ packed form
884A768j34j33p2p3p2p2RJ0l7l7m2m1MNN2N2K6o7r7r7P0O9nnj1Q3M2M2JJK5K4n4n4rrL7L8
879A237k2k2K5K5j6j7JJL9n5q1q1J3J2J3J2l7l7RJ0J5J5J6J5K5K6k2k1R0R1n0n0RRo9o9n4
875A005n4l1l1P2P2K2p3j16k4LKnQ9Q3Q3J7J7pok9k9J7J8L0L1j6j6m9m8kkk2k1N7N6K3K3n6
870A083n5M6M6nr8k6O8J09J5mmL7L7l1l0ppM3M3M2M3j3j3J1J0m4m4L5L4l4l4q1q1JJM7M8J1
865A199J0l7q3n9J9M8Kn7j0O5J8l4l5M1M1k8k8J9J9j0rj0rl1l2M7M7P6P6l0l0j4L3N0k7j02
861A135j02L4L4mmmmj3j3J0J0O3O4j2j1ON3J5r4j28n0R6R7J2o6k2N6N3Om0m1k4k4k4k3K2K3
856A086K3K3j5j5L1L2k2k1k2k2l2l2M5M6j3j3L4L4L2L2m6m6k0j9K7K7ooq4q4k8k7N0N1L4L4
852A068L4L4RJ0l7l7k7k7K0K0N9N9L6L6k9k8J9J8p3p4NMjjk4k4%JM7M8P5P5klo0n9n9o0k5
$$ plain form
847 1027 1002 1111 1221 1261 1207 1160 1112 1166 1220 1227 1234 1199 1163 1175 1187 1178 1168 1112 1056 1037 1017 1021 1025 1057 1089 1120 1152 1138 1124 1245 1365 1386 1313 1269 1225
843 1225 1226 1227 1274 1321 1237 1152 1093 1127 1150 1174 1151 1221 1253 1284 1244 1203 1209 1215 1222 1228 1176 1125 1093 1155 1201 1153 1116 1080 1106 1132 1111 1091 1085 1079 1146 1212 1293 1281 1243
838 1243 1205 1282 1359 1437 1514 1645 1776 1792 1652 1458 1265 1213 1254 1300 1347 1291 1234 1227 1220 1259 1299 1312 1326 1336 1347 1281 1168 1135 1196 1274 1306 1323 1340
834 1340 1331 1322 1313 1304 1274 1244 1213 1183 1137 1091 1127 1257 1361 1372 1269 1167 1204 1241 1272 1304 1298 1199 1082 1012 1061 1157 1209 1215 1186 1157 1204 1250 1212 1174 1136
830 1136 1097 1104 1111 1117 1124 1159 1193 1181 1168 1242 1315 1248 1181 1181 1180 1212 1197 1173 1242 1327 1364 1351 1291 1207 1124 1080 1037 1103 1168 1204 1240 1166 1092 1075 1058 1119 1180 1197
825 1197 1214 1184 1154 1128 1102 1076 1050 1066 1083 1099 1115 1091 1066 1120 1173 1168 1164 1203 1242 1217 1146 1090 1127 1140 1061 1027 1088 1187 1193 1155 1211 1327 1397 1390 1382 1328 1274
821 1274 1220 1166 1226 1285 1267 1249 1226 1204 1182 1160 1163 1166 1097 1028 995 1056 1111 1165 1145 1124 1182 1239 1269 1299 1371 1442 1474 1412 1356 1301 1335 1369 1403 1437 1418 1398
816 1398 1379 1360 1321 1282 1243 1204 1196 1187 1179 1170 1261 1352 1392 1338 1314 1383 1528 1673 1721 1676 1631 1679 1747 1815 1749 1682 1642 1601 1639 1677 1609 1541 1467 1487 1557 1628
$$ packed form
847A027k5J09J10M0n4m7m8N4N4PPl5l6J2J2rj0n6n6j9k0MML2L2L1L2j4j4J21J20K1p3m4m4
843A225JJM7M7q4q5n9L4K3K4k3P0L2L1m0m1OOPOn2n1l2O2M6m8l7l6K6K6k1k0ooO7O6Q1j2l8
838A243l8P7P7P8P7J31J31J6j40j94j93n2M1M6M7n6n7ppL9M0J3J4J0J1o6j13l3O1P8L2J7J7
834A340rrrrl0l0l1l0m6m6L6J30J04J1j03j02L7L7L1L2or9j17p0M9R6N2Ok9k9M7M6l8l8l8
830A136l9PPOPL5L4j2j3P4P3o7o7%jL2j5k4O9Q5L7j3o0q4q3m4m3O6O5L6L6p4p4j7j7O1O1J7
825A197J7l0l0k6k6k6k6J6J7J6J6k4k5N4N3nmL9L9k5p1n6L7J3p9l4O1R9Ol8N6J16P0pqn4n4
821A274n4n4O0N9j8j8k3k2k2k2LLo9o9l3O1N5N4k0k1N8N7L0L0P2P1L2o2n6n5L4L4L4L4j9k0
816A398j9j9l9l9l9l9qrqrR1R1M0n4k4O9J45J45M8m5m5M8O8O8o6o7m0m1L8L8o8o8p4K0P0P1
$$ plain form
812 1628 1564 1500 1453 1406 1406 1406 1465 1524 1505 1487 1456 1426 1395 1365 1411 1458 1457 1457 1400 1342 1310 1372 1441 1511 1508 1505 1515 1525 1488 1451 1446 1440 1513 1585 1665 1745 1748 1750 1828 1906
807 1906 1928 1856 1842 1828 1911 1995 2083 2078 1985 1892 1860 1828 1795 1763 1773 1783 1799 1721 1688 1655 1663 1671 1573 1474 1423 1371 1450 1528 1606 1684 1662 1640 1577 1514 1425 1430 1489
803 1489 1548 1510 1425 1449 1566 1685 1711 1623 1536 1511 1487 1463 1439 1386 1334 1338 1435 1595 1755 1781 1806 1807 1808 1808 1809 1864 1919 2021 2123 2156 2189 2216 2242 2239 2142
798 2142 2020 1898 1812 1727 1693 1752 1866 1887 1827 1766 1746 1727 1707 1688 1651 1615 1532 1449 1484 1518 1475 1385 1323 1356 1410 1465 1498 1531 1517 1503 1544 1585 1516
794 1516 1448 1432 1416 1479 1541 1641 1742 1733 1724 1748 1772 1797 1821 1758 1694 1631 1567 1627 1686 1668 1604 1564 1618 1689 1713 1648 1583 1569 1648 1722 1749 1730 1711 1658 1606
790 1606 1554 1502 1498 1495 1444 1394 1374 1353 1332 1312 1350 1388 1379 1370 1301 1233 1167 1101 1177 1301 1344 1294 1235 1223 1232 1241 1243 1338 1434 1436 1420 1405 1390 1375 1335 1389 1464 1492
785 1492 1470 1448 1500 1599 1667 1641 1594 1595 1613 1585 1451 1318 1249 1275 1325 1376 1437 1498 1477 1362 1290 1312 1351 1344 1354 1411 1465 1472 1471 1470 1467 1463 1421 1378 1382 1386 1352 1318
781 1318 1356 1394 1418 1348 1261 1221 1245 1316 1369 1329 1275 1221 1239 1257 1315 1373 1353 1334 1321 1308 1296 1283 1217 1151 1163 1175 1203 1232 1182 1132 1158 1184 1162 1141 1107
$$ packed form
812A628o4o4m7m7%%N9N9j9j8l1l0l1l0M6M7j%n7n8l2O2O9P0llJ0J0l7l7noP3P2Q0Q0LKP8P8
807A906K2p2j4j4Q3Q4Q8nr3r3l2l2l3l2J0J0J6p8l3l3QQr8r9n1n2P9P8P8P8k2k2o3o3q9NN9
803A489N9l8q5K4J17J19K6q8q7k5k4k4k4n3n2MR7J60J60K6K5JJ%JN5N5J02J02L3L3K7K6lr7
798B142j22j22q6q5l4N9J14K1o0o1k0j9k0j9l7l6q3q3L5L4m3r0o2L3N4N5L3L3j4j4M1M1o9
794A516o8j6j6O3O2J00J01rrK4K4K5K4o3o4o3o4O0N9j8o4m0N4P1K4o5o5j4P9P4K7j9j9n3n2
790A606n2n2mln1n0k0k1k1k0L8L8rro9o8o6o6P6J24M3n0n9j2RRKR5R6Kj6j5j5j5m0N4P5K8
785A492k2k2N2R9O8k6m7JJ8k8j34j33o9K6N0N1O1O1k1j15p2K2L9pJ0N7N4Pjjlmm2m3MMl4l4
781A318L8L8K4p0q7m0K4P1N3m0n4n4J8J8N8N8k0j9j3j3j2j3o6o6J2J2K8K9n0n0K6K6k2k1l4
$$ plain form
776 1107 1073 1042 1011 1024 1084 1172 1168 1142 1164 1231 1298 1379 1460 1518 1483 1388 1339 1336 1333 1277 1222 1213 1204 1233 1262 1291 1320 1394 1467 1547 1533 1481 1428 1394 1359 1315 1270
772 1270 1272 1274 1314 1353 1346 1339 1319 1298 1356 1414 1368 1322 1246 1265 1371 1476 1531 1493 1473 1453 1475 1496 1421 1346 1348 1351 1315 1279 1243 1206 1249 1292 1335 1377 1367 1356 1345
767 1345 1335 1309 1284 1258 1233 1251 1269 1365 1461 1448 1434 1397 1360 1324 1289 1300 1311 1308 1305 1301 1298 1286 1274 1285 1296 1242 1187 1211 1234 1241 1247 1242 1330 1417 1410 1295 1181 1089
763 1089 1092 1119 1147 1184 1222 1236 1251 1236 1221 1253 1285 1307 1329 1304 1278 1292 1306 1366 1427 1353 1279 1252 1224 1222 1220 1206 1286 1381 1382 1365 1347 1394 1440 1409 1378 1382 1386 1367
758 1367 1348 1325 1302 1325 1349 1356 1363 1299 1234 1232 1324 1410 1496 1515 1535 1445 1356 1309 1263 1264 1264 1330 1395 1441 1393 1341 1383 1395 1408 1363 1411 1483 1461 1394 1326 1362 1397
754 1397 1353 1308 1310 1312 1311 1309 1307 1306 1244 1183 1230 1278 1308 1339 1346 1353 1381 1409 1437 1465 1473 1482 1418 1354 1329 1398 1514 1536 1508 1479 1426 1374 1301 1321 1398 1475 1398 1320 1290
749 1290 1260 1243 1226 1256 1286 1183 1079 1063 1141 1233 1325 1344 1364 1361 1358 1378 1398 1384 1369 1355 1340 1309 1278 1294 1310 1323 1336 1325 1315 1342 1370 1374 1378 1383 1387 1368 1350
744 1350 1363 1375 1429 1483 1423 1270 1160 1205 1307 1408 1411 1413 1371 1329 1288 1246 1298 1351 1326 1300 1213 1125 1178 1230 1278 1325 1372 1419 1464 1508 1553 1597 1555 1513
$$ packed form
776A107l4l1l1J3O0Q8mk6K2O7O7Q1Q1N8l5r5m9lln6n5rrK9K9K9K9P4P3Q0j4n2n3l4l5m4m5
772A270KKM0L9ppk0k1N8N8m6m6p6J9J06J05N5l8k0k0K2K1p5p5KLl6l6l6l7M3M3M3M2j0j1j1
767A345j0k6k5k6k5J8J8R6R6j3j4l7l7l6l5J1J1llmlj2j2J1J1n4n5K4K3POnQ8Q7pj15j14r2
763A089LK7K8L7L8J4J5j5j5L2L2K2K2k5k6J4J4O0O1p4p4k7k8kkj4Q0R5Jj7j8M7M6l1l1MMj9
758A367j9k3k3K3K4PPo4o5kR2Q6Q6J9K0r0q9m7m6J%O6O5M6m8n2M2J2J3m5M8P2k2o7o8L6L5
754A397m4m5KKjkkjo2o1M7M8L0L1PPK8K8K8K8QRo4o4k5O9J16K2k8k9n3n2p3K0P7P7p7p8l0
749A290l0j7j7L0L0j03j04j6P8R2R2J9K0llK0K0j4j5j4j5l1l1J6J6J3J3j1j0K7K8MMNMj9j8
744A350J3J2N4N4o0j53j10M5J02J01LKm2m2m1m2N2N3k5k6q7q8N3N2M8M7M7M7M5M4M5M4m2m2
$$ plain form
740 1513 1471 1429 1411 1393 1376 1358 1349 1339 1283 1227 1211 1194 1225 1256 1300 1344 1342 1339 1358 1377 1442 1508 1389 1269 1259 1248 1302 1356 1363 1371 1337 1304 1380 1456 1472 1488
736 1488 1505 1521 1556 1592 1518 1444 1377 1310 1383 1456 1388 1320 1329 1339 1369 1399 1429 1459 1475 1492 1461 1431 1404 1378 1351 1325 1314 1303 1370 1437 1423 1408 1393 1378 1394
731 1394 1409 1378 1347 1328 1309 1369 1428 1481 1534 1508 1483 1396 1309 1300 1292 1298 1304 1310 1316 1338 1361 1461 1562 1566 1570 1528 1486 1419 1352 1394 1436 1441 1446 1451 1456 1475 1493 1506 1519 1482
727 1482 1351 1288 1382 1515 1555 1517 1478 1478 1478 1431 1384 1324 1264 1376 1488 1467 1447 1427 1407 1432 1458 1436 1415 1372 1329 1333 1337 1341 1345 1396 1447 1438 1429 1374 1318 1368 1418
722 1418 1421 1424 1373 1323 1381 1440 1495 1549 1526 1503 1478 1453 1381 1309 1349 1389 1429 1469 1478 1486 1385 1283 1368 1452 1489 1527 1507 1487 1467 1446 1426 1406 1386 1366 1410 1455
718 1455 1452 1449 1449 1448 1447 1447 1514 1580 1569 1558 1616 1674 1592 1510 1384 1259 1337 1414 1425 1435 1445 1456 1492 1529 1518 1508 1571 1634 1619 1604 1751 1898 1993 1931 1807
713 1807 1683 1659 1634 1644 1654 1617 1580 1522 1465 1454 1443 1458 1473 1488 1503 1642 1781 1842 1747 1655 1657 1821 1985 2028 1916 1761 1699 1719 1739 1765 1791 1810
709 1810 1830 1803 1776 1749 1721 1694 1666 1554 1441 1407 1529 1720 1817 1867 1918 1999 2081 2264 2603 2994 3166 3022 2660 2335 2103 1893 1776 1782
$$ packed form
740A513m2m2j8j8j7j8rj0n6n6j6j7L1L1M4M4klJ9J9O5O6j19j20j0j1N4N4PQl4l3P6P6J6J6
736A488J7J6L5L6p4p4o7o7P3P3o8o8RJ0L0L0L0L0J6J7l1l0k7k6k7k6j1j1O7O7j4j5j5j5J6
731A394J5l1l1j9j9O0N9N3N3k6k5q7q7rqOOOOK2K3J00J01MMm2m2o7o7M2M2NNNNJ9J8J3J3l7
727A482j31o3R4J33M0l8l9%%m7m7o0o0J12J12k1k0k0k0K5K6k2k1m3m3MMMMN1N1rrn5n6N0N0
722A418LLn1n0N8N9N5N4k3k3k5k5p2p2M0M0M0M0RQj01j02Q5Q4L7L8k0k0k0k1k0k0k0k0M4M5
718A455ll%jj%O7O6j1j1N8N8q2q2j26j25P8P7J1J0J0J1L6L7j1j0O3O3j5j5J47J47R5o2j24
713A807j24k4k5J0J0l7l7n8n7j1j1J5J5J5J5J39J39O1r5r2KJ64J64M3j12j55o2K0K0K6K6J9
709A810K0k7k7k7k8k7k8j12j13l4J22J91R7N0N1Q1Q2J83L39L91J72j44l62l25k32k10j17O
$$ plain form
706 1782 1789 1750 1618 1538 1551 1615 1678 1685 1691 1697 1704 1689 1675 1739 1803 1868 1932 1950 1968 1971 1975 1978 1981 1948 1915 1835 1755 1744 1733 1703 1579 1428 1371 1427 1483 1519 1554 1590
701 1590 1626 1726 1827 1824 1821 1846 1964 2082 2107 1932 1757 1602 1540 1539 1539 1497 1456 1442 1428 1461 1494 1466 1438 1456 1474 1471 1468 1465 1462 1490 1517 1544 1572 1533 1495
697 1495 1456 1418 1483 1548 1566 1584 1583 1583 1623 1663 1589 1421 1295 1326 1364 1402 1341 1279 1275 1272 1268 1264 1335 1407 1431 1456 1478 1501 1524 1546 1537 1528 1379 1229 1191 1152 1161
693 1161 1169 1224 1279 1334 1388 1374 1360 1392 1424 1480 1535 1543 1552 1518 1485 1451 1418 1471 1525 1500 1475 1440 1404 1478 1552 1542 1532 1444 1356 1380 1405 1382 1359 1373 1387 1401
688 1401 1415 1435 1455 1397 1338 1339 1339 1339 1339 1373 1406 1440 1473 1483 1492 1424 1355 1366 1376 1433 1491 1447 1404 1408 1412 1443 1474 1505 1535 1505 1476 1446 1416 1424 1432 1440 1448 1394 1341 1334 1327
683 1327 1340 1353 1319 1285 1343 1401 1459 1517 1545 1573 1523 1473 1415 1357 1346 1335 1364 1393 1423 1452 1508 1563 1572 1582 1548 1514 1480 1446 1412 1378 1297 1216 1216 1217 1265 1313
679 1313 1322 1331 1340 1350 1366 1383 1376 1369 1408 1447 1439 1431 1372 1313 1363 1413 1484 1555 1579 1604 1568 1533 1498 1462 1426 1389 1430 1471 1544 1618 1582 1546 1508 1470 1478 1487 1536 1586 1588 1591
674 1591 1564 1537 1463 1390 1380 1371 1409 1446 1505 1563 1513 1462 1420 1377 1358 1339 1350 1360 1371 1381 1370 1358 1394 1429 1404 1379 1307 1235 1246 1257 1315 1374 1406 1438 1447 1456
$$ packed form
706A782Pl9j32q0J3O4O3POOPj5j4O4O4O5O4J8J8LMLLl3l3q0q0j1j1l0j24j51n7N6N6L6L5L6
701A590L6J00J01llK5J18J18K5j75j75j55o2j%m2m1j4j4L3L3k8k8J8J8llllK8K7K7K8l9l8
697A495l9l8O5O5J8J8j%M0M0p4j68j26L1L8L8o1o2mlmmP1P2K4K5K2K3K3K2rrj49j50l8l9R
693A161QN5N5N5N4j4j4L2L2N6N5QRl4l3l4l3N3N4k5k5l5l6P4P4j0j0q8q8K4K5k3k3J4J4J4
688A401J4K0K0n8n9J%%%L4L3L4L3J0Ro8o9J1J0N7N8m4m3MML1L1L1L0l0k9l0l0QQQQn4n3pp
683A327J3J3l4l4N8N8N8N8K8K8n0n0n8n8j1j1K9K9L0K9N6N5RJ0l4l4l4l4l4l4q1q1%JM8M8
679A313RRRJ0J6J7ppL9L9qqn9n9N0N0P1P1K4K5l6l5l5l6l6l7M1M1P3P4l6l6l8l8QRM9N0KL
674A591k7k7p4p3j0rL8L7N9N8n0n1m2m3j9j9J1J0J1J0j1j2L6L5k5k5p2p2J1J1N8N9L2L2RR
$$ plain form
669 1456 1443 1430 1464 1498 1472 1447 1421 1396 1403 1409 1369 1329 1339 1349 1406 1463 1483 1503 1476 1450 1440 1430 1444 1457 1424 1390 1434 1479 1481 1484 1377 1271 1301 1331 1337 1344 1358
665 1358 1372 1362 1353 1334 1316 1274 1233 1233 1233 1257 1280 1295 1310 1278 1246 1210 1174 1248 1321 1324 1327 1284 1240 1258 1275 1340 1405 1398 1391 1408 1425 1443 1460 1455 1449 1429 1409 1366 1323
660 1323 1263 1203 1284 1364 1423 1481 1493 1505 1454 1403 1431 1458 1443 1427 1334 1240 1240 1240 1287 1333 1332 1331 1330 1329 1409 1489 1491 1493 1424 1354 1394 1434 1425 1416 1360 1304 1295 1287 1301 1316 1289
655 1289 1262 1234 1207 1243 1279 1268 1257 1284 1311 1338 1366 1287 1208 1269 1331 1391 1452 1434 1417 1426 1435 1444 1454 1413 1373 1356 1340 1292 1245 1244 1243 1311 1379 1399 1420 1345 1271
651 1271 1299 1328 1359 1297 1241 1341 1527 1619 1539 1460 1435 1411 1433 1455 1497 1540 1417 1294 1264 1329 1396 1370 1335 1348 1402 1408 1391 1373 1355 1337 1343 1395 1430 1371
646 1371 1289 1253 1294 1335 1392 1449 1459 1469 1463 1456 1450 1443 1392 1341 1399 1456 1435 1414 1393 1372 1420 1467 1467 1468 1464 1460 1456 1452 1434 1415 1397 1378 1345 1313 1286 1259 1294 1424 1526
642 1526 1583 1576 1569 1512 1456 1363 1270 1318 1366 1341 1316 1369 1423 1482 1541 1553 1565 1510 1455 1447 1439 1491 1544 1518 1492 1434 1376 1365 1353 1388 1423 1457 1492 1472 1452 1479 1505
637 1505 1520 1536 1551 1566 1525 1484 1489 1495 1559 1624 1641 1659 1599 1539 1480 1420 1455 1490 1525 1560 1526 1492 1458 1424 1419 1413 1407 1402 1357 1312 1408 1504 1532 1561 1589 1617 1583 1549
$$ packed form
669A456j3j3L4L4k6k5k6k5POm0m0J0J0N7N7K0K0k7k6j0j0J4J3l3l4M4M5KLj07j06L0L0OPJ4
665A358J4j0rj9j8m2m1%%K4K3J5J5l2l2l6l6P4P3LLm3m4J8J7O5O5ppJ7J7J8J7nok0k0m3m3
660A323o0o0Q1Q0N9N8J2J2n1n1K8K7j5j6r3r4%%M7M6jjjjQ0Q0KKo9p0M0M0rrn6n6rqJ4J5k7
655A289k7k8k7L6L6j1j1K7K7K7K8p9p9O1O2O0O1j8j7RRRJ0m1m0j7j6m8m7jjO8O8K0K1p5p4
651A271K8K9L1o2n6J00J86R2q0p9k5k4K2K2M2M3j23j23l0O5O7k6l5J3N4Oj7j8j8j8ON2L5n9
646A371q2l6M1M1N7N7J0J0opopn1n1N8N7k1k1k1k1M8M7%Jmmmmj8j9j8j9l3l2k7k7L5J30J02
642A526N7ppn7n6r3r3M8M8k5k5N3N4N9N9J2J2n5n5qqN2N3k6k6n8n8j1j2L5L5L4L5k0k0K7K6
637A505J5J6J5J5m1m1NOO4O5J7J8o0o0n9o0L5L5L5L5l4l4l4l4noonm5m5R6R6K8K9K8K8l4l4
$$ plain form
633 1549 1515 1481 1505 1530 1554 1579 1586 1594 1602 1610 1604 1598 1546 1493 1431 1369 1473 1577 1589 1508 1426 1439 1486 1533 1581 1628 1664 1606 1438 1365 1374 1383 1352 1320 1364 1407 1373
628 1373 1338 1361 1384 1407 1430 1412 1394 1376 1358 1455 1552 1562 1477 1433 1389 1416 1444 1459 1474 1416 1359 1356 1447 1485 1523 1480 1438 1396 1353 1361 1370 1378 1386 1417 1447 1477 1507
623 1507 1515 1523 1531 1538 1445 1352 1337 1322 1345 1368 1391 1414 1476 1539 1655 1677 1579 1481 1455 1429 1452 1475 1498 1521 1526 1531 1537 1542 1589 1636 1689 1649 1559 1468 1429 1483 1502 1521
619 1521 1442 1364 1369 1468 1567 1572 1550 1527 1499 1470 1452 1433 1493 1552 1530 1509 1534 1559 1539 1518 1498 1477 1473 1468 1392 1316 1341 1459 1581 1609 1509 1456 1514 1618 1628
615 1628 1592 1582 1572 1556 1493 1404 1409 1455 1502 1554 1606 1583 1560 1537 1514 1583 1653 1614 1529 1491 1546 1647 1702 1662 1575 1511 1448 1390 1332 1352 1372 1427 1482 1537 1592
610 1592 1620 1649 1630 1612 1550 1489 1535 1629 1716 1709 1680 1651 1657 1663 1669 1675 1687 1699 1710 1722 1712 1701 1690 1680 1625 1570 1593 1615 1662 1708 1749 1789 1839 1796 1701 1607 1608 1702
606 1702 1769 1790 1800 1810 1770 1730 1685 1639 1640 1641 1644 1646 1649 1651 1662 1672 1786 1899 1920 1847 1827 1807 1762 1716 1718 1719 1682 1646 1609 1573 1545 1518 1537 1556 1585 1614 1689 1811
601 1811 1926 1947 1915 1883 1885 1886 1841 1796 1793 1790 1787 1784 1742 1699 1704 1708 1700 1693 1639 1585 1594 1603 1612 1621 1618 1615 1612 1610 1678 1746 1674 1602 1548 1493 1486 1478 1498 1518 1538 1558 1505 1451 1445 1438 1389
$$ packed form
633A549l4l4K4K5K4K5PQQQoon2n3o2o2J04J04J2q1q2J3M7M7M8M7L6n8j68p3RRl1l2M4M3l4
628A373l5K3K3K3K3j8j8j8j8R7R7J0q5m4m4K7K8J5J5n8n7lR1L8L8m3m2m2m3QRQQL1L0L0L0
623A507QQQPr3r3j5j5K3K3K3K3O2O3J16K2r8r8k6k6K3K3K3K3NNONM7M7N3m0r0r1l9N4J9J9
619A521p9p8NR9R9Nk2k3k8k9j8j9O0N9k2k1K5K5k0k1k0k1mnp6p6K5J18J22K8j00n3N8J04J0
615A628l6j0j0j6o3q9NM6M7N2N2k3k3k3k3O9P0l9q5l8N5J01N5m0q7o4o3n8n8K0K0N5N5N5N5
610A592K8K9j9j8o2o1M6R4Q7pk9k9OOOOJ2J2J1J2j0j1j1j0n5n5K3K2M7M6M1M0N0m3r5r4JR4
606A702O7K1J0J0m0m0m5m6JJLKLKJ1J0J14J13K1p3k0k0m5m6KJl7l6l7l6k8k7J9J9K9K9P5J22
601A811J15K1l2l2KJm5m5llllm2m3NMqpn4n4RRRRlllkO8O8p2p2n4n5pqK0K0K0K0n3n4opm9
$$ plain form
595 1389 1339 1430 1521 1547 1574 1615 1703 1733 1669 1602 1629 1703 1683 1643 1604 1639 1673 1708 1743 1754 1764 1775 1785 1734 1683 1631 1580 1569 1557 1546 1535 1625 1715 1758 1802
591 1802 1755 1709 1663 1616 1642 1667 1646 1624 1589 1554 1519 1484 1480 1476 1519 1562 1634 1705 1782 1766 1686 1607 1599 1637 1670 1609 1549 1581 1660 1692 1615 1538 1482 1426 1448 1470
587 1470 1522 1574 1625 1677 1741 1806 1767 1728 1672 1711 1774 1838 1840 1841 1820 1798 1760 1722 1761 1801 1798 1796 1793 1791 1735 1679 1611 1637 1664 1597 1490 1476 1527 1579 1558 1537 1562
582 1562 1587 1588 1589 1672 1754 1790 1826 1871 1916 1852 1788 1758 1729 1658 1588 1527 1560 1587 1614 1568 1522 1523 1524 1520 1515 1588 1661 1742 1823 1826 1830 1757 1683 1688 1693 1746 1799 1796 1699 1594
577 1594 1489 1550 1610 1619 1629 1591 1553 1580 1607 1674 1742 1710 1584 1506 1521 1520 1519 1478 1436 1370 1303 1262 1315 1368 1422 1434 1447 1417 1387 1357 1327 1314 1301 1288 1274
573 1274 1332 1389 1441 1492 1524 1461 1399 1430 1491 1553 1543 1532 1524 1516 1508 1500 1467 1434 1424 1414 1408 1403 1385 1462 1582 1609 1587 1612 1670 1681 1612 1543 1522 1501 1433 1366 1444
569 1444 1522 1547 1478 1429 1426 1463 1500 1513 1433 1305 1271 1319 1366 1373 1379 1474 1568 1553 1538 1539 1539 1493 1447 1430 1413 1373 1333 1416 1499 1535 1571 1622 1674 1672 1576 1519 1509
564 1509 1490 1471 1459 1448 1436 1425 1471 1518 1521 1523 1560 1643 1709 1681 1627 1619 1632 1598 1532 1512 1510 1508 1435 1362 1398 1435 1482 1530 1469 1408 1425 1443 1414 1384 1354 1324 1371
$$ packed form
595A389n0R1R1K6K7M1Q8L0o4o7K7P4k0m0l9L5L4L5L5J1J0J1J0n1n1n2n1j1j2j1j1R0R0M3M4
591A802m7m6m6m7K6K5k1k2l5l5l5l5mmM3M3P2P1P7j6q0p9qL8L3o1o0L2P9L2p7p7n6n6K2K2
587A470N2N2N1N2O4O5l9l9n6L9O3O4KJk1k2l8l8L9M0lklkn6n6o8K6K7o7j07j4N1N2k1k1K5
582A562K5JJQ3Q2L6L6M5M5o4o4l0k9p1p0o1L3K7K7m6m6JJmnP3P3Q1Q1LMp3p4NNN3N3lr7j05
577A594j05O1O0RJ0l8l8K7K7O7O8l2j26p8J5jjm1m2o6o7m1N3N3N4J2J3l0l0l0l0j3j3j3j4
573A274N8N7N2N1L2o3o2L1O1O2j0j1qqqql3l3j0j0onj8P7J20K7k2K5N8J1o9o9k1k1o8o7P8
569A444P8K5o9m9lL7L7J3q0j28l4M8M7POR5R4j5j5J%m6m6j7j7m0m0Q3Q3L6L6N1N2kr6n7j0
564A509j9j9j2j1j2j1M6M7LKL7Q3O6k8n4qJ3l4o6k0kkp3p3L6L7M7M8o1o1J7J8k9l0l0l0M7
$$ plain form
560 1371 1464 1538 1519 1477 1435 1445 1455 1417 1380 1430 1480 1530 1579 1588 1597 1527 1458 1454 1449 1445 1441 1469 1498 1527 1555 1564 1572 1534 1450 1414 1472 1553 1633 1651 1669 1610 1504 1450
555 1450 1490 1578 1619 1562 1505 1445 1385 1420 1455 1491 1526 1565 1604 1533 1463 1413 1363 1363 1363 1411 1506 1580 1561 1483 1406 1349 1339 1371 1497 1620 1697 1715 1686 1632 1532
551 1532 1459 1434 1457 1481 1493 1506 1518 1531 1512 1493 1474 1454 1491 1527 1549 1524 1490 1550 1601 1496 1318 1233 1319 1452 1502 1459 1424 1389 1343 1296 1296 1297 1359 1421
546 1421 1436 1452 1518 1584 1572 1560 1488 1417 1424 1430 1486 1541 1518 1496 1481 1467 1500 1533 1533 1533 1509 1486 1455 1423 1470 1517 1571 1624 1538 1406 1360 1409 1451 1446 1449 1451 1459 1421
542 1421 1375 1424 1472 1426 1343 1305 1376 1493 1550 1513 1459 1451 1503 1556 1587 1619 1598 1578 1534 1490 1462 1433 1452 1470 1516 1562 1530 1498 1401 1305 1286 1267 1294 1321 1325
538 1325 1328 1362 1395 1475 1555 1508 1461 1461 1461 1480 1499 1472 1444 1489 1533 1534 1534 1508 1528 1546 1486 1385 1331 1388 1492 1576 1613 1568 1476 1405 1381 1405 1430 1457 1484 1434
533 1434 1383 1387 1392 1443 1495 1498 1501 1480 1460 1469 1478 1565 1652 1693 1733 1750 1767 1717 1667 1696 1724 1725 1725 1679 1633 1605 1577 1596 1616 1697 1778 1812 1846 1834 1822 1787 1752 1752 1752 1775
528 1775 1798 1784 1770 1710 1604 1519 1544 1611 1631 1579 1574 1649 1723 1735 1747 1736 1724 1696 1668 1718 1768 1731 1695 1705 1716 1715 1714 1666 1618 1661 1703 1746 1789 1776 1762 1796
$$ packed form
560A371R3P4j9m2m2J0J0l8l7N0N0N0M9RRp0o9mnmmK8K9K9K8RQl8q4l6N8Q1Q0J8J8n9j06n4
555A450M0Q8M1n7n7o0o0L5L5L6L5L9L9p1p0n0n0%%M8R5P4j9p8p7n7j0L2J26J23P7J8k9n4j00
551A532p3k5K3K4J2J3J2J3j9j9j9k0L7L6K2k5l4O0N1j05j78q5Q6J33N0m3l5l5m6m7%JO2O2
546A421J5J6O6O6j2j2p2p1PON6N5k3k2j5j4L3L3%%k4k3l1l2M7M7N4N3q6j32m6M9M2nLKQl8
542A421m6M9M8m6q3l8P1J17N7l7n4qN2N3L1L2k1k0m4m4k8k9J9J8M6M6l2l2r7r6j9j9K7K7M
538A325LL4L3Q0Q0m7m7%%J9J9k7k8M5M4J%k6K0J8o0j01n4N7J04Q4L7m5r2p1k4K4K5K7K7n0
533A434n1MNN1N2LLk1k0RRQ7Q7M1M0J7J7n0n0K9K8J%m6m6k8k8J9K0Q1Q1L4L4j2j2l5l5%%K3
528A775K3j4j4o0j06q5K5O7K0n2nP5P4J2J2j1j2k8k8N0N0l7l6J0J1jjm8m8M3M2M3M3j3j4L4
$$ plain form
524 1796 1830 1817 1805 1793 1780 1838 1896 1953 2011 1979 1947 1962 1977 1930 1883 1883 1884 1881 1879 1900 1921 1871 1822 1849 1923 1955 1893 1860 1874 1898 1922 1949 1975 1954 1933 1888 1843
519 1843 1764 1685 1684 1683 1757 1830 1903 1976 1970 1963 1933 1903 1867 1832 1842 1899 1949 1906 1840 1773 1779 1784 1897 2057 2194 2237 2196 2154 2123 2092 2061 2030 2068 2106 2118 2037
515 2037 1950 1863 1848 1833 1875 1917 1958 2000 1922 1844 1879 2007 2111 2121 2080 2040 1987 1934 1928 1922 1942 1961 1957 1953 2001 2048 2048 2049 2110 2172 2187 2202 2207 2212 2217 2222 2172 2122 2096
510 2096 2069 2120 2170 2173 2177 2127 2078 2106 2135 2102 2069 2113 2204 2257 2215 2120 2025 2041 2058 2152 2246 2280 2313 2269 2225 2278 2331 2307 2282 2258 2235 2289 2344 2406 2469 2454
506 2454 2439 2460 2481 2526 2570 2575 2579 2583 2587 2617 2646 2632 2617 2628 2684 2770 2763 2739 2763 2830 2850 2808 2813 2897 2982 2969 2956 2990 3024 3114 3203 3278 3306 3300 3387 3553 3719
501 3719 3767 3722 3700 3772 3826 3879 3980 4081 4169 4164 4164 4165 4201 4237 4267 4297 4264 4137 4054 4064 4114 4116 4104 4091 4152 4213 4346 4479 4617 4661 4648 4636 4622 4607
497 4607 4569 4532 4496 4460 4395 4330 4274 4124 3955 3787 3721 3750 3729 3661 3551 3442 3288 3135 2986 2930 2900 2870 2829 2788 2732 2630 2519 2501 2537 2573
493 2573 2531 2489 2447 2405 2361 2316 2272 2227 2166 2105 2121 2138 2115 2092 2069 2045 2007 1970 1932 1894 1886 1879 1871 1863 1832 1801 1848 1895 1961 2027 2036 1952 1831 1711 1631 1552
$$ packed form
524A796L4j3j2j2j3N8N8N7N8l2l2J5J5m7m7%JlkK1K1n0m9K7P4L2o2l3J4K4K4K7K6k1k1m5m5
519A843p9p9jjP4P3P3P3opl0l0l6l5J0N7N0m3o6o7ONJ13J60J37M3m1m2l1l1l1l1L8L8J2q1
515B037q7q7j5j5M2M2M1M2p8p8L5J28J04J0m1m0n3n3ooK0J9mmM8M7%JO1O2J5J5NNNNn0n0k6
510B096k7N1N0LMn0m9K8K9l3l3M4R1N3m2r5r5J6J7R4R4L4L3m4m4N3N3k4k5k4k3N4N5O2O3j5
506B454j5K1K1M5M4NMMML0K9j4j5J1N6Q6pk4K4O7K0m2NQ4Q5j3j3L4L4R0Q9P5K8oQ7J66J66
501C719M8m5k2P2N4N3J01J01Q8n%JL6L6L0L0l3j27q3J0N0Kj2j3O1O1J33J33J38M4j3j2j4j5
497D607l8l7l6l6o5o5n6j50j69j68o6K9k1o8j10j09j54j53j49n6l0l0m1m1n6j02j11j8L6L6
493B573m2m2m2m2m4m5m4m5o1o1J6J7k3k3k3k4l8l7l8l8qpqql1l1M7M7O6O6Rq4j21j20q0p9
$$ plain form
489 1552 1586 1621 1708 1702 1672 1642 1606 1571 1549 1528 1554 1579 1503 1427 1408 1482 1556 1631 1711 1791 1761 1731 1689 1741 1789 1744 1648 1552 1540 1528 1594 1660 1638 1615 1639
485 1639 1664 1690 1716 1696 1675 1688 1701 1667 1633 1604 1575 1546 1517 1467 1416 1500 1584 1584 1490 1396 1397 1445 1493 1469 1444 1449 1453 1498 1543 1631 1625 1531 1437 1410 1384 1435 1487
480 1487 1489 1492 1495 1498 1470 1443 1415 1388 1425 1463 1500 1538 1537 1536 1458 1379 1376 1374 1371 1369 1371 1373 1329 1284 1301 1318 1382 1445 1428 1411 1394 1377 1368 1360 1454 1549 1548 1452 1398 1437 1518 1505
475 1505 1411 1316 1312 1308 1304 1299 1283 1267 1298 1329 1348 1367 1339 1312 1367 1423 1479 1534 1588 1642 1617 1593 1536 1479 1421 1364 1347 1330 1209 1089 1108 1220 1258 1201 1169
471 1169 1183 1211 1240 1279 1318 1358 1397 1343 1288 1343 1398 1417 1436 1454 1473 1417 1360 1319 1324 1358 1298 1235 1266 1402 1443 1378 1312 1390 1561 1595 1535 1450 1412 1420 1427
466 1427 1419 1411 1403 1396 1422 1448 1396 1344 1288 1232 1254 1276 1266 1257 1325 1394 1481 1567 1575 1584 1632 1681 1682 1684 1679 1674 1669 1665 1747 1829 1833 1837 1785 1733 1729 1724 1772 1821 1870 1919 1916 1913 1864 1769
461 1769 1700 1726 1768 1810 1796 1688 1561 1434 1406 1471 1483 1496 1497 1499 1547 1596 1567 1539 1510 1482 1476 1469 1463 1457 1478 1499 1520 1541 1512 1483 1454 1425 1454 1484 1466 1449
457 1449 1407 1365 1401 1437 1467 1497 1450 1402 1354 1305 1339 1466 1574 1588 1520 1453 1449 1445 1394 1343 1391 1438 1382 1327 1305 1376 1395 1414 1397 1380 1362 1345 1348 1351 1354 1357 1353
$$ packed form
489A552L4L5Q7ol0l0l6l5k2k1K6K5p6p6j9P4P4P5Q0Q0l0l0m2N2M8m5r6r6j2j2O6O6k2k3K4
485A639K5K6K6k0k1J3J3l4l4k9k9k9k9n0n1Q4Q4%r4r4JM8M8k4k5NMM5M5Q8or4r4k7k6N1N2
480A487KLLLk8k7k8k7L7L8L7L8jjp8p9lklkKKm4m5J7J7O4O3j7j7j7j7rqR4R5jr6n4L9Q1j3
475A505r4r5mmmnj6j6L1L1J9J9k8k7N5N6N6N5N4N4k5k4n7n7n8n7j7j7j21j20J9J12L8n7l2
471A169J4K8K9L9L9M0L9n4n5N5N5J9J9J8J9n6n7m1NL4o0o3L1J36M1o5o6P8J71L4o0q5l8QP
466A427qqqpK6K6n2n2n6n6K2K2j0rO8O9Q7Q6QRM8M9JKnnnmQ2Q2MMn2n2mnM8M9M9M9llm9r5
461A769o9K6M2M2j4j08j27j27k8O5J2J3JKM8M9k9k8k9k8opooK1K1K1K1k9k9k9k9K9L0j8j7
457A449m2m2L6L6L0L0m7m8m8m9L4J27J08J4o8o7mmn1n1M8M7n6n5k2P1J9J9j7j7j8j7LLLLm
$$ plain form
452 1353 1349 1392 1435 1427 1419 1411 1403 1379 1355 1330 1306 1336 1365 1395 1425 1432 1439 1447 1454 1396 1338 1305 1366 1463 1560 1550 1446 1343 1335 1377 1419 1422 1424 1427 1430 1419 1407 1395 1384 1396 1409
447 1409 1422 1435 1417 1399 1453 1507 1600 1600 1486 1372 1306 1333 1308 1283 1311 1339 1368 1396 1375 1353 1332 1311 1301 1292 1360 1428 1458 1487 1469 1451 1460 1469 1478 1486 1500 1513 1454
443 1454 1396 1338 1374 1466 1559 1565 1571 1531 1491 1459 1427 1396 1364 1358 1351 1386 1421 1404 1293 1224 1248 1347 1352 1307 1262 1320 1378 1327 1276 1254 1232 1257 1281 1256 1231 1160 1088
438 1088 1125 1163 1200 1238 1254 1269 1285 1301 1354 1407 1357 1307 1277 1340 1352 1363 1333 1304 1274 1245 1166 1087 1117 1147 1188 1229 1271 1312 1343 1373 1357 1341 1398 1455 1372
434 1372 1289 1298 1307 1362 1417 1511 1605 1535 1309 1196 1302 1437 1478 1495 1512 1534 1463 1336 1302 1350 1398 1377 1355 1266 1176 1061 1102 1195 1289 1215 1141 1124 1200
430 1200 1274 1349 1382 1416 1385 1355 1372 1388 1415 1442 1391 1340 1362 1384 1430 1475 1450 1424 1375 1326 1350 1374 1399 1423 1452 1481 1515 1456 1401 1346 1363 1380 1360 1340 1398
426 1398 1456 1488 1520 1593 1666 1588 1418 1356 1388 1425 1463 1428 1393 1340 1287 1280 1274 1267 1261 1255 1249 1257 1265 1321 1376 1420 1463 1429 1395 1455 1514 1548 1489 1480 1471 1503 1535 1497 1458
421 1458 1466 1474 1461 1448 1411 1374 1301 1227 1263 1299 1222 1145 1114 1240 1379 1425 1362 1298 1301 1304 1380 1455 1556 1562 1544 1526 1484 1443 1323 1204 1221 1239 1233 1227 1298 1370
$$ packed form
452A353mM3M3qqqqk4k4k5k4L0K9L0L0PPQPn8n8l3O1R7R7j0j04j03qM2M2LKLLj1j2j2j1J2J3
447A409J3J3j8j8N4N4R3%j14j14o6K7k5k5K8K8K9K8k1k2k1k1j0rO8O8L0K9j8j8RRRQJ4J3n9
443A454n8n8L6R2R3OOm0m0l2l2l1l2opL5L5j7j11o9K4R9Nm5m5N8N8n1n1k2k2K5K4k5k5p1p2
438A088L7L8L7L8J6J5J6J6N3N3n0n0l0O3J2J1l0k9l0k9p9p9L0L0M1M1M2M1L1L0j6j6N7N7q3
434A372q3RRN5N5R4R4p0k26j13J06J35M1J7J7K2p1j27l4M8M8k1k2q9r0j15M1R3R4p4p4j7P6
430A200P4P5L3L4l1l0J7J6K7K7n1n1K2K2M6M5k5k6m9m9K4K4K5K4K9K9L4n9n5n5J7J7k0k0N8
426A398N8L2L2P3P3p8j70o2L2L7L8l5l5n3n3popoooQQN6N5M4M3l4l4O0N9L4n9rrL2L2l8l9
421A458QQj3j3l7l7p3p4L6L6p7p7l1J26J39M6o3o4LLP6P5J01Oj8j8m2m1j20j19J7J8ooP1P2
$$ plain form
416 1370 1416 1368 1285 1202 1222 1242 1272 1302 1285 1268 1284 1301 1317 1333 1354 1375 1396 1417 1381 1344 1308 1272 1327 1382 1461 1539 1515 1490 1388 1286 1281 1276 1318 1360 1354
412 1354 1348 1295 1242 1288 1334 1380 1426 1370 1313 1335 1356 1373 1390 1328 1267 1242 1216 1168 1119 1090 1061 1055 1049 1070 1090 1133 1177 1180 1183 1233 1283 1262 1242 1198 1155 1178 1202
408 1202 1225 1249 1230 1211 1239 1267 1343 1418 1447 1476 1412 1347 1330 1312 1309 1306 1326 1346 1327 1308 1335 1363 1339 1315 1338 1360 1313 1265 1263 1262 1280 1298 1292 1286 1240 1195 1228 1260
403 1260 1266 1272 1277 1283 1293 1304 1314 1325 1293 1262 1231 1199 1223 1246 1247 1247 1161 1074 1097 1120 1196 1271 1268 1265 1218 1171 1202 1233 1244 1256 1189 1123 1160 1196 1186 1176 1215 1254 1293
398 1293 1332 1312 1292 1272 1252 1228 1204 1258 1312 1334 1356 1331 1306 1264 1223 1181 1140 1077 1014 998 981 1024 1066 1108 1150 1248 1346 1419 1398 1325 1252 1283 1313 1333 1353
394 1353 1295 1237 1162 1087 1153 1219 1229 1239 1249 1259 1169 1079 1042 1099 1170 1194 1203 1213 1252 1292 1285 1278 1188 1098 1148 1198 1220 1241 1215 1189 1152 1115 1188 1260 1347 1434
389 1434 1443 1452 1418 1384 1350 1316 1254 1191 1180 1262 1321 1286 1210 1227 1323 1419 1439 1365 1233 1194 1263 1332 1325 1224 1120 1110 1162 1168 1176 1231 1344 1410 1329 1155 1007
385 1007 952 980 1007 1052 1097 1141 1186 1163 1140 1117 1094 1183 1272 1335 1305 1276 1246 1211 1176 1109 1042 1085 1128 1167 1207 1246 1286 1253 1221 1266 1312 1320 1328 1337 1345 1285 1225
$$ packed form
416A370M6m8q3q3K0K0L0L0j7j7J6J7J6J6K1K1K1K1l6l7l6l6N5N5P9P8k4k5j02j02nnM2M2o
412A354on3n3M6M6M6M6n6n7K2K1J7J7o2o1k5k6m8m9k9k9ooK1K0M3M4LLN0N0k1k0m4m3K3K4
408A202K3K4j9j9K8K8P6P5K9K9o4o5j7j8llK0K0j9j9K7K8k4k4K3K2m7m8kjJ8J8oom6m5L3L2
403A260OONOJ0J1J0J1l2l1l1l2K4K3J%q6q7K3K3P6P5llm7m7L1L1J1J2o7o6L7L6j0j0L9L9L9
398A293L9k0k0k0k0k4k4N4N4K2K2k5k5m2m1m2m1o3o3j6j7M3M2M2M2R8R8P3k1p3p3L1L0K0K0
394A353n8n8p5p5O6O6J0J0J0J0r0r0l7N7P1K4RJ0L9M0ppr0r0N0N0K2K1k6k6l7l7P3P2Q7Q7
389A434RRl4l4l4l4o2o3j1Q2N9l5p6J7R6R6K0p4j32l9O9O9pj01j04j0N2OQN5J13O6q1j74j48
385A007n5K8K7M5M5M4M5k3k3k3k3Q9Q9O3l0k9l0l5l5o7o7M3M3L9M0L9M0l3l2M5M6QQRQo0o0
$$ plain form
381 1225 1191 1250 1289 1329 1369 1408 1416 1329 1296 1262 1232 1201 1171 1140 1149 1159 1168 1178 1194 1210 1180 1150 1168 1186 1205 1223 1243 1263 1331 1398 1372 1347 1321 1296 1289 1282 1275 1268
376 1268 1234 1201 1271 1341 1352 1269 1186 1197 1245 1294 1270 1247 1280 1314 1388 1462 1456 1355 1255 1249 1285 1322 1318 1314 1348 1381 1415 1449 1433 1417 1401 1385 1417 1450 1405 1359
372 1359 1406 1453 1444 1341 1291 1241 1264 1287 1288 1290 1292 1293 1347 1400 1428 1363 1277 1192 1241 1290 1230 1170 1161 1245 1346 1354 1342 1330 1314 1298 1323 1348 1373 1303 1187 1164 1212
367 1212 1259 1234 1210 1155 1101 1093 1133 1170 1129 1091 1131 1212 1292 1327 1362 1352 1295 1262 1307 1410 1435 1337 1239 1250 1261 1272 1284 1304 1324 1266 1208 1213 1218 1224 1229 1231 1233 1235
362 1235 1237 1236 1234 1279 1324 1388 1452 1437 1423 1385 1347 1308 1270 1219 1168 1164 1160 1106 1053 1077 1148 1165 1103 1044 1064 1160 1257 1311 1366 1386 1407 1349 1292 1284 1276 1312 1348 1368
358 1368 1340 1290 1317 1402 1408 1297 1185 1168 1229 1317 1358 1379 1353 1281 1255 1318 1427 1509 1514 1460 1406 1347 1289 1298 1306 1315 1324 1305 1287 1268 1250 1294 1337 1381 1425 1429 1433
353 1433 1390 1347 1371 1395 1419 1443 1461 1478 1448 1418 1508 1598 1641 1684 1689 1694 1699 1704 1703 1703 1655 1608 1573 1538 1581 1624 1642 1659 1605 1550 1557 1657 1758 1765 1697 1629 1634 1638 1625
348 1625 1612 1552 1492 1461 1431 1401 1371 1337 1304 1277 1250 1279 1402 1472 1542 1575 1608 1641 1674 1689 1703 1717 1731 1666 1600 1591 1675 1797 1918 2033 2242 2465
$$ packed form
381A225l4N9L9M0M0L9Qq7l3l4l0l1l0l1RJ0RJ0J6J6l0l0J8J8J9J8K0K0O8O7k6k5k6k5pppp
376A268l4l3P0P0J1q3q3J1M8M9k4k3L3L4P4P4oj01j00oL6L7mmL4L3L4L4j6j6j6j6L2L3m5m6
372A359M7M7rj03n0n0K3K3JKKJN4N3K8o5q6q5M9M9o0o0rQ4J01Qj2j2j6j6K5K5K5p0j16k3M8
367A212M7k5k4n5n4qM0L7m1l8M0Q1Q0L5L5j0n7l3M5J03K5r8r8J1J1J1J2K0K0n8n8NNONKKK
362A235KjkM5M5O4O4j5j4l8l8l9l8n1n1mmn4n3K4P1J7o2n9K0R6R7N4N5K0K1n8n7qqL6L6K0
358A368k8n0K7Q5Oj11j12j7O1Q8M1K1k6p2k6O3J09Q2Nn4n4n9n8RQRRj9j8j9j8M4M3M4M4MM
353A433m3m3K4K4K4K4J8J7l0l0R0R0M3M3NNNNj%m8m7l5l5M3M3J8J7n4n5PJ00J01Po8o8NMj3
348A625j3o0o0l1l0l0l0l4l3k7k7K9J23P0P0L3L3L3L3J5J4J4J4o5o6rQ4J22J21J15K09K23
$$ plain form
345 2465 2594 2600 2513 2386 2259 2080 1901 1878 1855 1832 1809 1757 1705 1654 1602 1583 1564 1472 1380 1346 1406 1413 1420 1393 1366 1338 1311 1315 1319 1376 1339 1259 1179 1181 1277
340 1277 1342 1406 1430 1453 1469 1485 1428 1372 1327 1376 1419 1461 1503 1545 1587 1629 1590 1551 1532 1606 1762 1825 1743 1661 1637 1614 1591 1567 1598 1628 1664 1606 1511 1415
336 1415 1361 1306 1399 1492 1531 1476 1437 1444 1475 1412 1326 1286 1264 1242 1260 1323 1414 1410 1364 1318 1344 1370 1435 1500 1457 1413 1367 1321 1354 1386 1433 1480 1448 1417 1337 1257
332 1257 1183 1109 1131 1246 1361 1382 1354 1325 1291 1257 1202 1148 1172 1195 1176 1157 1138 1119 1191 1264 1314 1271 1190 1157 1169 1181 1182 1183 1230 1278 1269 1260 1251 1242 1251 1261 1271
327 1271 1280 1234 1188 1251 1314 1283 1251 1220 1188 1191 1193 1196 1199 1208 1216 1225 1234 1248 1262 1261 1214 1118 1116 1198 1281 1219 1158 1174 1190 1187 1183 1195 1253 1265 1183 1146 1202 1295 1294 1276 1305 1368
322 1368 1384 1320 1256 1239 1221 1204 1187 1216 1246 1229 1211 1216 1220 1224 1228 1216 1203 1269 1335 1354 1374 1316 1258 1284 1310 1335 1361 1331 1301 1271 1240 1204 1168 1132 1096 1096 1096 1095
317 1095 1095 1056 1017 1087 1157 1121 1085 1096 1107 1089 1072 1133 1193 1182 1171 1160 1149 1189 1228 1221 1214 1223 1232 1241 1250 1250 1250 1204 1157 1196 1235 1196 1157 1137 1116 1096 1076 1069 1063 1010
313 1010 957 1099 1241 1242 1244 1210 1176 1143 1109 1092 1075 1136 1197 1204 1211 1140 1070 1053 1037 1130 1223 1228 1233 1129 1025 1014 1003 1071 1138 1171 1204 1159 1114 1140 1166 1192
$$ packed form
345B465J29Oq7j27j27j79j79k3k3k3k3n2n2n1n2j9j9r2r2l4O0PPk7k7k8k7MMN7l7q0q0KR6
340A277O5O4K4K3J6J6n7n6m5M9M3M2M2M2M2M2l9l9j9P4J56O3q2q2k4k3k3k4L1L0L6n8r5r6
336A415n4n5R3R3L9n5l9PL1o3q6m0k2k2J8O3R1mm6m6K6K6O5O5m3m4m6m6L3L2M7M7l2l1q0q0
332A257p4p4K2J15J15K1k8k9l4l4n5n4K4K3j9j9j9j9P2P3N0m3q1l3J2J2JJM7M8rrrrRJ0J0
327A271Rm6m6O3O3l1l2l1l2LKLLRQRRJ4J4jm7r6kQ2Q3o2o1J6J6lmJ2N8J2q2l7N6R3jj8K9O3
322A368J6o4o4j7j8j7j7K9L0j7j8NMMMj2j3O6O6J9K0n8n8K6K6K5K6l0l0l0l1l6l6l6l6%%j
317A095%l9l9P0P0l6l6J1J1j8j7O1O0j1j1j1j1M0L9ppRRRR%%m6m7L9L9l9l9k0k1k0k0pon3
313A010n3J42J42JKl4l4l3l4j7j7O1O1PPp1p0j7j6R3R3NNj04j04j1j1O8O7L3L3m5m5K6K6K6
$$ plain form
308 1192 1219 1196 1174 1198 1222 1264 1306 1270 1234 1213 1192 1172 1151 1084 1018 998 978 1071 1164 1210 1256 1234 1212 1237 1262 1280 1297 1237 1177 1107 1037 1108 1179 1230 1281
304 1281 1254 1227 1150 1073 1075 1076 1124 1171 1219 1267 1266 1265 1185 1106 1120 1133 1147 1160 1130 1101 1074 1048 1052 1104 1141 1084 1067 1144 1262 1286 1250 1215 1173 1132 1053 973 1034
299 1034 1095 1115 1136 1078 1020 1000 980 1007 1034 1037 1040 1044 1047 1021 995 1048 1100 1131 1163 1195 1226 1231 1235 1318 1400 1384 1368 1352 1337 1254 1170 1194 1217 1141 1018 969 1075
295 1075 1153 1138 1080 1070 1061 1053 1048 1042 1026 1010 994 977 996 1014 1033 1052 1099 1147 1148 1149 1135 1120 1152 1185 1211 1237 1217 1197 1225 1254 1236 1218 1157 1096 1082 1068 1093 1118
290 1118 1183 1249 1237 1131 1051 1018 1006 993 1030 1068 1036 1004 972 940 958 976 994 1012 1104 1195 1146 1097 1059 1022 990 958 965 1065 1165 1171 1153 1135 1111 1086
286 1086 1018 950 961 971 1044 1117 1190 1263 1207 1150 1140 1131 1130 1130 1175 1267 1329 1297 1186 1075 1065 1148 1249 1303 1298 1247 1219 1191 1154 1117 1080 1043 1038 1033 1075 1117
282 1117 1108 1100 1091 1082 1100 1119 1138 1156 1194 1233 1224 1215 1170 1124 1153 1183 1190 1150 1084 1111 1184 1256 1225 1194 1143 1092 1118 1191 1229 1174 1097 1068 1073 1030 947 911 981 1098
277 1098 1166 1140 1096 1052 1048 1045 1076 1108 1140 1171 1147 1123 1098 1074 1072 1070 1068 1066 1117 1168 1260 1352 1347 1249 1174 1146 1120 1048 996 1037 1134 1183 1151 1071 1005 940 980 1021
$$ packed form
308A192K7k3k2K4K4M2M2l6l6k1k1k0k1o7o6k0k0R3R3M6M6k2k2K5K5J8J7o0o0p0p0P1P1N1N1
304A281k7k7p7p7KJM8M7M8M8jjq0p9J4J3J4J3l0k9k7k6MN2L7n7j7P7J18K4l6l5m2m1p9q0O1
299A034O1K0K1n8n8k0k0K7K7LLMLk6k6N3N2L1L2L2L1NMQ3Q2j6j6j6j5q3q4K4K3p6j23m9J06
295A075P8j5n8j0rqnoj6j6j6j7J9J8J9J9M7M8JJj4j5L2L3K6K6k0k0K8K9j8j8o1o1j4j4K5K5
290A118O5O6j2j06q0l3j2j3L7L8l2l2l2l2J8J8J8J8R2R1m9m9l8l7l2l2PJ00J00Oj8j8k4k5
286A086o8o8J1J0P3P3P3P3n6n7j0rj%M5R2O2l2j11j11j0Q3J01N4nn1k8k8l7l7l7l7nnM2M2
282A117rqrrJ8J9J9J8L8L9rrm5m6K9L0Pm0o6K7P3P2l1l1n1n1K6P3L8n5p7k9Nm3q3l6P0J17
277A098O8k6m4m4mlL1L2L2L1k4k4k5k4kkkkN1N1R2R2nr8p5k8k6p2n2M1R7M9l2q0o6o5M0M1
$$ plain form
272 1021 1054 1086 1072 1058 1105 1152 1089 1026 991 956 968 979 1058 1137 1138 1139 1129 1118 1061 1003 994 985 1053 1122 1140 1157 1175 1192 1153 1114 1098 1082 1110 1138 1119 1100 1106
268 1106 1112 1040 968 1037 1106 1151 1197 1193 1188 1137 1086 1066 1047 1105 1164 1130 1097 1063 1029 1057 1084 1135 1185 1147 1108 1116 1124 1136 1148 1183 1218 1240 1262 1261 1260 1241 1223 1204
263 1204 1185 1166 1147 1175 1202 1161 1119 1078 1036 1107 1178 1249 1320 1281 1242 1203 1164 1163 1161 1207 1253 1263 1274 1237 1201 1151 1101 1051 1001 1044 1086 1082 1078 1052 1025 1046 1066
259 1066 1048 1029 1058 1086 1119 1152 1139 1125 1129 1133 1137 1140 1145 1149 1154 1158 1151 1144 1137 1130 1119 1109 1099 1089 1132 1176 1173 1169 1154 1139 1125 1110 1161 1212 1217 1222 1193 1165 1136 1107 1067 1027 1065
253 1065 1102 1139 1176 1212 1249 1258 1267 1230 1192 1186 1181 1175 1169 1144 1118 1093 1068 1054 1041 1074 1108 1103 1098 1094 1089 1074 1059 1045 1030 1034 1039 1044 1048 1047 1046 1044 1043 1026 1009 1039 1069 1122 1175 1094
248 1094 1012 929 939 1006 1073 1121 1170 1141 1111 1089 1066 1122 1178 1183 1189 1194 1200 1172 1145 1164 1183 1121 1060 998 937 939 942 945 948 915 883 845 900 1022 1143 1161 1179 1124
243 1124 1070 986 995 1088 1182 1199 1122 1023 1017 1087 1157 1221 1192 1075 958 942 926 956 987 1016 1046 1075 1105 1150 1194 1104 1014 926 932 963 994 1058 1121 1185 1248
239 1248 1227 1206 1162 1118 1097 1076 1102 1128 1080 1032 1031 1030 1057 1083 1109 1136 1093 1049 1084 1119 1131 1144 1134 1123 1076 1029 1060 1091 1118 1145 1100 1054 998 1034 1128 1221
$$ packed form
272A021L3L2j4j4M7M7o3o3l5l5J2J1P9P9JJj0j1n7n8rrO8O9J8J7J8J7l9l9j6j6K8K8j9j9O
268A106Op2p2O9O9M5M6mnn1n1k0j9N8N9l4l3l4l4K8K7N1N0l8l9QQJ2J2L5L5K2K2jjj9j8j9
263A204j9j9j9K8K7m1m2m1m2P1P1P1P1l9l9l9l9jkM6M6J0J1l7l6n0n0n0n0M3M2mmk6k7K1K0
259A066j8j9K9K8L3L3j3j4MMMLNMNMppppj1j0j0j0M3M4lmj5j5j4j5N1N1NNk9k8k9k9m0m0L8
253A065L7L7L7L6L7RRl7l8onook5k6k5k5j4j3L3L4nnmnj5j5j4j5MNNMjjkjj7j7L0L0N3N3q1
248A094q2q3J0O7O7M8M9k9l0k2k3N6N6NONOk8k7J9J9o2o1o2o1KLLLl3l2l8N5J22J21J8J8n5
243A124n4q4RR3R4J7p7r9oP0P0O4k9j17j17j6j6L0L1K9L0K9L0M5M4r0r0q8OL1L1O4O3O4O3
239A248k1k1m4m4k1k1K6K6m8m8jjK7K6K6K7m3m4L5L5J2J3j0j1m7m7L1L1K7K7m5m6n6L6R4R3
$$ plain form
235 1221 1176 1130 1132 1133 1090 1047 1054 1155 1227 1205 1164 1123 1187 1251 1237 1223 1208 1194 1258 1321 1304 1286 1222 1158 1088 1018 896 867 924 980 996 1011 1038 1065 1115
230 1115 1165 1159 1153 1147 1141 1144 1146 1070 994 945 895 923 951 1018 1085 1129 1172 1196 1220 1166 1111 1103 1095 1087 1079 1044 1008 1050 1092 1051 1009 938 961 1019 1076 1062 1048 999 950 925
225 925 899 983 1067 1151 1235 1216 1197 1154 1112 1066 1020 927 835 874 913 953 992 1058 1123 1080 1036 1021 1005 1037 1068 1004 940 955 969 959 949 962 976 978 980 982 985
221 985 1055 1125 1149 1172 1207 1242 1199 1157 1121 1085 1050 1014 1095 1175 1171 1073 992 958 970 981 963 944 885 825 782 831 906 981 1032 1083 1055 1028 1027 1025 1027 1028 1042 1102
216 1102 1168 1141 1031 968 1010 1053 1044 988 953 1011 1130 1250 1266 1282 1221 1160 1146 1133 1132 1130 1106 1081 1077 1073 1046 1018 1031 1043 1102 1162 1111 1061 1088 1116 1145 1175
212 1175 1157 1139 1096 1052 1009 965 973 980 1011 1041 1191 1342 1404 1373 1265 1158 1186 1213 1223 1233 1196 1159 1093 1027 1042 1152 1187 1129 1029 1023 1069 1115 1089
208 1089 1063 1074 1085 1023 962 936 1003 1088 1126 1131 1090 1045 1047 1087 1128 1094 1059 1083 1107 1084 1061 1055 1048 1041 1035 1034 1033 1032 1031 1031 1031 1017 956 944 1026 1105 1091 996 902 879 857
203 857 857 857 858 858 912 967 1024 1082 1098 1160 1177 1100 978 949 1060 1170 1179 1096 1038 1027 1052 1077 1105 1133 1112 1091 1117 1142 1155 1167 1132 1098 1070 1042 1014 986
$$ packed form
235A221m5m6KJm3m3PJ01P2k2m1m1O4O4j4j4j5j4O4O3j7j8o4o4p0p0j22k9N7N6J6J5K7K7N0
230A115N0ooooLKp6p6m9n0K8K8O7O7M4M3K4K4n4n5qqqql5l6M2M2m1m2p1K3N8N7j4j4m9m9k5
225I25k6Q4Q4Q4Q4j9j9m3m2m6m6r3r2L9L9M0L9O6O5m3m4j5j6L2L1o4o4J5J4j0j0J3J4KKKL
221I85P0P0K4K3L5L5m3m2l6l6l5l6Q1Q0mr8q1l4J2J1j8j9n9o0m3M9P5P5N1N1k8k7jkKJJ4O0
216A102O6k7j10o3M2M3rn6l5N8J19J20J6J6o1o1j4j3jkk4k5mmk7k8J3J2N9O0n1n0K7K8K9L0
212A175j8j8m3m4m3m4QPL1L0J50J51O2l1j08j07K8K7J0J0l7l7o6o6J5J10L5n8j00oM6M6k6
208A089k6J1J1o2o1k6O7Q5L8Nm1m5KM0M1l4l5K4K4k3k3oppojjjj%%j4o1j2Q2P9j4r5r4k3k2
203H57%%J%N4N5N7N8J6O2J7p7j22k9J11J10Rq3n8j1K5K5K8K8k1k1K6K5J3J2l5l4k8k8k8k8
$$ plain form
198 986 1027 1067 1060 1054 1057 1060 1063 1066 1060 1053 974 895 915 1028 1142 1161 1148 1135 1116 1097 1149 1200 1198 1102 1019 984 963 942 923 904 932 960 955 950 944 939 975 1010 1046 1082 1068
193 1068 1055 1088 1121 1077 1034 1037 1040 999 959 966 973 972 972 972 972 1027 1082 1090 1098 1084 1070 1102 1135 1117 1099 1034 970 1002 1035 1021 1007 960 912 974 1035 1042 1049 1010 970 1034 1099
188 1099 1085 1071 1119 1167 1155 1064 984 981 1039 1097 1080 1063 1046 1029 1082 1135 1188 1241 1198 1154 1189 1270 1288 1228 1142 1102 1123 1144 1089 1035 1026 1017 1055 1093 1085 1077 1069 1061
184 1061 1124 1187 1203 1219 1210 1201 1161 1043 887 778 823 946 1051 1077 1074 1071 1086 1100 1068 1035 978 921 911 901 950 999 1048 1097 1111 1124 1138 1152 1182 1212
180 1212 1195 1178 1121 1064 1007 950 960 970 1011 1005 988 1050 1166 1235 1210 1139 1108 1124 1157 1142 1131 1167 1205 1243 1208 1174 1195 1264 1303 1263 1200 1137 1147 1158 1153
175 1153 1149 1066 983 971 958 945 933 973 1014 1102 1190 1194 1198 1125 1051 981 911 951 990 1060 1130 1091 1005 994 1061 1084 1028 935 920 961 955 881 807 808 809 877 946 967
171 967 989 994 998 1003 1008 956 903 897 891 891 891 938 984 1024 1063 1103 1142 1079 1016 1028 1040 1032 976 979 1059 1127 1148 1122 1096 1083 1070 1104 1138 1184 1231 1199 1168 1136 1105 1073
166 1073 1042 1033 1024 1018 1012 995 1026 1079 1053 967 958 1041 1124 1063 1001 986 971 977 982 1066 1149 1150 1151 1152 1153 1113 1072 1032 992 984 975 1039 1103 1128 1059 990 1015 1084 1153 1181 1209
$$ packed form
198I86M1M0poLLLLopp9p9K0J13J14J9j3j3j9j9N2N1kr6q3l5k1k1j9j9K8K8nnonL6L5L6L6j4
193A068j3L3L3m4m3LLm1m0PPj%%%N5N5QQj4j4L2L3j8j8o5o4L2L3j4j4m7m8O2O1PPl9m0O4O5
188A099j4j4M8M8j2r1q0lN8N8j7j7j7j7N3N3N3N3m3m4L5Q1J8o0q6m0K1K1n5n4rrL8L8qqqq
184A061O3O3J6J6rrm0j18j56j09M5J23J05K6llJ5J4l2l3n7n7j0j0M9M9M9M9J4J3J4J4L0L0
180A212j7j7n7n7n7n7J0J0M1oj7O2J16O9k5p1l1J6L3j5j1L6L8L8l5l4K1O9L9m0o3o3J0J1n
175A153mq3q3j2j3j3j2M0M1Q8Q8MMp3p4p0p0M0L9P0P0l9q6j1O7K3n6r3j5M1op4p4JJO8O9K1
171I67K2NMNNn2n3oo%%M7M6M0L9M0L9o3o3J2J2qn6LQ0O8K1k6k6j3j3L4L4M6M7l2l1l2l1l2
166A073l1rrooj7L1N3k6q6rQ3Q3o1o2j5j5ONQ4Q3JJJJm0m1m0m0qrO4O4K5o9o9K5O9O9K8K8
$$ plain form
161 1209 1151 1092 1080 1068 1078 1088 1020 951 863 774 794 815 865 915 965 1015 1068 1120 1063 1005 1009 1012 1015 1018 982 945 867 789 731 766 857 949 893 838 807 871 883
156 883 895 913 931 981 1031 941 851 791 732 781 831 874 917 954 991 1105 1126 1033 940 872 897 948 999 988 977 1007 1037 1030 929 876 915 986 1058 1056 1055 1045
152 1045 1035 1026 1016 996 976 997 1019 1037 962 886 904 938 971 1011 1050 1100 1150 1091 1031 1019 1007 995 983 973 963 953 942 971 1000 982 963 972 980 988 996 999 1001 1004 1007
147 1007 1028 1049 1070 1091 1181 1270 1277 1191 1104 1112 1139 1165 1184 1202 1221 1239 1180 1120 1061 1001 947 893 948 1003 1068 1133 1122 1112 1093 1121 1175 1135 1053 970 995 1113
143 1113 1254 1302 1233 1070 928 880 858 835 822 903 1001 1052 1019 940 904 915 937 959 984 1009 1056 1103 1104 1104 1049 994 1014 1034 1021 962 918 967 1029 999
139 999 953 954 988 1021 1011 1001 995 990 944 898 903 1002 1102 1107 1069 1031 1066 1100 1110 1120 1130 1140 1125 1111 1097 1083 1091 1100 1105 1110 1059 960 882 898 973 1048 1051 1054 1042 1030
134 1030 1018 1007 1017 1028 1039 1049 1011 973 935 897 941 985 1075 1166 1168 1170 1094 1019 933 847 933 1020 1053 1087 1074 1061 1053 1045 1037 1029 1046 1062 1120 1177 1167 1062 958
129 958 947 1004 1061 1077 1093 1069 1045 1021 997 960 923 886 849 920 991 1062 1134 1188 1242 1218 1194 1141 1088 1138 1188 1144 1006 833 815 912 1009 1038 1067 1089
$$ packed form
161A209n8n9j2j2J0J0o8o9q8q9K0K1N0N0N0N0N3N2n7n8MLLLl6l7p8p8n8L5R1R2n6n5l1O4J2
156H83J2J8J8N0N0r0r0o0n9M9N0M3M3L7L7J14K1r3r3o8K5N1N1j1j1L0L0pj01n3L9P1P2kjj0
152A045j0rj0k0k0K1K2J8p5p6J8L4L3M0L9N0N0n9o0j2j2j2j2j0j0j0j1K9K9j8j9RQQQLKLL
147A007K1K1K1K1R0Q9Pq6q7QK7K6J9J8J9J8n9o0n9o0n4n4N5N5O5O5j1j0j9K8N4m0q2q3K5J18
143A113J41M8o9j63j42m8k2k3j3Q1R8N1l3p9l6J1K2K2K5K5M7M7J%n5n5K0K0j3n9m4M9O2l0
139I99m6JL4L3j0j0onm6m6NR9J00Nl8l8L5L4J0J0J0J0j5j4j4j4QRNNn1r9p8J6P5P5LLj2j2
134A030j2j1J0J1J1J0l8l8l8l8M4M4R0R1KKp6p5q6q6Q6Q7L3L4j3j3qqqqJ7J6N8N7j0j05j04
129I58j1N7N7J6J6k4k4k4k4l7l7l7l7P1P1P1P2N4N4k4k4n3n3N0N0m4j38j73j8R7R7K9K9K2
$$ plain form
125 1089 1111 1086 1061 1106 1151 1146 1047 966 978 1010 1043 1023 1003 1031 1058 1033 1008 983 957 968 978 941 904 955 1005 1056 1107 1088 1070 1051 1033 1073 1112 1152 1192
121 1192 1191 1191 1144 1097 1097 1097 1098 1098 1107 1116 1125 1135 1085 1036 987 937 907 877 894 911 933 955 905 855 787 812 918 1025 1036 953 871 882 912 942 978 1015 1027 1040
116 1040 975 910 896 882 972 1062 1046 936 868 893 970 954 866 871 985 1099 1109 1119 1137 1155 1098 1041 1035 1076 1099 1028 998 1016 1027 991 942 892 918 943
112 943 957 971 985 999 1029 1058 1041 1023 1024 1024 1024 1024 977 930 930 929 922 915 908 901 923 945 967 989 991 994 950 905 934 963 945 927 1018 1110 1144 1085 1057 1028 951 828 808
107 808 944 1042 1047 969 891 886 880 858 836 861 885 882 879 923 967 946 925 951 978 1003 1029 1008 987 1017 1046 998 950 996 1043 1043 1043 1008 972 984 996 986 977 920 864
102 864 903 943 982 1021 1011 1001 991 981 983 985 940 895 856 817 856 896 923 951 1056 1162 1185 1208 1184 1161 1026 891 806 877 995 1066 1064 1062 1048 1034 1021
98 1021 1007 996 986 1022 1058 1087 1116 1067 1019 1036 1054 1116 1177 1172 1121 1043 1059 1155 1251 1266 1186 1077 967 898 830 883 936 879 823 802 781 838 894 978 1061
94 1061 1066 1071 1122 1173 1173 1080 1009 1032 1028 978 958 1031 1104 1084 1022 1007 1037 1068 1016 965 1023 1081 1144 1208 1163 1118 1120 1123 1125 1128 1072 1015 1066 1116 1097 1031 939 941 1021 1102
$$ packed form
125A089K2k5k5M5M5nr9q1J2L2L3k0k0K8K7k5k5k5k6J1J0l7l7N1N0N1N1j9j8j9j8M0L9M0M0
121A192j%m7m7%%J%RRRJ0n0m9m9n0l0l0J7J7K2K2n0n0o8K5J06J07J1q3q2J1L0L0L6L7J2J3
116A040o5o5j4j4R0R0j6j10o8K5P7j6q8NJ14J14J0J0J8J8n7n7oM1K3p1l0J8J1l6m9n0K6K5
112I43J4J4J4J4L0K9j7j8J%%%m7m7%jppppK2K2K2K2KLm4m5K9K9j8j8R1R2L4n9k8k9p7j23k0
107H08J36R8Np8p8nok2k2K5K4llM4M4k1k1K6K7K5K6k1k1L0K9m8m8M6M7%%l5l6J2J2j0rn7n6
102H64L9M0L9L9j0j0j0j0KKm5m5l9l9L9M0K7K8J05J06K3K3k4k3j35j35q5P1J18P1kkj4j4j3
98A021j4j1j0L6L6K9K9m9m8J7J8O2O1nn1p8J6R6R6J5q0j09j10o9o8N3N3n7n6k1k1N7N6Q4Q3
94A061NNN1N1%r3p1K3mn0k0P3P3k0o2j5L0L1n2n1N8N8O3O4m5m5KLKLn6n7N1N0j9o6r2KQ0Q1
$$ plain form
89 1102 1164 1132 1075 1018 1034 1050 1093 1136 1132 1128 1039 949 882 909 959 962 919 876 908 941 926 912 921 930 986 1042 1018 994 969 945 988 1030 1070 1109 1052 948 865
84 865 875 965 1056 1074 1093 1067 1040 1061 1081 1157 1234 1256 1186 1111 1083 1101 1119 1085 1052 1019 985 968 952 982 1012 1021 1031 962 894 852 811 848 885 949 1014 1084
80 1084 1061 1032 1003 1015 1027 1005 983 1008 1033 1005 977 902 828 799 770 788 806 880 953 1027 1100 1128 1155 1163 1077 951 919 969 1019 1008 997 1090 1183 1223 1169
75 1169 1121 1074 1084 1094 1151 1207 1210 1212 1136 1060 1031 1001 1050 1098 1098 1098 1098 1098 1060 1022 982 941 928 867 781 788 904 1020 1064 1107 1141 1175 1137 1099 1079 1152 1226 1206
71 1206 1148 1090 1073 1055 988 920 934 1041 1078 1021 949 924 957 990 954 917 948 1073 1145 1217 1208 1199 1143 1087 1106 1124 1189 1254 1189 1123 1058 992 968 943 919
67 919 894 846 798 797 796 863 930 997 1064 1052 1039 986 932 877 916 1012 1108 1103 1098 1047 996 933 871 887 903 958 1012 1067 1121 1088 1055 1021 988 990 992 1067 1141 1181 1128
62 1128 1080 1032 1026 1019 966 912 1001 1090 1154 1124 1067 1011 1058 1104 1115 1126 1137 1147 1177 1207 1159 1111 1136 1161 1140 1118 1106 1094 1128 1163 1149 1135 1120 1106 1059 1011
57 1011 964 916 909 901 941 980 978 977 976 974 1017 1059 1055 1050 1086 1123 1081 1039 994 949 982 1015 984 954 923 892 971 1050 1135 1127 1096 1065 1075 1085 1082 1078 1055 938 840 836 852
$$ packed form
89A102O2l2n7n7J6J6M3M3mmq9r0o7K7N0Lm3m3L2L3j5j4RRN6N6k4k4k5k4M3M2M0L9n7j04q3
84H65J0R0R1J8J9k6k7K1K0P6P7K2p0p5k8J8J8l4l3l3l4j7j6L0L0RJ0o9o8m2m1L7L7O4O5P0
80A084k3k9k9J2J2k2k2K5K5k8k8p5p4k9k9J8J8P4P3P4P3K8K7Qq6j26l2N0N0j1j1R3R3M0n4
75A169m8m7J0J0N7N6LKp6p6k9l0M9M8%%%%l8l8m0m1j3o1q6PJ16J16M4M3L4L4l8l8k0P3P4k0
71A206n8n8j7j8o7o8J4J07L7n7p2k5L3L3l6l7L1J25P2P2rrn6n6J9J8O5O5o5o6o5o6k4k5k4
67I19k5m8m8jjO7O7O7O7j2j3n3n4n5L9R6R6nnn1n1o3o2J6J6N5N4N5N4l3l3l4l3KKP5P4M0n3
62A128m8m8opn3n4Q9Q9O4l0n7n6M7M6J1J1J1J0L0L0m8m8K5K5k1k2j2j2L4L5j4j4j5j4m7m8
57A011m7m8pqM0L9kjjkM3M2mnL6L7m2m2m5m5L3L3l1l0l1l1P9P9Q5ql1l1J0J0lmk3j17r8mJ6
$$ plain form
52 852 867 834 800 876 952 979 1006 1111 1217 1190 1163 1209 1255 1233 1119 1004 982 969 956 901 847 896 945 994 1043 1017 992 967 942 952 963 1020 1078 1052
48 1052 1027 1048 1070 1077 1085 1046 1007 997 987 977 967 964 961 959 956 1010 1063 1070 1077 1043 1008 1021 1033 1022 1011 1047 1083 1036 989 961 1027 1079 1038 949 955 1013 977 869 855
43 855 926 998 941 884 911 1031 1105 1085 1044 1003 961 920 913 999 1033 1067 1072 1076 1081 1085 1080 1074 1068 1063 1072 1081 1090 1099 1063 1027 1039 1050 1050 1049 1002 955 949 944 939 933 911 888 912 936 969
38 969 1002 1035 1068 1095 1121 1070 1018 995 973 1029 1084 1148 1211 1193 1081 943 898 941 1030 1050 1069 1091 1113 1146 1179 1221 1169 1079 1036 1101 1212 1206 1107 1051 1090
34 1090 1124 1065 1009 1046 1082 1072 1062 1099 1143 1094 998 995 1020 998 930 862 840 819 845 870 903 935 968 1000 1092 1184 1104 1024 994 963 980 996 1041 1087 1054 1022
29 1022 1020 1017 1062 1107 1149 1192 1125 1059 1064 1070 1001 932 950 1014 1030 952 900 895 904 914 954 994 987 980 1011 1043 1028 1012 994 976 1005 1034 1074 1115 1156 1196 1197 1198 1126 1055
24 1055 1035 1108 1202 1249 1239 1229 1216 1202 1192 1182 1172 1161 1106 1051 949 847 867 888 955 1022 1035 1048 1013 979 1020 1061 993 879 823 861 920 931 953 1021
20 1021 1040 966 909 946 1000 1008 978 995 1056 1070 1041 1012 1027 1042 1039 1036 1105 1174 1187 1106 977 894 928 1009 1069 1083 1075 1068 1010 953 904 855 883 912 980 1048 1062
$$ packed form
52H52J5l3l4P6P6K7K7J05J06k7k7M6M6k2j14j15k2j3j3n5n4M9M9M9M9k6k5k5k5J0J1N7N8k6
48A052k5K1K2PQl9l9j0j0j0j0llklN4N3PPl4l5J3J2j1j1L6L6m7m7k8O6N2m1q9ON8l6j08j4
43H55P1P2n7n7K7J20P4k0m1m1m2m1pQ6L4L4NMNMnoonRRRRl6l6J2J1%jm7m7onnok2k3K4K4L3
38I69L3L3L3K7K6n1n2k3k2N6N5O4O3j8j12j38m5M3Q9K0J9K2K2L3L3M2n2r0m3O5J11or9n6L9
34A090L4n9n6L7L6j0j0L7M4m9r6lK5k2o8o8k2k1K6K5L3L2L3L2R2R2q0q0l0l1J7J6M5M6l3l2
29A022klM5M5M2M3o7o6NOo9o9J8O4J6p8n2nRJ0M0M0ppL1L2j5j6j8j8K9K9M0M1M1M0JJp2p1
24A055k0P3R4M7j0j0j3j4j0j0j0j1n5n5j02j02K0K1O7O7J3J3l5l4M1M1o8j14n6L8N9J1K2O8
20A021J9p4n7L7N4Ql0J7O1J4k9k9J5J5llO9O9J3q1j29q3L4Q1O0J4qpn8n7m9m9K8K9O8O8J4
$$ plain form
16 1062 982 933 930 942 953 941 928 918 908 916 970 1053 1043 1005 1014 1094 1174 1159 1050 918 880 934 987 969 857 790 880 1038 1103 1093 1083 1115 1146 1099 1052
11 1052 1052 1051 1077 1103 1105 1107 1147 1186 1175 1070 983 990 1043 1048 993 938 959 979 1015 1051 1064 1077 1002 926 960 993 964 935 957 1072 1130 1094 1014 1029 1090 1105 1075
7 1075 1044 1065 1086 1060 1035 1006 977 1027 1076 1064 1053 1041 1029 1022 1016 1009 1002 983 964 945 926 927 928 928 929 960 992 1024 1055 1107 1159 1071 982 982 982 982 982 1007 1032 985 937 900
2 900 956 983 1010 1024 1037 1051 1065 1035 1004 1052 1100 1105 1110 1042 975 930 978 973 969 923 876 908 940 878 816 863 910 946 982 971 959 944 928 1016 1103 1109 1021 980 1033
-3 1033 1103 1173 1139 1106 1037 969 982 1090 1179 1175 1120 1065 1032 999 965 932 941 950 958 967 950 932 915 897 960 1022 980 939 920 995 1070 1051 1035 1020 998 977 902
-8 902 828 863 898 938 977 1064 1150 1123 1095 1068 1040 1043 1045 1095 1144 1038 933 827 721 742 764 785 806 796 785 774 763 799 835 917 1000 1100 1200 1223
-12 1223 1245 1169 1094 1018 942 949 955 962 968 939 910 959 1008 1068 1128 1048 967 990 1014 1084 1154 1141 1128 1116 1103 1047 990 981 971 970 969 968 968 966 964 961 959 1001 1043 1007 971
-17 971 941 912 883 853 896 939 935 931 935 939 944 948 892 837 828 820 819 819 772 725 747 769 791 813 873 934 947 960 998 1036 964 893 877 860 891 921 938 955 972 989
$$ packed form
16A062q0m9lJ2J1j2j3j0j0QN4Q3j0l8RQ0Q0j5j09j32l8N4N3j8j12o7R0J58O5j0j0L2L1m7m7
11A052%jK6K6KKM0L9j1j05q7PN3Nn5n5K1K0L6L6J3J3p5p6L4L3k9k9K2J15N8l6q0J5O1J5l0
7A075l1K1K1k6k5k9k9N0M9j2j1j2j2poppj9j9j9j9JJ%JL1L2L2L1N2N2q8q9%%%%K5K5m7m8l7
2I00N6K7K7J4J3J4J4l0l1M8M8NNo8o7m5M8nmm6m7L2L2o2o2M7M7L6L6j1j2j5j6Q8Q7Oq8m1N3
-3A033P0P0l4l3o9o8J3J08Q9mn5n5l3l3l4l3RRQRj7j8j7j8O3O2m2m1j9P5P5j9j6j5k2k1p5
-8I02p4L5L5M0L9Q7Q6k7k8k7k8LKN0M9j06j05j06j06K1K2K1K1j0j1j1j1L6L6Q2Q3J00J00K3
-12A223K2p6p5p6p6POPOk9k9M9M9O0O0q0q1K3K4P0P0j3j3j2j3n6n7rj0jjj%kklkM2M2l6l6
-17I71l0k9k9l0M3M3mmMMNMn6n5rqj%m7m7K2K2K2K2O0O1J3J3L8L8p2p1j6j7L1L0J7J7J7J7
$$ plain form
-22 989 1001 1012 1024 1035 1074 1113 1074 1035 1020 1005 1037 1069 1004 938 873 807 846 884 922 961 981 1002 951 900 835 865 972 986 916 846 880 913 970 1028 1007
-26 1007 986 895 804 791 778 803 828 924 1021 1076 1038 1005 972 954 935 917 899 947 995 996 997 991 984 977 971 1002 1034 987 940 905 869 880 891 890 890 817 744 741 831
-31 831 968 1012 1013 1015 1010 1006 971 937 980 1023 964 905 955 1005 973 940 949 958 964 876 788 794 921 1049 1126 1109 1005 902 927 952 941 836 800 919 1065
-35 1065 1116 1121 1125 1167 1208 1116 1023 996 1063 1083 1010 915 819 827 836 822 809 796 782 804 825 846 868 872 877 882 886 852 818 830 842 851 859 868 876 894 911 850 789 825 861
-40 861 856 851 787 818 904 991 1001 1010 1020 1030 1058 1086 1005 924 872 820 871 922 939 863 810 851 934 1017 997 977 925 874 869 864 917 971 946 922 955 988 974 960
-45 960 987 1015 1020 1024 1005 986 991 995 932 869 860 944 1030 1069 1000 931 894 858 798 738 754 771 834 898 948 998 1002 1005 975 945 915 885 939 994 974 953 978 1049 1043
-49 1043 943 859 869 927 939 878 864 893 876 808 741 748 755 742 730 795 860 949 1038 1018 997 948 898 958 1018 1041 1064 1040 1016 977 938 977 1016 1033 1050
-54 1050 1066 1083 1003 923 921 919 951 983 992 1001 992 983 951 918 918 918 1027 1137 1160 1183 1207 1230 1191 1151 1089 1026 988 951 965 1072 1160 1154 1129 1104 1069 1035 1000 966
$$ packed form
-22I89J2J1J2J1L9L9l9l9j5j5L2L2o5o6o5o6L9L8L8L9K0K1n1n1o5L0J07J4p0p0L4L3N7N8k1
-26A007k1r1r1j3j3K5K5R6R7N5l8l3l3j8j9j8j8M8M8JJoppoL1L2m7m7l5l6J1J1j%p3p3lR0
-31H31J37M4JKnml5l4M3M3n9n9N0N0l2l3RROq8q8OJ27J28P7j7j04j03K5K5j1j05l6J19J46
-35A065N1NMM2M1r2r3k7O7K0p3r5r6QRj4j3j3j4K2K1K1K2MNNMl4l4J2J2RQRQJ8J7o1o1L6L6
-40H61nno4L1Q6Q7J0RJ0J0K8K8q1q1n2n2N1N1J7p6n3M1Q3Q3k0k0n2n1nnN3N4k5k4L3L3j4j4
-45I60K7K8NMj9j9NMo3o3rQ4Q6L9o9o9l7l6o0o0J6J7O3O4N0N0MLl0l0l0l0N4N5k0k1K5P1o
-49A043j00q4J0N8J2o1j4K9j7o8o7PPj3j2O5O5Q9Q9k0k1m9n0O0O0K3K3k4k4l9l9L9L9J7J7
-54A050J6J7q0q0kkL2L2RRrrl2l3%%J09J10K3K3K4K3l9m0o2o3l8l7J4J07Q8ok5k5l5l4l5l4
$$ plain form
-58 966 969 972 976 979 961 942 923 904 874 843 860 876 855 833 858 883 943 1004 986 968 925 883 887 891 856 821 781 834 896 957 916 874 878 881 931 981 1042 1102 1084
-63 1084 1066 1091 1117 1064 1011 995 980 1012 1043 1011 979 994 1009 1018 1028 1038 1047 1028 1008 988 969 1030 1091 1074 1057 1026 994 1009 1024 1012 999 1034 1068 1044 1019 995
-67 995 971 991 1012 1033 1053 1015 976 937 898 966 1035 962 890 868 845 869 894 929 965 954 943 955 967 1026 1085 1082 1079 973 867 858 943 1074 1112 1028 943
-72 943 930 918 935 952 859 767 755 742 777 812 833 853 897 941 972 1003 987 972 990 1008 1003 998 927 856 862 869 938 1006 966 925 903 882 907 933 911 889 946
-76 946 1002 1036 1070 1025 981 976 972 967 963 969 976 1029 1082 1010 938 912 887 918 949 1004 1059 1080 1100 1043 986 939 891 953 1014 1011 1009 959 909 924 938 874 810 841 872
-81 872 856 840 851 863 874 885 830 775 798 821 847 872 898 924 941 957 928 898 879 861 890 918 891 864 884 904 923 942 962 981 1046 1111 1098 1085 1051
-85 1051 1016 1060 1104 1145 1186 1055 924 957 990 1023 1056 1040 1024 984 944 901 857 922 987 968 949 906 863 902 942 981 1021 1006 992 930 869 909 949 1036
-89 1036 1123 1102 1082 1038 994 939 884 805 727 736 744 777 809 765 721 787 852 900 949 997 1045 1016 987 958 929 955 980 960 939 967 995 1046 1097 1058 1020 1028
$$ packed form
-58I66LLMLj8j9j9j9l0l1J7J6k1k2K5K5O0O1j8j8m3m2MMl5l5m0N3O2O1m1m2MLN0N0O1O0j8
-63A084j8K5K6n3n3j6j5L2L1l2l2J5J5RJ0J0Rj9k0k0j9O1O1j7j7l1l2J5J5j2j3L5L4k4k5k4
-67I95k4K0K1K1K0l8l9l9l9O8O9p3p2k2k3K4K5L5L6j1j1J2J2N9N9llj06j06rQ5J31L8q4q5
-72I43j3j2J7J7r3r2j2j3L5L5K1K0M4M4L1L1j6j5J8J8nnp1p1OPO9O8m0m1k2k1K5K6k2k2N7
-76I46N6L4L4m5m4nmnmOPN3N3p2p2k6k5L1L1N5N5K1K0n7n7m7m8O2O1lkn0n0J5J4o4o4L1L1
-81H72j6j6J1J2J1J1n5n5K3K3K6K5K6K6J7J6k9l0j9j8K9K8k7k7K0K0J9J9K0J9O5O5j3j3l4
-85A051l5M4M4M1M1j31j31L3L3L3L3j6j6m0m0m3m4O5O5j9j9m3m3L9M0L9M0j5j4o2o1M0M0Q7
-89A036Q7k1k0m4m4n5n5p9p8RQL3L2m4m4O6O5M8M9M8M8k9k9k9k9K6K5k0k1K8K8N1N1l9l8Q
$$ plain form
-94 1028 1036 974 912 897 882 879 876 873 869 842 815 787 760 814 869 924 978 984 991 997 1003 1042 1081 1143 1206 1197 1189 1103 1016 983 950 1026 1102 1063 1025 1033 1042 1038 1034 1007 980 984 988
-99 988 992 997 1027 1057 1087 1117 1046 975 904 833 820 808 905 1002 1071 1141 1070 999 944 889 912 935 982 1030 968 906 926 946 922 899 915 977 984 913 847 858 894
-104 894 883 852 820 809 798 809 820 878 936 943 950 957 965 896 827 792 836 913 991 995 999 1004 1009 990 972 897 822 825 828 898 968 1006 967 897 873 928 983 1031 1079 1080
-109 1080 1081 1030 978 974 969 952 934 994 1055 989 923 880 838 833 828 776 724 757 790 824 857 788 718 755 793 796 752 766 858 968 1032 1016 953 905 905 905 857 795
-113 795 779 844 908 899 891 905 920 912 904 920 936 997 1058 1073 1087 1010 933 934 935 965 994 1001 1007 934 861 866 871 833 795 787 856 940 946 928 956 1025 1093 1117 1142 1026
-118 1026 911 875 947 988 1028 1051 1075 1132 1190 1169 1148 1093 1038 975 1005 1060 1068 1001 886 804 816 878 940 906 825 821 911 958 911 821 824 909 948 945 989
-122 989 1064 1138 1106 1074 1050 1026 923 821 834 847 814 734 704 768 825 883 951 1065 1159 1159 1084 1010 1007 1004 1008 1012 969 926 922 918 986 1054 1102 1057 955 854
-127 854 831 809 810 812 760 709 735 762 760 759 773 833 877 827 731 682 703 771 833 895 952 915 858 847 920 993 1022 1051 1060 1069 1000 932 877 823 816 809 879 949 1016
$$ packed form
-94A028Qo2o2j5j5lllmk7k7k8k7N4N5N5N4OPOOL9L9O2O3rqq6q7l3l3P6P6l9l8QRmmk7k7MM
-99I88MNL0L0L0L0p1p1p1p1j3j2R7R7O9P0p1p1n5n5K3K3M7M8o2o2K0K0k4k3J6O2Pp1o6J1L6
-104H94j1l1l2j1j1J1J1N8N8PPPQo9o9l5M4P7P8MMNNj9j8p5p5LLP0P0L8l9p0k4N5N5M8M8J
-109A080Jn1n2mnj7j8O0O1o6o6m3m2nnn2n2L3L3L4L3o9p0L7L8Lm4J4R2J10O4j6o3m8%%m8o2
-113G95j6O5O4rqJ4J5qqJ6J6O1O1J5J4p7p7JJL0K9POp3p3NNl8l8qO9Q4Oj8K8O9O8K4K5j16
-118A026j15l6P2M1M0K3K4N7N8k1k1n5n5o3L0N5Qo7j15q2J2O2O2l4q1mR0M7m7r0LQ5L9lM4
-122I89P5P4l2l2k4k4j03j02J3J3l3q0l0O4N7N8O8J14R4%p5p4llMMm3m3mmO8O8M8m5j02j01
-127H54k3k2JKn2n1K6K7kjJ4O0M4n0r6m9K1O8O2O2N7l7n7j1P3P3K9K9RRo9o8n5n4ppP0P0O7
$$ plain form
-132 1016 1083 1028 927 846 859 916 972 1012 1051 1045 1040 988 936 933 930 852 774 844 960 1024 995 954 912 943 973 967 960 954 947 945 943 941 939 958 978 894 810 832 948
-136 948 1021 939 821 703 715 728 743 757 819 880 845 810 775 740 737 734 777 821 884 948 964 981 967 954 941 928 886 844 848 853 803 753 704 654 694 734
-141 734 768 802 923 950 858 766 714 662 610 558 585 611 637 663 717 771 824 878 844 810 723 730 776 823 829 835 824 814 804 793 857 921 938 954 926 897
-145 897 874 850 791 826 942 1059 1155 1158 1105 1051 991 930 870 809 847 886 846 806 824 843 821 798 787 869 952 941 860 780 782 877 987 1097 1126 1060
-149 1060 994 928 934 940 958 977 996 1015 1027 1039 1052 1064 981 899 816 734 802 871 914 864 822 781 739 698 696 788 875 961 937 912 935 957 912 866 840 907
-154 907 982 963 894 824 837 849 821 792 721 743 821 900 884 869 854 839 902 965 1028 1091 1028 966 981 996 967 937 908 879 838 796 755 714 733 751 816
-158 816 881 943 1005 1015 1024 1032 947 868 788 764 740 675 610 640 762 885 914 870 826 776 726 759 793 826 859 884 908 933 957 994 1031 928 825 797
-162 797 768 818 868 976 1084 1079 980 914 941 910 878 844 811 855 899 974 1048 1045 1041 1022 1003 912 821 736 746 811 877 901 925 949 973 931 890 895 900 903 905
$$ packed form
-132A016O7n5j01q1J3N7N6M0L9onn2n2llp8p8P0J16O4k9m1m2L1L0opopkkkkJ9K0q4q4K2J16
-136I48P3q2j18j18J2J3J5J4O2O1l5l5l5l5llM3M4O3O4J6J7j4j3j3j3m2m2MNn0n0m9n0M0M0
-141G34L4L4J21K7r2r2n2n2n2n2K7K6K6K6N4N4N3N4l4l4q7PM6M7OOj1j0j0j1O4O4J7J6k8k9
-145H97k3k4n9L5J16J17R6Ln3n4o0o1o0o1L8L9m0m0J8J9k2k3j1Q2Q3j1q1q0KR5J10J10K9o6
-149A060o6o6OOJ8J9J9J9J2J2J3J2q3q2q3q2O8O9M3n0m2m1m2m1kR2Q7Q6k4k5K3K2m5m6k6O7
-154I07P5j9o9p0J3J2k8k9p1K2P8P9j6j5j5j5O3O3O3O3o3o2J5J5k9l0k9k9m1m2m1m1J9J8O5
-158H16O5O2O2J0RQq5p9q0k4k4o5o5L0J22J23K9m4m4n0n0L3L4L3L3K5K4K5K4L7L7j03j03k8
-162G97k9N0N0J08J08nr9o6K7l1l2l4l3M4M4P5P4lmj9j9r1r1q5J0O5O6K4K4K4K4m2m1NNLK
$$ plain form
-167 905 861 816 836 856 876 896 882 868 854 839 817 794 849 904 894 883 873 863 877 892 906 920 911 902 893 884 855 826 843 861 839 817 795 774 790 806 870
-171 870 933 945 957 891 825 826 826 827 827 821 815 808 802 834 865 850 835 809 782 755 729 818 908 951 993 970 947 971 995 952 908 865 822 807 793 856 920 961 1002
-176 1002 997 991 946 902 779 656 692 728 764 800 772 743 793 843 876 909 942 975 920 864 808 753 796 840 931 1021 1011 1001 944 887 842 797 798 800 787
-180 787 774 715 656 710 765 820 874 889 904 872 793 689 663 730 798 821 843 866 888 852 815 825 835 912 988 987 939 903 944 1017 1090 1071 1051 985 919
-184 919 912 904 896 889 900 912 923 934 841 749 765 781 758 736 713 690 784 879 911 864 792 767 757 747 747 748 796 844 806 768 871 973 993 1013 1030 1047 982
-189 982 871 818 842 884 879 804 775 802 876 952 982 951 920 887 853 798 744 767 790 810 829 849 868 920 972 976 981 996 1010 1025 1040 982 925 914 904 913
-193 913 921 884 846 845 845 845 844 825 807 897 987 995 1003 938 872 792 791 854 917 899 881 936 991 973 877 828 856 852 847 847 848 807 766 773 826 848 793 785 855 977 1052
-198 1052 1080 1108 1043 978 934 889 870 803 775 856 969 1003 979 1002 1023 966 883 846 886 926 922 918 941 963 847 684 618 661 748 836 845 854 816 778 761
$$ packed form
-167I05m4m5K0K0K0K0j4j4j4j5k2k3N5N5j0j1j0j0J4J5J4J4rrrrk9k9J7J8k2k2k2k1J6J6O4
-171H70O3J2J2o6o6J%J%oopoL2L1j5j5k6k7k7k6Q9R0M3M2k3k3K4K4m3m4m3m3j5j4O3O4M1M1
-176A002nom5m4j23j23L6L6L6L6k8k9N0N0L3L3L3L3n5n6n6n5M3M4R1R0j0j0n7n7m5m5JKj3
-180G87j3n9n9N4N5N5N4J5J5l2p9j04k6O7O8K3K2K3K2l6l7J0J0P7P6jm8l6M1P3P3j9k0o6o6
-184I19pqqpJ1J2J1J1r3r2J6J6k3k2k3k3R4R5L2m7p2k5j0j0%JM8M8l8l8J03J02K0K0J7J7o5
-189I82j11n3K4M2np5k9K7P4P6L0l1l1l3l4n5n4K3K3K0J9K0J9N2N2MNJ5J4J5J5n8n7j1j0R
-193I13Ql7l8j%%jj9j8R0R0QQo5o6q0jO3O3j8j8N5N5j8r6m9K8mn%Jm1m1PN3K2n5qP0J22P5
-198A052K8K8o5o5m4m5j9o7k8Q1J13L4k4K3K1n7q3l7M0M0mmK3K2j16j63o6M3Q7Q8RRl8l8j7
$$ plain form
-203 761 743 773 803 864 926 846 767 771 775 802 830 790 750 758 765 833 900 859 817 786 755 725 694 662 630 676 723 837 952 943 857 771 763 846 930 924 918 889
-207 889 859 829 799 792 785 824 864 857 850 846 841 837 833 824 816 886 955 956 956 956 957 915 873 878 883 854 825 773 720 732 743 755 767 797 827 810 793 743 693 709 802 887 972
-213 972 974 882 797 713 669 625 679 733 788 842 856 871 838 805 835 866 849 832 832 831 831 831 830 829 906 982 947 912 830 747 748 749 797 845 838 831 823 816 792 767 767 766
-218 766 825 884 834 784 783 782 786 791 736 774 836 804 729 655 772 888 927 873 793 713 706 700 771 842 871 899 905 910 862 814 791 862 899 937 871 804 787 770
-222 770 799 828 799 769 817 866 886 905 902 898 915 931 901 870 835 799 811 822 849 876 856 836 777 719 770 820 863 905 919 932 916 807 698 683 709
-227 709 735 720 705 784 864 893 828 777 821 884 946 888 830 772 715 733 752 794 836 814 791 784 823 892 867 788 709 689 669 673 676 707 738 769 801 810 820
-231 820 908 995 1009 1022 988 954 926 897 892 888 906 924 896 868 882 897 935 973 967 962 909 857 866 875 837 800 789 779 815 852 877 902 849 796 825 854 930 1006
-236 1006 974 941 837 732 689 740 899 1011 972 840 741 799 889 885 809 779 843 906 920 839 770 748 774 847 906 918 882 845 813 782 750 718
$$ packed form
-203G61j8L0L0O1O2q0p9MMK7K8m0m0QPO8O7m1m2l1l1l0l1l2l2M6M7J14J15rq6q6qQ3Q4ook9
-207H89l0l0l0ppL9M0ppmnmmrqP0O9J%%Jm2m2NNk9k9n2n3J2J1J2J2L0L0j7j7n0n0J6R3Q5Q5
-213I72Kr2q5q4m4m4N4N4N5N4J4J5l3l3L0L1j7j7%j%%jjP7P6l5l5q2q3JJM8M8ppqpk4k5%j
-218G66N9N9n0n0jjMNn5L8O2l2p5p4J17J16L9n4q0q0poP1P1K9K8ONm8m8k3P1L7L8o6o7j7j7
-222G70K9K9k9l0M8M9K0J9lmJ7J6l0l1l5l6J2J1K7K7k0k0n9n8N1N0M3M2J4J3j6j09j09j5K6
-227G09K6j5j5P9Q0K9o5n1M4O3O2n8n8n8n7J8J9M2M2k2k3pL9O9k5p9p9k0k0MLL1L1L1L2RJ0
-231H20Q8Q7J4J3l4l4k8k9nmJ8J8k8k8J4J5L8L8onn3n2RRl8l7j1j0L6L7K5K5n3n3K9K9P6P6
-236A006l2l3j04j05m3N1J59J12l9j32r9N8R0mp6l0O4O3J4q1o9k2K6P3N9J2l6l7l2l1l2l2
$$ plain form
-240 718 735 752 769 786 777 768 782 797 810 824 728 633 636 639 666 693 728 763 774 786 787 788 766 744 819 895 923 952 934 917 858 799 794 882 970 964 944 923 944
-245 944 964 947 931 890 850 795 740 794 848 869 891 834 777 747 716 732 794 830 772 670 661 768 874 849 824 851 924 980 942 929 964 996 934 835
-249 835 736 740 745 721 698 675 651 717 783 848 914 872 830 811 792 799 806 735 664 679 693 708 722 767 811 812 813 839 912 936 866 752 685 666 693 751 761
-253 761 726 690 735 826 920 920 855 791 767 744 807 869 854 839 827 816 851 887 874 861 776 691 643 688 759 830 844 858 828 798 863 974 1006 943 826
-257 826 755 761 767 770 773 800 826 819 811 827 843 835 828 774 719 780 841 856 870 812 754 743 732 799 865 884 904 902 900 898 896 887 877 868 859 799 739 758 776 854 933 902
-263 902 872 865 857 897 937 900 864 874 885 920 956 914 872 832 793 831 870 827 785 820 856 845 835 825 815 876 937 951 965 957 948 893 838 849 861 919 977
-267 977 993 1009 946 884 899 914 929 944 911 877 890 903 879 855 831 807 824 840 778 717 747 777 853 930 906 882 859 835 821 807 746 685 695 706 716
-271 716 726 775 823 825 826 822 818 860 903 912 921 853 784 775 767 805 843 862 880 899 917 877 836 795 754 748 742 815 887 926 966 958 951 922 893 820 747 799 898 945 899
$$ packed form
-240G18J7J7J7J7rrJ4J5J3J4r6r5LLK7K7L5L5J1J2JJk2k2P5P6K8K9j8j7n9n9nQ8Q8ok0k1K1
-245I44K0j7j6m1m0n5n5N4N4K1K2n7n7l0l1J6O2L6n8j02rJ07J06k5k5K7P3N6l8j3L5L2o2r9
-249H35r9MNk4k3k3k4O6O6O5O6m2m2j9j9PPp1p1J5J4J5J4M5M4JJK6P3K4p0j14o7j9K7N8J0
-253G61l5l6M5R1R4%o5o4k4k3O3O2j5j5j2j1L5L6j3j3q5q5m8M5P1P1J4J4l0l0O5J11L2o3j17
-257H26p1OOLLK7K6pqJ6J6qpn4n5O1O1J5J4n8n8j1j1O7O6J9K0kkkkrj0rro0o0J9J8P8P9l1
-263I02l0pqM0M0l7l6J0J1L5L6m2m2m0l9L8L9m3m2L5L6j1j0j0j0O1O1J4J4qrn5n5J1J2N8N8
-267I77J6J6o3o2J5J5J5J5l3l4J3J3k4k4k4k4J7J6o2o1L0L0P6P7k4k4k3k4j4j4o1o1J0J1J0
-271G16J0M9M8KJmmM2M3RRo8o9rqL8L8J9J8J9J8m0m1m1m1ooP3P2L9M0qpk9k9p3p3N2R9M7m6
$$ plain form
-276 899 836 773 751 728 784 840 818 796 801 806 811 816 826 837 847 858 833 808 784 759 764 769 774 779 836 893 873 806 722 732 764 797 760 723 689 655 705 801 848
-281 848 802 757 758 757 709 657 651 695 738 828 917 1027 1090 1059 935 837 786 815 891 921 857 787 764 755 747 740 733 727 720 711 702 740 778 727 675 701 727 774 820
-286 820 866 913 918 923 928 934 865 797 804 810 732 607 559 605 679 659 642 719 831 897 886 875 852 828 807 786 798 856 941 932 904 876 921 965 949 933 917
-290 917 901 857 813 817 820 826 833 816 799 775 751 805 859 842 825 855 979 1096 1056 907 758 737 715 772 828 796 764 755 746 755 763 749 734 781 829 767 705
-295 705 721 737 706 675 702 730 804 878 889 901 866 830 770 709 758 807 787 767 770 774 739 703 715 726 738 749 760 771 797 823 802 782 766 750 844 937
-299 937 888 840 869 898 899 899 877 854 851 848 767 687 688 690 738 787 784 781 778 775 849 923 919 915 986 1057 1050 1042 990 937 908 879 918 957 918 880 860 841 821 802 800 798 819
-305 819 840 816 792 721 650 684 717 751 785 799 813 803 794 794 794 872 950 936 922 862 801 800 798 820 842 820 798 823 848 878 907 913 920 939 958 978 997 998 1000
-309 1000 954 909 904 900 895 891 797 704 657 611 641 671 774 877 963 955 922 889 836 782 729 675 679 683 734 784 789 794 818 936 1048 1067 1003 940 934 928 899 869
$$ packed form
-276H99o3o3k2k3N6N6k2k2NNNNJ0J1J0J1k5k5k4k5NNNNN7N7k0o7q4J0L2L3l7l7l4l4N0R6M7
-281H48m6m5Jjm8n2oM4M3R0Q9J10O3l1j24r8n1K9P6L0o4p0k3rqppoprrL8L8n1n2K6K6M7M6
-286H20M6M7NNNOo9o8POp8j25m8M6P4k0j7P7J12O6j1j1k3k4k1k1J2N8Q5rk8k8M5M4j6j6j6
-290I17j6m4m4MLOPj7j7k4k4N4N4j7j7L0J24J17m0j49j49k1k2N7N6l2l2rrRQj4j5M7M8o2o2
-295G05J6J6l1l1K7K8P4P4J1J2l5l6o0o1M9M9k0k0LMl5l6J2J1J2J1J1J1K6K6k1k0j6j6R4R3
-299I37m9m8K9K9J%k2k3llq1q0JKM8M9llllP4P4mmP1P1pqn2n3k9k9L9L9l9l8k0j9k0j9kkK1
-305H19K1k4k4p1p1L4L3L4L4J4J4j0r%%P8P8j4j4o0o1jkK2K2k2k2K5K5L0K9OPJ9J9K0J9JK
-309A000m6m5nmnmr4r3m7m6L0L0J03J03Q6ql3l3n3n4n3n4MMN1N0NNK4J18J12J9o4o3ook9l0
$$ plain form
-314 869 828 786 768 750 732 713 654 595 628 754 880 912 878 844 731 619 595 664 757 756 696 636 649 661 699 737 816 895 936 884 831 872 932
-318 932 991 921 852 821 883 892 902 888 874 860 846 835 823 812 801 737 673 656 638 727 815 856 897 893 888 884 880 846 813 826 839 805 770 736 701 698 695 677
-323 677 613 554 589 646 703 708 712 717 722 703 685 669 654 660 712 797 789 747 799 892 892 812 733 726 718 665 613 669 726 693 661 676 690 696 702 705 708 715 676 608 633 684
-328 684 688 651 661 708 756 729 702 682 663 691 718 695 672 695 719 719 719 647 574 536 592 668 697 652 607 605 604 603 603 649 696 725 754 780 806 783 713 692
-333 692 765 894 976 946 822 711 694 696 698 619 541 516 584 633 635 614 686 796 858 839 773 727 680 630 581 551 520 599 678 788 897 924 858
-337 858 746 729 758 788 725 614 587 653 691 730 774 819 817 816 768 719 752 784 738 692 658 624 637 649 696 742 741 741 712 683 654 625 588 550 653
$$ packed form
-314H69m1m2j8j8j8j9n9n9L3J26J26L2l4l4j13j12k4O9R3jo0o0J3J2L8L8P9P9M1n2n3M1O0
-318I32N9p0o9l1O2RJ0j4j4j4j4j1j2j1j1o4o4j7j8Q9Q8M1M1mnmml4l3J3J3l4l5l4l5llj8
-323F77o4n9L5N7N7NMNNj9j8j6j5ON2Q5qm2N2R3%q0p9pqn3n2N6N7l3l2J5J4OOLLPl9o8K5N1
-328F84Ml7J0M7M8k7k7k0j9K8K7k3k3K3K4%%p2p3l8N6P6K9m5m5kjj%M6M7K9K9K6K6k3p0k1
-333F92P3J29Q2l0j24j11j7KKp9p8k5O8M9Kk1P2J10O2j9o6m6m7n0m9l0l1P9P9J10J09K7o6
-337H58j12j7K9L0o3j11k7O6L8L9M4M5kjm8m9L3L2m6m6l4l4J3J2M7M6j%k9k9k9k9l7l8J03
$$ [...]
-1605G46
##END=	
##END=	
