##TITLE=	Sep10-2019.31.fid
KB - Propyl-PSP

##JCAMP-DX=	6.0	$$ MestReNova 14.1.1-24571
##DATA TYPE=	LINK
##BLOCK_ID=	1
##BLOCKS=	1    
##ORIGIN=	Mestrelab Research S.L.
##OWNER=	hrzepa
##$MNOVA/LINK_BLOCK_TYPE=	ITEM	$$ NMR Spectrum
##$MNOVA/ITEM/POLYGON=	(XY..XY)
5321,5835
8722,5835
8722,8208
5321,8208
5321,5835
##$MNOVA/ITEM/Z=	0
##$MNOVA/ITEM/ANGLE=	0
##TITLE=	Sep10-2019.31.fid
##JCAMP-DX=	6.0	$$ MestReNova 14.1.1-24571
##BLOCK_ID=	2
##DATA TYPE=	NMR SPECTRUM
##DATA CLASS=	XYDATA
##NUMDIM=	1
##ORIGIN=	Bruker BioSpin GmbH
##OWNER=	nmr
##.OBSERVE FREQUENCY=	100.64143942070799653
##.OBSERVE NUCLEUS=	^13C
##.SOLVENT NAME=	MeOD
##.PULSE SEQUENCE=	zgpg30
##LONGDATE=	2019/09/11 00:44:00.000
##.ACQUISITIONMODE=	SIMULTANEOUS (DQD)
##$ORIGINAL FORMAT=	Bruker XWIN-NMR
##$MNOVA/SCALES_VERSION=	9
##$PARAMETER FILE=	(acqus, ASCII, /Users/hrzepa/Downloads/Polysiphenol%20SI%20NMR%20Original%20Data/1/1d%20-%2013C%20-%20400C.19.09.10.031/31/acqus, 0)
$$ ##TITLE= Parameter file, TOPSPIN		Version 3.2
$$ ##JCAMPDX= 5.0
$$ ##DATATYPE= Parameter Values
$$ ##NPOINTS= 11	$$ modification sequence number
$$ ##ORIGIN= Bruker BioSpin GmbH
$$ ##OWNER= nmr
$$ $$ 2019-09-11 00:45:00.562 +0100  nmr@CZC2439F63
$$ $$ /opt/topspin/data/brad/nmr/Sep10-2019/31/acqus
$$ $$ process /opt/topspin3.2/prog/mod/shimcntl
$$ ##$ACQT0= -1.90126054427203
$$ ##$AMP= (0..31)
$$ 100 100 100 100 100 100 100 100 100 100 100 100 100 100 100 100 100 100
$$ 100 100 100 100 100 100 100 100 100 100 100 100 100 100
$$ ##$AMPCOIL= (0..19)
$$ 0 0 0 0 0 0 0 0 0 0 0 0 0 0 0 0 0 0 0 0
$$ ##$ANAVPT= -1
$$ ##$AQSEQ= 0
$$ ##$AQ_mod= 3
$$ ##$AUNM= <au_zg>
$$ ##$AUTOPOS= <52 >
$$ ##$BF1= 100.63037
$$ ##$BF2= 400.2
$$ ##$BF3= 100.63037
$$ ##$BF4= 100.63037
$$ ##$BF5= 100.63037
$$ ##$BF6= 100.63037
$$ ##$BF7= 100.63037
$$ ##$BF8= 100.63037
$$ ##$BYTORDA= 0
$$ ##$CAGPARS= (0..11)
$$ 0 0 0 0 0 0 0 0 0 0 0 0
$$ ##$CFDGTYP= 0
$$ ##$CFRGTYP= 9
$$ ##$CHEMSTR= <none>
$$ ##$CNST= (0..63)
$$ 1 1 145 1 1 1 1 1 1 1 1 1 1 1 1 1 1 1 1 1 1 1 1 1 1 1 1 1 1 1 1 1 1 1 1
$$ 1 1 1 1 1 1 1 1 1 1 1 1 1 1 1 1 1 1 1 1 1 1 1 1 1 1 1 1 1
$$ ##$CPDPRG= (0..8)
$$ <waltz16> <> <waltz16> <> <mlev> <mlev> <mlev> <mlev> <mlev>
$$ ##$D= (0..63)
$$ 0 1 0.00345 0 0 0 0 0 0 0.06 0 0.03 2e-05 3e-06 0 0 0.0002 0 0 0 0 0 0
$$ 0 0 0 0 0 0 0 0 0 0 0 0 0 0 0 0 0 0 0 0 0 0 0 0 0 0 0 0 0 0 0 0 0 0 0 0
$$ 0 0 0 0 0
$$ ##$DATE= 1568159099
$$ ##$DE= 6.5
$$ ##$DECBNUC= <off>
$$ ##$DECIM= 704
$$ ##$DECNUC= <off>
$$ ##$DECSTAT= 4
$$ ##$DIGMOD= 1
$$ ##$DIGTYP= 12
$$ ##$DQDMODE= 0
$$ ##$DR= 21
$$ ##$DS= 4
$$ ##$DSPFIRM= 0
$$ ##$DSPFVS= 20
$$ ##$DTYPA= 0
$$ ##$EXP= <c13>
$$ ##$F1LIST= <111111111111111>
$$ ##$F2LIST= <222222222222222>
$$ ##$F3LIST= <333333333333333>
$$ ##$FCUCHAN= (0..9)
$$ 0 1 2 0 0 0 0 0 0 0
$$ ##$FL1= 83
$$ ##$FL2= 83
$$ ##$FL3= 83
$$ ##$FL4= 83
$$ ##$FOV= 20
$$ ##$FQ1LIST= <freqlist>
$$ ##$FQ2LIST= <freqlist>
$$ ##$FQ3LIST= <freqlist>
$$ ##$FQ4LIST= <freqlist>
$$ ##$FQ5LIST= <freqlist>
$$ ##$FQ6LIST= <freqlist>
$$ ##$FQ7LIST= <freqlist>
$$ [...]
$$ ##$Sgu3PowerLevels= (0..7)
$$ 0 0 0 0 0 0 0 0
$$ ##$Sgu4PowerLevels= (0..7)
$$ 0 0 0 0 0 0 0 0
$$ ##$Sgu5PowerLevels= (0..7)
$$ 0 0 0 0 0 0 0 0
$$ ##$Sgu6PowerLevels= (0..7)
$$ 0 0 0 0 0 0 0 0
$$ ##$Sgu7PowerLevels= (0..7)
$$ 0 0 0 0 0 0 0 0
$$ ##$Sgu8PowerLevels= (0..7)
$$ 0 0 0 0 0 0 0 0
$$ ##$SguType= 3
$$ ##$ShimPowMaxUA= (0..63)
$$ 130000 130000 130000 130000 130000 130000 130000 130000 130000 130000 130000
$$ 130000 130000 130000 130000 130000 130000 130000 130000 130000 0 0 0 0
$$ 0 0 0 0 0 0 0 0 0 0 0 0 0 0 0 0 0 0 0 0 0 0 0 0 0 0 0 0 0 0 0 0 0 0 0 0
$$ 0 0 0 0
$$ ##$ShimPowMaxUC= (0..63)
$$ 130000 130000 130000 130000 130000 130000 130000 130000 130000 130000 130000
$$ 130000 130000 130000 130000 130000 130000 130000 130000 130000 0 0 0 0
$$ 0 0 0 0 0 0 0 0 0 0 0 0 0 0 0 0 0 0 0 0 0 0 0 0 0 0 0 0 0 0 0 0 0 0 0 0
$$ 0 0 0 0
$$ ##$ShimPowMaxUG= (0..63)
$$ 524287 524287 524287 524287 524287 524287 524287 524287 524287 524287 524287
$$ 524287 524287 524287 524287 524287 524287 524287 524287 524287 0 0 0 0
$$ 0 0 0 0 0 0 0 0 0 0 0 0 0 0 0 0 0 0 0 0 0 0 0 0 0 0 0 0 0 0 0 0 0 0 0 0
$$ 0 0 0 0
$$ ##$ShimPowRcbType= 3
$$ ##$ShimPowRes= (0..63)
$$ 1e-20 1e-20 1e-20 1e-20 1e-20 1e-20 1e-20 1e-20 1e-20 1e-20 1e-20 1e-20
$$ 1e-20 1e-20 1e-20 1e-20 1e-20 1e-20 1e-20 1e-20 0 0 0 0 0 0 0 0 0 0 0 0
$$ 0 0 0 0 0 0 0 0 0 0 0 0 0 0 0 0 0 0 0 0 0 0 0 0 0 0 0 0 0 0 0 0
$$ ##$ShimPowRng0= (0..63)
$$ 1 1 1 1 1 1 1 1 1 1 1 1 1 1 1 1 1 1 1 1 0 0 0 0 0 0 0 0 0 0 0 0 0 0 0 0
$$ 0 0 0 0 0 0 0 0 0 0 0 0 0 0 0 0 0 0 0 0 0 0 0 0 0 0 0 0
$$ ##$ShimPowRng1= (0..63)
$$ 1 1 1 1 1 1 1 1 1 1 1 1 1 1 1 1 1 1 1 1 0 0 0 0 0 0 0 0 0 0 0 0 0 0 0 0
$$ 0 0 0 0 0 0 0 0 0 0 0 0 0 0 0 0 0 0 0 0 0 0 0 0 0 0 0 0
$$ ##$ShimPowRng2= (0..63)
$$ 1 1 1 1 1 1 1 1 1 1 1 1 1 1 1 1 1 1 1 1 0 0 0 0 0 0 0 0 0 0 0 0 0 0 0 0
$$ 0 0 0 0 0 0 0 0 0 0 0 0 0 0 0 0 0 0 0 0 0 0 0 0 0 0 0 0
$$ ##$ShimPowRng3= (0..63)
$$ 1 1 1 1 1 1 1 1 1 1 1 1 1 1 1 1 1 1 1 1 0 0 0 0 0 0 0 0 0 0 0 0 0 0 0 0
$$ 0 0 0 0 0 0 0 0 0 0 0 0 0 0 0 0 0 0 0 0 0 0 0 0 0 0 0 0
$$ ##$ShimSysFunc= (0..63)
$$ 1 2 3 4 5 7 9 11 15 16 8 10 12 14 6 17 13 18 19 20 0 0 0 0 0 0 0 0 0 0
$$ 0 0 0 0 0 0 0 0 0 0 0 0 0 0 0 0 0 0 0 0 0 0 0 0 0 0 0 0 0 0 0 0 0 0
$$ ##$ShimSysMatrix= 0
$$ ##$ShimSysType= 1
$$ ##$TFXNUM= 0
$$ ##$TRIPLO2= 0
$$ ##$VTU= 2
$$ ##$VTUETH= <149.236.99.20>
$$ ##$VTUTY= <no>
$$ ##$WBREFAM= (0..15)
$$ 135.5 97.7 100 100 100 100 100 100 100 100 100 100 100 100 100 100
$$ ##$WBREFLM= (0..15)
$$ 0 0 0 0 0 0 0 0 0 0 0 0 0 0 0 0
$$ ##$WBREFPH= (0..15)
$$ 72.26 -67.22 0 0 0 0 0 0 0 0 0 0 0 0 0 0
$$ ##$WBSGU= (0..15)
$$ 0 0 0 0 0 0 0 0 0 0 0 0 0 0 0 0
$$ ##$XFAC= 2
$$ ##END=
$$ 
##$DECIM=	704
##$DSPFVS=	20
##XUNITS=	HZ
##YUNITS=	ARBITRARY UNITS
##FIRSTX=	25273.966162542779784
##LASTX=	-3134.691258222480883
##DELTAX=	-0.43348832563920436378
##XFACTOR=	1
##YFACTOR=	0.051093440426236771956
##FIRSTY=	-3.0456142425537109375
##MINY=	-23.215776443481445312
##MAXY=	4984.15087890625
##NPOINTS=	65536
##XYDATA=	(X++(Y..Y))
$$ [...]
10380G2l9RJ0RJ0K6K7l4l3k6k5J0J0K9K9K9K9kkL3P0M4j6m0l9l4l3l3l4K0K0K0K0nmnmrrr
$$ 72 33 42 52 61 71 97 124 90 57 31 6 16 26 55 84 113 142 140 138 171 241 285 269 229 190 156 123 90 56 76 96 116 136 131 127 122 118 109 100 91
10362I1rM3M2M3M3k2k2n7n8m9m9j3j4JJ%JlkN6N7L5L5jjj9j9j9j9k5k6k5k5JJLLL4P0M8j1
$$ 91 82 125 167 210 253 231 209 152 94 45 -4 -17 -31 -30 -29 -29 -28 -31 -33 23 80 115 150 149 148 129 110 91 72 47 21 -4 -29 -28 -27 -24 -21 13 83 131 120
10345A20n0n0j8j7K3K4O0O0K1K2j5j4n7n6K7K8N2N2J6J6k9l0k9l0j8j9M1M1M4M3PQL3L2n0
$$ 120 70 20 2 -15 8 32 92 152 173 195 180 166 109 53 80 108 160 212 228 244 215 185 156 126 108 89 130 171 215 258 265 273 306 338 288
10329B88n1m1m2nnj2j2j1j2NONOj0j0j0j0j5j6M4M4O2O2J2m7o6o6rj0mmnmpqN3N2K1K1K1K0
$$ 288 237 196 154 149 144 132 120 109 97 102 108 113 119 109 99 89 79 64 48 92 136 198 260 272 225 159 93 84 74 70 66 61 57 50 42 95 147 168 189 210 230
10312B30%%l6l6j6j6j7j6LKKLj7j7j7j7L1L2O7O8L1L1L1L1j2j1j2j2j3j3j3j4PPk9k9l4l4
$$ 230 230 230 194 158 142 126 109 93 96 98 100 103 86 69 52 35 66 98 165 233 264 295 326 357 345 334 322 310 297 284 271 257 264 271 242 213 179 145
10295A45l5l4j0j0rj0J1J0J1J1O1O1O2O1K3K2K3K3l8l8l8l8m5m4qql6l5l5l5J5J4N1N1L1L1
$$ 145 110 76 66 56 47 37 48 58 69 80 141 202 264 325 348 370 393 416 378 340 302 264 219 175 167 159 123 88 53 18 33 47 98 149 180 211
10280B11k8k9qrqrl3l3l3l3J6J6J6J6LMLMK8K8l1l2n8n8JKllllK8K8K7K8l1l1l1l2ONM1M0
$$ 211 183 154 146 137 129 120 87 54 21 -12 4 20 36 52 55 59 62 66 94 122 91 59 1 -57 -56 -54 -57 -60 -63 -66 -38 -10 17 45 14 -17 -48 -80 -74 -69 -28 12
10261A2K6K7K6K6jj%jL4L5jkj5j5j4j5m2m1M2M3N5N6mm%J%%k2k3k2k2j7j6J9J9jjJ7J7J%J9
$$ 12 38 65 91 117 116 115 115 114 148 183 182 180 165 150 136 121 79 38 80 123 178 234 230 226 226 227 227 227 205 182 160 138 121 105 124 143 142 141 158 175 176 176 195
10243A95J9jjl7l7l7l8kjL3L2llo6o5m1K0P0P1J1k4j2j2KKj4n0o3o4l9lL6L6M3M2N9O0J5J4
$$ 195 214 213 212 175 138 101 63 61 60 93 125 122 119 53 -12 -53 -33 37 108 119 95 83 71 73 75 61 11 -52 -116 -155 -158 -122 -86 -43 -1 58 118 133 147
10226A47llj8j7jkj0m7m6j0M4M5J1J1LKLLpok7RJ0J0J2J2J2J2J2J2QRRRJ4J4k2k2llmll1l2
$$ 147 144 141 123 106 105 103 93 46 0 -10 34 79 90 101 104 106 109 112 105 99 72 81 91 101 113 125 137 149 161 173 181 190 199 208 222 236 214 192 189 186 182 179 148 116
10207A16QM4N0N1J3k3k9k8l0l1j5j4j5j5k6k6QQpm1m1mN3Q9P4L8J%l7l8m1m1k3k4K1K0N4N4
$$ 116 124 168 218 269 282 259 230 202 172 141 126 112 97 82 56 30 38 46 39 -2 -43 -47 6 95 169 207 208 208 171 133 92 51 28 4 25 45 99 153
10190A53M9J2n2q8o8l0OOK4K5K4K5rj0rrMMM0M0L1L0j6p5r5l4M6J06R8L8qqqqK8K7K4K3K3
$$ 153 202 214 162 74 6 -24 -18 -12 12 37 61 86 77 67 58 49 53 57 97 137 168 198 182 107 12 -22 24 130 228 266 258 250 242 234 262 289 313 336 359
10173C59K3K0K1m0m0n4n5n4n5j6j5K0K0l5l6l5l5j6j6M3M4K7K7K8K7k8k8k8k8NMl1l0l0l0
$$ 359 382 402 423 383 343 289 234 180 125 109 94 114 134 99 63 28 -7 -23 -39 4 48 75 102 130 157 129 101 73 45 50 54 23 -7 -37 -67
10158f7L1O5O7Qo4o3K3K5K5K5l1l0l0l1L3L3k5k7j9j9M1L9Q8Q8L9j9m6rLLj4j3K2K2j2j3j2
$$ -67 -36 29 96 104 40 -23 0 25 50 75 44 14 -16 -47 -14 19 -6 -33 -52 -71 -30 9 97 185 224 205 159 150 153 156 142 129 151 173 161 148 136
10142A36j3L7L7JJk7k6k6k7j5j6j6j6L1L0nnnnL0L1L0K9L0L0N4N5onr2r2l2l2jjj%jjJJJ8
$$ 136 123 160 197 198 199 172 146 120 93 78 62 46 30 61 91 86 81 76 71 101 132 162 191 221 251 305 360 354 349 257 165 133 101 100 99 98 98 97 96 97 98 116
10124A16N3N2J5k0n5l8l8m5m4rrK5K7K7K7k6k6m4j0K2K2M5Rk6k7QM5L7Kl6l6rj0rj0J0RJ0
$$ 116 169 221 236 216 161 123 85 40 -4 -13 -22 3 30 57 84 58 32 -12 -22 0 22 67 76 50 23 31 76 113 115 79 43 34 24 15 5 15 24 34
10108C4RM2M3M2M3K3K4K4K4nonnlll7l7k0J6L1L1K9K8pqk5k5n8n8l5K4K7K7PPk9k9k7k7pm3
$$ 34 43 85 128 170 213 236 260 284 308 303 297 292 287 284 281 244 207 187 203 234 265 294 322 315 307 282 257 199 141 106 130 157 184 191 198 169 140 113 86 79 36
10090C6o1o2K2N9M2M2M5M5J5J5qK8J9j8j5K0L2L2ml9m5rNMkkl6l5m0mL3L3j9n5n5j8j3j4m5
$$ 36 -25 -87 -65 -6 36 78 123 168 183 198 190 218 237 219 204 224 256 288 284 245 200 191 196 200 198 196 160 125 85 81 114 147 128 73 18 0 -13 -27 -72
10073g2m4n6j9%L6Q1Q1Q4Q4PPPPl9l8l8l9K2K1P8P7Q6K7k4k4j8j8j8j7j0rm5m5n8n8k1k2J3
$$ -72 -116 -172 -191 -191 -155 -74 7 91 175 182 189 196 203 164 126 88 49 71 92 170 247 333 360 336 312 294 276 258 241 231 222 177 132 74 16 -5 -27 -14
10056a4J3M8M9j5j6n1n0llL4L2J8J9j8j8l6l8kkN6N6N6N7K3K3K4K3k8k8k7k8l0k9l0l0m0m1
$$ -14 -1 47 96 81 65 14 -36 -39 -42 -8 24 42 61 43 25 -11 -49 -51 -53 3 59 115 172 195 218 242 265 237 209 182 154 124 95 65 35 -5 -46
10040d6j5M5N2N3K1K1L0L0L1L0L7L6m7m7k1k1k1k1l2l3l2l2K5K4O1O0RRn1n1k2k1k2k2NNM0
$$ -46 -61 -16 36 89 110 131 161 191 222 252 289 325 278 231 210 189 168 147 115 82 50 18 43 67 128 188 197 206 155 104 82 61 39 17 22 27 67
10024F7M1J4J4k2k3jkjko8o7j9M2M4M5M9M9l9l8l9l9J1J1J1J1l7l5k0J5M0M1QPK4K3M1Ol4
$$ 67 108 122 136 114 91 90 88 87 85 17 -50 -69 -27 17 62 111 160 121 83 44 5 16 27 38 49 12 -23 -43 -28 12 53 61 68 92 115 156 162 128
10008A28p0n2n1j5j6j3j3J3M8M8J3ooK5K5Kl4j4j2PRM2M2M0Mj1j2j2j3j2j2k4k4m3qK0K0K2
$$ 128 58 6 -45 -60 -76 -89 -102 -89 -41 7 20 14 8 33 58 60 26 12 0 7 16 58 100 140 144 133 121 109 96 84 72 48 24 -19 -27 -7 13 35
9991C5K3J7J7Jl5k5k6QQMMl0k9J7N2J8j9k3k3k5k6opL2O6P1L5kkl0l0k9l0RRJ1J2L0O6L0o
$$ 35 58 75 92 93 58 33 7 15 23 27 31 1 -28 -11 41 59 40 17 -6 -31 -57 -63 -70 -38 28 99 134 132 130 100 70 41 11 20 29 40 52 82 148 178 172
9974A72l8l8l8l8j9J7K0j7l5jN7N9K5j2RRj6j7j6j7KKL8L8QRQRl8l8n6k0K2N8M0L9JKJJj0
$$ 172 134 96 58 20 1 18 38 21 -14 -15 42 101 126 114 123 132 116 99 83 66 68 70 108 146 154 163 171 180 142 104 48 28 50 108 148 187 188 190 191 192 182
9956A82rm5m5l5l4KL9M5Rk9o6m9j5K3K3L6L7L7L7K0K0J8J8m4p9n8n6k3J4pqk8k9k9k9m6m5
$$ 182 173 128 83 48 14 16 55 100 109 80 14 -35 -50 -27 -4 32 69 106 143 163 183 201 219 175 96 38 -18 -41 -27 -34 -42 -70 -99 -128 -157 -203 -248
9940b48rj0K3K3Q1Q1N9K5RRNOl0k9J7J9J8J9K5K5Rk7l3l2MM1L8L9M0M1qqm2m1k0J6L0L0J9
$$ -248 -257 -267 -244 -221 -140 -59 0 25 34 43 48 54 24 -5 12 31 49 68 93 118 127 100 67 35 39 80 118 157 197 238 230 222 180 139 119 135 165 195 214
9923B14j6l3l2LMM0L9M8M7M8M8J5J5k0k1j8j7l4o9r0r0n3j7J1J2J4J3rj0N0N1O1O1M6J0k6
$$ 214 198 165 133 136 140 180 219 267 314 362 410 425 440 420 399 381 364 330 261 171 81 28 11 22 34 48 61 52 42 92 143 204 265 311 321 295
9907B95k6k6k6k4J2K8K7j3j3j3j4m6m6m6m6l4l5K5K4k2k2J4J4K8K9opk7k5k7k7k0k0J5J6J8
$$ 295 269 243 217 193 205 233 260 247 234 221 207 161 115 69 23 -11 -46 -21 3 -19 -41 -27 -13 15 44 38 31 4 -21 -48 -75 -95 -115 -100 -84 -66
9892f6J9J8J9L6L7P3P3N4N3oom1m1m1m1k7k7k8k7qpK8K9QQQRlklkk4k3k3k4J0RJ0Rj4j3j3
$$ -66 -47 -29 -10 26 63 136 209 263 316 310 304 263 222 181 140 113 86 58 31 23 16 44 73 81 89 97 106 103 101 98 96 72 49 26 2 12 21 31 40 26 13 0
9873@j4K6K6rrKKO2O1j0j0m6m7J5J4N1N0j8j8j9j8J7J7J7J7POOOM2M1NOk5k5k5k5K4K4K4K4
$$ 0 -14 12 38 29 20 22 24 86 147 137 127 81 34 49 63 114 164 146 128 109 91 108 125 142 159 166 172 178 184 226 267 272 278 253 228 203 178 202 226 250 274
9856B74rrrrK0K1j6j5j9k0j9j9J2J1J2J1%j%jk3k3J3J3M6M5RJ0j3j3j4j3j3j3j3j4k4k5k4
$$ 274 265 256 247 238 258 279 263 248 229 209 190 171 183 194 206 217 217 216 216 215 192 169 182 195 241 286 295 305 292 279 265 252 239 226 213 199 175 150 126
9839A26k5L6L7%%m0m0m1m0noL0L1m7m6j1j1K5K4l5l6k0k0J7J6K2K3K3K2NNM0M1j3j2j3j3j
$$ 126 101 137 174 174 174 134 94 53 13 8 2 32 63 16 -30 -41 -52 -27 -3 -38 -74 -94 -114 -97 -81 -59 -36 -13 9 14 19 59 100 87 75 62 49 48
9822D8kjkJ7J6J6J6P1P0J1J1lklkj9k0j9j9m1m1r7r6p6j5L4L4lmmlLMMMllL4L3J3J3J3J3J0
$$ 48 46 45 43 60 76 92 108 179 249 260 271 268 266 263 261 242 222 203 184 143 102 5 -91 -167 -182 -148 -114 -117 -121 -125 -128 -125 -121 -117 -113 -116 -119 -85 -52 -39 -26 -13 0 10
9803A0J1J1J0pqqqNNM1M1k2k2k2k2K8K8l2l2n1n1j3j4M9Q3Q2M6J9j7n6n7n8k4L8L6L4lnL1
$$ 10 21 32 42 35 27 19 11 16 21 62 103 81 59 37 15 43 71 39 7 -44 -95 -108 -122 -73 10 92 138 157 140 84 27 -31 -55 -17 19 53 50 45 76
9786G6O4K8l1l1k6RK3K3k2n8n8k2j4j3j2j1k2k3J3J3M0M1L9M0j5j5JL7M7M7J4J4jjl7l7l7
$$ 76 140 168 137 106 80 89 112 135 113 55 -3 -25 -39 -52 -64 -75 -97 -120 -107 -94 -54 -13 26 66 51 36 37 74 121 168 182 196 195 194 157 120 83
9770H3l7KL8P2P2N8K3MMKKonoo%%o0r7p6j7K9K9K5j1k5k5qK9O5O6M0Lj2j2J4J4J4J4k1k1k2
$$ 83 46 48 86 158 230 288 311 315 319 321 323 317 312 306 300 300 300 240 143 67 50 79 108 133 122 97 72 64 93 158 224 264 267 255 243 257 271 285 299 278 257 235
9752B35k1mmnml2l1l1l1RJ0RJ0J0RJ0J0RJ0J0RN8N9M2Pj2j1m7m8m8j2K7K8L0L1k9k9l3l3L
$$ 235 214 210 206 201 197 165 134 103 72 81 91 100 110 120 129 139 149 158 168 178 187 245 304 346 353 341 330 283 235 187 175 202 230 260 291 262 233 200 167 170
9735A70Lj8j9j9j9m1m1m0m2K7K7O2O3O1O0K5K5M1M2NOk4k4k3k4k0j9n6n5k9k9PQPQQQl8l9
$$ 170 173 155 136 117 98 57 16 -24 -66 -39 -12 50 113 174 234 259 284 325 367 372 378 354 330 307 283 263 244 188 133 104 75 82 90 97 105 113 121 83 44
9718D4kkK5K6QQQQK5K6mmm0l9j5j5j5j5j0j1N0M9N3N3opl2l1K8K8J1J1k5k5L2L1L1L1k5k6
$$ 44 42 40 65 91 99 107 115 123 148 174 170 166 126 87 72 57 42 27 17 6 56 105 158 211 205 198 166 135 163 191 202 213 188 163 195 226 257 288 263 237
9700B37k6k5poK9L0NNONJ4J4m6m6o3o3k7k7J1J2M7M8QRQRN7N7N7N8l0l0k9l0l9l9l9m0OON
$$ 237 211 186 179 173 202 232 237 242 248 253 267 281 235 189 126 63 36 9 20 32 79 127 135 144 152 161 218 275 332 390 360 330 301 271 232 193 154 114 120 126 131
9683A31OJ9J9J9K0m2m1m2m1RJ0K3N8N9K3l8l9n4n3n1n2%L5N0N1M7M8J1J2rrj1K5N0N1J8J7
$$ 131 137 156 175 194 214 172 131 89 48 57 67 90 148 207 230 192 153 99 46 -5 -57 -57 -22 28 79 126 174 185 197 188 179 168 193 243 294 312 329
9667C29qrQPOk9o8o7m2pJ0RNNNNM0M0M0L9MMMLj3j4j5j6om2n8n7NNNNJ%%JJ3J3J3J3j5j5m8
$$ 329 321 312 320 327 333 304 236 169 127 120 130 139 144 149 154 159 199 239 279 318 322 326 330 333 320 306 291 275 269 227 169 112 117 122 127 132 133 133 133 134 147 160 173 186 171 156 108
9646A08m8k5J2M7M7L9k2o9p0k6Pqj0qK6J0RK5O0L8L8mm0j9k0k2k2k1k2K6K7M7J0l2l1j9J8
$$ 108 60 35 47 94 141 180 158 89 19 -7 0 -8 -18 -26 0 10 19 44 104 142 180 176 136 117 97 75 53 32 10 36 63 110 120 88 57 38 56
9630E6M2M2M4M4mmnmQRQRk5k4k5k4j0j0j0j0J1J0J1J1k7k6k7k7k9k8k9k9N9N8K2K3O1O1K5
$$ 56 98 140 184 228 224 220 215 211 219 228 236 245 220 196 171 147 137 127 117 107 118 128 139 150 123 97 70 43 14 -14 -43 -72 -13 45 67 90 151 212 237
9613B37K5jkl7l7o6o7J7J8MNNMk3k3k3k3J8J7J8J7K3K3j3j3j8j8j7j8J9J9J9J9J0J1J0J0M3
$$ 237 262 261 259 222 185 119 52 69 87 91 96 101 105 82 59 36 13 31 48 66 83 106 129 116 103 85 67 50 32 51 70 89 108 118 129 139 149 192
9597A92M3PQj9j9n5n5l6l6%jK6K5K6K5n6n5n4n6L0L0ooooL0K9RRJ0RL2L2nmPOOPk8k7RQL0
$$ 192 235 242 250 231 212 157 102 66 30 30 29 55 80 106 131 75 20 -34 -90 -60 -30 -36 -42 -48 -54 -24 5 14 23 33 42 74 106 101 97 104 110 116 123 95 68 77 85 115
9578A15L1ooqqqqkkL3L4M7M7j2j3qpJ2k3m3m2m2m2j5K1O1O0M1M0NMnnnmqpppj0j0rj0k4k5
$$ 115 146 140 134 126 118 110 102 100 98 131 165 212 259 247 234 226 219 231 208 165 123 81 39 24 45 106 166 207 247 252 256 251 246 241 237 229 222 215 208 198 188 179 169 145 120
9558A20k5k4popoK8K7M9J2l3l3NM1M0L9POK0K1J8J9l1o6o6l0k7k7k4k5kkl7l8k9k9PPM1M0
$$ 120 95 71 64 58 51 45 73 100 149 161 128 95 100 141 181 220 227 233 253 274 292 311 280 214 148 118 91 64 40 15 13 11 -26 -64 -93 -122 -115 -108 -67 -27
9541b7J7m3n5j9M1M2L5L4L3L3K2j3k9k9OPOOL3L2mm1l4K%l6l1l2KKk6k6J0J0j4j4K7O1N1N1
$$ -27 -10 -53 -108 -127 -86 -44 -9 25 58 91 113 100 71 42 48 55 61 67 100 132 128 87 53 55 55 19 -12 -44 -42 -40 -66 -92 -82 -72 -86 -100 -73 -12 39 90
9524I0J8J8m0m0l8l6k4J2K8K8N1N2M9N0K4j1RRM3M2POqqj1j0k0n6o9o9nL1M6M7L0L1M8J3l4
$$ 90 108 126 86 46 8 -28 -52 -40 -12 16 67 119 168 218 242 231 240 249 292 334 341 347 339 331 320 310 290 234 165 96 91 122 168 215 245 276 324 337 303
9507C03p0n2n2n9n8k1J3M4Pk6k6lN3P8M1PPl1l1m3m2ppj0j1K5K6k1k2k0k1K0J9K0K0KLKLK
$$ 303 233 181 129 70 12 -9 4 48 55 29 3 0 53 131 172 179 186 155 124 81 39 32 25 15 4 29 55 34 12 -8 -29 -9 10 30 50 52 55 57 60 62
9489F2LKLJ5J5J3J3%l5m9m8j1K4O4O5O4O5L8k1m9m8j2K3j3j3j1j1J0RPQ%l5m9m9l1MM2M2j4
$$ 62 65 67 70 85 100 113 126 126 91 42 -6 -17 7 71 136 200 265 303 282 233 185 173 196 183 170 159 148 158 167 174 182 182 147 98 49 18 22 64 106 92
9472I2n0m7j1K6O3M5M4J%L3L4j5n0l1l0j0rl0OM3M2J0RKLKKJ2J2J1J2NNMNm7m8l1MM8M8J3
$$ 92 42 -5 -16 10 73 118 162 163 163 196 230 215 165 134 104 94 85 55 61 104 146 156 165 167 170 172 174 186 198 209 221 226 231 235 240 193 145 114 118 166 214 227
9454B27k2l2NJ5J6j8n4j8J8M1M1k0n6k9k9l1l1k9l0OOj0j0j0j1J8J8N4R0R3N8J6k0l6l6n6
$$ 227 205 173 178 193 209 191 137 119 137 178 219 199 143 114 85 54 23 -6 -36 -30 -24 -34 -44 -54 -65 -47 -29 25 115 208 266 282 262 226 190 134
9438A34k1NM0M2Pn0n0j3K4K8K9nnm3m3m1l9lL2M7M7K7rJ1J1L1L1mnJ8J8J8J7k9k9k9l0j2j2
$$ 134 113 118 158 200 207 157 107 94 118 146 175 170 165 122 79 38 -1 -4 28 75 122 149 140 151 162 193 224 220 215 233 251 269 286 257 228 199 169 157 145
9421A45j2j3lllmL2L2L2L2N4N5J4k1m8m7m8m8p2l7LLk0k1j9k1mmmmM9M9L3lrrK4K5RJ0J0R
$$ 145 133 120 117 114 111 107 139 171 203 235 289 344 358 337 289 242 194 146 74 37 40 43 23 2 -17 -38 -42 -46 -50 -54 -5 44 77 74 65 56 80 105 114 124 134 143
9403A43j8j9j9j9J0Rn1n0j2j1j2j2l6l6M7M8O6O7PQJKKJmnmmOOl0l0j3j2K3K3J4J4m6m6J5
$$ 143 125 106 87 68 78 87 36 -14 -26 -37 -49 -61 -97 -133 -86 -38 28 95 102 110 111 113 115 116 112 107 103 99 105 111 81 51 38 26 49 72 86 100 54 8 23
9385B3J5N0N1j3j3j3j4m9m8L4L5K8K8K8K8K5K4K4K5j1j0j0j1J0J0k6k6k3k3k4k3n5n3j9j9
$$ 23 38 88 139 126 113 100 86 37 -11 23 58 86 114 142 170 195 219 243 268 257 247 237 226 236 246 220 194 171 148 124 101 46 -7 -26 -45
9370d5M4M2M4M4M5M5RRk6k7k7k7k6k5L3L4L8L7JKL0L1L0L1KJn8n8n8n9KKj8j8j7j8JJJJJ8
$$ -45 -1 41 85 129 174 219 228 237 211 184 157 130 104 79 112 146 184 221 222 224 254 285 315 346 348 349 291 233 175 116 118 120 102 84 67 49 50 51 52 53 71
9352G1J7J7J8j0rj0rK4K5K5K4LKN8N9M7j3l9l9k7k7j4K2K5j1m9m8mmlmk7k8RQRJ0RRL2L2K9
$$ 71 88 105 123 113 104 94 85 109 134 159 183 186 188 246 305 352 339 300 261 234 207 193 215 240 229 180 132 128 124 121 117 90 62 71 79 88 98 107 116 148 180 209
9334B09L0M2Pl3l3k1k2L7L6K5j2m7j2L7L8JJj4m9q7q7m1nk2k3K3N8P2P2N4J9m3m2j6K0%%n2
$$ 209 239 281 288 255 222 201 179 216 252 277 265 218 206 243 281 282 283 269 220 133 46 5 0 -22 -45 -22 36 108 180 234 253 210 168 152 172 172 172 120
9318A20n2n1n1l1l1l1l1RQQRN5N6N2N3K4j2m9m9j8J5L2L3L0L0L0L1mlL0L0N6K0m5q1o3k7J1
$$ 120 68 17 -34 -65 -96 -127 -158 -149 -141 -133 -124 -69 -13 39 92 116 104 55 6 -12 3 35 68 98 128 158 189 185 182 212 242 298 318 273 192 129 102 113
9301A13J0J5J5J5J5kklkONOOm0l9l9l9j8j7j7j7JJJJj7j8K0N5O5K9rrj0j1j0j1k3k4k0k1J9
$$ 113 123 138 153 168 183 181 179 176 174 180 185 191 197 157 118 79 40 22 5 -12 -29 -28 -27 -26 -25 -42 -60 -40 15 80 109 100 91 81 70 60 49 26 2 -18 -39 -20
9283b0N4L5L4L1L0L0L0ooL0L0J8J7j8j9o7o7n2j5L1L0L1L1K2j4n4n3l5l5l2l3k4J1K7K8L5
$$ -20 34 69 103 134 164 194 224 218 212 242 272 290 307 289 270 203 136 84 69 100 130 161 192 214 200 146 93 58 23 -9 -42 -66 -55 -28 0 35
9267C5L6O9P0M6J1rm5n5n4pN3P9Q0J7j8k9o5q0q0o0k4L8M0M3M3K7rl5l6l8l9jjL4L4P1P0L1
$$ 35 71 140 210 256 267 258 213 158 104 97 150 229 309 326 308 279 214 134 54 -6 -30 8 48 91 134 161 152 117 81 43 4 3 2 36 70 141 211 242
9251B42nj0rj2j2nmK8K9ml9m0mN9O0M7J0m8m8n0n0k5k6k5k6ONNNJ4J4Jl5m4oK8L0L3L3om3
$$ 242 237 227 218 206 194 189 185 213 242 238 199 159 155 214 274 321 331 283 235 185 135 110 84 59 33 39 44 49 54 68 82 83 48 4 -2 26 56 89 122 116 73
9233G3l8l6nmRQRRj%%%OOk7k7jL5L5jj2j2K2K2L3L3mm1k4J2rrJL6M9N0qm4k4k3lllkJ3J4L4
$$ 73 35 -1 -6 -10 -1 7 16 25 24 24 24 24 30 36 9 -18 -19 16 51 50 38 26 48 70 103 136 132 91 67 79 70 61 62 98 147 197 189 145 121 98 95 92 89 87 100 114 148
9213A48km3m2m2m2j7J8L1L2j6n2n2j7M9M8L7KK1N8N5K0k0k1J3J4m4m4m3m4k8k8PPQPQQJ4J6
$$ 148 146 103 61 19 -23 -40 -22 9 41 25 -27 -79 -96 -47 1 38 40 61 119 174 194 174 153 166 180 136 92 49 5 -23 -51 -44 -37 -29 -22 -14 -6 8 24
9196B4J5J6N8N8M2Pl8l7%L5PORRL8L8N9K2mmpol2l2K5K6J5k1l6l7r6r6o9j0N0N1N5N5K1K1
$$ 24 39 55 113 171 213 220 182 145 145 180 187 193 202 211 249 287 346 368 364 360 353 347 315 283 308 334 349 328 292 255 159 63 -6 -16 34 85 140 195 216 237
9179B37l8l9MMMMPPOPn0n1n0n0nnoon0n1n1n0L0L0L0L0J8J7J7J8L6L7P3P3K0K0K0K0L6L7L6
$$ 237 199 160 164 168 172 176 183 190 196 203 153 102 52 2 -3 -8 -14 -20 -70 -121 -172 -222 -192 -162 -132 -102 -84 -67 -50 -32 4 41 114 187 207 227 247 267 303 340 376
9161C76L6o2o3o2o3OONOj7j7M3M3K3K3l7l7j8j9j8j8l1l0k9L2N8N9KKJ5J5M7M7j8p7q2m7j9
$$ 376 412 350 287 225 162 168 174 179 185 168 151 194 237 260 283 246 209 191 172 154 136 105 75 46 78 136 195 197 199 214 229 276 323 305 228 146 99 80
9144H0k0j7j7L2L2L3L2%%%jk6k6k6k6NNK2K3K0K0j6j6j6j6K0K1k5k6m3m2J7J7J8J8j3j3K3
$$ 80 60 43 26 58 90 123 155 155 155 155 154 128 102 76 50 55 60 82 105 125 145 129 113 97 81 101 122 97 71 28 -14 3 20 38 56 43 30 53
9128E3K3J6J5J5J5J4J3m6m7l4l4j6j6lkN7N7O1O0M3M2mno5o5l2l2K8K7n4n5n3n5L4L5L3L4
$$ 53 76 92 107 122 137 151 164 118 71 37 3 -13 -29 -32 -34 23 80 141 201 244 286 282 277 212 147 115 83 111 138 84 29 -24 -79 -45 -10 23 57
9112E7KJJKQRRRl4l4l2l4qqK8K7NNM0M1P7P6J7J7n9n9k3k4llJ4J5jjL6L5J0J0k5k6OOj2j3
$$ 57 59 60 61 63 71 80 89 98 64 30 -2 -36 -44 -52 -24 3 8 13 53 94 171 247 264 281 222 163 140 116 113 110 124 139 138 137 173 208 218 228 203 177 183 189 177 164
9093A64NNj3j3J9J9J9J9LKn7n7j3j4K3K3K3K3j3j3J2J1J2J2j5j5K1K1K5K5l4l5qqrql3l3K7
$$ 164 169 174 161 148 167 186 205 224 227 229 172 115 102 88 111 134 157 180 167 154 166 177 189 201 186 171 192 213 238 263 229 194 186 178 169 161 128 95 122
9076A22K7J5J6k0k0l3l3n1n0l9l9K0K1L6L6L6L7PPQPjkkjj7j7j6j7kjkkj2j2j2j2k5k5k5k4
$$ 122 149 164 180 160 140 107 74 23 -27 -66 -105 -85 -64 -28 8 44 81 88 95 103 110 109 107 105 104 87 70 54 37 35 34 32 30 18 6 -6 -18 -43 -68 -93 -117
9058a17J6J6N2N1jjjjJ1J1J1J1j8j8J8J8K2K1K2K1J6J6J5J6K2K2l8l8l3l3KLJ7J7J8J7n2n1
$$ -117 -101 -85 -33 18 17 16 15 14 25 36 47 58 40 22 40 58 80 101 123 144 160 176 191 207 229 251 213 175 142 109 111 114 131 148 166 183 131 80
9042H0j6j6J0J0J0J0M5M6M5M5k4k3k4k3J5J5J6J5k9k9l0k9L4L3L4L4l8l8l8l8J8J9J9J9k3
$$ 80 64 48 58 68 78 88 133 179 224 269 245 222 198 175 190 205 221 236 207 178 148 119 153 186 220 254 216 178 140 102 120 139 158 177 154
9026A54k2k3k3L0K9ool9l8M6M5K8K7l2l2%jL6L5K3K3j3j3ooonl0l0k7k8k8PO9O8N4J8k4n9
$$ 154 132 109 86 116 145 139 133 94 56 102 147 175 202 170 138 138 137 173 208 231 254 241 228 222 216 210 205 175 145 118 90 62 69 138 206 260 278 254 195
9009A95o4k8J0J0J1J2J2J2LMLMLLj3m9n6n5k1k2mml7l8l4KO3O3L6%K1K0J8J9J6J6K7qm9m8
$$ 195 131 103 113 123 134 146 158 170 173 177 180 184 187 190 177 128 72 17 -4 -26 -30 -34 -71 -109 -143 -141 -78 -15 21 21 42 62 80 99 115 131 158 150 101 53
8992E3n0m9j1j2J6N3O7O8POMMl7p2l6jM5M6M7M8J7J7J7J7j6j5l6Jmnl7l8k1k1m1nL9L9O1K6
$$ 53 3 -46 -57 -69 -53 0 67 135 142 148 152 156 119 47 11 10 55 101 148 196 213 230 247 264 248 233 197 198 194 189 152 114 93 72 31 26 65 104 165 191
8975A91L0L1K6K6l2o8o8l2J2J2J4J5J9J9J9J8J7J7J7J7j0j0j0j0LKLLo6o6n0j5L3L3L2L3J
$$ 191 221 252 278 304 272 204 136 104 116 128 142 157 176 195 214 232 249 266 283 300 290 280 270 260 263 265 268 271 205 139 89 74 107 140 172 205 206
8959B06l6n1n1%%%%MMNMK2K2J9m0n0m9PM4O1K5j3j2RJ0RRk6k5k6k6n5n4k9L1O9O9L4lj5j6
$$ 206 170 119 68 68 68 68 68 72 76 81 85 107 129 148 108 58 9 16 60 121 146 133 121 130 140 149 158 132 107 81 55 0 -54 -83 -52 17 86 120 117 102 86
8941H6j8j8jjN6N6N6K0k0k0j9j8j7j7k2J3P3P3M3j7m3m3qqqqk7k8k8k7l3l2LKlnk5J1O9P0
$$ 86 68 50 49 48 104 160 216 236 216 196 177 159 142 125 103 116 189 262 305 288 245 202 194 186 178 170 143 115 87 60 27 -5 -2 0 -3 -8 -33 -22 47 117
8924A17N7K0J0RM0M1J0k6k9QRk6o2o1n6k0mmK7K7K8K7%%%Jm9n0j1K4Qk8m0m1pqm3m3k1k0K0
$$ 117 174 194 204 213 253 294 304 278 249 257 266 240 178 117 61 41 37 33 60 87 115 142 142 142 142 143 94 44 33 57 65 37 -3 -44 -51 -59 -102 -145 -166 -186 -166
8906a66N5M0L9OOJ00J01O5O6K1K1K2K1k4k3n9o0o1o1o2o0J4J5J5J5RRk7k8KKO2O2K7K8rql6
$$ -166 -111 -71 -32 -26 -20 80 181 246 312 333 354 376 397 373 350 291 231 170 109 47 -13 1 16 31 46 55 64 37 9 11 13 75 137 164 192 183 175 139
8889A39l5K4K5J6J6j9k0l2l2l3l2j7j7J8J8L7L6k3k3J9K0J9K0J1J1k4k5k5k5J1J1NNM1M1K5
$$ 139 104 128 153 169 185 166 146 114 82 49 17 0 -17 1 19 56 92 69 46 65 85 104 124 135 146 122 97 72 47 58 69 74 79 120 161 186
8874A86K4j1j2K3K3l7l7n7n6K7K7RRRRKKKKm9m8o5k9M2J02Q2ko4o3l4l2L2L3L0k9o0o1J0O8
$$ 186 210 199 187 210 233 196 159 102 46 73 100 109 118 127 136 138 140 142 144 95 47 -18 -47 -5 97 179 177 113 50 16 -16 16 49 79 50 -10 -71 -61 7
8857GQ1Q0K4K4J0J0m9q6n6MN2N2J8J8J9J8MNMMK0J9j6j7l1l1K9K9J5J6k1k0p2p2l6l6L5L6
$$ 7 88 168 192 216 226 236 187 101 45 49 101 153 171 189 208 226 230 235 239 243 263 282 266 249 218 187 216 245 260 276 255 235 163 91 55 19 54 90
8840I0L5L5K3K3o0o0PQPQJ7J7J7J7n4n4j8j8k3k2k3k3K9K7Q5Q5M3j7o0k5L8P5P3L7oo7q8n3
$$ 90 125 160 183 206 146 86 93 101 108 116 133 150 167 184 130 76 58 40 17 -5 -28 -51 -22 5 90 175 218 201 141 116 154 229 302 339 333 266 178 125
8824A25kL3N2N2L0L0l0l0j5j5j5j5J6J5J5J6mll9l9k1k1k0k1j0j1j0j0k6k6L4L4N3N4N1ro7
$$ 125 123 156 208 260 290 320 290 260 245 230 215 200 216 231 246 262 258 255 216 177 156 135 115 94 84 73 63 53 27 1 35 69 122 176 227 218 151
8808A51o8j1j1qrqqMMMMOOOOj6j7K0J9L5L4jkJ3J3J3J4L1L1nnpoppm0m0mnkkj8n4m4m4J3J2
$$ 151 83 72 61 53 44 36 28 32 36 40 44 50 56 62 68 52 35 55 74 109 143 142 140 153 166 179 193 224 255 250 245 238 232 225 218 178 138 134 129 127 125 107 53 9 -35 -22 -10
8788a0qrrrk1k2n7n7j7j6J9K0P4P4N9K5JL7N1N1LMj7J9L2L2J8j7l4l4l6l6k6k5k5k6p1p2l2
$$ -10 -18 -27 -36 -45 -66 -88 -145 -202 -219 -235 -216 -196 -122 -48 11 36 37 74 125 176 179 183 166 185 217 249 267 250 216 182 146 110 84 59 34 8 -63 -135 -167
8771a67ML5L5L7L7K7K8M1P7O5K8rrl2l2l2l2l6l5n5k0K5K4K7K8N3N3poj6j7m8m9j6M4R0R0
$$ -167 -163 -128 -93 -56 -19 8 36 77 154 219 247 238 229 197 165 133 101 65 30 -25 -45 -20 4 31 59 112 165 158 152 136 119 71 22 6 50 140 230
8755B30O1Jk5k5k4k3k3k3k7k7k7k7k8k7k6k5jL4M8M8K5j0n0m9n0n0j1K6N6N5K3K3QPj2K3N3
$$ 230 291 292 267 242 218 195 172 149 122 95 68 41 13 -14 -40 -65 -66 -32 16 64 89 79 29 -20 -70 -120 -131 -105 -49 6 29 52 60 67 55 78 131
8739A31N4J9K0k5k4o0o1k7k7PRJ9J9J8J9L6L7L6L6NMn5n5k3k4L7L6J7J7j9j9j1j1m7m6n5n6
$$ 131 185 204 224 199 175 115 54 27 0 7 16 35 54 72 91 127 164 200 236 241 245 190 135 112 88 125 161 178 195 176 157 146 135 88 42 -13 -69
8723f9k0j9m5m4m0J9Q9J24R2N6MLJJllmlMLl2l2k4k3J3J2%j%%m0l8lmnmnnL6L5J%k7k8L1L2
$$ -69 -89 -108 -153 -197 -237 -218 -129 -5 87 143 147 150 151 152 149 146 142 139 143 146 114 82 58 35 48 60 60 59 59 59 19 -19 -22 -26 -31 -35 -40 -45 -9 26 27 27 0 -28 3 35
8703C5K7K6K7K7j8j8M2M3L7L8KKj7j7j7j7j9j9k0j9nonnonnoL8L9L8L8rrrrk7k6o3o2%%KL
$$ 35 62 88 115 142 124 106 148 191 228 266 268 270 253 236 219 202 183 164 144 125 120 114 109 104 98 93 88 82 120 159 197 235 226 217 208 199 172 146 83 21 21 21 23 26
8684B6j8J7N6N5L8Ko0n9k5J1M8M9M0Ml7p3n2j6klLMLLK1K1N5N5K8qk4k4lll9m0l9l8llnnR
$$ 26 8 25 81 136 174 176 116 57 32 43 91 140 180 184 147 74 22 6 4 1 4 8 11 14 35 56 111 166 194 186 162 138 135 132 93 53 14 -24 -27 -30 -35 -40 -31
8665c1M4M7J1lkj3j3j3j2kjl7l7l3l3KLJ3J4J3J3%jk0J5N4N3N5ol4l3K3K2j3j3j4j3L4L3N4
$$ -31 13 60 71 68 66 53 40 27 15 13 12 -25 -62 -95 -128 -126 -123 -110 -96 -83 -70 -70 -71 -91 -76 -22 31 86 80 46 13 36 58 45 32 18 5 39 72 126
8648A26J8k1k1pK8M2M3K9pl6l5kjL5L5L5L5L3L3llj1j1K3K3K2j4k9l0k8k9QP%%k0J5J8J7j6
$$ 126 144 123 102 95 123 165 208 237 230 194 159 157 156 191 226 261 296 329 362 359 356 345 334 357 380 402 388 359 329 301 272 280 287 287 287 267 282 300 317 301
8630C01j6j7j7j7j7rrj0rJ4J3mnnml7l7l2K7P4P4L5k6k7k8J9J8J9J8J3J3k1k1ML9L7Kl1o6
$$ 301 285 268 251 234 217 208 199 189 180 194 207 203 198 193 189 152 115 83 110 184 258 293 267 240 212 231 249 268 286 299 312 291 270 274 313 350 352 321 255
8613B55o9l3J6J5J8J8M2M2j8j8kjj7n4m1m1mL1L2L1lkLLl5p0p3l6K3K4L4L4J9j8MLJ9J9J0
$$ 255 186 153 169 184 202 220 262 304 286 268 266 265 248 194 153 112 108 139 171 202 199 197 200 203 168 98 25 -11 12 36 70 104 123 105 109 112 131 150 160
8596A60J0J0J0mmmmJ7J7J6J7poppK7K6j0j0j0j1j0j1J0J0J0RRRQRKKPl0l5%L5L6k7o2k7J0
$$ 160 170 180 190 186 182 178 174 191 208 224 241 234 228 221 214 241 267 257 247 237 226 216 205 215 225 235 244 253 262 270 279 281 283 290 260 225 225 260 296 269 207 180 190
8578A90K0K1NMj7j7jkj3n0o5o5OPpm2m9j3K5K4K9K8M6M7ppPM3J7j8l2l1J5J5J4J3J0k5k5J0
$$ 190 210 231 236 240 223 206 205 203 190 140 75 10 16 23 16 -26 -75 -88 -63 -39 -10 18 64 111 104 97 104 147 164 146 114 83 98 113 127 140 150 125 100 110
8560A10L7L7N8N7L4L5nm1n0n0l6jK1K1NNk2k1k2k1n1n1o9l5j4j4j2j2L1L2M4Q0Q7N1j2m7m3
$$ 110 147 184 242 299 333 368 363 322 272 222 186 185 206 227 232 237 215 194 172 151 100 49 -20 -55 -69 -83 -95 -107 -76 -44 0 80 167 218 206 159 116
8544A16pj1j2l6l6j9J4K1K0MNnnRM5N2J6k0k1qqrqm5m5m2m4pK7O3O4L1k9n2n1nN4N4N5Rk8
$$ 116 109 98 86 50 14 -5 9 30 50 54 59 54 49 58 103 155 171 151 130 122 114 105 97 52 7 -35 -79 -86 -59 4 68 99 70 18 -33 -38 16 70 125 134 106
8527A06m0m1oL1J2J2jL5M8M9J3k3l8l9l8l7K3O0M1Nqqj6j6oK9M1M0ml9n3n3n4n2l1MP1P2O3
$$ 106 66 25 19 50 62 74 73 108 156 205 218 195 157 118 80 43 66 126 167 172 164 156 140 124 118 147 188 228 224 185 132 79 25 -27 -58 -54 17 89 152
8510A52K6J7J7llk3J2K4K4k7k8j6j5j6j6m4m5k3J3M1M0j1j2PPL6L7J8J9j2j2J6J6J7J6k3k4
$$ 152 178 195 212 209 206 183 195 219 243 216 188 172 157 141 125 81 36 13 26 67 107 96 84 91 98 134 171 189 208 196 184 200 216 233 249 226 202
8494B02n3n3l1l0rK6K0K0m1m1j5J9L0L0M2M3J3J3MMMML8L7K8qjklmj9k0kkKJm3p8o8l1j1j0
$$ 202 149 96 65 35 26 52 72 92 51 10 -5 14 44 74 116 159 172 185 189 193 197 201 239 276 304 296 295 293 290 286 267 247 245 243 245 246 203 125 57 26 15 5
8475EoK8Q4Q3K6j1k0k1k7k7m5rJ5N1N3J8l2l2l3l4ppppj0j1j1rLMNML0L0L0L0K3K3N3N3J7
$$ 5 -1 27 111 194 220 209 189 168 141 114 69 60 75 126 179 197 165 133 100 66 59 52 45 38 28 17 6 -3 0 4 9 13 43 73 103 133 156 179 232 285 302
8458C02J7o1o1j8j9J2J1J9J9JJJ0RN1N1jjj9j8l0l1m8m7p2p1k7L2L3L4PQrrrqKKj6j6k9k8
$$ 302 319 258 197 179 160 172 183 202 221 222 223 233 242 293 344 343 342 323 305 275 244 196 149 77 6 -21 11 44 78 85 93 84 75 66 58 60 62 46 30 1 -27
8440b7J2J3L5L6j8j8l2l1J0RonooN4N5L4k5n7n7l0l1k9k8JKP4P4P4P5L2L2m5m6m6m6nmK5K5
$$ -27 -15 -2 33 69 51 33 1 -30 -20 -11 -17 -22 -28 -34 20 75 109 84 27 -30 -60 -91 -120 -148 -147 -145 -71 3 77 152 184 216 171 125 79 33 28 24 49 74
8423G4K3K3n2q7r9l9K5O1K3j2k7k7L7L7P0P1M1M1j5j5o5o6m7J1L0L1nnm6m8LKM4M3mln4n5
$$ 74 97 120 68 -19 -118 -157 -132 -71 -48 -60 -87 -114 -77 -40 30 101 142 183 168 153 88 22 -25 -14 16 47 42 37 -9 -57 -54 -52 -8 35 31 28 -26 -81
8406h1m5rN4N5M2M3M3M3M0M0K5j1o0o0k7k6k7k6k6k7m5m4J8N5N1N1J5J6J2k3l9l9lmlmk2k3
$$ -81 -126 -135 -81 -26 16 59 102 145 185 225 250 239 179 119 92 66 39 13 -13 -40 -85 -129 -111 -56 -5 46 61 77 89 66 27 -12 -15 -19 -22 -26 -48 -71
8390g1J8N3N5N7N7N6K8rm6m6l1Mj6j6J5J5L6%n3n3l9lJ9J9K1K2L0L0L0L0J1J2J1J2%%l7p3
$$ -71 -53 0 55 112 169 225 253 244 198 152 121 125 109 93 108 123 159 159 106 53 14 11 30 49 70 92 122 152 182 212 223 235 246 258 258 258 221 148
8373A48p7m2mmk5k6k3k3L8P4P5L8mnopk1k2k2k1j3j2j3j2J0J0J3J3j0K5M1M2J6J7J6J7kkL1
$$ 148 71 29 25 21 -4 -30 -53 -76 -38 36 111 149 145 140 134 127 106 84 62 41 28 16 3 -9 1 11 24 37 27 52 93 135 151 168 184 201 199 197 228
8356B28L2k9o5o5k9mlkkk0k0j6j5J8R0J04O9J0k6rql6l6K4K4J7J7m3m3l8l7kkmnnmL3L3L3
$$ 228 260 231 166 101 72 68 65 63 61 41 21 5 -10 8 98 202 271 281 255 246 238 202 166 190 214 231 248 205 162 124 87 85 83 79 74 69 65 98 131 164
8339A64L3mlmlk5k5PPl8j09j06l5M4P9Q1M6mm0n8n7RQO7O9K5K6j0j0K5K5K6K5%%%jlll9l9
$$ 164 197 193 190 186 183 158 133 140 147 109 0 -106 -141 -97 -18 63 109 105 65 7 -50 -41 -33 34 103 128 154 144 134 159 184 210 235 235 235 235 234 231 228 189 150
8321A50j2j2j2j2J4J3k2k2K3K4Q3Q3M2M3j7j7J3J4J3J3OOl0l1k1k1J5J4k7k7k7k8k0k1p5p6
$$ 150 138 126 114 102 116 129 107 85 108 132 215 298 340 383 366 349 362 376 389 402 408 414 384 353 332 311 326 340 313 286 259 231 211 190 115 39
8305C9p0JK1K0L0L1L0L0K4K3j3j2J8J8N3N4J5J5k0k1n2n1j6j6J1J1J1J0l4l4KKj1j2l1MK2
$$ 39 -31 -30 -9 11 41 72 102 132 156 179 166 154 172 190 243 297 312 327 307 286 234 183 167 151 162 173 184 194 160 126 128 130 119 107 76 80 102
8289A02K1j2j2nonoJ1J1J1J1L1L2nmJJJ%j0j0j0j0j8j7J8J8J8J7j9j9mmnmM0M1Jl5k4k4k3
$$ 102 123 111 99 94 88 83 77 88 99 110 121 152 184 179 175 176 177 178 178 168 158 148 138 120 103 121 139 157 174 155 136 132 128 123 119 159 200 201 166 142 118 95
8271I5k4l4KJ8J7ppO4J23J07M7ll9o5o6n2j6MNPPO0N9M5Qm3m3m6m5j7j7j7j7%jl4l3k1J6N5
$$ 95 71 37 39 57 74 67 60 124 247 354 401 398 359 294 228 176 160 164 169 176 183 243 302 347 355 312 269 223 178 161 144 127 110 110 109 75 42 21 37 92
8254I2N5N9O0J9j6o1o1o1o2j9J6L2L2m1m0k4J1J6J7j8n3l7%L6L7J5J6J7J6L1L2rm4n4n4N0
$$ 92 147 206 266 285 269 208 147 86 24 5 21 53 85 44 4 -20 -9 7 24 6 -47 -84 -84 -48 -11 4 20 37 53 84 116 107 63 9 -45 5
8238EN0N0M9M9M9K8K9K8K8opm2m2k6k6J0J0J0J0k5k6m2m2oonmm1m0J6J6P6P6N9N8jjm3m3m2
$$ 5 55 105 154 203 252 280 309 337 365 359 352 310 268 242 216 226 236 246 256 231 205 163 121 115 109 104 100 59 19 35 51 127 203 262 320 319 318 275 232 190
8221A90m3l5l6K5K4klllL7L6%%l2l2l3l2pqK8K9%JL6L7K0K0j6j6k4k3J3J2J3J2k3k4k9k9P
$$ 190 147 112 76 101 125 123 120 117 114 151 187 187 187 155 123 90 58 51 43 71 100 100 101 137 174 194 214 198 182 158 135 148 160 173 185 162 138 109 80 87
8204H7Oj5j6j6j6K0J9J9J9M0L9LMJ1J1J1J0j2j2j2j3KKJKk5k5o2o1m2m3J6J7O4O6L0L0k6k5
$$ 87 93 78 62 46 30 50 69 88 107 147 186 189 193 204 215 226 236 224 212 200 187 189 191 192 194 169 144 82 21 -21 -64 -48 -31 33 99 129 159 133 108
8187A08J0J0lmlmk5k6m6j1J7J7j5j4kL4J4J4j3j3j3j3J6J5J6J6J6J5J6J6K0K1K1K1L5L6L6
$$ 108 118 128 125 121 118 114 89 63 17 6 23 40 25 11 9 43 57 71 58 45 32 19 35 50 66 82 98 113 129 145 165 186 207 228 263 299 335
8171C35L6j3j3j3j3%%%%n7n8l2K9N7N6ll9n2n2n3n2lL3J2J3rrrrqrk9PN8N8M5Rjjmmk1k1k1
$$ 335 371 358 345 332 319 319 319 319 319 262 204 172 201 258 314 311 272 220 168 115 63 60 93 105 118 109 100 91 82 74 65 36 43 101 159 204 213 212 211 207 203 182 161 140
8152A40k1ooK8K7K9qm7m7j8j9lL3O4O3N0J5j6j6j7j8nmo2o2pK8RQmmm1p6o2k6J1J1K8K8K7
$$ 140 119 113 107 135 162 191 183 136 89 71 52 49 82 146 209 259 274 258 242 225 207 202 198 136 74 67 95 104 112 108 104 63 -13 -75 -101 -90 -79 -51 -23 4
8134DK7L0K9K9L0QQk8k7j5j4j4j4j1j0K5K5K9K8K8K9J0J0m8m7j0K7K6rqrj1j1j7j7j6j5rK8
$$ 4 31 61 90 119 149 157 165 137 110 95 81 67 53 42 32 57 82 111 139 167 196 206 216 168 121 111 138 164 155 147 138 127 116 99 82 66 51 42 70
8117G0M2M3M3M3K7qo7o7q6m8K6Q7Q9L0j7j7J5J5j8j8j8j8l5l5JJK3K3N7N7K9pJ4J3qqpqj6
$$ 70 112 155 198 241 268 260 193 126 40 -8 18 105 194 224 207 190 205 220 202 184 166 148 113 78 79 80 103 126 183 240 269 262 276 289 281 273 266 258 242
8100B42j6j5j6nmnnl6l6k0J6M0M0RRL5P1O8L3J2k4o4o4q0m4nmJ3J3J3J4QQM2M2J5k1o0o0k6
$$ 242 226 211 195 190 186 181 176 140 104 84 100 140 180 189 198 233 304 372 405 417 393 329 265 185 141 136 132 145 158 171 185 193 201 243 285 300 279 219 159 133
8083A33k6J0J0L1L1L0L1oppoppopJ1J2J1J2K6K6K5K4j8n3o9rM0Mn7n6k3k3J3J3j3j2j3j3m5
$$ 133 107 117 127 158 189 219 250 244 237 230 224 217 210 204 197 208 220 231 243 269 295 320 344 326 273 204 195 235 239 182 126 103 80 93 106 93 81 68 55 10
8066A0m5m5m6K2K2Q1Q1O6O7OPnmnmMMn5n6l3l3N1Q6O7Qj7j7M1M1M1M1m2m2m2m2llllk2k2k2
$$ 10 -35 -80 -126 -104 -82 -1 80 146 213 219 226 221 217 212 208 212 216 161 105 72 39 90 176 243 251 234 217 258 299 340 381 339 297 255 213 210 207 204 201 179 157 135
8048A35k2kjjjK8K8K8K8k8k9k9k8J0J1J1J1MMMMl8l8kln6n5MMM5M5M2M3qo7l3l4M5M4M4M5
$$ 135 113 111 110 109 108 136 164 192 220 192 163 134 106 116 127 138 149 153 157 161 165 127 89 87 84 28 -27 -23 -19 26 71 113 156 148 81 48 14 59 103 147 192
8030A92J1J2J1J2rqqrJ%JJn7n6n6n6j3j4j4j4qrN2N0O5O5K8K9k4k5k5k5K4K4K4K4L1L0L1L1
$$ 192 203 215 226 238 229 221 213 204 205 205 206 207 150 94 38 -18 -31 -45 -59 -73 -81 -90 -38 12 77 142 170 199 175 150 125 100 124 148 172 196 227 257 288 319
8012C19qqpqmlmlK9L0K9L0j3j3j3j3mlmmn3n3n3n3J6J5J6J6mmmmj0rrrn6n6MML1L1L1L1M5
$$ 319 311 303 296 288 284 281 277 274 303 333 362 392 379 366 353 340 336 333 329 325 272 219 166 113 129 144 160 176 172 168 164 160 150 141 132 123 67 11 15 19 50 81 112 143 188
7993A88M5RJ0l1l2K9K9J8J8J9J8j1j1j1j1MMMLn9n9k3k3K0K1m0l9rrK7K8J7J8J8J8ppppl7
$$ 188 233 242 252 221 189 218 247 265 283 302 320 309 298 287 276 280 284 288 291 232 173 150 127 147 168 128 89 80 71 98 126 143 161 179 197 190 183 176 169 132
7976A32l7l7l7L4L5L4L4K3K4l7l6l2l1MMMMLMllllK6K5K5K6kkjkk3k3k3k4m1m1k4J0J8J8K1
$$ 132 95 58 21 55 90 124 158 181 205 168 132 100 69 73 77 81 85 88 92 89 86 83 80 106 131 156 182 180 178 177 175 152 129 106 82 41 0 -24 -14 4 22 43
7957D3K1k1k1KO3Q4M8j1j2K7K7j0rJ0J0k8o4l7jJ2J2l0k9l0k9poopNMMMj5j5J9K0K4K4K4K4
$$ 43 64 43 22 24 87 171 219 208 196 223 250 240 231 241 251 223 159 122 121 133 145 115 86 56 27 20 14 8 1 6 10 14 18 3 -12 7 27 51 75 99 123
7940A23j4j5JL7L5L6KKl6l6l6l6j1j1NM1O3O4j9n5m5rN2N3M5M6j2j2j3K2L9L8j7j6n2n2r3
$$ 123 109 94 95 132 167 203 205 207 171 135 99 63 52 41 46 87 150 214 195 140 95 86 138 191 236 282 270 258 245 267 306 344 327 311 259 207 114
7924A14r2n1j7%Jj8J9P4P4L8Jj9k0k2k1llllL2L2L2L2M3M3Ll3n4n4m0mM4M3O7L0j6j6j8j8
$$ 114 22 -29 -46 -46 -45 -63 -44 30 104 142 143 124 104 82 61 58 55 52 49 81 113 145 177 220 263 266 233 179 125 85 81 125 168 235 265 249 233 215 197
7907A97llllk8k8K9L0P3L7j5p4o8l2j7J9L2L2j4p4q3m5l5l5k3k3L7L7L0L0K9L0j1j1M9M9M5
$$ 197 194 191 188 185 157 129 158 188 261 298 283 209 141 109 92 111 143 175 161 87 4 -41 -76 -111 -134 -157 -120 -83 -53 -23 6 36 25 14 63 112 157
7891A57M5j5j4j3j2l6r6j12p8j6K0L2lj7j7QPQQKLKLJ7J8J7J8mlmmO2O0K6K5k6k6k7k5qpq
$$ 157 202 187 173 160 148 112 16 -96 -174 -190 -170 -138 -141 -158 -175 -167 -160 -152 -144 -142 -139 -137 -134 -117 -99 -82 -64 -68 -71 -75 -79 -17 43 69 94 68 42 15 -10 -18 -25 -33
7872c3qK4K3K4K4N0N0K6l4n3j8M3M2qrqrM8M7J2J1j6j6p6p6q5q6klN8N7N6N8ononK2K2K2K2
$$ -33 -41 -17 6 30 54 104 154 180 146 93 75 118 160 152 143 135 126 174 221 233 244 228 212 136 60 -25 -111 -113 -116 -58 -1 55 113 107 102 96 91 113 135 157 179
7855A79J4J4o9p0l2l2K9K8P4P3N9K2l8l9m0m1j5j6j6j6k8k9L1L2J6J6J7J6K0J9j7j6%%%%j2
$$ 179 193 207 138 68 36 4 33 61 135 208 267 289 251 212 172 131 116 100 84 68 40 11 42 74 90 106 123 139 159 178 161 145 145 145 145 145 133
7839A33j1j1j1onjkqN2R5O0ml9m2oL8L8K5j1m8m8m8m8l8kJ4J4j8j8J8J8LMLMj9k0L8L8K3j4
$$ 133 122 111 100 94 89 88 86 78 130 225 285 281 242 200 194 232 270 295 284 236 188 140 92 54 52 66 80 62 44 62 80 83 87 90 94 75 55 93 131 154 140
7821A40PPJ1J0k5k5l9l8JL7L5L6KKkkN8R4O5Nk2k1Ll4p0p1m7j1K6K6jl8n3n3k4k5k2k3j1K5
$$ 140 147 154 165 175 150 125 86 48 49 86 121 157 159 161 159 157 215 309 374 379 357 336 339 305 235 164 117 106 132 158 157 119 66 13 -11 -36 -58 -81 -92 -67
7804f7K5j0k8k8RM6L6L6L8L9J5J5J5J5j5j6JL6J8J8l8l7K7O3J8m1n9k4J3J2jjjjN5N5k9k9
$$ -67 -42 -52 -80 -108 -99 -53 -17 19 57 96 111 126 141 156 141 125 126 162 180 198 160 123 150 213 231 190 131 107 120 132 131 130 129 128 183 238 209 180
7787A80n2n2QPL9L8k1k2k5k5J1J1J6J7J7J7j0rm5m6k1k2J4J4N5N5J8J9K8K8qqk2k2l4p0n2
$$ 180 128 76 84 91 130 168 147 125 100 75 86 97 113 130 147 164 154 145 100 54 33 11 25 39 94 149 167 186 214 242 234 226 204 182 148 78 26
7771B6QP9P9rrrrJ5J4k2k1k3k2k2k3KLKKK0J9K0J9o0o0k4k4lmlmpqK8K8PQQQJ3J2J3J2L4L4
$$ 26 34 113 192 183 174 165 156 171 185 163 142 119 97 75 52 54 57 59 61 81 100 120 139 79 19 -5 -29 -32 -36 -39 -43 -50 -58 -30 -2 5 13 21 29 42 54 67 79 113 147
7752A47L3L4L8L8L7L8K9K8n6n5k8k8k7k8j5j6j5j6k5k4J1J1nonnQPM6Q1Q3M7Pl0k3k3k4k5
$$ 147 180 214 252 290 327 365 394 422 366 311 283 255 228 200 185 169 154 138 113 89 100 111 106 100 95 90 98 105 151 232 315 362 369 339 316 293 269 244
7735B44j9j8Kl4n6n7NM0L8L9MNJ5J5L5jm4m4l0OL1L1pm2m4m3j0rl6l6k0J5KKl2l2ooopk2k2
$$ 244 225 207 209 175 119 62 67 107 145 184 188 193 208 223 258 257 213 169 139 145 176 207 200 158 114 71 61 52 16 -20 -40 -25 -23 -21 -53 -85 -91 -97 -103 -110 -132 -154
7717a54J4J4K5K5j1j1kkL4L4M0M1K6j0LMJJk0j9J8N3N9K4RJ0K9K9J4k2k7k7k9k9j5j5K1K0
$$ -154 -140 -126 -101 -76 -87 -98 -100 -102 -68 -34 6 47 73 63 66 70 71 72 52 33 51 104 163 187 196 206 235 264 278 256 229 202 173 144 129 114 135 155
7700A55J5J4kl8p1p1p2p3l6l6ML9O5O5QPJ4J3J4J4K6K6N9N9K3j3k9k9J6J7J7J6K6K5l4p0o2
$$ 155 170 184 182 144 73 2 -70 -143 -179 -215 -211 -172 -107 -42 -34 -27 -13 0 14 28 54 80 139 198 221 208 179 150 166 183 200 216 242 267 233 163 101
7684A01kM6M5K4K4K4K4ppppKKKKpqppNNNONNl0l1l5l5K5K4M5M5M5M5l9m0p5p5l5l4KKRJ0J0
$$ 101 99 145 190 214 238 262 286 279 272 265 258 260 262 264 266 259 251 244 237 242 247 252 258 263 268 238 207 172 137 162 186 231 276 321 366 327 287 212 137 102 68 70 72 81 91 101
7664A01J0L1L2nmn1n1RRj1j1j1j1M6M6J0J0k9k8k9k8M1M2L8L8k3q3j03o7j6J9JKL4L3L3L4
$$ 101 111 142 174 169 165 114 63 72 81 70 59 48 37 83 129 139 149 120 92 63 35 76 118 156 194 171 88 -15 -82 -98 -79 -78 -76 -42 -9 24 58
7648E8L6L6L6L6JJl5l6k6k6k6k6k3k2L6L7N2N2pqm5m5m5m4PPM1M3L7L8m3m3j0M9O9L4k5o1
$$ 58 94 130 166 202 203 204 169 133 107 81 55 29 6 -16 20 57 109 161 154 146 101 56 11 -33 -26 -19 22 65 102 140 97 54 44 93 162 196 171 110
7632A10o1k6kL3P5P5N8N7K2K2J8J7j8j9j3j3KL8K3K3j3j4m7q3r6r7j8J7L3L3L1L1J5k1j9j9
$$ 110 49 23 21 54 129 204 262 319 341 363 381 398 380 361 348 335 337 375 398 421 408 394 347 264 168 71 53 70 103 136 167 198 213 192 173 154
7616A54k1k2J2J1k2k3OM2M2Ol2l2o7o5n7LK9K9K5K5K6K5NOO0O0K4o0r4r4l5%J8J7J8N4O7O8
$$ 154 133 111 123 134 112 89 95 137 179 185 153 121 54 -11 -68 -65 -36 -7 18 43 69 94 99 105 165 225 249 189 95 1 -34 -34 -16 1 19 73 140 208
7600B08K3j3k8k9LKLKLKKLk2k3J4J4K6K6K6K7k4k4k4k4ppopK6K5j2m7n4j8M5Q1M5J0nmj6j7
$$ 208 231 218 190 161 164 166 169 171 174 176 178 181 159 136 150 164 190 216 242 269 245 221 197 173 166 159 153 146 172 197 185 138 84 66 111 192 237 247 242 238 222 205
7582B05l6%K7K8N1J4l2l2l4l4k8k8QQJ5J5J4J5J4J4J4J4j3j3j3j3J4J5J4J4j5j5j4j5K7K8
$$ 205 169 169 196 224 275 289 257 225 191 157 129 101 109 117 132 147 161 176 190 204 218 232 219 206 193 180 194 209 223 237 222 207 193 178 205 233
7566B33J2k5k8k9l0l1RQRRkjl8l7j8j7kL4P6P6L9Ll7l8k3J2L1L1L3L3rrk9PK3K2l5l5KKj2
$$ 233 245 220 192 163 133 102 111 119 128 137 135 134 96 59 41 24 22 56 132 208 247 250 213 175 152 164 195 226 259 292 283 274 245 252 275 297 262 227 229 231 219
7548B19m7n8k2J5J6L6L7K2j2l8kL4L3J1k5nnlmlmk2k3k2k3mmL2L2POMNk2n8n6k0L1O7O8L3
$$ 219 172 114 92 107 123 159 196 218 206 168 166 200 233 244 219 214 209 206 202 199 195 173 150 128 105 101 97 129 161 168 174 178 183 161 103 47 27 58 125 193 226
7530B26nnm1m1J7N3N3J8MNKKn2n3n3n2k4k3k1k0oL0M7M6KJJ8N3M4M5M6M7LLLLk6k5m3m4l7
$$ 226 221 216 175 134 151 204 257 275 279 284 286 288 236 183 130 78 54 31 10 -10 -16 14 61 107 109 110 128 181 225 270 316 363 366 369 372 375 349 324 281 237 200
7513B00l7JL6M4Pn1n1m4pRQJ2J1J2J1J6J7J6J6l0k9OPk4k4ooLKKLl0k9k7k7K0N7L6L6j2j2
$$ 200 163 164 200 244 251 200 149 105 98 107 115 127 138 150 161 177 194 210 226 196 167 173 180 156 132 126 120 123 125 127 130 100 71 44 17 37 94 130 166 154 142
7495A42j6J9J7k0n7n8j9j9l6l5j5K0O0O0R1R0N2J5k3k4m4m3nmnmlkJ8j8n1n0l4l5l1l1NNK0
$$ 142 126 145 162 142 85 27 8 -11 -47 -82 -97 -77 -17 43 134 224 276 291 268 244 200 157 152 148 143 139 136 134 152 134 83 33 -1 -36 -67 -98 -93 -88 -68
7478f8K1L8L8PQPQj2j2MM0N8N9K4K4POk7k7k1J6L1L1M9N0J4J4k3k2n9n8o5o5k6J1M4M5L1m
$$ -68 -47 -9 29 36 44 51 59 47 35 39 79 137 196 220 244 251 257 230 203 182 198 229 260 309 359 373 387 364 342 283 225 160 95 69 80 124 169 200 196
7461A96JKJ7J7J3J3llLL9N6K1l7l7l9l9k8k7l0PL9L9K5j1n2n2j5K1KJj3j4k7k7k7k7J3J3L3
$$ 196 197 199 216 233 246 259 256 253 256 295 351 372 335 298 259 220 192 165 135 142 181 220 245 234 182 130 115 136 138 139 126 112 85 58 31 4 17 30 63
7444F3lmmK9L0N4N4N5K0mmpok9l0k9l0k0k1k1k0J8J9J6J6j8n4l4l4noK6K8K1j5l1l0K1K2K2
$$ 63 60 56 52 81 111 165 219 274 294 290 286 279 273 244 214 185 155 135 114 93 73 91 110 126 142 124 70 36 2 -3 -9 17 45 66 51 20 -10 11 33 55
7427E5K2J8J7J8J7K2K2j4j4qponJ5N2O7L1mm0k3L8P6M1k3n9l3l2l3l3j1K4L9M0OPj0m5p0p0
$$ 55 77 95 112 130 147 169 191 177 163 155 148 142 137 152 204 271 302 298 258 235 273 349 390 367 308 275 243 210 177 166 190 229 269 275 282 272 227 157 87
7410H7j0K5K5j1k2k1jL6N2N1J6J7J6J6n0n1n0n0m2m0k6J0J9J9K2K1K2K2K2K1K8K8rqJ0J0P
$$ 87 77 102 127 116 94 73 72 108 160 211 227 244 260 276 226 175 125 75 33 -7 -33 -23 -4 15 37 58 80 102 124 145 173 201 192 184 194 204 211
7394B11Qj4n1o2o2JO1O0O1Pk9qqK4K4K3K2Ll4l3LO2O3K5j1l1l2l3l4k4k4L4L4L5%m0m1j6j6
$$ 211 219 205 154 92 30 31 92 152 213 220 191 183 175 199 223 246 268 271 237 204 207 269 332 357 346 315 283 250 216 192 168 202 236 271 271 231 190 174 158
7377A58J8J7kl8j8j8j5j6j6j5nnJ1M7L5L6L7L8M9N0J0k6n3n3n3n3QM5K4K4J7J7J8J7l1l0l1
$$ 158 176 193 191 153 135 117 102 86 70 55 50 45 56 103 138 174 211 249 298 348 358 332 279 226 173 120 128 173 197 221 238 255 273 290 259 229 198
7361A98l0m1m0K1N7O7L1ooLLn9r4p0l3k0k0JKJJj5j6j5j6K2K1K1K1nnN4N5K2K3l8l8k8k8k6
$$ 198 168 127 87 108 165 232 263 257 251 254 257 198 104 34 1 -19 -39 -38 -36 -35 -34 -49 -65 -80 -96 -74 -53 -32 -11 -16 -21 33 88 110 133 95 57 29 1 -25
7344b5k8l0k9k9l0K1K0N7N6O0O1JJL6L5L5L6l8l7l7l7L6L6L6L6M3M3j7j8n0n1n1n0k2k1J4
$$ -25 -53 -83 -112 -141 -171 -150 -130 -73 -17 43 104 105 106 142 177 212 248 210 173 136 99 135 171 207 243 286 329 312 294 244 193 142 92 70 49 63
7328F3J4j4j4K2K2K2K3K2K3M4M3QQk2k3k3k3K3K3K3K3k0k0j9k0k5k5J1J1j3j2K4K3J8J8m2
$$ 63 77 63 49 71 93 115 138 160 183 227 270 278 286 264 241 218 195 218 241 264 287 267 247 228 208 183 158 169 180 167 155 179 202 220 238 196
7312A96m1l5l6JJK3K2K3K2K0J9m0m1k9k9l0k9lkL3L3J8J8J8J8n0n1n0n0n7n6LMM4M5M5M3p
$$ 196 155 120 84 85 86 109 131 154 176 196 215 175 134 105 76 46 17 14 12 45 78 96 114 132 150 100 49 -1 -51 -108 -164 -161 -157 -113 -68 -23 20 13
7296A3opok0j9M0L9L6L5L5L6OOj4K2M0M0OOl7l6l7l6k6k6k6k6PPPPKJJJj9k0k0j8k6k6k6k6
$$ 13 7 0 -6 -26 -45 -5 34 70 105 140 176 182 188 174 196 236 276 282 288 251 215 178 142 116 90 64 38 45 52 59 66 68 69 70 71 52 32 12 -6 -32 -58 -84 -110
7277a10nmL5P1O9P0J2J3J6J7J5J4k5o2o2k6J5J4J7J7J0J0J0J0%jl6l6j7j6J9K0K3K4M4Rj1
$$ -110 -115 -119 -84 -13 56 126 138 151 167 184 199 213 188 126 64 38 53 67 84 101 111 121 131 141 141 140 104 68 51 35 54 74 97 121 165 174 163
7261A63j1LL9M5M6J1J2J3J4J3J3l4l3l4l4k1k1k1k2K9K8K6l4p7p7p6p8qN2P4P5M9J4j%kL5
$$ 163 152 155 194 239 285 296 308 321 335 348 361 327 294 260 226 205 184 163 141 170 198 224 190 113 36 -40 -118 -126 -74 0 75 124 138 137 137 135 170
7245A70M7M8Jl4p2p2m6j0L3P0L8L9m3m3p3p3p3p4k7k7L2L3M9N0N0M8J9J8J9J8j5j6M5M4J5
$$ 170 217 265 266 232 160 88 42 32 65 135 173 212 169 126 53 -20 -93 -167 -194 -221 -189 -156 -107 -57 -7 41 60 78 97 115 100 84 129 173 188
7230A88J4J5J4MMMMqqr2r2k6k6RJ0L0L0L1L0K4K3j2j3ppM8M9L0l0q0q0n6n4K8K8K1K1l9l8
$$ 188 202 217 231 235 239 243 247 239 231 139 47 21 -5 4 14 44 74 105 135 159 182 170 157 150 143 191 240 270 240 160 80 24 -30 -2 26 47 68 29 -9
7213iMML8M0nnnnm7m6m6m7K4K5K4K5L5L7k3k2j6j6M2M4N5N5J9K0J6J6J6J7j7j6j7j6RRM4M5
$$ -9 -5 -1 37 77 72 67 62 57 10 -36 -82 -129 -105 -80 -56 -31 4 41 18 -4 -20 -36 6 50 105 160 179 199 215 231 247 264 247 231 214 198 207 216 260 305
7196C05QQp6p6m8m9m4m4j9L9Q6Q7J8m1o4k8j2j2rj0J0J1k6k4j4j4J9J9k3n9n9k3J7J6N2N2
$$ 305 313 321 245 169 121 72 28 -16 -35 4 90 177 195 154 90 62 50 38 29 19 29 40 14 -10 -24 -38 -19 0 -23 -82 -141 -164 -147 -131 -79 -27
7180b7N8K3j6j7jj%jJ0J0J1J0ONNOjkl4l5rK6QRK3O0L6k2l9l9J7J7mmmmQQPQj7j7j7j7MNM0
$$ -27 31 54 38 21 20 19 19 18 28 38 49 59 65 70 75 81 80 78 44 9 0 26 34 43 66 126 162 140 101 62 79 96 92 88 84 80 88 96 103 111 94 77 60 43 47 52 92
7160I2M0N2N1J4k1j2K4K1j4l1l1l3l3l7l7LL9M0M0OPnmo2o2m7j2K7K7K3K3j4j3l0l1ONL0L0
$$ 92 132 184 235 249 228 216 240 261 247 216 185 152 119 82 45 48 87 127 167 173 180 175 171 109 47 0 -12 15 42 65 88 74 61 31 0 6 11 41 71
7143G1L0L0K9L0N0J4k7k8l0k9llllj0j0j0j0L3L3L0L1J0k5l9l9l6jJ5J6J5J6k0k0j3j3j3j2
$$ 71 101 131 160 190 240 254 227 199 169 140 137 134 131 128 118 108 98 88 121 154 184 215 225 200 161 122 86 85 100 116 131 147 127 107 94 81 68 56
7126E6%%LKJ7N3O6O6L0pk3k2n9n9n9n9J%%Jj4j4j5j4K4K3K5K6M2P9P5M1k1n5l6l6MM1K0K1
$$ 56 56 56 59 61 78 131 197 263 293 286 263 241 182 123 64 5 6 6 6 7 -7 -21 -36 -50 -26 -3 22 48 90 169 244 285 264 209 173 137 141 182 202 223
7109B23K4K5K5K5k2k3J2J1%l6j6j6pppoJJJJL0L1L0L0LLL9L9K0K0j5j6j8j9kL3N1N1L8Kon
$$ 223 247 272 297 322 300 277 289 300 300 264 248 232 225 218 211 205 206 207 208 209 239 270 300 330 333 336 375 414 434 454 439 423 405 386 384 417 468 519 557 559 553 548
7091E48k4n9p0p0j1K6J9j7n4n4m7m7j0j1J1J1K9po1r6o2k7LLM0M0N6N6K0K0j7j7n1n0l1MJ8
$$ 548 524 465 395 325 314 340 359 342 288 234 187 140 130 119 130 141 170 163 102 6 -56 -83 -80 -77 -37 3 59 115 135 155 138 121 70 20 -11 -7 11
7075A1K0J2J2M8M8M3M3P6P6L8k1o9o9m0mL6L6J9J8J%MLl4p0p7m1k7k7o3o2kL4J2k5l7l8j5
$$ 11 31 43 55 103 151 194 237 313 389 427 406 337 268 228 224 260 296 315 333 334 334 338 341 307 237 160 119 92 65 2 -60 -62 -28 -16 -41 -78 -116 -131
7058a31j4j2j3K4N9M0L9M3M5O5K9m5m4MO3O0O0K4j1n1n0l5l5LLj6j5m0m1k4J2J3J5%jl6l7
$$ -131 -145 -157 -170 -146 -87 -47 -8 35 80 145 174 129 85 89 152 212 272 296 285 234 184 149 114 117 120 104 89 49 8 -16 -4 9 24 24 23 -13 -50
7042e0j8J7K4N9P4P5K2l7o3o4m6m7k2L9N6N6M1M0N0J4k6k6k0j9l6l5l7jJ5J5%j%%L2L3L2L3
$$ -50 -68 -51 -27 32 106 181 203 166 103 39 -7 -54 -76 -37 19 75 116 156 206 220 194 168 148 129 93 58 21 20 35 50 50 49 49 49 81 114 146 179
7026A79LMl3l2m8m8k9l0KLK0J9L1L2nmM2M1M2M1O7O8L1L1l6l6n4n4o4o4m6m6j2j1OPJ0J1k5
$$ 179 182 186 153 121 73 25 -4 -34 -32 -29 -9 10 41 73 68 64 106 147 189 230 297 365 396 427 391 355 301 247 183 119 73 27 15 4 10 17 27 38 13
7009A3k4J6J6N2N2J5J6k0k0pok5k5j5j5M4M5j1j0o7o5n4NN6N5K6K6QPnoJ3J2M0M0P2P2M0k1
$$ 13 -11 5 21 73 125 140 156 136 116 109 103 78 53 38 23 67 112 101 91 24 -41 -95 -90 -34 21 47 73 81 88 83 77 90 102 142 182 254 326 366 345
6992C45m6m7j2j3j2j3OOl0l0j2j3K4K3K5K4j1j1p1p1j2j1K7K8rqk7k8L3L2M0L9k1k0J1J1J1
$$ 345 299 252 240 227 215 202 208 214 184 154 142 129 153 176 201 225 214 203 132 61 49 38 65 93 84 76 49 21 54 86 126 165 144 124 135 146 157
6976A57J1J2J2oom2m2j6M4P0P1K5l6o5o5n1n1J8J8J8J8nom1m2j3j4K1K0J5J4J5J4j0j0j1j0
$$ 157 168 180 192 186 180 138 96 80 124 194 265 290 254 189 124 73 22 40 58 76 94 89 83 42 0 -13 -27 -6 14 29 43 58 72 62 52 41 31
6960C1RRQRj2j2j2j2PQPQK6K6K6K6J4J3k2k3j7j7j7j7K0K1K0K0oopoK9K9L0K9J5J4k1k2LM
$$ 31 40 49 57 66 54 42 30 18 25 33 40 48 74 100 126 152 166 179 157 134 117 100 83 66 86 107 127 147 141 135 128 122 151 180 210 239 254 268 247 225 228 232
6942B32l3l3m3m4M1M0L9L9LLk0k0M0L9k1k2k2k2m5m5m5m5ppopL7L8L8L8L5L5L6L5K2K3j3j4
$$ 232 199 166 123 79 120 160 199 238 241 244 224 204 244 283 262 240 218 196 151 106 61 16 9 2 -4 -11 26 64 102 140 175 210 246 281 303 326 313 299
6925B99l6l7l6l7LKKLl2l1NML3L3L3L3M5M5J0Rl3l3l3l4N0M9N0N0kjjkj4j4j5j4k3k4n7n7
$$ 299 263 226 190 153 156 158 160 163 131 100 105 109 142 175 208 241 286 331 341 350 317 284 251 217 267 316 366 416 414 413 412 410 396 382 367 353 330 306 249 192
6908A92j7J8N6N5M3Pl2l3opppL3L2L2L2PPk9k8m0l9k6J0L2nm0m0j4K2KKJ4J5jl6l8l7mmK6
$$ 192 175 193 249 304 347 354 322 289 283 276 269 262 295 327 359 391 398 405 376 348 308 269 243 253 285 280 240 200 186 208 210 212 226 241 240 204 166 129 125 121 147
6890A47K6K6K7rqK8O3L6k3p0o9n6k0nmJ8J9Ll3k2k2J2J2J0J0k4k4nL2J1J1k0k1J6J5P0P0N5
$$ 147 173 199 226 217 209 237 300 336 313 243 174 118 98 93 89 107 126 129 96 74 52 64 76 86 96 72 48 43 75 86 97 77 56 72 87 157 227 282
6874B82J8%Jkkl1l1l1l1k8k8k9k8k8k7j1K3O5O5N1J6MLl4l4l7l8j4n1p5m1%L6L3L2L3L5j2
$$ 282 300 300 301 299 297 266 235 204 173 145 117 88 60 32 5 -6 17 82 147 198 214 218 221 187 153 116 78 64 13 -62 -103 -103 -67 -34 -2 31 66 54
6857E4j1j1j1JJJJONM2M1K0J9j7j7K1K1K0K1j2j2j2j3NNNNrj0K5K4L1mk0k0ONL9L9O0K3j6
$$ 54 43 32 21 22 23 24 25 31 36 78 119 139 158 141 124 145 166 186 207 195 183 171 158 163 168 173 178 169 159 184 208 239 235 215 195 201 206 245 284 344 367 351
6839C51j6J3J4%l6m9j3j6n1r3r4m4J4O4O4O6O6O3K8j2j2poJ4k2m6m5J1J2L5L5L3L2Ml1l2M
$$ 351 335 348 362 362 326 277 264 248 197 104 10 -34 -20 44 108 174 240 303 331 319 307 300 294 308 286 240 195 206 218 253 288 321 353 357 326 294 298
6823B98K6K7K9K9l6l6l5l6j2j2j3j2k6k7j0K5J4J5J6J6j5j5jL4L3lm1m0k5k4k3k2J1M6K7K6
$$ 298 324 351 380 409 373 337 302 266 254 242 229 217 191 164 154 179 193 208 224 240 225 210 209 243 276 273 232 192 167 143 120 98 109 155 182 208
6807B08J2J2J3J2MMl2o7m0J9O8O8j3j3K4O1N7K2PORk6o5o4l9nJ2J2m5m6m5m5k0k0J9N6O5O5
$$ 208 220 232 245 257 261 265 233 166 126 145 213 281 268 255 279 340 397 419 426 432 441 415 350 286 247 242 254 266 221 175 130 85 65 45 64 120 185 250
6791B50O5O5M5Ql2o8q1m4ppk2k1J7N2L3kj6j6rqrrj1j1j1j1k3k3k3k3m8n0l4KK9K9L1L1LL
$$ 250 315 380 425 433 401 333 252 208 201 194 172 151 168 220 253 251 235 219 210 202 193 184 173 162 151 140 117 94 71 48 0 -50 -84 -82 -53 -24 7 38 41 44
6774D4l0l0j9J6J9j7l0OM3M3J1J0J0J0K3K3K3K3j9k0j9j9n3n1p0l4OM2P9P9K2l8k5J1opnm
$$ 44 14 -16 -35 -19 0 -17 -47 -41 2 45 56 66 76 86 109 132 155 178 159 139 120 101 48 -3 -73 -107 -101 -59 20 99 121 83 58 69 63 56 51 47
6757D7QQQQM6M6J0J1J5J5J6J5k1k2k1k1J4J3J4J4L6L5mm0o4o3k9l0JJJJl0k9k9k9LLLLJ2J2
$$ 47 55 63 71 79 125 171 181 192 207 222 238 253 232 210 189 168 182 195 209 223 259 294 290 250 186 123 94 64 65 66 67 68 38 9 -20 -49 -46 -43 -40 -37 -25 -13
6739a3J2J1k1k3k3k3N3N1Q8Q8N2N1pqrqrrl7l7kjN5N5j6p6r3n7j7J9K7K8L0K9N5N4N4N4k4
$$ -13 -1 10 -11 -34 -57 -80 -27 24 112 200 252 303 296 288 279 271 262 253 216 179 177 176 231 286 270 194 101 44 27 46 73 101 131 160 215 269 323 377 353
6722C53k5o0o0n0n0n0m9kjjjjkj%l0l1k6k7j1M9P5P4M5M5QRjj%jl2l2l2l3k3k3L6L6N2N1r
$$ 353 328 268 208 158 108 58 9 7 6 5 4 3 1 0 0 -30 -61 -87 -114 -125 -76 -1 73 118 163 171 180 179 178 178 177 145 113 81 48 25 2 38 74 126 177 168
6704A68qJ3J3J4J3j2j1j2j1m0m1m0m0L3L2L2L3%JN7N7j4p4m1m0j5j4M5M5L2L2mmj8j9j8j9
$$ 168 160 173 186 200 213 201 190 178 167 127 86 46 6 39 71 103 136 136 137 194 251 237 163 122 82 67 53 98 143 175 207 203 199 181 162 144 125
6688A25J6J6N2N2J3J3J3J3LKl3l3j5j5j5j5K8K7K8K8m6m6m5m6j9j9M1M1K6K6j0j0L2L1mml0
$$ 125 141 157 209 261 274 287 300 313 316 318 285 252 237 222 207 192 220 247 275 303 257 211 166 120 101 82 123 164 190 216 206 196 228 259 255 251 221
6672B21l0o2o1JQ4J13P7J0n0n1n1jN8M3Pn6r3n8k3j7j6j5j4M4M4QRJKJK%%%%RRRRJ0J0RJ0
$$ 221 191 129 68 69 153 266 343 353 303 252 201 200 258 301 308 252 159 101 78 61 45 30 16 60 104 112 121 122 124 125 127 127 127 127 127 136 145 154 163 173 183 192 202
6653B02L0L0opklllm7m8m7m8K8K8O4O4ppK9K9qqo8o8l1l1NNK9L0K7K7j3m9o2lO2O3POPQPP
$$ 202 232 262 256 249 247 244 241 238 191 143 96 48 76 104 168 232 225 218 247 276 268 260 192 124 93 62 67 72 101 131 158 185 172 123 61 58 120 183 190 196 203 211 218 225
6634B25ppqpk7k8N6N7K0K1K1K1K3K3j5j5p6j12o6nK5K5l2l1j4j3j4j4l7l9K2K1O0O0K5K5j4
$$ 225 218 211 203 196 169 141 197 254 274 295 316 337 360 383 368 353 277 165 99 94 119 144 112 81 67 54 40 26 -11 -50 -28 -7 53 113 138 163 149
6618A49j4j5j4M7M7M7M7KKn8n7k8k7QRJ7J7J8J7L0L1L0L0l6l6l7l6k2k3J4J4M2M2j8j8j6j6
$$ 149 135 120 106 153 200 247 294 296 298 240 183 155 128 136 145 162 179 197 214 244 275 305 335 299 263 226 190 168 145 159 173 215 257 239 221 205 189
6602A89j7j6m0m0nmONOOJ8J8j7j8o4o4j7M3N1J5MLL1L1L1L1L8L8KKj6j6n2n1l3l2K8K7L5L5
$$ 189 172 156 116 76 71 67 73 78 84 90 108 126 109 91 27 -37 -54 -11 40 55 59 62 93 124 155 186 224 262 264 266 250 234 182 131 98 66 94 121 156 191
6585A91k4k5k1k1L9L9N8N8N8N8K1K0l9l9k6k5k6k5j4j4j3j4ooo5j02o9JM2M2J2J2J1J2J3J2
$$ 191 167 142 121 100 139 178 236 294 352 410 431 451 412 373 347 322 296 271 257 243 230 216 210 204 139 37 -32 -31 11 53 65 77 88 100 113 125
6569A25k3k4m3m2ppk9k9PPP6P7P7P7MMNMKKKLPPk8k9k6k6k6k6L1L1nnm7m7m7m6J6J7N3N3M
$$ 125 102 78 35 -7 -14 -21 -50 -79 -72 -65 11 88 165 242 246 250 255 259 261 263 265 268 275 282 254 225 199 173 147 121 152 183 178 173 126 79 32 -14 2 19 72 125 129
6550A29LMML3L3L3L3llllj8j8j7j8pppoK0K0K0K0KJKKKJKKL0L1L0L1k4k4k4k4l7l7kjm2m3
$$ 129 132 136 140 173 206 239 272 269 266 263 260 242 224 207 189 182 175 168 162 182 202 222 242 244 245 247 249 251 252 254 256 286 317 347 378 354 330 306 282 245 208 206 205 163 120
6531A20m2m3LKLKNNNMl3l2JLJ5J6J5J5OOONK0J9j6j6p4p2n2j7J1J0k9k9l3l4J3M8P4P4P3P4
$$ 120 78 35 38 40 43 45 50 55 60 64 31 -1 0 3 18 34 49 64 70 76 82 87 107 126 110 94 20 -52 -104 -121 -110 -100 -129 -158 -191 -225 -212 -164 -90 -16 57 131
6513A31R1N6mo4q7q7l4KM0M0j%PPK8rk3k3NNl0k9k0J7J7J7k0k0NM1P3P3N7K2l9p5q7q7k3k4
$$ 131 222 278 274 210 123 36 2 4 44 84 83 83 90 97 125 116 93 70 75 80 50 21 1 18 35 52 32 12 17 58 131 204 261 283 244 169 82 -5 -28 -52
6495e2llM8M8L1mmmpm2m1oK9K9j1rm0m1j9J7N8N6L8KJ0J0K7O3O2K6k8k7qK8L7L8L3L2l3r4
$$ -52 -55 -58 -10 38 69 65 61 57 50 8 -33 -39 -10 19 8 -1 -41 -82 -101 -84 -26 30 68 70 80 90 117 180 242 268 240 213 205 233 270 308 341 373 340 246
6478B46r6o0NOnmmnJ8J7J7J8KLKLj0rrropk4k4k7k8LKL7L7J5k1m0m1K3K3J%m1m0MNM5M7J0
$$ 246 150 90 95 101 96 92 88 83 101 118 135 153 155 158 160 163 153 144 135 126 120 113 89 65 38 10 13 15 52 89 104 83 43 2 25 48 49 49 8 -32 -28 -23 22 69 79
6458G9J1k0k0QPPQN8N9MNklK8K7MLj4j5k0k0kll4l5l4l5J2J2J2J2J6J6J7J6llllj3j3J6J7
$$ 79 90 70 50 58 65 72 80 138 197 201 206 204 201 229 256 260 263 249 234 214 194 192 189 155 120 86 51 63 75 87 99 115 131 148 164 161 158 155 152 139 126 142 159
6440A59L5L5poppL5L6nnl4l5JJM4M3k8k8j0rl3l2l2l2m2m1m2m2M5M3M5M5j3j3j4j3ONL6L5
$$ 159 194 229 222 216 209 202 237 273 268 263 229 194 195 196 240 283 255 227 217 208 175 143 111 79 37 -4 -46 -88 -43 0 45 90 77 64 50 37 43 48 84 119
6422A19N9N9NNj3j3m2m3m8m8j9j8M0L9M0M0KJL2L2L7L7QPj7j8M8Q3O1j1q2q2r2r1n5n5j5j5
$$ 119 178 237 242 247 234 221 179 136 88 40 21 3 43 82 122 162 164 165 197 229 266 303 311 318 301 283 331 414 475 464 382 300 208 117 62 7 -8 -23
6406b3KKj4j4K2K2L9M1k0j9J9J9N5R1Q0K1k8k7j2j2l0l0opooK2K2j4j4L6L5%%j1j0j1j0mm
$$ -23 -21 -19 -33 -47 -25 -3 36 77 57 38 57 76 131 222 302 323 295 268 256 244 214 184 178 171 165 159 181 203 189 175 211 246 246 246 235 225 214 204 200 196
6389A96L2L3J8J8m1m2m0m1nnN9N9O0N9m1m2p7p7l0l1l0l1l4l5M9M8mmlmK1K1N4N3O6Om4m4
$$ 196 228 261 279 297 256 214 174 133 128 123 182 241 301 360 319 277 200 123 93 62 32 1 -33 -68 -19 29 25 21 18 14 35 56 110 163 229 235 191 147
6372A47n5n5n4n5J2J2J2J1L2L3L3L3K9K9K9K8RQQQj9j8j8j8m1m1nnK8K7rrK4K5M2M3k7k6k6
$$ 147 92 37 -17 -72 -60 -48 -36 -25 7 40 73 106 135 164 193 221 230 238 246 254 235 217 199 181 140 99 94 89 117 144 135 126 150 175 217 260 233 207 181
6355A81k7nnm1m1J5J4J4J5MMl1l2J8J7j%m2m1RO9R4R4M7j2m1m2rrk3k2n5n5k8L1N5J8qqN0
$$ 181 154 149 144 103 62 77 91 105 120 124 128 97 65 83 100 99 99 57 16 25 94 188 282 329 317 276 234 225 216 193 171 116 61 33 64 119 137 129 121 171
6338A71N0L2L2mmp4p4l8l8J7J8%jj5j6O8O7N2N1J5J5J7J8m3m2j4j4M6M6JKl4l4m3m4m3m3%
$$ 171 221 253 285 281 277 203 129 91 53 70 88 88 87 72 56 124 191 243 294 309 324 341 359 316 274 260 246 292 338 339 341 307 273 230 186 143 100 100
6321A00jj%qrqrK5K4M2M3M3M4j6j6j7j7l5l5m7m8j2j2%jJ8J7P0P0L4L4l2l2j4j5J3J2J3J2
$$ 100 99 98 98 90 81 73 64 89 113 155 198 241 285 269 253 236 219 184 149 102 54 42 30 30 29 47 64 134 204 238 272 240 208 194 179 192 204 217 229
6305B29o2o3o2o1lmllJ6J6N1N3LMMMj3j4l1l1k2k1J4J4L4L4J6J6j9j9kjMMK2K1J5J4k1k2P
$$ 229 167 104 42 -19 -22 -26 -29 -32 -16 0 51 104 107 111 115 119 106 92 61 30 8 -13 1 15 49 83 99 115 96 77 75 74 78 82 104 125 140 154 133 111 118
6287A18PM3M3K2K2j3j4k5k4J1J2RRk6k7rqrqJ2J2ooJ8J7j8j8mnL2L2rqrqopoopqpqNNj3j3
$$ 118 125 168 211 233 255 242 228 203 179 190 202 211 220 194 167 158 150 141 133 145 157 151 145 163 180 162 144 140 135 167 199 190 182 173 165 159 152 146 140 133 125 118 110 115 120 107 94
6266I4m1m2onO1O1M3M4k5k6L5L5K8K8n5n6j9j9J6J7L3L4lkJ2J3L0L1k1k1mlK3K4j3j2j1j0
$$ 94 53 11 5 0 61 122 165 209 184 158 193 228 256 284 229 173 154 135 151 168 201 235 232 230 242 255 285 316 295 274 270 267 290 314 301 289 278 268
6250B68k8k9ONl0l1k0k1J6J5J7J7m3m3klL3L4K0K1j6j6k2k2J4J3J3J4J3J3PQk9o4l2K8P6P6
$$ 268 240 211 217 222 192 161 141 120 136 151 168 185 142 99 97 94 127 161 181 202 186 170 148 126 140 153 166 180 193 206 213 221 192 128 96 124 200 276
6233B76J9K0m0m0n0n1j5j4L2L3L2L3l1l1NNM6M6J0J1nmL2L1j0rj0rj7j6J9J9j5j6j6j6ONN
$$ 276 295 315 275 235 185 134 119 105 137 170 202 235 204 173 178 183 229 275 285 296 291 287 319 350 340 331 321 312 295 279 298 317 302 286 270 254 260 265 270
6217B70Nm0l9m0m0k2k3k3k2l1l2l1l2M2M2M1M2M2M2M2M2j4j4j5j4OOl0l0kllkJ0J0J0J0k5
$$ 270 275 235 196 156 116 94 71 48 26 -5 -37 -68 -100 -58 -16 25 67 109 151 193 235 221 207 192 178 184 190 160 130 128 125 122 120 130 140 150 160 135
6200A35k4k4k4ppppQRM4M4opm2m2MNNMLKLKJ4J5J5J4KKKKN8N8L1k8o1o2k9l0L9L8L9L8J3J2
$$ 135 111 87 63 56 49 42 35 43 52 96 140 134 127 85 43 47 52 57 61 64 66 69 71 85 100 115 129 131 133 135 137 195 253 284 256 195 133 104 74 113 151 190 228 241 253
6181B53k3k4k7k7RRn8n8n6n6J0M5O0Jm5j0N1N0QQQQl8l9l8K1M7J1%jK7K7rrj4j5K1K2K4K4
$$ 253 230 206 179 152 161 170 112 54 -2 -58 -48 -3 57 58 13 3 54 104 112 120 128 136 98 59 21 42 89 100 100 99 126 153 144 135 121 106 127 149 173 197
6163A97Q1Q0O1Kk5k4j6j6j5j6l1l1MNj6j7n2n2m3m2m2m3J8J8J7J7J6J6J5J6J%JJJ9K0K0K0
$$ 197 278 358 419 421 396 372 356 340 325 309 278 247 251 256 240 223 171 119 76 34 -8 -51 -33 -15 2 19 35 51 66 82 83 83 84 85 104 124 144 164
6147A64j0j1m3m4q2m7OO7P5P6lml3l2l3l3J6J5J5J6L3L3O9P0k6k6k6k6%jjjl5l4K5K5L8L8
$$ 164 154 143 100 56 -26 -73 -67 0 75 151 148 144 111 79 46 13 29 44 59 75 108 141 210 280 254 228 202 176 176 175 174 173 138 104 129 154 192 230
6130B30L5L6J8j8n6n6n5j9M1M2J2k4k4J2L6L7Jl5l5JL9L8j9j9k0j9l1l1l0l1j3j3j2j3kkL6
$$ 230 265 301 319 301 245 189 134 115 156 198 210 186 162 174 210 247 248 213 178 179 218 256 237 218 198 179 148 117 87 56 43 30 18 5 3 1 37
6114C7P2N5K0MMj2m9m6j0J5N1O6O7M2OLM0N4J8MNj9j9j8j9KKl4l4l5l4l5l4n5n4p3l8J8J9
$$ 37 109 164 184 188 192 180 131 85 75 90 141 207 274 316 322 325 365 419 437 441 446 427 408 390 371 373 375 341 307 272 238 203 169 114 60 -13 -51 -33 -14
6097a4J9K1K2K3N6N6O5K9J3J3j3j4n0n0j7j7j7j6J9K0K0K0J1J1J1J1j8j8j8j8kjl7l8l0l1
$$ -14 5 26 48 71 127 183 248 277 290 303 290 276 226 176 159 142 125 109 128 148 168 188 199 210 221 232 214 196 178 160 158 157 120 82 52 21
6082B1L1O7O2K7J2J3N0N0J4J3j3j3j3j3pqqpmmlmk3k2L7L7MMLMl1l0l1l1j6j5j6j6j4j5j4
$$ 21 52 119 181 208 220 233 283 333 347 360 347 334 321 308 301 293 285 278 274 270 267 263 240 218 255 292 296 300 303 307 276 246 215 184 168 153 137 121 107 92 78
6064G8j5J9J8J8J9k4k3k3k4K4K3j2j2L0K9L0L0l2l2MNoonoj7j6J9J9jjl6l7nnonrqrrL2L4
$$ 78 63 82 100 118 137 113 90 67 43 67 90 78 66 96 125 155 185 153 121 125 130 124 118 113 107 90 74 93 112 111 110 74 37 32 27 21 16 7 -1 -10 -19 13 47
6045D7L4L3J8J9j8j8nnL1L1K0K1j6j6k6k6k6k6J0J0J0J0K2K1K1K2K9L0l1l0l8l8kkRJ0RRp
$$ 47 81 114 132 151 133 115 110 105 136 167 187 208 192 176 150 124 98 72 82 92 102 112 134 155 176 198 227 257 226 196 158 120 118 116 125 135 144 153 146
6028A46pqpj7j8J9J8LMLMj3j2p2p2n9n8k3k3K4K3K4K4J1J2K5O1O5K9j0m6l0OK0J9k8k8kN8
$$ 146 139 131 124 107 89 108 126 129 133 136 140 127 115 43 -29 -88 -146 -169 -192 -168 -145 -121 -97 -86 -74 -49 12 77 106 96 50 20 26 46 65 37 9 7 65
6011F5O4O4L0K9ml9m0mL5L4K1j5k4k4k6k6POk9k9nnnnJ4J4jl7l2l1K6K6L9L9L9L9L3L3llk5
$$ 65 129 193 223 252 248 209 169 165 200 234 255 240 216 192 166 140 147 153 124 95 90 85 80 75 89 103 102 65 33 2 28 54 93 132 171 210 243 276 273 270 245
5994B45k6k5k5%%L4L4K7qp1p2n8n8j8J7K3K5K5K4K8qk4k4qqooL8P3M0Lj2K3L6L7K1K1N3N3
$$ 245 219 194 169 169 169 203 237 264 256 185 113 55 -3 -21 -4 19 44 69 93 121 113 89 65 57 49 43 37 75 148 188 191 179 202 238 275 296 317 370 423
5977D23L6k4r4r4p7j8L3L3J5J5J6J5J0J0J0J0j1j1j1j1j5j5j5j5L2L2mlk6k6k6k5NNM1M0N4
$$ 423 459 435 341 247 170 152 185 218 233 248 264 279 289 299 309 319 308 297 286 275 260 245 230 215 247 279 275 272 246 220 194 169 174 179 220 260 314
5961C14N4K8l2p8p8k2k2J0J0rqJ4J3J4J3k1k0l9l9L1L2nmKLJ7J8l9p6o8rO6J02O9L4NNLLK1
$$ 314 368 396 364 286 208 186 164 174 184 175 167 181 194 208 221 200 180 141 102 133 165 160 156 158 161 178 196 157 81 13 4 70 172 241 275 280 285 288 291 312
5943C12K2l9l8oooom1m1n9o0o3o4M4M3P6P7ppk4k4k4k4o9p1j0j1M7M6K9K7L0L0K9L0M1M2N6
$$ 312 334 295 257 251 245 239 233 192 151 92 32 -31 -95 -51 -8 68 145 138 131 107 83 59 35 -34 -105 -115 -126 -79 -33 -4 23 53 83 112 142 183 225 281
5927B81N5K0m0o6o6J6J5N2N2J3J4m6m6k3k3L6L7ONONK3K2j3j3noL1L0r4r4r4r3OPM4M3J5J4
$$ 281 336 356 316 250 184 200 215 267 319 332 346 300 254 231 208 244 281 287 292 298 303 326 348 335 322 317 311 342 372 278 184 90 -3 3 10 54 97 112 126
5910A26lmopK9L0jjjjLLLLK8K7K8K8j6j7n2n2q3q1%Q3J15P9Rn2n7k1J8N5N2N1K8l2r0r0o8
$$ 126 123 119 113 106 135 165 164 163 162 161 164 167 170 173 201 228 256 284 268 251 199 147 64 -17 -17 66 181 260 269 217 160 139 157 212 264 315 343 311 221 131 63
5892F3qK4K3rqk0j9O5O4j3j3m9m9l7l7K3K1N8N7M0M0j4j3m9m9L7L6L6L6M7M7M7M6j9k0n6n6
$$ 63 55 79 102 93 85 65 46 111 175 162 149 100 51 14 -23 0 21 79 136 176 216 202 189 140 91 128 164 200 236 283 330 377 423 404 384 328 272
5876B72p4p4l9l8L4L4Q6N1mo4p0l4llL6L5L1L1n3n3JJL7L7k6k5J0J0P0O9L2L1k8o5m4J6M4
$$ 272 198 124 85 47 81 115 201 252 248 184 114 80 77 74 110 145 176 207 154 101 102 103 140 177 151 126 136 146 216 285 317 348 320 255 211 227 271
5860B71Pm8m9k1L8M1M1k5k5ppK2K3j3j4o9p0l4l3L4L4L5L4LLk9k9l9K1P1P1k0k0k0k0K2K2
$$ 271 278 230 181 160 198 239 280 255 230 223 216 238 261 248 234 165 95 61 28 62 96 131 165 168 171 142 113 74 95 166 237 217 197 177 157 179 201
5844B01K1K2RQk7k8j6j6j7j6k4k3k4k4M5M5M6M5j8j9j8j8J1J1J2J1j3j2K3K4J2J2k4k3n2n2
$$ 201 222 244 253 261 234 206 190 174 157 141 117 94 70 46 91 136 182 227 209 190 172 154 165 176 188 199 186 174 197 221 233 245 221 198 146 94
5829I4k5L4Q5Q6O9L4lo2q4m7L1R1Q0M3J6J5k3k2q0p9m4m4n0m9n0m9KJQ5Q6L8L8LKk5k6L4L4
$$ 94 69 103 188 274 343 377 374 312 228 181 212 303 383 426 442 457 434 412 332 253 209 165 115 66 16 -33 -31 -30 55 141 179 217 220 222 197 171 205 239
5812B39N9N9k5k5n4n5j9j8O1O1JJl1l2K8K8LLl3l3k9k9OPk6k6k6k5m4m3qqJ9J8K0J9OPOPJ0
$$ 239 298 357 332 307 253 198 179 161 222 283 284 285 254 222 250 278 281 284 251 218 189 160 166 173 147 121 95 70 26 -17 -25 -33 -14 4 24 43 49 56 62 69 79
5794G9J1J0J1RJ0k6k6KLKLRJ0PPj7n3o5oM5M7J4J5qpqqJ2J1J1J1k0k0j9k0L4L3L4L3N3N4p
$$ 79 90 100 111 120 130 104 78 80 83 85 88 97 107 114 121 104 51 -14 -20 25 72 86 101 93 86 78 70 82 93 104 115 95 75 56 36 70 103 137 170 223 277 270
5776B70pkkL4L3%jj%qpK8K9k6k5J1J1K7K7n7n7n2n3j6j7k5k5k4k5l1k9NOJ2J4N0M9N8N7K1
$$ 270 263 261 259 293 326 326 325 324 324 316 309 337 366 340 315 326 337 364 391 334 277 225 172 156 139 114 89 65 40 9 -20 -15 -9 3 17 67 116 174 231 252
5759B52K2k5k5k5k5k8k7k7k8k7k7k6k8J5J5J4J4K4K4K4K3L2L2L2L1M3M3PPk0k0k1k0QQQRp0
$$ 252 274 249 224 199 174 146 119 92 64 37 10 -16 -44 -29 -14 0 14 38 62 86 109 141 173 205 236 279 322 329 336 316 296 275 255 263 271 279 288 218
5742B18o9l2MJ6k1l4l4j1j1K9O4P3P3J5J5qqm4m4l9l9l9l9m6m7j0K6M2Nk7RN3N3N4N4J1k5
$$ 218 149 117 121 137 116 82 48 37 26 55 119 192 265 280 295 287 279 235 191 152 113 74 35 -11 -58 -68 -42 0 5 -22 -13 40 93 147 201 212 187
5726A87o3o2n7j9kL4M8M9J4J5K3K4j0rj2K3K4j2l9m0ooJJJJj1j0l1NM0L9j6j5J7N3N4J7l2
$$ 187 124 62 5 -14 -16 18 66 115 129 144 167 191 181 172 160 183 207 195 156 116 110 104 105 106 107 108 97 87 56 61 101 140 124 109 126 179 233 250 218
5709B18l3n5j9L2L1J8j7j3j2j3j3l2MM1M1K6rk5k4L1L1J8j8m2oN3N3J2k3o3o2m7m6j0j1J9
$$ 218 185 130 111 143 174 192 175 162 150 137 124 92 96 137 178 204 195 170 146 177 208 226 208 166 160 213 266 278 255 192 130 83 37 27 16 35
5694C5J9K0J9K0K1Nl1n3n2j6j7jL5P5P5M2M2M2M2K1K1j5j5J0RNOm2j02q5n0J1M8L0L0RQRR
$$ 35 54 74 93 113 134 139 108 55 3 -13 -30 -31 4 79 154 196 238 280 322 343 364 349 334 344 353 358 364 322 220 135 85 96 144 174 204 213 221 230 239
5677B39N2N2J6J6l9l8l9l9K4K4K4K4nnnnm5m4q0q1n0n1RQP2P3L7L7RJ0J0J0K4K4K3K4l3l3
$$ 239 291 343 359 375 336 298 259 220 244 268 292 316 311 306 301 296 251 207 127 46 -4 -55 -46 -38 34 107 144 181 190 200 210 220 244 268 291 315 282 249
5660B49l3l3OPOOj4j5M5M6L0L0noPPPPl4l5qN2P4P4Ln6o2o1o6o5l7l8K3K3k5k5k5k5RRJ0R
$$ 249 216 183 189 196 202 208 194 179 224 270 300 330 325 319 326 333 340 347 313 278 270 322 396 470 473 417 355 294 228 163 126 88 111 134 109 84 59 34 43 52 62 71
5642G1LKl3l3kkl3l4K3Q1Q3K3nnrqMMMML1L1L1L1K3K3K3K3K4K4j3j2p1p1n2n3ooN2N1j3m9
$$ 71 74 76 43 10 8 6 -27 -61 -38 43 126 149 144 139 130 122 126 130 134 138 169 200 231 262 285 308 331 354 378 402 389 377 306 235 183 130 124 118 170 221 208 159
5624A59o2lM2M2J0J0o1o1o1o0M2M0M2M1j5j5j5j5J0J0O7O6K5l6o1o2j1j2K5K5j4j4m9m9%%
$$ 159 97 94 136 178 188 198 137 76 15 -45 -3 37 79 120 105 90 75 60 70 80 147 213 238 202 141 79 68 56 81 106 92 78 29 -20 -20 -20
5608b0j%K8K9K9K9QQQQk0k0k0k0rqK7K8%Jj8j7K5K4O1O1M9N0n9n8k7k6RRJ2J2k4k4j8j9l0
$$ -20 -21 -21 7 36 65 94 102 110 118 126 106 86 66 46 37 29 56 84 84 85 67 50 75 99 160 221 270 320 261 203 176 150 159 168 180 192 168 144 126 107 77
5591G7o7o3mK0K0kkJ7J5jkjkj2j3m8q3n8K5Q3Q4L3L3kkn6n6MMM1M0NNJ3J4M9M9M6M5K0m1q8
$$ 77 10 -53 -57 -37 -17 -19 -21 -4 11 10 8 7 5 -7 -20 -68 -151 -209 -184 -101 -17 16 49 47 45 -11 -67 -63 -59 -18 22 27 32 45 59 108 157 203 248 268 227 139
5572A39q8n1j6ppK8K8Ml1l2LM2M3M4M5JKL4L5M0Mj1j2j6j5l6%J5J5J8J7j4j4l2l3J5J4jl7
$$ 139 51 0 -16 -23 -30 -2 26 30 -1 -33 -30 12 55 99 144 145 147 181 216 256 260 249 237 221 206 170 170 185 200 218 235 221 207 175 142 157 171 170 133
5555A33n5n5j8J8K5K5K7K7KKkklo2q5q6k1J5J5J6M0P5R0Q9Q2M6K7j0J2J2M1M2J3m7p3p2m2
$$ 133 78 23 5 23 48 73 100 127 129 131 129 127 124 62 -23 -109 -130 -115 -100 -84 -44 31 121 210 292 338 365 355 367 379 420 462 475 428 355 283 241
5539B41m2m2m2lkj8j7jN8O0O0K5K4j3m9l4KJ5J5j1j1k6k7k9PM6M6MMMMj6j6j5j6J9J9j5j5
$$ 241 199 157 115 112 110 92 75 74 132 192 252 277 301 288 239 205 207 222 237 226 215 189 162 133 140 186 232 236 240 244 248 232 216 201 185 204 223 208 193
5523A93k6J0K6K5ppppj2j3K2K1Ok9m3m3k8QK3K4K6K5O2O1K5K5j1j1j9j8Jl4q6q5j8M2N2pn1
$$ 193 167 177 203 228 221 214 207 200 188 175 197 218 224 195 152 109 81 89 112 136 162 187 249 310 335 360 349 338 319 301 302 268 182 97 79 121 173 166 115
5506A15j4M4M3L0oj5j4J9K0K1K2Ol0m2m2k8PK6K5M6J0k2n8o0k4L2L2N5J8kknmqpm4m3n1n1
$$ 115 101 145 188 218 212 197 183 202 222 243 265 271 241 199 157 129 136 162 187 233 243 221 163 103 79 111 143 198 216 214 212 207 203 195 188 144 101 50 -1
5489aj4K2K2j3J0RJ0J0k3k4nL2M4M5Ll2l4KM3Qn2n1m6j0RM4O9O9N5K0k2k2k4k5nonoJ1J1J1
$$ -1 -15 7 29 16 26 35 45 55 32 8 3 35 79 124 127 95 61 63 106 114 62 11 -35 -45 -36 8 77 146 201 221 199 177 153 128 123 117 112 106 117 128 139
5471A39J1j2j3j0j0l1NM2M2J1k6onrrrrK5K5O2O1RRk7k7n4n3j8j8L8L9LKjkkkMNMMjjL5P1
$$ 139 150 138 125 115 105 74 79 121 163 174 148 142 137 128 119 110 101 126 151 213 274 283 292 265 238 184 131 113 95 133 172 175 177 176 174 172 170 174 179 183 187 186 185 220 291
5451B91N5mp3p2n6LN4N4O2O1K5K6m0l9m0l9m8m7j2j1J9J9m0m1k1k1J5J5L0L0noK5K5j1j1j8
$$ 291 346 342 269 197 141 144 198 252 314 375 400 426 386 347 307 268 220 173 161 150 169 188 148 107 86 65 80 95 125 155 150 144 169 194 183 172 154
5435A54j7j8j8K1K1N7N7m0m0p5p6l5l6%%K5K4K2K3j6n2k9L0P8Q0Q3Q3NMq0p9n3n2j7j6K6K6
$$ 154 137 119 101 122 143 200 257 217 177 102 26 -9 -45 -45 -45 -20 4 26 49 33 -19 -48 -18 60 140 223 306 311 315 235 156 103 51 34 18 44 70
5419G0K6K6k7k7RRM4M3R8R8Qp5o3o4n7n8l1K9N0N1J8J8O7O7M2j9q2q3p0l4J2J3J4J5M8M9R
$$ 70 96 122 95 68 77 86 130 173 271 369 377 302 239 175 118 60 29 58 108 159 177 195 262 329 371 352 270 187 117 83 95 108 122 137 185 234 243
5403B43k8kkmnj9k0J7J6OPOOMMMMk6k7k7k7j2j2j2j2llllOOOOJJJJK3K3j2j3n2n1l5%M9N0
$$ 243 215 213 211 207 202 183 163 180 196 202 209 215 221 225 229 233 237 211 184 157 130 118 106 94 82 79 76 73 70 76 82 88 94 95 96 97 98 121 144 132 119 67 16 -19 -19 30 80
5383H0L6JQPQPM2P8N8N8QQQRllJ7j8n0n0n0n0l7kJ5J4ONM2M2j3j3j3j3o4o5m8j3J5J5Jl4l6
$$ 80 116 117 125 132 140 147 189 267 325 383 391 399 407 416 413 410 427 409 359 309 259 209 172 170 185 199 205 210 252 294 281 268 255 242 178 113 65 52 67 82 83 49 13
5364A3l4K4O2L5L5L7L7j8j8L9M0L6%J8J8J9j8q1q1p3p3n6k1NOM3M3P4P5J4J5LKLLj2j2K4K3
$$ 13 -21 3 65 100 135 172 209 191 173 212 252 288 288 306 324 343 325 244 163 90 17 -39 -60 -55 -49 -6 37 111 186 200 215 218 220 223 226 214 202 226 249
5347B49NNNNllklN2N3l2l1j9k0j9j9K4K5j2j1n8n8j0N0O1K4J3J2k3k3k4k3j4j4M6M7L4L5k5
$$ 249 254 259 264 269 266 263 261 258 310 363 331 300 281 261 242 223 247 272 260 249 191 133 123 173 234 258 271 283 260 237 213 190 176 162 208 255 289 324 299
5330B99k5lll9l9J0J0J0J0J4J3J4J3J2J2m8m8o2o3klN0N1j0rj0j0j0j0k6k7L4L3L1L1L0L1
$$ 299 274 271 268 229 190 200 210 220 230 244 257 271 284 296 308 260 212 150 87 85 82 132 183 173 164 154 144 134 124 98 71 105 138 169 200 230 261
5314B61L2L2L2L2k9k9o4o5j2j2j2j1OOOOjjj7J9O2J21J24O4llm3m3p8p9j8j9oom3m2j4j4M
$$ 261 293 325 357 389 360 331 267 202 190 178 166 155 161 167 173 179 178 177 160 179 241 362 486 550 547 544 501 458 380 301 283 264 258 252 209 167 153 139 143
5298A43MkkL5L4J7J7J8J7K3K4m1p6j04j04p9k0J0J0oL0O9P0L3lj8j7kjJ2J2noK5K4K7rj0j1
$$ 143 147 145 143 178 212 229 246 264 281 304 328 287 211 107 3 -76 -96 -86 -76 -82 -52 17 87 120 117 99 82 80 79 91 103 98 92 117 141 168 159 149 138
5281A38K3K3J3J2m8m7m5m5oL0O1O0M7J2j6j5%%j0j0j0j0jjL4L4M0L9K1K2m0m1m0m0j0j1j1
$$ 138 161 184 197 209 161 114 69 24 18 48 109 169 216 228 212 197 197 197 187 177 167 157 156 155 189 223 263 302 323 345 305 264 224 184 174 163 152
5265A52j0l5l4NM2O7O7N3J8pqk7k8RRK7K7l1l1l1l1RRRRk6k7k6k6oonok7k6k5k5%L6J6J6K1
$$ 152 142 107 73 78 120 187 254 307 325 318 310 283 255 264 273 300 327 296 265 234 203 212 221 230 239 213 186 160 134 128 122 117 111 84 58 33 8 8 44 60 76 97
5246I7K1K1K1K9K9J4k3k5k5N6N7L3L4k6k6l0l0OOk9k8L1L1L9M0k0k1m6m7k0L9N6N6j2p2q0
$$ 97 118 139 160 189 218 232 209 184 159 215 272 305 339 313 287 257 227 233 239 210 182 213 244 283 323 303 282 236 189 169 208 264 320 308 236 156
5231A56m5mL1M5M5J2J1lllll6l5n4n3m2m1noM2M2O1O0L1L0onrqLL9M0k1q8q9o4mM7M6K5K5
$$ 156 111 107 138 183 228 240 251 248 245 242 239 203 168 114 61 19 -22 -27 -33 9 51 112 172 203 233 227 222 213 205 208 247 287 266 178 89 25 21 68 114 139 164
5213A64j0j1ONONN5N6J9J9j9k0l7l7m9m8o7o5l4l4K5K6P9Q0N4oqpK5K5l6l6K4K3P3P3J4J3
$$ 164 154 143 149 154 160 165 220 276 295 314 295 275 238 201 152 104 37 -28 -62 -96 -71 -45 34 114 168 162 154 147 172 197 161 125 149 172 245 318 332 345
5197C45m8m8m8m8L7L7L7L8%JJ%m0m0mmj3j4m6m7k2J5J4k1k0k0L8L7j1j1j2j1k0k1k0j9J2J4
$$ 345 297 249 201 153 190 227 264 302 302 303 304 304 264 224 220 216 203 189 143 96 74 89 103 82 62 42 80 117 106 95 83 72 52 31 11 -8 4 18
5180A8M7M8L0oJ2J2K2j4k9l0PPPPK5K5j1j1j1j2rj0OM1M1Nk1k0k1k1k4J2K8K8L7L7L5L5rm4
$$ 18 65 113 143 137 149 161 183 169 140 110 117 124 131 138 163 188 177 166 155 143 134 124 130 171 212 217 196 176 155 134 110 122 150 178 215 252 287 322 313 269
5163B69k4k4pom2m2J0RJ0J0JJJJooL0L1j%l4l5l4JJ7J7qrK8K7j8j9j9j8j1j1j1j1m1m0J9N6
$$ 269 245 221 214 208 166 124 134 143 153 163 164 165 166 167 161 155 185 216 215 215 181 146 112 113 130 147 139 130 158 185 167 148 129 111 100 89 78 67 26 -14 5 61
5145F1O0K4l7l8m3m3oK8K6j0k2k4L1L1L2L2J6J7j9j9qpqpl4l4n4j9L4L4L5L6L4L4L2L1J4k2
$$ 61 121 145 108 70 27 -16 -22 6 32 22 0 -24 7 38 70 102 118 135 116 97 89 82 74 67 33 -1 -55 -74 -40 -6 29 65 99 133 165 196 210 188
5128A88l7l8K1K2j3j2PM3N7mm2m2J4J3NMMNK3K2K3K3QQPQNOLLj8n3o6o7p7m1%L6Ol0o0k5K2
$$ 188 151 113 134 156 143 131 138 181 238 234 192 150 164 177 182 186 190 195 218 240 263 286 294 302 309 317 322 328 331 334 316 263 197 130 53 12 12 48 54 24 -36 -61 -39
5109c9N6P6P6O7O8N2J6k3k2k7k6l6p1n1n1k1k1k0k0J4J3J3J4M9M9M9M8J7J7k0n6n7k0J7J7
$$ -39 17 93 169 236 304 356 372 349 327 300 274 238 167 116 65 44 23 3 -17 -3 10 23 37 86 135 184 232 249 266 246 190 133 113 130 147
5094A47j3j4j3j4K9L0K9K9J8J8L6%l3o8p0l4qqnoJ7J7j6j7j2K4M0M0M1M0M1M1J9J9J9J9kj
$$ 147 134 120 107 93 122 152 181 210 228 246 282 282 249 181 111 77 69 61 56 50 67 84 68 51 39 63 103 143 184 224 265 306 325 344 363 382 380 379
5078C79kkl2l3l2l3KKK2j4m1m1mL3QQL1np1p0l6M8P9P9K1j4m8m7o9l4J0J0J2J2K2K2K2K2k5
$$ 379 377 375 343 310 278 245 247 249 271 257 216 175 171 204 212 220 251 246 175 105 69 117 196 275 296 282 234 187 118 84 94 104 116 128 150 172 194 216 191
5061A91k5j0K7O1O1M7J2poqrm6m6rj0KLLLj2j2j2j3J1J2QRK8rm8m8l1l2l1l2j5j5j5j5J1J1
$$ 191 166 156 183 244 305 352 364 357 351 343 334 288 242 233 223 225 228 231 234 222 210 198 185 196 208 216 225 253 244 196 148 117 85 54 22 7 -8 -23 -38 -27 -16
5043a6J2J0klklL9M0L8L7M7J0nnKKKJl4l4NM2M0M0Kl3l1l0l3l2m3m3o3k7M6M4M8M8O5O6L9
$$ -16 -4 6 4 1 -1 -4 35 75 113 150 197 207 202 197 199 201 203 204 170 136 141 183 223 263 265 232 201 171 138 106 63 20 -43 -70 -24 20 68 116 181 247 286
5025B86k1o2o3m8j2J4N0L2L2J0J1nm1m9n0j6j6ooN2N2N8K2j9n5m7j1N0N0J5J5J5J5oppoM0
$$ 286 265 203 140 92 80 94 144 176 208 218 229 224 183 134 84 68 52 46 40 92 144 202 224 205 150 103 92 142 192 207 222 237 252 246 239 232 226 266
5009B66M0L7L7Jn8q4q5n4n4l8kM0M0K6rOPMMNMNML2L1L1L2j4j4j4j4j2j2rj0J7N1O4O4Jo0
$$ 266 306 343 380 381 323 239 154 100 46 8 6 46 86 112 103 109 116 120 124 129 133 138 142 174 205 236 268 254 240 226 212 200 188 179 169 186 237 301 365 366 306
4991C06q3q3j8J9N6N5J1k6m1m2j1j2j2j2J0J1J0J1poL2O7O9L4mmJ4J5k2k2J6J5J6J6j4j5j4
$$ 306 223 140 122 141 197 252 263 237 196 154 143 131 119 107 117 128 138 149 142 136 168 235 304 338 334 330 344 359 337 315 331 346 362 378 364 349 335
4975C35j4llllm5m5k9Pj1j1k8PM1M1M3M3RRk7k7m2m1l9K1R2R3J3J2jkkjLMl3l2n8n8K6K6L3
$$ 335 321 318 315 312 309 264 219 190 197 186 175 147 154 195 236 279 322 331 340 313 286 244 203 164 185 277 370 383 395 394 392 390 389 392 396 363 331 273 215 241 267 300
4957C00L3L4L3k6k6k6k5LLMLk7k8RQK8K8K8K8J2J2p2p2j04j03m3m3J1J2J0J1RQQRM1M1ONp
$$ 300 333 367 400 374 348 322 297 300 303 307 310 283 255 264 272 300 328 356 384 396 408 336 264 160 57 14 -29 -18 -6 4 15 24 32 40 49 90 131 137 142 135
4939A35pqpj1j1j1j1QQR0R0J28R3J7m3n9k4j1j2l0l0l0l0K7K7K7K7N5N5N3pp2p2l9m0M2M3
$$ 135 128 120 113 102 91 80 69 77 85 175 265 393 486 503 460 401 377 366 354 324 294 264 234 261 288 315 342 397 452 505 498 426 354 315 275 317 360
4923C60M2M3M4M4QQOPOOm6m7m7m7j6j6j6j7j1j2j2j2J4J3J3J3j7j8j7j8MLL9L9J%l6l5k8k8
$$ 360 402 445 489 533 541 549 555 562 568 574 528 481 434 387 371 355 339 322 311 299 287 275 289 302 315 328 311 293 276 258 262 265 304 343 344 344 308 273 245 217
4906B17k9k8m1m2noPPPPnonoJ9J8J9J9R0Q9N4N4J8J7J8J7j8j7j8j8L0K9L0K9M2M3M2M2K7K7
$$ 217 188 160 119 77 72 66 73 80 87 94 89 83 78 72 91 109 128 147 237 326 380 434 452 469 487 504 486 469 451 433 463 492 522 551 593 636 678 720 747 774
4889G74qrj2j1j2j2K9K8Q8Q8J00J01J03J04J57K17K60L19M26M62L71J20j73l76m29m29l77
$$ 774 766 757 745 734 722 710 739 767 855 943 1043 1144 1247 1351 1508 1725 1985 2304 2730 3192 3563 3683 3510 3134 2705 2276 1899
4877A899l16k39j56q3m7k6k7k5k6k5k6P9P8P8P9N7N8N7N8P5P6P6P6O7O6O6O6P8P8J48J84K36
$$ 1899 1583 1344 1188 1105 1058 1032 1005 980 954 929 903 982 1060 1138 1217 1274 1332 1389 1447 1522 1598 1674 1750 1817 1883 1949 2015 2093 2171 2319 2503 2739
4863B739L45M74O05P42R20J151J426J723J901J691Q90k76j293j794j794j550j275j035q08
$$ 2739 3084 3558 4163 4905 5825 6976 8402 10125 12026 13717 14607 14331 13038 11244 9450 7900 6625 5590 4782
4855D782o01m81l72k52j79j44r7r7q0q1n9J3N4R1J11J11J60J61J61J61J47J47K14K85K83K82
$$ 4782 4181 3700 3328 3076 2897 2753 2656 2559 2479 2398 2339 2352 2406 2497 2608 2719 2879 3040 3201 3362 3509 3656 3870 4155 4438 4720
4844D720L35M54N47O67Q97J208J528J887K414L107L951M883N647N527L877O95k729n051n659
$$ 4720 5055 5509 6056 6723 7620 8828 10356 12243 14657 17764 21715 26598 32245 37772 41649 42344 39615 34564 28905
4835B8905n156m260l374k606j960j509j197r23p07n96m77l42k71k35j99j05l4K1N6J04J75
$$ 28905 23749 19489 16115 13509 11549 10040 8843 7920 7213 6617 6140 5798 5527 5292 5093 4988 4954 4975 5031 5135 5310
4826E310J78J77K29L00L31M04N09N80N78O49Q10J024J237J549K034K634L356M338N605P160
$$ 5310 5488 5665 5894 6194 6525 6929 7438 8018 8596 9245 10055 11079 12316 13865 15899 18533 21889 26227 31832 38992
4818C8992Q918J0713J1500R658M409k698q649j1305j1000r349p549n946m549l473k751k154
$$ 38992 47910 58623 70123 79781 84190 81492 72843 61538 50538 41189 33640 27694 23145 19672 16921 14767
4811A4767j666j307j066q50o41n21m52l80k73k37k11j39j2O0R1J27K09K81L40M60N70O43P03
$$ 14767 13101 11794 10728 9878 9237 8716 8264 7884 7611 7374 7163 7024 7012 7072 7163 7290 7499 7780 8120 8580 9150 9793 10496
4801A0496Q71J134J349J627K129K784L526M510N874P570R555J1657J3261J2626Q152M28p491
$$ 10496 11367 12501 13850 15477 17606 20390 23916 28426 34300 41870 51425 63082 76343 88969 97121 97549 90058
4793I0058j2382j3363j1910r781p763o015m601l620k911k265j766j455j169r04p20o00n14
$$ 90058 77676 64313 52403 42622 34859 28844 24243 20623 17712 15447 13681 12226 11057 10153 9433 8833 8319
4786H319l95k84k83k12r2k1k2PJ26K02K75L09M30M80N53O63Q78J072J288J622K125K695L389
$$ 8319 7924 7640 7357 7145 7053 7032 7010 7017 7143 7345 7620 7929 8359 8839 9392 10055 10933 12005 13293 14915 17040 19735 23124
4776B3124M396N761P354R149J0880J1383R080L457l703r326j1586j0987r220p377n789m474
$$ 23124 27520 33281 40635 49784 60664 72047 81127 84584 80881 71555 59969 48982 39762 32385 26596 22122
4769B2122l441k700k149j694j380j165r72q05o46n26m10k89k38k37j96j23j05j04k8k7L7L6
$$ 22122 18681 15981 13832 12138 10758 9593 8621 7816 7170 6644 6234 5945 5707 5470 5274 5151 5046 4942 4914 4887 4924 4960
4760D960J28K00K55L27L75M47N37P05R06J170J456J912K543L285M129N062N708N301L192k29
$$ 4960 5088 5288 5543 5870 6245 6692 7229 7934 8840 10010 11466 13378 15921 19206 23335 28397 34105 39406 42598 42369
4751D2369l519n458n768n074m143l306k575k026j581j270j028q60o68m99l49k78k92k93k45
$$ 42369 38850 33392 27624 22550 18407 15101 12526 10500 8919 7649 6621 5761 5093 4594 4245 3967 3675 3382 3137
4743C137j74j36j37p2p3k1k2k2k1n0m9J0J1N3N4P6J13J86L06M59N32O15P36R36J199J546J810
$$ 3137 2963 2827 2690 2618 2545 2524 2502 2480 2459 2409 2360 2370 2381 2434 2488 2564 2677 2863 3169 3628 4160 4775 5511 6447 7646 9192 11002
4731A1002J842J388L76p97j659j969j838j527j201r38p26n58m47l75k87k50j99j27j06j06
$$ 11002 12844 14232 14608 13811 12152 10183 8345 6818 5617 4679 3953 3395 2948 2573 2286 2036 1837 1710 1604 1498
4722A498m2m2QPn2n2n7n8r3r3r0r1l0l1K2K3MMlmJ5J5k3k3n9n9JJJKo3o3o3o3l0l0l0l0j4
$$ 1498 1456 1414 1422 1429 1377 1325 1268 1210 1117 1024 934 843 813 782 804 827 831 835 832 828 843 858 835 812 753 694 695 696 697 699 636 573 510 447 417 387 357 327 313
4705C13j5j5j5m8m9J2J1L9L9L9L9L1L2k8k9QQQPnnnnJ4J4J4J4ppppk2k2k3k2NMNNk1k1j9j8
$$ 313 298 283 268 220 171 183 194 233 272 311 350 381 413 385 356 364 372 380 387 382 377 372 367 381 395 409 423 416 409 402 395 373 351 328 306 311 315 320 325 304 283 264 246
4687B46J3M9O6O5L5L6j%m9m9l3LJ4J5j9j9J0J0J1J0MNl1l2MMMMPPQPj3j3n0q6r8o2k1J4L4
$$ 246 259 308 374 439 474 510 509 509 460 411 378 381 395 410 391 372 382 392 403 413 417 422 391 359 363 367 371 375 382 389 397 404 391 378 328 242 144 82 61 75 109
4669A09L3L8Ll3l2m8m9m4J5Q4Q6M7j2l5l6J2M8O1O1L0oo7o7k7RK5K5j0j0PQl7l7l7l7MMM0
$$ 109 142 180 183 150 118 70 21 -23 -8 76 162 209 197 162 126 138 186 247 308 338 332 265 198 171 180 205 230 220 210 217 225 188 151 114 77 81 85 125
4652A25M1J1J1J1J1N1N1M8M8j2m8k7k8K3K2K3K3j0j0j1j0k5k5k5k5j2j2OOj0rMM1P7M2NNk6
$$ 125 166 177 188 199 210 261 312 360 408 396 348 321 293 316 338 361 384 374 364 353 343 318 293 268 243 231 219 225 231 221 212 216 257 334 376 381 386 360
4636C60k5j0K7K8K9rm5n4n4n4n4nL1M6M6J8J7J7J7l1l2l1l2k4k5k3k3KL8P4P4L1k9n2j5j7
$$ 360 335 325 352 380 409 400 355 301 247 193 139 134 165 211 257 275 292 309 326 295 263 232 200 176 151 128 105 107 145 219 293 324 295 243 228 211
4620B11j7l5JM4M3Qk8j5K0J9j8l5l5jjj7j6j6j7m0m1K3N9Q2Q2O8L3L0K9K6l5o5o5l2NJl4l2
$$ 211 194 159 160 204 247 255 227 212 232 251 233 198 163 162 161 144 128 112 95 55 14 37 96 178 260 328 361 391 420 446 411 346 281 249 254 255 221 189
4604A89LO0O0M7J0llnnk1k0k0k0K2K1j8n3o1o1llJ1J0J1J0K6K5K6K5J6J5N1N2KKKKmnm0m0
$$ 189 192 252 312 359 369 366 363 358 353 332 312 292 272 294 315 297 244 183 122 119 116 127 137 148 158 184 209 235 260 276 291 342 394 396 398 400 402 398 393 353 313
4586C13j1j1rrK9O5M3M2Ll4m7m7n6j9J8J8J9j6l3l2n7n7LKN6N6J9K0j2j2j1j2%JJJKJKKJ1
$$ 313 302 291 282 273 302 367 410 452 455 421 374 327 271 252 270 288 307 291 258 226 169 112 115 117 173 229 248 268 256 244 233 221 221 222 223 224 226 227 229 231 242
4568B42J1J1J1qqqqj9j9j9j9l7l7j7N4O2O3j7j7n2n3j7j6K0K1j6j5J2J2k4k4K4K5K5K4j0j1
$$ 242 253 264 275 267 259 251 243 224 205 186 167 130 93 76 130 192 255 238 221 169 116 99 83 103 124 108 93 105 117 93 69 93 118 143 167 157 146
4552A46RQ1J01J02L9l3n9n9o3o3MNNNj0rj0j0K2K2j4j4k0k1J6J6rrrrJ9J9j7j7K3K3j2j3%
$$ 146 155 236 337 439 478 445 386 327 264 201 205 210 215 220 210 201 191 181 203 225 211 197 177 156 172 188 179 170 161 152 171 190 173 156 179 202 190 177 177
4535A77%J%k9k9k9k9J7J6J7J6J1J1M8M7K7K7K7K7l8l8klN2N1J5J6j0rK7K6l3l4l1l1j1K6M1
$$ 177 177 178 178 149 120 91 62 79 95 112 128 139 150 198 245 272 299 326 353 315 277 275 272 324 375 390 406 396 387 414 440 407 373 342 311 300 326 367
4519C67M1nmK8K9mm0j9k0j3j3m8m9m7m7qK8M2M2K8pl8l9m0m1ONQQJL7P3P2N0rl6l6MMNMK4
$$ 367 408 403 399 427 456 452 412 393 373 360 347 299 250 203 156 148 176 218 260 288 281 243 204 164 123 129 134 142 150 151 188 261 333 383 374 338 302 306 310 315 319 343
4501C43K4j1j2m9m8m8m9j1j2j1j2J6J5J6J5K5K5M5Rooqql3l2pN4N9N8LLm0m0m0m0ppppk4k4
$$ 343 367 356 344 295 247 199 150 139 127 116 104 120 135 151 166 191 216 261 270 264 258 250 242 209 177 170 224 283 341 344 347 307 267 227 187 180 173 166 159 135 111
4483A11J6N2L3L3jjkkkkl1l1l1l1j5j5j5j5l3l1j8J9M5M5M6M5K9om5m4j7K0L5L4K1K1j6j5
$$ 111 127 179 212 245 244 243 241 239 237 235 204 173 142 111 96 81 66 51 18 -13 -31 -12 33 78 124 169 198 192 147 103 86 106 141 175 196 217 201 186
4467A86k0k0J6J6LLJ7N2P3L6k5k5K2K2K2K2RRK7rp5j09q9q8o1jM8M9N0N1J4J4J8J7j8j8j9
$$ 186 166 146 162 178 181 184 201 253 326 362 337 312 334 356 378 400 409 418 445 436 361 252 163 75 14 13 61 110 160 211 225 239 257 274 256 238 219
4450B19j8L9L9L0oo8o7o0k3qpL8L9L8L8J8J8k3n8n4n4k1k1K4K4K4K4K4K3K4K3rrj0rllllQ
$$ 219 201 240 279 309 303 235 168 108 85 77 70 108 147 185 223 241 259 236 178 124 70 49 28 52 76 100 124 148 171 195 218 209 200 190 181 178 175 172 169 177
4433A77RQQL1L1Nn5j18j16p2j1PPrK6L9L7NNJ3J2k1k0l2LK0J8M0M1P2P3N3pl3l3m0m0o0k4
$$ 177 186 194 202 233 264 269 214 96 -20 -92 -103 -96 -89 -98 -72 -33 4 9 14 27 39 18 -2 -34 -31 -11 7 47 88 160 233 286 279 246 213 173 133 73 49
4416D9J1J1J3J3j7j7J8J9ONNOL3L2klonm1m1k0k0J6J5%%%%M5M5RQN7N7K2K1pok4k4jkN5N5
$$ 49 60 71 84 97 80 63 81 100 106 111 116 122 155 187 185 182 176 171 130 89 69 49 65 80 80 80 80 80 125 170 179 187 244 301 323 344 337 331 307 283 282 280 335 390
4397C90J9m0o3k7K4K4qpJ8N4L1k8o1o1nnK8K9qpQPK6K5j1j1OPlkk1k0kkk0j9j1j1j1j1pop
$$ 390 409 369 306 279 303 327 319 312 330 384 415 387 326 265 260 255 283 312 304 297 305 312 338 363 352 341 347 354 351 349 328 308 306 304 284 265 254 243 232 221 214 208 201
4379B01pK2K2j3j4LLMLK2K2K1K2m6m7m6m7RRrqm6m7O2O1K9K9ppj6j7j6j6n4n4k9K9P4L9Jl5
$$ 201 194 216 238 225 211 214 217 221 224 246 268 289 311 265 218 172 125 134 143 134 126 80 33 95 156 185 214 207 200 184 167 151 135 81 27 -2 27 101 140 141 106
4361A06l5%L8L8K5K6p8p9l2K7K7l3m9n1ONJ8J8J8J6rrQQL0L0R0Q9P2P3J2J3k7k7rqk0k0p8
$$ 106 71 71 109 147 172 198 120 41 9 36 63 30 -19 -70 -64 -59 -41 -23 -5 11 2 -7 1 9 39 69 159 248 320 393 405 418 391 364 355 347 327 307 229
4344B29p7q2m5OO6P6M1m3m3J1J0K9K9j5j5l2l3l4l5K6K5K4K3K4K3L4L4l6r7q2k3K5O0M6J0
$$ 229 152 70 25 31 97 173 214 171 128 139 149 178 207 192 177 145 112 78 43 69 94 118 141 165 188 222 256 220 123 41 18 43 103 149 159
4329A59n1q7q1k3K6K5lmL2L2P1P1J1J2o5o5k8k9PQK5K5K6K6K7K6K1K1K1K1J4J4mmNNl1l1n8
$$ 159 108 21 -60 -83 -57 -32 -35 -39 -7 25 96 167 178 190 125 60 32 3 10 18 43 68 94 120 147 173 194 215 236 257 271 285 281 277 282 287 256 225 167
4312A67n8k2k2LLK1K1P5P4J5J5j5j5LLJ1J0k5o1k6L5P8P8J1n0n1n2m1m2m1m1K5K5K6K5k4k5
$$ 167 109 87 65 68 71 92 113 188 262 277 292 277 262 265 268 279 289 264 203 177 212 290 368 379 329 278 226 185 143 102 61 86 111 137 162 138 113
4296A13k4k5rj0rj0llJJj6M4P1P0JJJKMNNNk7k7k7k7m7m7m4J5Q5Q6L0L0j3j4K3K2L1L1nnJ1
$$ 113 89 64 55 45 36 26 23 20 21 22 6 50 121 191 192 193 194 196 200 205 210 215 188 161 134 107 60 13 -31 -16 69 155 185 215 202 188 211 233 264 295 290 285 296
4277B96J1k5k5l5l4l4l5KLMML7P2Q5K6j4j3j7j7j9j8j9j9m6m6J5J4M0M0NMJ8J8j8j8n7n7k1
$$ 296 307 282 257 222 188 154 119 121 124 128 132 169 241 326 352 338 325 308 291 272 254 235 216 170 124 139 153 193 233 238 242 260 278 260 242 185 128 107
4261A07k1QPQPllllM8M8M8M8PQPQqpo3o4k2L7O0K4k1k1k3k4%jjjJ4J4J4J4j8j8j7j8j4j4j4
$$ 107 86 94 101 109 116 113 110 107 104 152 200 248 296 303 311 318 326 318 311 248 184 162 199 259 283 262 241 218 194 194 193 192 191 205 219 233 247 229 211 194 176 162 148 134
4242A34j4m9n0J0J0J1J2J1J2j4j5K2K2L8L7k2k2J3J3N0M9J6J7m4m3l1l2NNN7N8N8N7k9k9r0
$$ 134 120 71 21 31 41 52 64 75 87 73 58 80 102 140 177 155 133 146 159 209 258 274 291 247 204 173 141 146 151 208 266 324 381 352 323 233
4226B33q9m6m7m7m5RJ0RRJ%J%j9k0j9j9L1L1L1L1L1L1L0L1O7O6j7j7n9n8JJl7l7jjjjjkpq
$$ 233 144 98 51 4 -41 -32 -22 -13 -4 -3 -3 -2 -2 -21 -41 -60 -79 -48 -17 14 45 76 107 137 168 235 301 284 267 208 150 151 152 115 78 77 76 75 74 73 71 64 56
4207E6qqK0K0K0K0pqppqrqrJ%J%J8J7J8J8L2L3L3L2qqqpk3k3k3k3L3L2L3L3K9K9K6K7K8rm8
$$ 56 48 40 60 80 100 120 113 105 98 91 83 74 66 57 58 58 59 59 77 94 112 130 162 195 228 260 252 244 236 229 206 183 160 137 170 202 235 268 297 326 352 379 407 398 350
4188C50m8l3l2LLk8k9k9k8%J%JRJ0PPj7n3l3l4%jjjRJ0M3M3J9j7l3l2J4J5J2J2J0k7k6J0L3
$$ 350 302 269 237 240 243 215 186 157 129 129 130 130 131 140 150 157 164 147 94 61 27 27 26 25 24 33 43 86 129 148 131 98 66 80 95 107 119 129 102 76 86 119
4170A19L3j3p2o5k8j7j7llL2L3KMMMK0J9j6j6k4k4J2J1M9N0M7M8J9j7l1l1K2N8N5K0%l5l8
$$ 119 152 139 67 2 -26 -43 -60 -63 -66 -34 -1 1 5 9 13 33 52 36 20 -4 -28 -16 -5 44 94 141 189 208 191 160 129 151 209 264 284 284 249 211
4153B11jN2N2J5k1m5m4m4m4k6J0K6K6M3M2M3M3J2J2k4k4rrm5m4m2m2l9m0oL0K9omnL0K9PP
$$ 211 210 262 314 329 308 263 219 175 131 105 115 141 167 210 252 295 338 350 362 338 314 305 296 251 207 165 123 84 44 38 68 97 91 87 82 112 141 148 155
4136A55PPm5m6m3m2lL3M9M9L6L6L3L2K1l9o5o5J0J0J0RPOOOllllM7M6O4K8k8o4m6m6j8j9p5
$$ 155 162 169 124 78 35 -7 -10 23 72 121 157 193 226 258 279 240 175 110 120 130 140 149 156 162 168 174 171 168 165 162 209 255 319 347 319 255 209 163 145 126 51
4118E1p4n7LP5P3N4J9KLJ2J2J2J3L2L2L2L2QPk8k8l5l6l5l5o0n9m3rJ7J6J8J9N2N1J3k4k7
$$ 51 -23 -80 -77 -2 71 125 144 146 149 161 173 185 198 230 262 294 326 334 341 313 285 250 214 179 144 84 25 -18 -27 -10 6 24 43 95 146 159 135 108
4102A08k7L1L1K6K6K6K7K0K0J8J8J8j7n7n7m0m1jL4N2N2N4N4J4J3J3J3kjnmp5j12j10p3l2
$$ 108 81 112 143 169 195 221 248 268 288 306 324 342 325 268 211 171 130 129 163 215 267 321 375 389 402 415 428 426 425 420 416 341 229 119 46 14
4086A4MK3K2K9L0K7K8J9j7l0l0M4Q1Q0M5k2k2k4k4llklMMLMl7l7jjn6n7n6n5jjN7N9J2J3J2
$$ 14 18 41 63 92 122 149 177 196 179 149 119 163 244 324 369 347 325 301 277 274 271 269 266 270 274 277 281 244 207 206 205 149 92 36 -19 -20 -21 36 95 107 120 132
4068A32J2M5M4j5j5n7n6k1k0K5K4O1O1j4j4j5j4M4M4M3M4jjkjj0j0j1j0J1J0J1J0L2L1L1L1
$$ 132 144 189 233 218 203 146 90 69 49 74 98 159 220 206 192 177 163 207 251 294 338 337 336 334 333 323 313 302 292 303 313 324 334 366 397 428 459
4052D59K5K4j1j2m1m1m1m1L1L2L1L2j2j2j2j1j2j2j1j2k5k5k5k5kjl7l7m7m6J3J3J4J4k1k1
$$ 459 484 508 497 485 444 403 362 321 352 384 415 447 435 423 411 400 388 376 365 353 328 303 278 253 251 250 213 176 129 83 96 109 123 137 116 95
4037I5j3j2K3K4J9J9j7j7K0K0N5N6m0m0p6p6k2k2L6P3N6mk8k8j9j9j9j9J0J1J0J0J2J1J1J2
$$ 95 82 70 93 117 136 155 138 121 141 161 216 272 232 192 116 40 18 -4 32 105 161 157 129 101 82 63 44 25 35 46 56 66 78 89 100 112
4021A12L8L8LKrrK7K6M2M2NOL1L0k9l0j3j4K2K2m2m3m3m2l6l6l6l6j%%jK9K9ppk7k7k5k7K2
$$ 112 150 188 191 193 184 175 202 228 270 312 317 323 354 384 355 325 312 298 320 342 300 257 214 172 136 100 64 28 27 27 27 26 55 84 77 70 43 16 -9 -36 -14
4003a4K0N8N8L4L4k6k6jjL5L4LLKLj3j2j2j3K0J9j6j6m4m3pqQPQPM9M9J2J3m1m1J9J8KJKJ
$$ -14 6 64 122 156 190 164 138 137 136 171 205 208 211 213 216 203 191 179 166 186 205 189 173 129 86 79 71 79 86 94 101 150 199 211 224 183 142 161 179 181 182 184 185
3984A85OOk9l0l1l1l0l1K8K7K8K8J9J8J9J9k0k0j9k0j1j1M9M9N2N2J6J6k5k5k5k5M3M3PPl5
$$ 185 191 197 168 138 107 76 46 15 43 70 98 126 145 163 182 201 181 161 142 122 111 100 149 198 250 302 318 334 309 284 259 234 277 320 327 334 299
3968B99l6l5l6J9J9J9K0j4j4j4j4k7k8k8k7j1j0j1j0NOM1M2N4N4J8J8j9k0M0M0kklkm3m3p
$$ 299 263 228 192 211 230 249 269 255 241 227 213 186 158 130 103 92 82 71 61 66 72 113 155 209 263 281 299 280 260 300 340 338 336 333 331 288 245 238
3952B38pOOOOMMMNJ3J3J4J3j8j7j8j7l3l2l3l2m7m7m7m7J0J0J0RL0L1L1L1k8k9QQJ5J5J5J5
$$ 238 231 237 243 249 255 259 263 267 272 285 298 312 325 307 290 272 255 222 190 157 125 78 31 -16 -63 -53 -43 -33 -24 6 37 68 99 71 42 50 58 73 88 103 118
3934A18P4P3M7j2q8q8m4J6M5QllK8K8qqnnnnL6L5L5L6m0l9l9m0l4l4l4l4K3K3K2K3nonnJ0
$$ 118 192 265 312 300 212 124 80 96 141 149 146 143 171 199 191 183 178 173 168 163 199 234 269 305 265 226 187 147 113 79 45 11 34 57 79 102 97 91 86 81 91
3916I1RJ0J0j1j0j1j0J6J6J9J9J0M7M6J1k4k4k6k6K8K8K9K8NNNNm0m0J9J9j0j0j1j0k4k3L4
$$ 91 100 110 120 109 99 88 78 94 110 129 148 158 205 251 262 238 214 188 162 190 218 247 275 280 285 290 295 255 215 234 253 243 233 222 212 188 165 199
3900A99L4M0Nj1j0l0l0l0l0l7l8l7l6ooL2O9M5M5J1J1KL%%jl6j7j6j0j0K6K6K7K6j0j0RRP
$$ 199 233 273 278 267 257 227 197 167 137 100 62 25 -11 -17 -23 9 78 123 168 179 190 192 195 195 195 194 158 141 125 115 105 131 157 184 210 200 190 199 208 215
3883B15Oj1m8m8j2L1L1L4L3K0J9J5J6J0m9r7r8n7k0J8J9J7J8J7J7llkjJ0M6O2O1J8J7k2n8
$$ 215 221 210 162 114 102 133 164 198 231 251 270 285 301 311 262 165 67 10 -10 8 27 44 62 79 96 93 90 88 87 97 143 205 266 284 301 279 221
3867B21r5r5m6J3L5L5LLL9L8N8K3k0k0k2k3k3k4J2J3ook3J2M5Q0O3O3QQQQm1m1n8k3K1N7N8
$$ 221 126 31 -15 -2 33 68 71 74 113 151 209 232 212 192 170 147 124 100 112 125 119 113 90 102 147 227 290 353 361 369 377 385 344 303 245 222 243 300 358
3850C58K1nm1m3pJ1J2J1J2L1nm3m2j3K4L9L9j1j0j1j1j9j9n5n4o5o4m5j0J5N0O6O7K0j5l2
$$ 358 379 374 333 290 283 294 306 317 329 360 355 312 270 257 281 320 359 348 338 327 316 297 278 223 169 104 40 -5 -15 0 50 116 183 203 188 156
3834A56l1j9j8J5J5K5j0k6k7K9L0rm4l4KL9L9nnnmj4j4j4j3J1J1M4M5Qk7ppj1j0m4m4m2qJ2
$$ 156 125 106 88 103 118 143 133 107 80 109 139 130 86 52 54 93 132 127 122 117 113 99 85 71 58 69 80 124 169 177 150 143 136 125 115 71 27 -15 -23 -11
3817a1M7K9K9L1L2N9N9J9j7l1l0OM3L5L6k2k2l1l2NML6L7L6L7J4J4k2k2l6l6l6l6m5m5m5m6
$$ -11 36 65 94 125 157 216 275 294 277 246 216 222 265 300 336 314 292 261 229 234 238 274 311 347 384 398 412 390 368 332 296 260 224 179 134 89 43
3801D3l6l6jjN5N6N6N5K5K5O1O1L5L5k4k5k0k0j9k0r1r1q9k9L6L5L9L9L9L9L9L9K0K1j6j5
$$ 43 7 -29 -30 -31 24 80 136 191 216 241 302 363 398 433 409 384 364 344 325 305 214 123 34 5 41 76 115 154 193 232 271 310 330 351 335 320
3785C20j%L5L6M9M9M9M9k0k0j9k0J8J8j8j8mmnmpqK9K9J9K0J6J5k5q5j11j11l3l2LL%%%%j7
$$ 320 319 319 354 390 439 488 537 586 566 546 527 507 525 543 525 507 503 499 494 490 483 475 504 533 552 572 588 603 578 493 382 271 238 206 209 212 212 212 212 212 195
3767A95j6j7j6k0j9p5p4m8J1L8L8QJ0k5k6j1j2M9M7L3L3llONOOqqqqL9M0LLl3l3l2l3J3J4
$$ 195 179 162 146 126 107 32 -42 -90 -79 -41 -3 5 15 -10 -36 -47 -59 -10 37 70 103 100 97 103 108 114 120 112 104 96 88 127 167 170 173 140 107 75 42 55 69
3750F9M9N0J6J6J6J7rqrqk8k7k8k8J%J3N0O6L1k9k9j3K3L9L9K1K2K2K1j1j1j2j1qqm2m2j2
$$ 69 118 168 184 200 216 233 224 216 207 199 171 144 116 88 89 89 102 152 218 249 220 191 178 201 240 279 300 322 344 365 354 343 331 320 312 304 262 220 208
3733B08K5L8L8j4n0k7k8k8QJ0k6n4j8O3O3L0l0n4n4m4rQPj9k0mL2J6J6j7j8j5j5K1K0J8J8
$$ 208 233 271 309 295 245 218 190 162 170 180 154 100 82 145 208 238 208 154 100 56 47 55 62 43 23 19 51 67 83 66 48 33 18 39 59 77 95
3717I5J8J8J1J1J2J1j4j3j4j4J9K0J9J9QRQQj2j3j3j2k0k1j8j7K2N8L9L8MMl3l2j8j9j8j9
$$ 95 113 131 142 153 165 176 162 149 135 121 140 160 179 198 206 215 223 231 219 206 193 181 161 140 122 105 127 185 224 262 266 270 237 205 187 168 150 131
3700A31k9l0j3K2N6N7M3Pl1l2l4l4K3K2K3K3NML9L8L1mk0k0qqqqj1j0j1j0rrrr%j%%J0J0R
$$ 131 102 72 59 81 137 194 237 244 213 181 147 113 136 158 181 204 209 213 252 290 321 317 297 277 269 261 253 245 234 224 213 203 194 185 176 167 167 166 166 166 176 186 195
3681A95J0O8O8M9k3p7p6m5m5K4K4K4K4J7J7J7J7OONOo3o3llQQk6k5K8O5M9k3o5o6l4l4n8n7
$$ 195 205 273 341 390 367 290 214 169 124 148 172 196 220 237 254 271 288 294 300 305 311 248 185 182 179 187 195 169 144 172 237 286 263 198 132 98 64 6 -51
3665e1l8L3P8P9P9P8R5K4k1k0j7j7j7j8rrP1P0L3l9n5j8j5j4m8m7ppopK2K1N8N7QQn2n1j5
$$ -51 -89 -56 22 101 180 258 353 377 356 336 319 302 285 267 258 249 320 390 423 384 329 311 296 282 234 187 180 173 167 160 182 203 261 318 326 334 282 231 216
3648B16j4j4j5j8j8j8j8M1M2M1M1j9j8M1M1L3L3n1n0m3m2m3m2j3j4K3K3K5K5j1j1j9k0J7J6
$$ 216 202 188 173 155 137 119 101 142 184 225 266 247 229 270 311 344 377 326 276 233 191 148 106 93 79 102 125 150 175 164 153 134 114 131 147
3632A47K6K5j0j0RJ0M6M5K6K6j0rj1j0m6m6p4p3p1j1N3N5K3K3l1l1MNQ6Q5L6k4k2k2m3m3l5
$$ 147 173 198 188 178 187 197 243 288 314 340 330 321 310 300 254 208 134 61 -10 -21 32 87 110 133 102 71 75 80 166 251 287 263 241 219 176 133 98
3616I8l4KJk9k8L1L1Q7Q7Q5K6j8j7L9L8K3K3l7l8k0k1k1k0l7l7l7l7kkkjj9j9J8J7M2M2OO
$$ 98 64 66 67 38 10 41 72 159 246 331 357 339 322 361 399 422 445 408 370 350 329 308 288 251 214 177 140 138 136 134 133 114 95 113 130 172 214 220 226
3600B26m3m2J7J8M3M3OPm2m2oprrrqJ1J2ooj7j6K0J9j2j3j3j2NONOn2n3l3l5P4P4L8L9kkj
$$ 226 183 141 158 176 219 262 268 275 233 191 185 178 169 160 151 143 154 166 160 154 137 121 141 160 148 135 122 110 115 121 126 132 80 27 -6 -41 33 107 145 184 182 180 179
3581A79kNONNk7k6k7k7L4L4L4L4L3L3llm6m5j0j0J1J0M7M7k3k3m1m1j4j4MMj8j8j%j8j7l6
$$ 179 177 182 188 193 198 171 145 118 91 125 159 193 227 260 293 290 287 241 196 186 176 187 197 244 291 268 245 204 163 149 135 139 143 125 107 106 106 88 71 35
3564C5l5j5j6M4M4K6K5j1j0l2l2j4j3OQk8k9k5k5J0J1K4K3N9O0N2N2J6J6J7J7j%k0k0J6J6
$$ 35 0 -15 -31 13 57 83 108 97 87 55 23 9 -4 2 10 -18 -47 -72 -97 -87 -76 -52 -29 30 90 142 194 210 226 243 260 259 259 239 219 235 251
3548B51k2k3J4J3M4M5j6j6j6j6j7j6l5l5JJJ6J5m4m4j7j7%JooJ2J2M2M2M1M2l3l2l3l3RQQ
$$ 251 229 206 220 233 277 322 306 290 274 258 241 225 190 155 156 157 173 188 144 100 83 66 66 67 61 55 67 79 121 163 204 246 213 181 148 115 124 132 140
3531A40Rm6m5rj0K7K8rronN3N4L9L8KLonpqkl8l6%M1P7N7N6N6K0j9k0k6k7k6k6l7l8kjJ9J9
$$ 140 149 103 58 49 39 66 94 85 76 70 65 118 172 211 249 251 254 248 243 236 228 226 188 152 152 193 270 327 383 439 459 440 420 394 367 341 315 278 240 238 237 256 275
3512B75j7j7QQPQj9j8J7J7J7J7j9j8k4k4k2k2j7J8L5L4mmK9L0Kl3j3j3o5o5k7RK8ppK9P8M2
$$ 275 258 241 249 257 264 272 253 235 252 269 286 303 284 266 242 218 196 174 157 175 210 244 240 236 265 295 297 264 251 238 173 108 81 90 118 111 104 133 211 253
3495B53Jl5l2l3n5j9J8J7j4j4RM4N8N8Ml1m5m5j7J9K0j7l2l2OM1N2N3J9J9k6k5k6k5J1J2J1
$$ 253 254 219 187 154 99 80 98 115 101 87 96 140 198 256 260 229 184 139 122 141 161 144 112 80 86 127 179 232 251 270 244 219 193 168 179 191 202
3479B02J1pqrj0Ml2m7m8mnnmnmnnM2M1P4P3L2k8n5n4j8j9n4n3n8n8k2k2J9J8J8J9J7J6J7J7
$$ 202 213 206 198 189 179 183 151 104 56 52 47 42 38 33 29 24 19 61 102 176 249 281 253 198 144 126 107 53 0 -58 -116 -138 -160 -141 -123 -105 -86 -69 -53 -36 -19
3461a9Q4Q5K5K5pqqpJ6J7%p3q0m5J5J4j9j8j9j9j5j6K1K0M8M9J2J3L0L0O6O5l1l1l1l1j4j4
$$ -19 65 150 175 200 193 185 177 170 186 203 203 130 50 5 20 34 15 -3 -22 -41 -56 -72 -51 -31 17 66 78 91 121 151 217 282 251 220 189 158 144 130
3444A30j3j4k3k4k3k3J8J8J8J8M1M1P3P3jp3n3j7k2k3p5p5k3M8O7O8J0J1J0J0k2k1J5J4KJ
$$ 130 117 103 80 56 33 10 28 46 64 82 123 164 237 310 309 236 183 166 144 121 46 -29 -52 -4 63 131 141 152 162 172 150 129 144 158 160 161
3429A61JJj8j7j8j7j2j1j2j1J9J9K0J9L1L2nnj8j8M2M2j6j6j6j6k3k3k4k3L5L5%jllL1L1N
$$ 161 162 163 145 128 110 93 81 70 58 47 66 85 105 124 155 187 182 177 159 141 183 225 209 193 177 161 138 115 91 68 103 138 138 137 134 131 162 193 198
3412A98l2m7m7qpJ0J0j9j8j6M3P9P9O7L1k0j9k3J2RQppJ4J4k1k2OPOOj9j9j9k0J9J8J9J8L
$$ 198 166 119 72 64 57 67 77 58 40 24 67 146 225 292 323 303 284 261 273 282 290 283 276 290 304 283 261 267 274 280 286 267 248 229 209 228 246 265 283 286
3395B86Lj5j4J5J5j8j8k0J6J6j9l4l4J%J2J2L0L1j5j5l0l0j5K1N9N8L4lj8j8k3k4k3k4qrq
$$ 286 289 274 260 275 290 272 254 234 250 266 247 213 179 180 180 192 204 234 265 250 235 205 175 160 181 240 298 332 329 311 293 270 246 223 199 191 182 174
3378A74rllL3L3K5K5PPk1k1mL1MMj3K2L3L3J9j6j1j2K3N8M7j3l7l7LMl6p2o5o5l2l1j1j0K3
$$ 174 165 162 159 192 225 250 275 282 289 268 247 243 274 278 282 269 291 324 357 376 360 349 337 360 418 465 452 415 378 381 385 349 277 212 147 115 84 73 63 86
3361H6K3L4jl9l9oL1M6M6NNK3K3K2K2l8l7J3J4J4J4j2j2K4K3J5J5k1k1L0L1noklklj3j4l1
$$ 86 109 143 142 103 64 58 89 135 181 186 191 214 237 259 281 243 206 219 233 247 261 249 237 261 284 299 314 293 272 302 333 328 322 320 317 315 312 299 285 254
3343B54l1p1p0l4l4poopqpN1N2L0L0opMNMMJ5J6J6J5J7J7kjk0k0J5J6j9j8j9j9NMNMj2j2j3
$$ 254 223 152 82 48 14 7 1 -5 -12 -20 -27 24 76 106 136 130 123 127 132 136 140 155 171 187 202 219 236 234 233 213 193 208 224 205 187 168 149 154 158 163 167 155 143 130
3324A30j2K0K0L9L8M0M0MNmmm0m0k9k9j1j1JKK0J9PPM3M3L0L1k9l0j3j4j3j4ooN4N3kkkkk0
$$ 130 118 138 158 197 235 275 315 319 324 320 316 276 236 207 178 167 156 157 159 179 198 205 212 255 298 328 359 330 300 287 273 260 246 240 234 288 341 339 337 335 333 313
3306C13k1n7n6J0J1M7M6K1K1l8l9k2k1J4J4M4M3M3M4J4J4m6m6m2m1onKLLKn2n2j6j6L8L8k2
$$ 313 292 235 179 189 200 247 293 314 335 297 258 236 215 229 243 287 330 373 417 431 445 399 353 311 270 264 259 261 264 267 269 217 165 149 133 171 209 187
3290A87k2l3l4LLK9K9L0K9j3j4j3j3K7K8K7K8L7L7l4r5q2m7j1j1N2N1P0O9j3j3j3j3j0rj0
$$ 187 165 132 98 101 104 133 162 192 221 208 194 181 168 195 223 250 278 315 352 318 223 141 94 83 72 124 175 245 314 301 288 275 262 252 243 233
3274B33j0k9l0POmmk1k2rj0rrk2k2J5J4N4N5N4N4j4j4j5j4RQk7k7l7l7j8j9PPK6K5mmk3k2
$$ 233 223 194 164 171 177 173 169 148 126 117 107 98 89 67 45 60 74 128 183 237 291 277 263 248 234 243 251 224 197 160 123 105 86 93 100 126 151 147 143 120 98
3256I8JJn5n5nN3M1Nk5k5RRJ0J0k6k6ppJ1J0M6M5K7K7j5j5K5O0K8K8noj2j3K3K4L6L6%%pp
$$ 98 99 100 45 -10 -15 38 79 84 59 34 43 52 62 72 46 20 13 6 17 27 73 118 145 172 157 142 167 227 255 283 278 272 260 247 270 294 330 366 366 366 359 352
3238C52ppmmm0m0k2k1k2k2j0j0K6K6J1J1K6K5Ln7o0n9KLLKrrK8O4P3L7lm0k3k4qqj3j4p2p1
$$ 352 345 338 334 330 290 250 228 207 185 163 153 143 169 195 206 217 243 268 271 214 154 95 97 100 103 105 96 87 115 179 252 289 286 246 223 199 191 183 170 156 84 13
3220A3o4k9J4N0Q1Q3O6L1j5n0l0l0J8N3L3L3J%j6n1o0n9k2J3M9M9Q5Q4N4J8m6m6l6l6%jJ1
$$ 13 -51 -80 -66 -16 65 148 214 245 230 180 150 120 138 191 224 257 258 258 242 191 131 72 50 63 112 161 246 330 384 402 356 310 274 238 238 237 248
3204B48J1k5k5POM2M3L6L6K7J12K00K36J42l7j76j77j48j12o0o1k2k2J5J5k2n8o9l4K8K8j9
$$ 248 259 234 209 216 222 264 307 343 379 406 518 718 954 1096 1059 883 706 558 446 386 325 303 281 296 311 289 231 162 128 156 184 165
3190A65j8j5j5K5Q6Q5K5m3m3J3J3QRk8k7J2J2J1J2n3n3j7j8J%L6L6J2J1J2J1j3j2K3K3%%o0
$$ 165 147 132 117 142 228 313 338 295 252 265 278 286 295 267 240 252 264 275 287 234 181 164 146 147 147 183 219 231 242 254 265 252 240 263 286 286 286 226
3173B26o0k4k5J2J1L4L4P0P0K6K6rj0k8k9k8k9m0m0K0J9J0J0k6k6K3K3Q2Q2L4L4L3L4N1N0
$$ 226 166 142 117 129 140 174 208 278 348 374 400 391 381 353 324 296 267 227 187 207 226 236 246 220 194 217 240 322 404 438 472 505 539 590 640
3158F40j0rKKl5l4K0J9N6N5kkK4Q4R4R4J27J86K35K71L86N41P18R69J371J694J439M45p67
$$ 640 630 621 623 625 590 556 576 595 651 706 704 702 726 810 904 998 1125 1311 1546 1817 2203 2744 3462 4431 5802 7496 8935 9380 8613
3146H613j473j460j065p30n27l79k23q3M9K25M52P44R47Q28K41n01r93r95p68o06m99l82k26
$$ 8613 7140 5680 4615 3885 3358 2979 2756 2673 2722 2947 3399 4143 5090 5918 6159 5658 4665 3670 2902 2296 1797 1415 1189
3136A189j47j47j19n8n6n7l0l0l0l0k0j9k0k0j4j4n1n0k1k0Ll3l6K4P1P1O3O2KLm5m6rj0J1
$$ 1189 1042 895 776 718 662 605 575 545 515 485 465 446 426 406 392 378 327 277 256 236 239 206 170 194 265 336 399 461 463 466 421 375 366 356 367
3121C67J1m9m9n4n3L0L0K9K8ppm5m5J5J6J2J2k4k4MMMMl7l7K3K3K0K0K0K0K3K3j3j2PPQPj3
$$ 367 378 329 280 226 173 203 233 262 290 283 276 231 186 201 217 229 241 217 193 197 201 205 209 172 135 158 181 201 221 241 261 284 307 294 282 289 296 304 311 298
3103B98j4j3j4opK9K9J9J9J9J9O4O5J4m5o3o2o7o6k7k6L3L3J9K0j5j4J1M7K7l3p1l5K5K4k2
$$ 298 284 271 257 251 244 273 302 321 340 359 378 442 507 521 476 413 351 284 218 191 165 198 231 250 270 255 241 252 299 326 293 222 187 212 236 214
3088B14k3k2k3mmmmL7L7JJk0k0k1k0J8J9J8J9m5m5rrK8K7K8K8K9K9K9K9QRQQj0j0j0j1n0n1
$$ 214 191 169 146 142 138 134 130 167 204 205 206 186 166 145 125 143 162 180 199 154 109 100 91 119 146 174 202 231 260 289 318 326 335 343 351 341 331 321 310 260 209
3070B09J0RlmL3L2NNNNj8j7n4n3J4J4J4J4kkL4L4NNl1l1L3L3R3R3K4K4K4K4J6J7J7J7RJ0M5
$$ 209 219 228 225 221 254 286 291 296 301 306 288 271 217 164 178 192 206 220 218 216 250 284 289 294 263 232 265 298 391 484 508 532 556 580 596 613 630 647 656 666 711
3052G11M5R9R8J58J57K32K31L52L53M95P12J015J373J951K597K588J416n86k188k631k176
$$ 711 756 855 953 1111 1268 1500 1731 2083 2436 2931 3643 4658 6031 7982 10579 13167 14583 13997 11809 9178 7002
3043G002j577j170r04o41m63l91l27k07j59j59j51j51p2p1l5l6k5k5k5k5K6K5j0j1L9L9L9
$$ 7002 5425 4255 3351 2710 2247 1856 1529 1322 1163 1004 853 702 630 559 524 488 463 438 413 388 414 439 429 418 457 496 535
3031E35L9OPn4n3k7k7k6k7m9m8j3j3j1j1m6m7k2k2oL0O9O9L2lk0k0k0k0rK6M3M2PPk9k9k7
$$ 535 574 580 587 533 480 453 426 400 373 324 276 263 250 239 228 182 135 113 91 85 115 184 253 285 282 262 242 222 202 193 219 262 304 311 318 289 260 233
3015B33k7k7k8lllmk3k3J2J3J2J2J0J0%l6l7%L0K9J7k0l9l9K0N5J4k2%%popommN7R2N9jk4
$$ 233 206 179 151 148 145 142 138 115 92 104 117 129 141 151 161 161 125 88 88 118 147 164 144 105 66 86 141 155 133 133 133 126 120 113 107 103 99 156 248 307 306 282
2997B82k5%%lkRk6o2k7K1K2K3K3j2j1K1K2K5j2n1n1mnL1L1K8K7K7K7J7J6j9j9k4k3m4pL4L5
$$ 282 257 257 257 254 252 261 235 173 146 167 189 212 235 223 212 233 255 280 268 217 166 162 157 188 219 247 274 301 328 345 361 342 323 299 276 232 225 259 294
2980B94J1m8q0p9o8l1m6m7o2k6K1N7L9L9J9J8jL5N8N8K1j5j8j8k0k0j2j2l1ON0Q6O8O8M1M2
$$ 294 305 257 177 98 30 -1 -47 -94 -156 -182 -161 -104 -65 -26 -7 11 10 45 103 161 182 167 149 131 111 91 79 67 36 42 92 178 246 314 355 397
2964C97K6j0l2l3l4l5MLMMonnoj3j4j4j4LLMLopK8K7J0k6o5o5j8j8j6j5l1NM5M5J3J3L7R7
$$ 397 423 413 381 348 314 279 283 286 290 294 288 283 278 272 259 245 231 217 220 223 227 230 224 217 245 272 282 256 191 126 108 90 74 59 28 33 78 123 136 149 186 283
2946B83J10P4j1m7l4Jk1k1l5l4JJJ5J4j9j9oK9M5M5K3K2j4j3k2k2k2k1m6m6l3LK2j4k7k7%
$$ 283 393 467 456 409 375 376 355 334 299 265 266 267 282 296 277 258 252 281 326 371 394 416 402 389 367 345 323 302 256 210 177 180 202 188 161 134 134
2930A34Jl5l5J2J1k4k4jkJ%K7O2M1M0Nl1m7m6j8j7kL4P1P2L3kppK6K6MLl0l0k4J3J2k3o0n9
$$ 134 135 100 65 77 88 64 40 39 37 38 38 65 127 168 208 213 182 135 89 71 54 52 86 157 229 262 260 253 246 272 298 302 305 275 245 221 234 246 223 163 104
2912A04k5k6nnL1L0N1N0J5J5qqqpN7N8N8N8j9k0j9j9n3n4OPk7k8k7k7OPOPO1O1JJl0l0l1l0
$$ 104 79 53 48 43 74 104 155 205 220 235 227 219 211 204 261 319 377 435 416 396 377 358 305 251 257 264 237 209 182 155 161 168 174 181 242 303 304 305 275 245 214 184
2894A84lmlmK1K0j5j5poL0K9J2J3J2J2j3j4n0n0mmL1L2%%l6l5k3k3L8L7L4L4jkM1M0NNj6j6
$$ 184 181 177 174 170 191 211 196 181 174 168 198 227 239 252 264 276 263 249 199 149 145 141 172 204 204 204 168 133 110 87 125 162 196 230 229 227 268 308 313 318 302 286
2876B86j6j6J1J2J1J1m4m4qrL2L2mll3l2l3l2jjjjK0K0K0K0k7k6k7k7K2K1N8N8rqrqj6j5j5
$$ 286 270 254 265 277 288 299 255 211 203 194 226 258 254 251 218 186 153 121 120 119 118 117 137 157 177 197 170 144 117 90 112 133 191 249 240 232 223 215 199 184 169
2858A69j5j0rrj0l8l9k2J3N8N8M5Qj5j5j7j8j7j8J8J8J8J8j8j8j9j9j8j9J8J8J8J8ooopM9
$$ 169 154 144 135 126 116 78 39 17 30 88 146 191 199 184 169 152 134 117 99 117 135 153 171 153 135 116 97 79 60 78 96 114 132 126 120 114 107 156
2841A56M8M7M6Kl4m8m7n9k3J7J7LMl3l2n6n5qN2M4Rk7k6QJ0J0Rl1l0l1l1l2l2QM3O2O2K6K6
$$ 156 204 251 297 299 265 217 170 111 88 105 122 125 129 96 64 8 -47 -55 -3 41 50 23 -3 5 15 25 34 3 -27 -58 -89 -121 -153 -145 -102 -40 22 48 74
2824G4K8qk4k4L1L2L1L2kjl6l5lL2J3J2oonmk8QK4K3K4K5K4K4l7l7%L6L2mm1m1L6L6jl7n0
$$ 74 102 94 70 46 77 109 140 172 170 169 133 98 95 127 140 152 146 140 135 131 103 111 135 158 182 207 231 255 218 181 181 217 249 245 204 163 199 235 234 197 147
2807A47j4K3K3L4L5L4L4opppL7L6L7L6m7m7j03j04q7k8K2K2qrm4m4j6j7O7O6J6J5J6J5M3M2
$$ 147 133 156 179 213 248 282 316 310 303 296 289 326 362 399 435 388 341 238 134 47 19 41 63 55 46 2 -42 -58 -75 -8 58 74 89 105 120 163 205
2791B05OPK9L0pon1n2RQ%j%jopppK6K6O2O2K9K8l1l1l5l4l4l4J5J6J5J6L4L4k6k5j9j9j8j9
$$ 205 211 218 247 277 270 264 213 161 170 178 178 177 177 176 170 163 156 149 175 201 263 325 354 382 351 320 285 251 217 183 198 214 229 245 279 313 287 262 243 224 206 187
2772A87L1L1onk3k3k3k3m1m1m2m0n4n3mN6R9J00J00J00O2Lk4k3o1o0o0o0n8n6k1k1N1N1N1
$$ 187 218 249 243 238 215 192 169 146 105 64 22 -18 -72 -125 -129 -73 26 126 226 326 388 391 367 344 283 223 163 103 45 -11 -32 -53 -2 49 100
2757A00N1k4k3k4k4J3J3J3J2K7K7rrn3n3L0L1L8L9KLPPPPJJJJJ8J8J8J8j3j3o9o9n0J1O0O0
$$ 100 151 127 104 80 56 69 82 95 107 134 161 152 143 90 37 67 98 136 175 177 180 187 194 201 208 209 210 211 212 230 248 266 284 271 258 189 120 70 81 141 201
2740B01O0O0K3K4l4l4l4l3J3J4k3k2m7m7p7p7o6J7J19J21Q5Kl6l5J4J3J3J3n7n7k2k1J0J0
$$ 201 261 321 344 368 334 300 266 233 246 260 237 215 168 121 44 -33 -99 -82 37 158 243 245 209 174 188 201 214 227 170 113 91 70 80 90
2725I0J0RK2K1K1K1k6k5k5k6J8J7J7J8ppm3m2j0j0K6K7ppopmmnmL7L6L7L6J8J7%jM3M3PPp3
$$ 90 100 109 131 152 173 194 168 143 118 92 110 127 144 162 155 148 105 63 53 43 69 96 89 82 76 69 65 61 56 52 89 125 162 198 216 233 233 232 275 318 325 332 259
2706B59p3l7l7N5N4Q6Q7L6k4n0n0ook3k4p9p8o0o0K1J9K1K0OONOM0M0K2K2m6m5J4J4O1O2J1
$$ 259 186 149 112 167 221 307 394 430 406 356 306 300 294 271 247 168 90 30 -30 -9 10 31 51 57 63 68 74 114 154 176 198 152 107 121 135 196 258 269
2690B69m8p2p2j2K4K1K0K2K3POPPLL%Jqm3m4pOOm9n0m6j1NMJ9J9J9J9L3L3L5%o5o5l9J9P8
$$ 269 221 149 77 65 89 110 130 152 175 182 188 195 202 205 208 208 209 201 158 114 107 113 119 70 20 -26 -37 -32 -28 -9 10 29 48 81 114 149 149 84 19 -20 -1 77
2671G7Q0Q2Q1P1L4rm5l2l2j%Nl1r2r2o4k8j0j0OM1M2Pmnmmk4J2N2N1N0M9J4J3J5J5J5J5J2
$$ 77 157 239 320 391 425 416 371 339 307 306 306 311 280 188 96 32 4 -6 -16 -10 31 73 80 76 71 67 63 39 51 103 154 204 253 267 280 295 310 325 340 352
2654C52J2J1J2k3k3m1m1n5n6j5K0J6J5j5j6j6K0Q1Q1M0Nj1j1k7k6k7k7k9k9k7k7LL9J8J8j2
$$ 352 364 375 387 364 341 300 259 204 148 133 153 169 184 169 153 137 157 238 319 359 364 353 342 315 289 262 235 206 177 150 123 126 165 183 201 189
2639A89j2l0l0j9j9J7J6J6J6J6J6l3l3MLO0O0L3k6n0n1LLlm0j7M3N9O0LLk7k7q4q3nN6M1O
$$ 189 177 147 117 98 79 96 112 128 144 160 176 143 110 114 117 177 237 270 244 194 143 146 149 146 106 89 132 191 251 254 257 230 203 119 36 31 87 128 134
2622A34k1k0L7L7M1M1NNkkL3L4n1n1o9o9K9K9O4O5OOl0k9LMO4R9P1J2m1p6o7o7p0o9K6K6Q
$$ 134 113 93 130 167 208 249 254 259 257 255 288 322 271 220 151 82 111 140 204 269 275 281 251 222 225 229 293 392 463 475 434 358 291 224 154 85 111 137 145
2605A45Qk3k3O1O1QPk9k9k6k7rrnmJ4J3k9k8k9k9N7N7P3L8j0p0p2j2J9K0l7l7J%L7L6J3J3
$$ 145 153 130 107 168 229 237 244 215 186 160 133 124 115 110 106 120 133 104 76 47 18 75 132 205 243 233 163 91 79 98 118 81 44 45 45 82 118 131 144
2588A44k3k3n1n1l3l4J7J7L4L4O7O8L2L1o1o2o1o1ppRM4N9N8KJJ6J6J7J6rqm4m5n3n2j4K1
$$ 144 121 98 47 -4 -37 -71 -54 -37 -3 31 98 166 198 229 168 106 45 -16 -23 -30 -21 23 82 140 142 143 159 175 192 208 199 191 147 102 49 -3 -17 4
2571DM9M9J6J5J6J5J5J6J3J3J3J3K8K9M7J1k8o3o6k9lljjj2j2j5K2K4K3j1m7n0j4K3K4K3K4
$$ 4 53 102 118 133 149 164 179 195 208 221 234 247 275 304 351 362 334 271 205 176 173 170 169 168 156 144 129 151 175 198 187 140 90 76 99 123 146 170
2555A70j6n2k8k8PM3K9pk0k0L2L3L2L2J3J3k3k3kll6l6k6RPPj4j5M6M5JJjL4K6K6qpj3j3m8
$$ 170 154 102 74 46 53 96 125 118 98 78 110 143 175 207 220 233 210 187 185 182 146 110 84 93 100 107 93 78 124 169 170 171 170 204 230 256 248 241 228 215 167
2537A67m9p6p4o0k4J0RJ5J4N9R3P3J2jjJ3J3PPK5K5QQK4K4m5q1r7o1pK8J1J0K3K2j3j3j7j7
$$ 167 118 42 -32 -92 -116 -106 -97 -82 -68 -9 84 157 169 168 167 180 193 200 207 232 257 265 273 297 321 276 195 98 37 30 58 69 79 102 124 111 98 81 64
2520F4j7j7j2j2M6M5M0Ll6l6l3l2PM3M3M3M5M5JKJKm2m2mL1L5jl8l8qrL1O8P9Q0K0K0j3m9
$$ 64 47 30 18 6 52 97 137 140 104 68 35 3 10 53 96 139 184 229 230 232 233 235 193 151 147 178 213 212 174 136 128 119 150 218 297 377 397 417 404 355
2503C55o5o5l8l8k3J4N9N9K6K5mmm0m1k2k3J4J3KLKKj0j0K6K6QQQQl1l0NN%%%%J9J9J9J9K6
$$ 355 290 225 187 149 126 140 199 258 284 309 305 301 261 220 198 175 189 202 204 207 209 211 201 191 217 243 251 259 267 275 244 214 219 224 224 224 224 224 243 262 281 300 326
2484C26K5M6J0j2j2j4j4mml9m0l9l8K2N9N6K0m1m1j8j8j8j8k4k4L6L6J7J7J4J5j6n2n2j6P
$$ 326 351 397 407 395 383 369 355 351 347 308 268 229 191 213 272 328 348 307 266 248 230 212 194 170 146 182 218 235 252 266 281 265 213 161 145 152
2469A52PRRPPNNll9n5n5qqpqK9K9O3O2L5kj7j7poRM5P1P2L5L5J1k6m1m1n2n2n0n1NM0M0Mj3
$$ 152 159 168 177 184 191 196 201 198 159 104 49 41 33 26 18 47 76 139 201 236 234 217 200 193 187 196 241 312 384 419 454 465 439 398 357 305 253 203 152 157 197 237 241 228
2450B28j2j4j5L3L3L3L3j%%%jkJ9j7n2n1l9kOPK4O0N6N6om2n0n0QPJ6J5k0k0j5j5j5j5l6l6
$$ 228 216 202 187 220 253 286 319 318 318 318 318 317 315 334 317 265 214 175 173 179 186 210 270 326 382 376 334 284 234 242 249 265 280 260 240 225 210 195 180 144 108
2432A08n4j8OM3M5J0n5n5m1oM3M5M6M7J6J6J6J6K6K6K7K6m0m0m0m0l0k9MMjl6n0m8pK9M3M3
$$ 108 54 36 42 85 130 140 85 30 -11 -17 26 71 117 164 180 196 212 228 254 280 307 333 293 253 213 173 143 114 118 122 121 85 35 -13 -20 9 52 95
2415I5L7Kl7l8K0J9K0K0JJJKl8l7l8l6L1L1L1L2j9j8j9j9J5J4J4J5N7N7N6N7L6L6M1M0J19
$$ 95 132 134 97 59 79 98 118 138 139 140 141 143 105 68 30 -6 25 56 87 119 100 82 63 44 59 73 87 102 159 216 272 329 365 401 442 482 601
2399F01J90K09R0r0k09k26j54j08j08l8L3Q3M7J1J2L1L1L0L1k4k4k3k4l1l0l0l0l9l9m0l9
$$ 601 791 1000 1090 1000 791 565 411 303 195 157 190 273 320 331 343 374 405 435 466 442 418 395 371 340 310 280 250 211 172 132 93
2386I3k4k3k4k3M3M3QQm6m6j0j0K3K4K4K5qqpqM5M6RJ0n0n1n0m9J9J7J9J8j7j6J9J9P2P2J2
$$ 93 69 46 22 -1 42 85 93 101 55 9 -1 -11 12 36 60 85 77 69 62 54 99 145 154 164 114 63 13 -36 -17 0 19 37 20 4 23 42 114 186 198
2369A98J1rj0rj0qrK7K7MMl1l2KJKKl8l7kkL5L4jjM5M6L0pj5j5j8j7j9j9n2n1j7M2O6O6pm2
$$ 198 209 200 190 181 171 163 154 181 208 212 216 185 153 155 156 158 160 122 85 83 81 116 150 149 148 193 239 269 262 247 232 214 197 178 159 107 56 39 81 147 213 206 164
2350A64k3k2j7j7j5j5k8PM5M5M0Ml3l3QM3K4K3JJn7n6k8RK4K4l5l4l2l1kL2M9M9KKKKL4L3
$$ 164 141 119 102 85 70 55 27 34 79 124 164 168 135 102 110 153 177 200 201 202 145 89 61 70 94 118 83 49 17 -14 -16 16 65 114 116 118 120 122 156 189
2333A89klnnj9n5m1nL3L2L3L2k5k5JL8L7Kk7k7k7k6j5K1N9N8M0Ml4l3K2N8L7k2j9J7K8K9l0
$$ 189 187 184 179 174 155 100 59 54 87 119 152 184 159 134 135 173 210 212 185 158 131 105 90 111 170 228 268 272 238 205 227 285 322 300 281 298 326 355 325
2316C25l1k8k8l5%J6J6K3K2j3j4k2k3%l6n8k3J5J5J4J4J4J4M9M8L3lk2k3L9P4Q3Q3Q9Q9J24
$$ 325 294 266 238 203 203 219 235 258 280 267 253 231 208 208 172 114 91 106 121 135 149 163 177 226 274 307 304 282 259 298 372 455 538 627 716 840
2300H40J96J88J16m2j62k02k03j27n6J2J2m1m0m0m1j2j3j3j2%J%JJ6J5J6J5j7j8j7j8j5j6
$$ 840 1036 1224 1340 1298 1136 934 731 604 548 560 572 531 491 451 410 398 385 372 360 360 361 361 362 378 393 409 424 407 389 372 354 339 323
2286C23j5j5k7k7QRJ9K0J9J9k9k9o5o5j4j4K2K1l9m0l5l5RQ1R7O0OOLMl3l2N1N1N7N8N7N7
$$ 323 308 293 266 239 247 256 275 295 314 333 304 275 210 145 131 117 139 160 121 81 46 11 20 101 198 258 264 270 273 277 244 212 263 314 371 429 486 543
2270E43j7j8j7j8p0p0L8L8OOO6O6LKNNn7k0J02J75J69K41L27L26L82N97R72J236J654K588
$$ 543 526 508 491 473 403 333 371 409 415 421 487 553 556 558 563 568 511 491 593 768 937 1178 1505 1831 2213 2810 3782 5018 6672 9260
2257I260L562L299J095j848l543l377k297j507j116q05m61l42l42k70j31n9r5r5l2l2o8o8
$$ 9260 12822 16121 17216 15368 11825 8448 6151 4644 3528 2723 2262 1920 1578 1308 1177 1118 1023 928 896 864 796 728
2247G28l9m0l9m0m3m3o4k7J7J7k0n7l6l6JL8N9O0K7K6O6O6k2n7n8n9k5k4JKl5l4KLK3j3j5
$$ 728 689 649 610 570 527 484 420 393 410 427 407 350 314 278 279 317 376 436 463 489 555 621 599 542 484 425 400 376 377 379 344 310 312 315 338 325 310
2231C10j6j8j9j5j4j5j5J8J9k1n7m7m7j3j4KJKJL7L6L7L6klklklk3J3L3L2k9o4o7o6k8PL4
$$ 310 294 276 257 242 228 213 198 216 235 214 157 110 63 50 36 38 39 41 42 79 115 152 188 186 183 181 178 176 173 150 163 196 228 199 135 68 2 -26 -19 15
2214A5L5K1j4j0j0j3j2L0L1L0L1QQRQpoppJ0J0J0J0J9J9J9J9l9l9l7l6J1M8M8J2ppK7K7j8
$$ 15 50 71 57 47 37 24 12 42 73 103 134 142 150 159 167 160 154 147 140 150 160 170 180 199 218 237 256 217 178 141 105 116 164 212 224 217 210 237 264 246
2196B46j9j8j8lmL0L0J8j9KKk2k1q2q1j7j7j6j7j2j2M8M7M5M5M5M5J3J4k3k2jjN4N5O5ok6
$$ 246 227 209 191 188 184 214 244 262 243 245 247 225 204 122 41 24 7 -9 -26 -38 -50 -2 45 90 135 180 225 238 252 229 207 206 205 259 314 379 373 347
2180C47k6OPl0l0m2m2m2m2k4k3k4k3N0N1N0N1%j%%N2N2N3N2%%l6l6n7n7k1k1PQPQnmmmNMN
$$ 347 321 327 334 304 274 232 190 148 106 82 59 35 12 62 113 163 214 214 213 213 213 265 317 370 422 422 422 386 350 293 236 215 194 201 209 216 224 219 215 211 207 212 216 221
2161B21NK4K5K4K4L5L6j%m5m4m5m4m6m5J5J4M9N0j1j0k7k6k6k6k2k1n8n6k5k4J1J2N2N1N2
$$ 221 226 250 275 299 323 358 394 393 393 348 304 259 215 169 124 139 153 202 252 241 231 204 178 152 126 104 83 25 -31 -56 -80 -69 -57 -5 46 98
2145I8N2klklm2m2m2m1kkL3L4K0J9j7j7N7N6K3K3M0P5M0Mj3j3j5j4o2o1p9m4K5O1O3K7OOO
$$ 98 150 148 145 143 140 98 56 14 -27 -29 -31 2 36 56 75 58 41 98 154 177 200 240 315 355 359 346 333 318 304 242 181 102 58 83 144 207 234 240 246 252
2128B52OK3O0O9P0J4p0j04j04m8j1l0k9l1Oj5j5mlmmQRQQRRmm1n4j9J8J8K8K9K7K7kl9j8j8
$$ 252 258 281 341 410 480 494 424 320 216 168 157 127 98 67 73 58 43 39 36 32 28 36 45 53 61 70 79 75 34 -20 -39 -21 -3 25 54 81 108 106 67 49 31
2110C1K7K7K4K5K7qm8m9n0m9j1K5J4J4j9k0m4m4o3k6M6Q2O5O3O1O1M5J0MMl4l4k3k3k3k3l5
$$ 31 58 85 109 134 161 153 105 56 6 -43 -54 -29 -15 -1 -20 -40 -84 -128 -191 -217 -171 -89 -24 39 100 161 206 216 220 224 190 156 133 110 87 64 29
2094B9l4j9J6L0L1N3J8lkmnmnmnL1L1L0L1K4K4Qk8l8l9onm8m7j2j2ook4J2M6Q2Q2M7k5o0m3
$$ 29 -5 -24 -8 22 53 106 124 121 119 115 110 106 101 97 92 123 154 184 215 239 263 271 243 205 166 160 155 107 60 48 36 30 24 0 12 58 140 222 269 244 184 141
2076A41m2MMMML3L2llQRQQJ1J1J1J2QQM4M4J0J0k9o6p1p2l4KPPM5M4j2j3j3j2rqM9M9K0j5
$$ 141 99 103 107 111 115 148 180 177 174 182 191 199 207 218 229 240 252 260 268 312 356 366 376 347 281 210 138 104 106 113 120 165 209 197 184 171 159 150 142 191 240 260 245
2057B45j5K1M2M2POk8o4m3m4j3j2j3j2k9k8RM5M8J2m8m7m8j2LML7L8L8L8nmnnMMMMk6k5J1
$$ 245 230 251 293 335 342 348 320 256 213 169 156 144 131 119 90 62 71 116 164 176 128 81 33 21 24 28 65 103 141 179 174 170 165 160 164 168 172 176 150 125 136
2039A36J0J8J8J7J8j2j3ML9O5O5J8m3o4o4l2l2n9n8m1pM4M4K1m0l6l5mm%%J6N0P2P1K7l4n0
$$ 136 146 164 182 199 217 205 192 196 235 300 365 383 340 276 212 180 148 89 31 -10 -17 27 71 92 52 16 -19 -23 -27 -27 -27 -11 39 111 182 209 175 125
2023A25j3K2K3L4L4L5L4RRPOJ3k4j09j46j30m7L6P2P2L8K4K4PPPPRQRRQRRQmmmmRJ0j1K5M9
$$ 125 112 134 157 191 225 260 294 303 312 319 325 338 314 205 59 -71 -118 -82 -10 62 100 124 148 155 162 169 176 185 193 202 211 219 228 237 245 241 237 233 229 238 248 237 262 311
2004C11M8J1k5k6k6PQL4L5jjllmlK0K0j7n3n6j9J8J8K2K3j3j4KJKK%J%Jj2j3j2j2k0k1J6J5
$$ 311 359 370 345 319 293 300 308 342 377 376 375 372 369 365 362 382 402 385 332 276 257 275 293 315 338 325 311 313 314 316 318 318 319 319 320 308 295 283 271 251 230 246 261
1985B61J8J8j9j8k7k8j2K4K6K6l3o9l6%kl8n1n0QM3K2j3j2K5M8M8N1N1K5K5l2l3k0J5L1L2
$$ 261 279 297 278 260 233 205 193 217 243 269 236 167 131 131 129 91 40 -10 -2 41 63 50 38 63 111 159 210 261 286 311 279 246 226 241 272 304
1970C04K5K5j1j0l6l5J%m7m7m8m7J4J4J4J4n5n5j9j8K4K5O1O1J4J3k2k2k8k9k9k9m2m2j7M3
$$ 304 329 354 343 333 297 262 263 263 216 169 121 74 88 102 116 130 75 20 1 -17 7 32 93 154 168 181 159 137 109 80 51 22 -20 -62 -79 -36
1954c6R9R9L2k9l2LL9M0K0K0K0J9K0J9j6j6PQPPl0l0L0L0KKp8p8n7MK9K9j9j9J6J7J5J5k1
$$ -36 63 162 194 165 133 136 175 215 235 255 275 294 314 333 317 301 308 316 323 330 300 270 300 330 332 334 256 178 121 125 154 183 164 145 161 178 193 208 187
1937A87k0j4j3j3j4J6J5J5J6k0k0J6J6J7J7J7J7L0L0l0l0m5m5J4J5M1M0k0j9k3k3J4J3L7L6
$$ 187 167 153 140 127 113 129 144 159 175 155 135 151 167 184 201 218 235 265 295 265 235 190 145 159 174 215 255 235 216 193 170 184 197 234 270
1922B70m7m7QRRRMLMMRRRRj2j2j1j2LMMLj6j7K0J9l3l3l3l3J6J7J6J7k3k2J3J3J4J3k2k3M
$$ 270 223 176 184 193 202 211 215 218 222 226 235 244 253 262 250 238 227 215 218 222 226 229 213 196 216 235 202 169 136 103 119 136 152 169 146 124 137 150 164 177 155 132 136
1903A36MNMK2K2j4j4k6k6k7k6jkjkJ0RJ0RM3M2M2M3K1K1K1K1j2j2j2j2nnnnkjjjJ3J4l5r4
$$ 136 140 145 149 171 193 179 165 139 113 86 60 59 57 56 54 64 73 83 92 135 177 219 262 283 304 325 346 334 322 310 298 293 288 283 278 276 275 274 273 286 300 265 171
1885A71j09p2lN6M5j5o1o0j5j5K1K1PPOPRQRRK8K9K8K9RRn0n1p3p4j5j4M1M1M0M1LLLLK4K3
$$ 171 62 -10 -13 43 88 73 12 -48 -63 -78 -57 -36 -29 -22 -16 -9 0 8 17 26 54 83 111 140 149 158 108 57 -16 -90 -105 -119 -78 -37 3 44 47 50 53 56 80 103
1866A03j3j3k7k7k7k7j6j6M3M3K0K0m0l9LLl4l3j4j4j1j1J3P2R8R8POOOj1j1m7m7rrN1N0O7
$$ 103 90 77 50 23 -4 -31 -47 -63 -20 23 43 63 23 -16 -13 -10 -44 -77 -91 -105 -116 -127 -114 -42 56 154 161 167 173 179 168 157 110 63 54 45 96 146 213
1850B13O7QPo4o3mlk9k8k8k8M4M5RRm0m0K0K0K5K5j1j0ppK8K9K3K2K3K2MMl3l2q2q2k2k2J1
$$ 213 280 288 295 231 168 164 161 132 104 76 48 92 137 146 155 115 75 95 115 140 165 154 144 137 130 158 187 210 232 255 277 281 285 252 220 138 56 34 12 23
1832B3J0k5k4M6M7J2J1M0L9N7K0k7q7r2r0JJL7L6K8K8qqK1K1N7N7k1k1k1k1K1K0K0K1m0l9
$$ 23 33 8 -16 30 77 89 100 140 179 236 256 229 142 50 -40 -39 -38 -1 35 63 91 83 75 96 117 174 231 210 189 168 147 168 188 208 229 189 150
1816A50l9l9L0L0L0K9MLLLK2K1o3o2p1p0j1j1L4L4P0P1qrqqm4m4OO5O6O5RJ0J5J5J5J6j3j2
$$ 150 111 72 102 132 162 191 195 198 201 204 226 247 184 122 51 -19 -30 -41 -7 27 97 168 160 151 143 135 91 47 53 118 184 249 258 268 283 298 313 329 316 304
1799C04j3j2jjkjl9l9llL2L1L0K9K5j1k7k6o8o7o6o5l4JL7L9L2mj9j9K5K5K5K5kkkkm6m5l0
$$ 304 291 279 278 277 275 274 235 196 193 190 222 253 283 312 337 326 299 273 205 138 72 7 -27 -26 11 50 82 78 59 40 65 90 115 140 138 136 134 132 86 41 11
1781A1OO3O2M9J3j7j6J9N4N7K0j7j8k5k6J3N0N0N1qpl6l7LL9N2N1J2k3q4j20j20q4l9mJ3J4
$$ 11 17 80 142 191 204 187 171 190 244 301 321 304 286 261 235 248 298 348 399 391 384 348 311 314 353 405 456 468 445 361 241 121 37 -2 -6 7 21
1765B1J1J2J1J1J3J4J3J4PPOPl8l8k2J4K5K5K7K7K2K1L5P0Q0M3Ll4k5k5OOm6q3o2o2k6k5j0
$$ 21 32 44 55 66 79 93 106 120 127 134 140 147 109 71 49 63 88 113 140 167 189 210 245 315 395 438 441 407 382 357 363 369 323 240 178 116 90 65 55
1748E5K6Q0P9M7M6K4K3K4K4l4l4l4l3LMO3O3L1L1k9k9l6l6l7l6J6J7J6J6k8k9k8k9j4j3j4
$$ 55 81 161 240 287 333 357 380 404 428 394 360 326 293 296 300 363 426 457 488 459 430 394 358 321 285 301 318 334 350 322 293 265 236 222 209 195
1733A95j3L5L5L5L5n2n3q9q8kkjkL5L5jjK0J9K0J9j1j1j1j1rqN2N2M4M5QRj2j3m8m8k1k1L9
$$ 195 182 217 252 287 322 270 217 128 40 38 36 35 33 68 103 102 101 121 140 160 179 168 157 146 135 126 118 170 222 266 311 319 328 316 303 255 207 186 165 204
1715B04L8LLLLl8l7l8l7PQM3M3J7J8m3m2j8j7M3M3M5M4j5j5ooN4N4P5P6J5J6q8q9q8q8p8p8
$$ 204 242 245 248 251 254 216 179 141 104 111 119 162 205 222 240 197 155 137 120 163 206 251 295 280 265 259 253 307 361 436 512 527 543 455 366 278 190 112 34
1698C4l4L6N2N2lmmmmmJ9J9l8l9k1J4L0L0M9M9Rk7k7k8k7k8k4J1K7K8mlL3L2%%l6l6l8l7K3
$$ 34 0 36 88 140 137 133 129 125 121 117 136 155 117 78 57 71 101 131 180 229 238 211 184 156 129 101 77 88 115 143 139 136 169 201 201 201 165 129 91 54 77
1680G7K2M0M0K4j2m4m5j1j1qrNM1P3L7K3K4K5K5j1j1l2l2l2l2J1J1nm1o7o7o5o6j4M6R5R6
$$ 77 99 139 179 203 191 147 102 91 80 72 63 68 109 182 219 242 266 291 316 305 294 262 230 198 166 177 188 183 142 75 8 -57 -123 -137 -91 4 100
1664A00O1O1N9N9N9K2Ml2n1n0p1l4KL8K0J9J2J1J2J1j9j9j9j9l4l3KLj2j3m8m9nonok3k2k0
$$ 100 161 222 281 340 399 421 425 393 342 292 221 187 189 227 247 266 278 289 301 312 293 274 255 236 202 169 171 174 162 149 101 52 47 41 36 30 7 -15 -35
1648c5k1K3N8L9L8J9J8N5N4M3M2MMj0m5o0n9QM3Qk8l2l2K5K5M8M7J7J7j1j0L1L1K0K0m5m6
$$ -35 -56 -33 25 64 102 121 139 194 248 291 333 337 341 331 286 226 167 175 218 226 198 166 134 159 184 232 279 296 313 302 292 323 354 374 394 349 303
1632C03n9n8n9n9k2k2M4M4M8M8ooj1j0J9K0J0J1J1J1PQm7m7p4p5k0k0L8L8K1K1mml4l4J7J7
$$ 303 244 186 127 68 46 24 68 112 160 208 202 196 185 175 194 214 224 235 246 257 264 272 225 178 104 29 9 -11 27 65 86 107 103 99 65 31 48 65
1615F5M6M7J3J3J3J3k9k9l0k9onooqrL3L4L2L3l3l3jjJ7J7mlo9o9onK3K3J4J3j6j6j2j1L0
$$ 65 111 158 171 184 197 210 181 152 122 93 87 82 76 70 62 53 86 120 152 185 152 119 118 117 134 151 147 144 75 6 0 -5 18 41 55 68 52 36 24 13 43
1597D3L1K9L0j2j2k3k3mnk6k7k5k7L8L7L8L8K7K8k7k6m9m8J7J8J0J1m3m2p4p3k0k0J6J5N6
$$ 43 74 103 133 121 109 86 63 59 54 28 1 -24 -51 -13 24 62 100 127 155 128 102 53 5 22 40 50 61 18 -24 -98 -171 -191 -211 -195 -180 -124
1582a24N5K9pJ4J3J9J8k0k1JL7N8N9K9K8j4j4ooL4L3K9qm3p9o1k6J7J8K0K0K0K0L2L2J0k6
$$ -124 -69 -40 -47 -33 -20 -1 17 -3 -24 -23 14 72 131 160 188 174 160 154 148 182 215 244 236 193 114 53 27 44 62 82 102 122 142 174 206 216 190
1566A90p2p1l2l1KLM1M3M3Pj5j4RRJ1k5l6l5MMJ1J0J1J1KJKKK0K0kl8l6l7J5J5J4J4l7l7j2
$$ 190 118 47 15 -16 -14 -11 30 73 116 123 108 94 103 112 123 98 62 27 31 35 46 56 67 78 80 81 83 85 105 125 123 85 49 12 27 42 56 70 33 -4 -16
1548a6K4M2PkjN9O0K2j4k3k4J8J7J8J8m3m3l5Jj1m7l9J8P5P4L4jnL0K4K4k9o5o2k6PM3M4P
$$ -16 8 50 57 55 54 113 173 195 181 158 134 152 169 187 205 162 119 84 85 74 27 -12 6 81 155 189 188 183 213 237 261 232 167 105 79 86 129 173 180
1531A80m4q0o0o2qpll9o2k5O7J03Q7N2L7L6N8K2Ll4j8j7k0k0J3J3L3lrj0j1j2K9K9M9J3rq
$$ 180 136 56 -4 -66 -74 -81 -84 -123 -185 -210 -143 -40 47 99 136 172 230 252 255 221 203 186 166 146 159 172 205 202 193 183 172 160 189 218 267 280 271 263
1514B63M7M7nm1m4pK1j6k8k9mmo2o1m3opm2n5n5j8J8PQRJ0J3J4J5J6K8O3M4M4L1L2L1L1M2
$$ 263 310 357 352 311 267 260 281 265 237 208 204 200 138 77 34 28 21 -21 -76 -131 -149 -131 -124 -116 -107 -97 -84 -70 -55 -39 -11 52 96 140 171 203 234 265 307
1498C07M2O2K6l4l4l7l6l2l1l1l1n5n4l1K9L8Kj0j0j6j5j6j5J6J5mL1N2N1J4k1k5k4k6k7J5
$$ 307 349 411 437 403 369 332 296 264 233 202 171 116 62 31 60 98 100 90 80 64 49 33 18 34 49 45 76 128 179 193 172 147 123 97 70 85
1482H5J4J5J5k9k8nm2l1Lj9j9j6j6j7j6J4J5J4J4k4k4J5N2L5L6L9L9OPPPk0k1k0k0K3K4K3
$$ 85 99 114 129 100 72 67 25 -6 -3 -22 -41 -57 -73 -90 -106 -92 -77 -63 -49 -73 -97 -82 -30 5 41 80 119 125 132 139 146 126 105 85 65 88 112 135
1465A35K3L6L6k4k4ppppk2k2k2k2LMl3l2j6j7M2M3P2P2J3J2p5p5p6p4j6j6M3M4L8M0LLj5j5
$$ 135 158 194 230 206 182 175 168 161 154 132 110 88 66 69 73 40 8 -8 -25 17 60 132 204 217 229 154 79 3 -71 -87 -103 -60 -16 22 62 65 68 53 38
1449C8j5j5LMLML3L2L3L3j8j8j8j9j3j3j3j3k4k2N9O0L9L8LLk2k3k2k3k5k6k6k4j1j1j0j1
$$ 38 23 8 11 15 18 22 55 87 120 153 135 117 99 80 67 54 41 28 4 -18 41 101 140 178 181 184 162 139 117 94 69 43 17 -7 -18 -29 -39 -50
1432e0N1N2N2N2N2N2N2N2k0k0k1k0j1j1K4K5L1L1k8k9m8m8j2j2L3L4lljjjjl1l1l1l1j6j7
$$ -50 1 53 105 157 209 261 313 365 345 325 304 284 273 262 286 311 342 373 345 316 268 220 208 196 229 263 260 257 256 255 254 253 222 191 160 129 113 96
1416I6j7j6m2m0M1M2K4K3l6l6jjN9N8L4L4k5k6j2j1j2j1m4m5qrN6N6N7N6J6J5k0k0ppqpm3
$$ 96 79 63 21 -19 22 64 88 111 75 39 38 37 96 154 188 222 197 171 159 148 136 125 81 36 28 19 75 131 188 244 260 275 255 235 228 221 213 206 163
1399A63m2poNNM2M1J6J7j9k0klklPOPOK9K9l2l1m7m8m7m8l6l6K6R7Q6J5k4k4k4k4J2J2K3K2
$$ 163 121 114 108 113 118 160 201 217 234 215 195 193 190 188 185 192 198 205 211 240 269 237 206 159 111 64 16 -20 -56 -30 67 153 168 144 120 96 72 84 96 119 141
1381A41o1o1qpN2N2NMn5n6rj0K4K6nnm0m1nnnnK9K9K9K9P4P3L8L8JKL2L3k4r6j15j14k8k8
$$ 141 80 19 11 4 56 108 113 117 62 6 -3 -13 11 37 32 27 -13 -54 -59 -64 -69 -74 -45 -16 13 42 116 189 227 265 266 268 300 333 309 213 98 -16 -44 -72
1364g2L1L2N1N3pqqrK7K7K2K1l6l7m3pQRK0J9j6j7k6k7J1J1J4N0O2O2J3m7l3LL3L3L4L3K3
$$ -72 -41 -9 42 95 88 80 72 63 90 117 139 160 124 87 44 37 45 54 74 93 77 60 34 7 18 29 43 93 155 217 230 183 150 153 186 219 253 286 309
1347C09j3k9k9llllk1k0k0k1J%JJppK9K9K6K6rj0K2K1K2K2j0j1j0j1j0j0j1j0qqqqnonok8
$$ 309 296 267 238 235 232 229 226 205 185 165 144 145 145 146 147 140 133 162 191 217 243 234 224 246 267 289 311 301 290 280 269 259 249 238 228 220 212 204 196 191 185 180 174 146
1328A46k9j4K1K9ol7jN0Q6N2J7j5j6mL1L5kl8l9j7j6J7J8j1m7k5k4oL0O8O7M5Qk7RL1L2k5
$$ 146 117 103 124 153 147 110 109 159 245 297 314 299 283 279 310 345 343 305 266 249 233 250 268 257 210 185 161 155 185 253 320 365 373 346 355 386 418 393
1311C93k4j8J7L3L3j%j9J8P9J15J63K23K02O9j34k42k22j50o5o6j8j9J8J7K9K8K4K4op8p3
$$ 393 369 351 368 401 434 433 433 414 432 511 626 789 1012 1214 1283 1149 907 685 535 470 404 386 367 385 402 431 459 483 507 501 423 350
1297C50p3j0rj0rl3l2o9o8m8m9J1J2P2P4L8L9LLl2l3RRQR%jL6L5K6K6n8n8j06j05j5N6Q8Q8
$$ 350 277 267 258 248 239 206 174 105 37 -11 -60 -49 -37 35 109 147 186 189 192 160 127 136 145 153 162 162 161 197 232 258 284 226 168 62 -43 -58 -2 86 174
1280A74j5j5L3L4lkk6k6o3o2k6k5N6N8R1R2QRl9l9k4M8L5l6p6p5L3L3L3L2Q6Q6k1k2k1k1n7
$$ 174 159 144 177 211 208 206 180 154 91 29 3 -22 34 92 183 275 283 292 253 214 190 238 273 237 161 86 119 152 185 217 303 389 368 346 325 304 247
1264B47n7NOl0l0j5j6K1K1O9O9Kp0m0m1m4m5M9N0M9M9Q7Q6K7K6O7O7PPL4L3L3L3J14J13O1
$$ 247 190 195 201 171 141 126 110 131 152 221 290 292 222 182 141 97 52 101 151 200 249 336 422 449 475 542 609 616 623 657 690 723 756 870 983 1044
1249A044O1K24L44L16M36Q03J162J452K146L353L760K085j098l593l809k573j497j119q56
$$ 1044 1105 1329 1673 1989 2425 3228 4390 5842 7988 11341 15101 17186 16088 12495 8686 6113 4616 3497 2641
1241B641m98k35k71k72r6k4j07j80p1%m9j21q0rm2m2K3K2m4m4m5m4m9m9J1J1J3J4N0N0J4J5
$$ 2641 2143 1908 1637 1365 1269 1245 1138 958 887 887 838 717 637 628 586 544 567 589 545 501 456 412 363 314 325 336 349 363 413 463 477 492
1227D92J5J5o0o0k4k4k4k4k5k4m1m1J9J9k2k3k2k2OOOOJ5J5P5P4L7L7J%p9q0m4m4rj0rj0q
$$ 492 507 522 462 402 378 354 330 306 281 257 216 175 194 213 191 168 146 124 130 136 142 148 163 178 253 327 364 401 402 402 323 243 199 155 146 136 127 117 109
1210A09pqpj3j3j3j3l5l4K4K4K0K0K0K0kkL0K9L3l8l5l4j9j9J7J6L7L7L7L7NNl1l1qrqrm5
$$ 109 102 94 87 74 61 48 35 0 -34 -10 14 34 54 74 94 92 90 120 149 182 144 109 75 56 37 54 70 107 144 181 218 223 228 197 166 158 149 141 132 87
1192H7m5j0rppmN6R9J00N2rp4j11r1l1K8L0L3L3k2k2k2k2k7k6N5N7L1L0k9k9k7k8RQK4K3K3
$$ 87 42 32 23 16 9 5 61 160 260 312 303 229 118 27 -4 24 54 87 120 98 76 54 32 5 -21 34 91 122 152 123 94 67 39 48 56 80 103 126
1176A26K4NNNNPPPPo5o6l0l0j6j7j8j7L2L0L1L1%%q3q4m1m1nnL7L6P2P1J2J2J2J1L5L5L6L5
$$ 126 150 155 160 165 170 177 184 191 198 133 67 37 7 -9 -26 -44 -61 -29 1 32 63 63 63 -20 -104 -145 -186 -191 -196 -159 -123 -51 20 32 44 56 67 102 137 173 208
1158B08j0j1j2j2j8n3o7pM1M1RRj5j6K0K1J5J6M8M8J2m7r3n8qqnokkl8l6k7k6RJ0k6k6k5k6
$$ 208 198 187 175 163 145 92 25 18 59 100 109 118 103 87 107 128 143 159 207 255 267 220 127 69 61 53 48 42 40 38 0 -36 -63 -89 -80 -70 -96 -122 -147 -173
1141a73N7N7R1R3L7L8L7L7mnm0m1k0k0k1k0J1J1J2J1M7M7j3j3m1m1nnL1L2k9k8j8j9j8j9K9
$$ -173 -116 -59 32 125 162 200 237 274 270 265 225 184 164 144 123 103 114 125 137 148 195 242 229 216 175 134 129 124 155 187 158 130 112 93 75 56 85
1125H5K9K9K8M3M3M3M3l8l8l8l8ONOOLLMLM5M6RRk9k9o4o5k7k8RRk3k3k2k3j2j1j2j2K6K6
$$ 85 114 143 171 214 257 300 343 305 267 229 191 197 202 208 214 217 220 224 227 272 318 327 336 307 278 214 149 122 94 103 112 89 66 44 21 9 -2 -14 -26 0 26
1107B6K7K7M4M4M5M4j5j4j5j5m3m2J7J7OOn4n4QQO9O8K2K2j4j4k1k1n7n7LMLMK9L0oojjjj
$$ 26 53 80 124 168 213 257 242 228 213 198 155 113 130 147 153 159 105 51 59 67 136 204 226 248 234 220 199 178 121 64 67 71 74 78 107 137 131 125 124 123 122 121
1089A21J4J3J4J3j9k0j9k0llklqpN2N2N1N1rql1l1l0l1j5j6M4M5K1K1o3o3n1n1j4j5QQPRL0
$$ 121 135 148 162 175 156 136 117 97 94 91 89 86 78 71 123 175 226 277 268 260 229 198 168 137 122 106 150 195 216 237 174 111 60 9 -5 -20 -12 -4 3 12 42
1071D2L1ono7o8o5o4k7L2N9N9M0L9P4P6M6M6J1J0J2J1m8m8j0j1K5K5k5k6k5k6K1K2K1K2N8
$$ 42 73 67 62 -5 -73 -138 -202 -229 -197 -138 -79 -39 0 74 150 196 242 253 263 275 286 238 190 180 169 194 219 194 168 143 117 138 160 181 203 261
1055B61N8N8N8RRk8k7m1m1ooK5K5k3q3q2m6rK7J3k3l7l6L2L1O8O7J6J6m4m4qqrqm3m3m3m3
$$ 261 319 377 435 444 453 425 398 357 316 310 304 329 354 331 248 166 120 111 138 151 128 91 55 87 118 186 253 269 285 241 197 189 181 172 164 121 78 35 -8
1039hJ1J1J2J1OOO6O6M5M6j5j5J9K0J9K0J6J5J6J6k3k2k3k3n7n8qN2P6P6On4m4m4j1j2rrj0
$$ -8 3 14 26 37 43 49 115 181 226 272 257 242 261 281 300 320 336 351 367 383 360 338 315 292 235 177 169 221 297 373 379 325 281 237 226 214 205 196 186
1022A86rL8L8KKm7m7p8p7m2L9P8P7J9K0J9J9KKl3l4%%L5L6KKn4n4J1P1P0J1m8m8QQL7L7JJ
$$ 186 177 215 253 255 257 210 163 85 8 -34 5 83 160 179 199 218 237 239 241 208 174 174 174 209 245 247 249 195 141 152 223 293 304 256 208 216 224 261 298 299 300
1004C00n0n0n0n0ppopN9N8K3K2lkjjL9P4N2qk5k5k8k8j0rj0rK4K4K4K4l3l2l3l3LLLLl3l2
$$ 300 250 200 150 100 93 86 80 73 132 190 213 235 232 230 229 228 267 341 393 385 360 335 307 279 269 260 250 241 265 289 313 337 304 272 239 206 209 212 215 218 185 153
986A53K7K6L5L5%jl9l8klL1L1onJJl5l5PPM4M3K3K3o1o0l1l1l1l0J4J5J5J5N1N0N1N0OOON
$$ 153 180 206 241 276 276 275 236 198 196 193 224 255 249 244 245 246 211 176 183 190 234 277 300 323 262 202 171 140 109 79 93 108 123 138 189 239 290 340 346 352 358 363
967C63p3p3p3p3j5j5K1K1J8J8j7j8J2J2O8O7N6j7l6l6j7j8j8j8J2J2J3J2J2J2J3J2j4j5j4
$$ 363 290 217 144 71 56 41 62 83 101 119 102 84 96 108 176 243 299 282 246 210 193 175 157 139 151 163 176 188 200 212 225 237 223 208 194
952A94j4OPPOllklJ5J5k1k1L3L4L7l4m2m3m6m7LLL8L9J2J2J1J2k3k3J2J3J3J3J4J3j3j4j3
$$ 194 180 186 193 200 206 203 200 198 195 210 225 204 183 216 250 287 253 211 168 122 75 78 81 119 158 170 182 193 205 182 159 171 184 197 210 224 237 224 210 197
935A97j4MMM4k7r3r2k8M1M0M0RRj6j5M4M4O3O3MLk9k9k9k9l2l2MMOONOK7K7K6K7lkl8l9m3
$$ 197 183 187 191 235 208 115 23 -5 36 76 116 125 134 118 103 147 191 254 317 321 324 295 266 237 208 176 144 148 152 158 164 169 175 202 229 255 282 279 277 239 200 157
917A57m2J7J7N2N3N2N3L1L1rm4l7l6l9l8k2k1k2k1KLK2j3m2m1J5J6K7K6K6K7K1K1K1K1K4K5
$$ 157 115 132 149 201 254 306 359 390 421 412 368 331 295 256 218 196 175 153 132 134 137 159 146 104 63 78 94 121 147 173 200 221 242 263 284 308 333
901C33M2Pm8q4o4o3m6j0L0L0jkjkj0j0l1OL3L4jl7m9j3JJm0l9kL4K5j0k2k4j6j7j6j7K8K9
$$ 333 375 382 334 250 186 123 77 67 97 127 126 124 123 121 111 101 70 76 109 143 142 105 56 43 44 45 5 -34 -36 -2 23 13 -9 -33 -49 -66 -82 -99 -71 -42
883d2K8K7K8K8K8K8ONNOj0rj0rj9j8l9kj4j4rrJ5N0L0L1j1j2K5O0K4l6n8n8QM4N8N7J9j6l2
$$ -42 -14 13 41 69 97 125 131 136 141 147 137 128 118 109 90 72 33 31 17 3 -6 -15 0 50 80 111 100 88 113 173 197 161 103 45 53 97 155 212 231 215 183
866A83l2j2j2j2j2k2k1m2pK9K8pm3k6QK3K2ppK9K9M3M4PPj8j9oL1N3J6j7j7L6R6R3L4l0o7
$$ 183 151 139 127 115 103 81 60 18 11 40 68 61 18 -8 0 23 45 38 31 60 89 132 176 183 190 172 153 147 178 231 247 230 213 249 345 438 472 442 375
849C75n0n0k3k3m1nL2O8N0N0J5J5m5m5n5n4LLK2j4n2n1n0j4JKm9m8l4LL1L0J6j7m7m6rK7L3
$$ 375 325 275 252 229 188 183 215 283 333 383 398 413 368 323 268 214 217 220 242 228 176 125 75 61 62 64 15 -33 -67 -64 -33 -3 13 -4 -51 -97 -106 -79 -46
832d6L4L2L3K2j3OOJ6J7k0k0mml8l7j5K1L5L6RJ0k7k6K7K7K8K7J0J0QQj0m5m6j0L1L1N3J7
$$ -46 -12 20 53 75 62 68 74 90 107 87 67 63 59 21 -16 -31 -10 25 61 70 80 53 27 54 81 109 136 146 156 164 172 162 117 71 61 92 123 176 193
815A93l6l7k3J3M3M4J0RL2L1K9K9j2m8q6q5l9kk1k1kL4N0M9N4N4N2qo6o7o8o7k1J6M9J3l0
$$ 193 157 120 97 110 153 197 207 216 248 279 308 337 325 277 191 106 67 65 44 23 21 55 105 154 208 262 314 306 240 173 105 38 17 33 82 95 65
799F5o6o7l1oL0L4krK8K4j0j8j8J5J5noJ0M5L8L7Jl6o0n9K0J9jl7j8j7k4k5m5rK3K2M0P7J11
$$ 65 -1 -68 -99 -105 -75 -41 -43 -52 -24 0 -10 -28 -46 -31 -16 -21 -27 -17 28 66 103 104 68 8 -51 -31 -12 -13 -50 -68 -85 -109 -134 -179 -188 -165 -143 -103 -26 85
781H5J12O4Mk5k6k9k9MMNMj5j5j5j5j6j6M4M4O1O1N8N7Rn2p6p5m6j0OOj8j8j6j6K7O2K7j0
$$ 85 197 261 265 240 214 185 156 160 164 169 173 158 143 128 113 97 81 125 169 230 291 349 406 415 363 287 212 166 156 162 168 150 132 116 100 127 189 216 206
765B06l1l2KKj5j4j4j5k5k5m4rL4L4L6L7J7J7L7Jo6o7m3J8N8N8KKK9K8K9K9K2K3M2Pk1k1k3
$$ 206 175 143 145 147 132 118 104 89 64 39 -5 -14 20 54 90 127 144 161 198 199 133 66 23 41 99 157 159 161 190 218 247 276 298 321 363 370 349 328 305
748C05k4kklkk4k3k4k3K5K6K8rk5k5QQnnnnj0rk8k7k6k6n9n7m0K1M6M6K4K5OPJ2J2L2mn9n9
$$ 305 281 279 277 274 272 248 225 201 178 203 229 257 248 223 198 206 214 209 204 199 194 184 175 147 120 94 68 9 -48 -88 -67 -21 25 49 74 80 87 99 111 143 139 80 21
729B1k1J5ppmN4P4L8KKj3j3j1j1K3O0N7K1rm4o3o2j6j6J7J8J9j8l2l3K2K2MMMMrm5n0j6K5
$$ 21 0 15 8 1 -3 51 125 163 165 167 154 141 130 119 142 202 259 280 271 227 164 102 86 70 87 105 124 106 74 41 63 85 89 93 97 101 92 47 -3 -19 6
711FO2O6O6N1N0J9J8j8j7m1m0k3k2n8n8n6n5l6jL9L9K1K2K1K2K6K7RQopm0m0m4qL3O9N1J5
$$ 6 68 134 200 251 301 320 338 320 303 262 222 199 177 119 61 5 -50 -86 -87 -48 -9 12 34 55 77 103 130 139 147 141 134 94 54 10 2 35 104 155 170
694A70JKllllJ0RJ0J0o4o4o0n8K7R8R0R0L7l6p8p9o3o2k7k7N6N5N7N6j2j3OOj%o1o0m4m4J5
$$ 170 171 173 170 167 164 161 171 180 190 200 136 72 12 -46 -19 79 169 259 296 260 182 103 40 -22 -49 -76 -20 35 92 148 136 123 129 135 134 134 73 13 -31 -75 -60
677f0J5P2P3P2P3NNl1l1j2j1OPmmm1m0J4J3M9M9k0k0k1k0JKl5l4n2n0L1L3J1J2L0L0MMl2l2
$$ -60 -45 27 100 172 245 250 255 224 193 181 170 176 183 179 175 134 94 108 121 170 219 199 179 158 138 139 141 106 72 20 -30 1 34 45 57 87 117 121 125 93 61
659F1n8n6l8L4N8N9MMn3n3j0O0J00R9lmk5k5k6k5PPM2M3ooo5o6j0j0K6K6PPK4K5mmm0m0M0
$$ 61 3 -53 -91 -57 1 60 64 68 15 -38 -48 12 112 211 208 204 179 154 128 103 110 117 159 202 196 190 125 59 49 39 65 91 98 105 129 154 150 146 106 66 106
641A06M0R6R5P7Oo1o2l2l2o6o6o3k8j1j2j0rK6K5k6k7j1K5M2M3K9ok9k9j6K1L0L0mlm4m4m1
$$ 106 146 242 337 414 420 359 297 265 233 167 101 38 10 -1 -13 -23 -32 -6 19 -7 -34 -45 -20 22 65 94 88 59 30 14 35 65 95 91 88 44 0 -41
625d1m1j1K4NNJ3J4J4J3M4M5QRJ8J8J7J8L8L7K2j4o0o1m7j1J9J9M1NJ3J2J1J0MMLMMMLMj7
$$ -41 -82 -93 -69 -64 -59 -46 -32 -18 -5 39 84 92 101 119 137 154 172 210 247 269 255 195 134 87 76 95 114 155 160 173 185 196 206 210 214 217 221 225 229 232 236 219
606B19j7j7j7K0K0J9K0M3M4K5j0m2p9n8n8qK7PQj6j6n0m9m9j3M9N0L6L6L6L6J0RQPJ2k5m0
$$ 219 202 185 168 188 208 227 247 290 334 359 349 307 228 170 112 104 131 138 146 130 114 64 15 -34 -47 2 52 88 124 160 196 206 215 223 230 242 217 177
590A77m1m6m6l0OK1K1j6n1n8n8n7n8l4LM4P9Q2M5j2j2jN7Q2M5J2J2M3M3M5Rppk2k3k2k3k2
$$ 177 136 90 44 14 20 41 62 46 -5 -63 -121 -178 -236 -270 -267 -223 -144 -62 -17 -29 -41 -42 15 97 142 154 166 209 252 297 306 299 292 270 247 225 202 180
573A80k3k0k0j1K5L9L9j6n2l2l2NNNMOPk8k7j1K5L9L9Ol0j0j0qqk9QL6L6L8L9j%l7l6l1l0
$$ 180 157 137 117 106 131 170 209 193 141 109 77 82 87 92 96 102 109 81 54 43 68 107 146 152 122 112 102 94 86 57 65 101 137 175 214 213 213 176 140 109 79
556G9PM2N1J5k2k3l0k9m8j2M1P7N7N7K2j3n4n3k9l0OPM3M3Nl0lL4M5M4Nl2j1j1k6k5k6k5j7
$$ 79 86 128 179 194 172 149 119 90 42 30 71 148 205 262 284 271 217 164 135 105 111 118 161 204 209 179 176 210 255 299 304 272 261 250 224 199 173 148 131
539A31j6J9K0L6L7jl7l7jL4L4L8Lj4j3jjj%k9k8m8j3M8M8L5jm4m3o6l0J9J8j5j5PQPPoopo
$$ 131 115 134 154 190 227 226 189 152 151 185 219 257 260 246 233 232 231 230 230 201 173 125 112 160 208 243 242 198 155 89 59 78 96 81 66 73 81 88 95 89 83 76 70
520G0l5l5LL8L8Ll5l5jjJJL0O7M6M6J4J5k2n9n2j7K2N9O1K6rj0j3K3L7L6j3m9k8k9LMOOk6
$$ 70 35 0 3 41 79 82 47 12 11 10 11 12 42 109 155 201 215 230 208 149 97 80 102 161 222 248 239 229 216 239 276 312 299 250 222 193 196 200 206 212 186
502A86J1P2P2M2Ol3l4rqrrj2j3j2j3m1m1m0m1n7n6m0nmmJ2M8Q4N0rrnL0L0nn9n8k0J3K6K6
$$ 186 197 269 341 383 389 356 322 313 305 296 287 275 262 250 237 196 155 115 74 17 -39 -79 -84 -88 -92 -80 -32 52 102 93 84 79 109 139 134 75 17 -3 10 36 62
485F2K8K9NNNNp0o9o5o6k8L2Q2Q1P0O9L0oj8j8k0k1m7m8J2J1JJL4L4M9J3lkn2n1l6%KKMMJ5
$$ 62 90 119 124 129 134 139 69 0 -65 -131 -159 -127 -45 36 106 175 205 199 181 163 143 122 75 27 39 50 51 52 86 120 169 182 179 177 125 74 38 38 40 42 46 50 65
466F5J5J5J6J2J3J2J3J9K0N3N3%l6j7j8k8o4o2k6J8N4L4L4j8n4n5j8L8L8MMPPQPMMl2l2l2
$$ 65 80 95 111 123 136 148 161 180 200 253 306 306 270 253 235 207 143 81 55 73 127 161 195 177 123 68 50 88 126 130 134 141 148 156 163 167 171 139 107 75
449G5l2j9J7L1oj9j9L6L6J%LLLLk8k9QPJ7J7J7J7KLL6L6L2no6o6n0j4JKk5k4k1k2MM0K1K0
$$ 75 43 24 41 72 66 47 28 64 100 101 101 104 107 110 113 85 56 64 71 88 105 122 139 141 144 180 216 248 243 177 111 61 47 48 50 25 1 -20 -42 -38 2 23 43
430D3onoorqK7K7L2L1qm3k7k7k5k7MM0M2Pj0K6O0N9k9r0p5m0J7J6J8J9j4j3%L7J8J8K0K0J1
$$ 43 37 32 26 20 11 3 30 57 89 120 112 69 42 15 -10 -37 -33 7 49 56 46 72 132 191 162 72 -3 -43 -26 -10 8 27 13 0 0 37 55 73 93 113 124
412A24J2J1J1J2J1J1J1j4j5j5j5k4k4k3k4JKJKK8K8K9K8K4K4K4K4K9K9poj0rrrk8k8o2o2k9
$$ 124 136 147 158 170 181 192 203 189 174 159 144 120 96 73 49 50 52 53 55 83 111 140 168 192 216 240 264 293 322 315 309 299 290 281 272 244 216 154 92 63
395F3OK3K2K6K7K7K6L3L3klKKLKQRK6j0o8j05q5k4M0L9K8qJ%N9N8J2J3J2J2J1J1RQRk7o9j04
$$ 63 69 92 114 140 167 194 220 253 286 284 281 283 285 288 290 298 307 333 323 255 150 65 41 81 120 148 140 141 141 200 258 270 283 295 307 318 329 338 346 355 328 259 155
376A55r3n7j6J9M3M3Nl0m6m4qK8O9O9L3ml0k9q8q7o3kM8M7M3M3Ol0l4KJ4J6J2J2M8M8O5O4
$$ 155 62 5 -11 8 51 94 99 69 23 -21 -29 -1 68 137 170 166 136 107 19 -68 -131 -133 -85 -38 5 48 54 24 -10 -8 6 22 34 46 94 142 207 271
360B71Q2M7k0n5p1p1n0j3j2m7o3k7L5P1K4j3k6k6QQQPlmjjJ7N4N3J7PPM0M1MMl0l0m4qQPl3
$$ 271 353 400 380 325 254 183 133 120 108 61 -2 -29 6 77 101 88 62 36 44 52 60 67 64 60 59 58 75 129 182 199 206 213 253 294 298 302 272 242 198 190 198 205 172
341A72l2K8O4M3Oppj4j4j3j2j9J6K9L0m3q0n7LRJ0k3k2j3j3j3j3j0j0K3K3M0Ml6l5l8l8JL7
$$ 172 140 168 232 275 281 274 267 253 239 226 214 195 211 240 270 227 147 90 93 102 112 89 67 54 41 28 15 5 -5 18 41 81 85 49 14 -24 -62 -61 -24
324b4L1L3L2L3M0Ml6l5n7n5j7J9LLPQJ5N2Q9Q8M7j2l9l8m0m0lL3K2j5n2n2l6l6k1J4O2O3K9
$$ -24 7 40 72 105 145 149 113 78 21 -34 -51 -32 -29 -26 -19 -11 4 56 145 233 280 268 229 191 151 111 108 141 163 148 96 44 8 -28 -49 -35 27 90 119
307A19K8K9K8K8K8J%l6l6j4j5K1K1j7j7j8j7MNO4O4j4j4p3p4l0k9OOk8k8k8k9k5k5J0J0J6
$$ 119 147 176 204 232 260 261 261 225 189 175 160 181 202 185 168 150 133 137 142 206 270 256 242 169 95 65 36 42 48 20 -8 -36 -65 -90 -115 -105 -95 -79
291g9J6J5J6RRRPK7K7K7K7M9M9j0j1J6J6k0j9k3k2k2k2j4j4K2K3N4N5J9J9jjjjLML9L9j7j6
$$ -79 -63 -48 -32 -23 -14 -5 2 29 56 83 110 159 208 198 187 203 219 199 180 157 135 113 91 77 63 85 108 162 217 236 255 254 253 252 251 254 258 297 336 319 303
273C03j7j7j5j6n1n1j5j5j5j6kklkj0j0j0j0j3j2j1j2P1P3L7L7lmlmN2N1qrQQQQOOl0l0k5
$$ 303 286 269 254 238 187 136 121 106 91 75 73 71 68 66 56 46 36 26 13 1 -10 -22 49 122 159 196 193 189 186 182 234 285 277 268 276 284 292 300 306 312 282 252 227
254B27k5k5k5K9K9K9K9l3l4l4l4J7J7J7J7j3j2K4K3j8j9j9j8kjkjPOPPj0j1j0j1L1L0nnl6
$$ 227 202 177 152 181 210 239 268 235 201 167 133 150 167 184 201 188 176 200 223 205 186 167 149 147 146 144 143 150 156 163 170 160 149 139 128 159 189 184 179 143
237A43l5J3P2J15P9J5k0m7m8m9n0J0RJ0J0J8J9J9J8J2J1J1J2k2k2k1k2L1L1L1L1k1k0k0k0
$$ 143 108 121 193 308 387 402 382 335 287 238 188 198 207 217 227 245 264 283 301 313 324 335 347 325 303 282 260 291 322 353 384 363 343 323 303
222C03qqrqm4m3qpL6L6L6L6j4j5j5j4N4N4N2qm9n0j7j6K1K2K1K2k9l0k9k9K4K4j2j2l2l2M
$$ 303 295 287 278 270 226 183 175 168 204 240 276 312 298 283 268 254 308 362 414 406 357 307 290 274 295 317 338 360 331 301 272 243 267 291 279 267 235 203 207
205B07ML2L2n1n2n1n1j6j6j8j9M1M1N3N2qpk1k1k0k1k5k4k5k3j1j0j1j0J6J7L5Jj3j2K0K0
$$ 207 211 243 275 224 172 121 70 54 38 20 1 42 83 136 188 180 173 152 131 111 90 65 41 16 -7 -18 -28 -39 -49 -33 -16 19 20 7 -5 15 35
189C5K8K7K8K7RRQRL6L7L2L3K2l8q6q6l2MLl2k9k9k8k9l4KM4P8P1L5K1K2J2J3m9q5n3j7K1
$$ 35 63 90 118 145 154 163 171 180 216 253 285 318 340 302 216 130 98 102 105 73 44 15 -13 -42 -76 -74 -30 48 119 154 175 197 209 222 173 88 35 18 39
172C9K0j7j6j6j6J%JJnmL0L1LLLLl7l7n7k2L9M0M0M2J4J5k1k2j4j5k7o4n6j9lL3O3O1J7m2
$$ 39 59 42 26 10 -6 -5 -5 -4 -3 -8 -12 18 49 52 55 58 61 24 -13 -70 -92 -53 -13 27 69 83 98 77 55 41 26 -1 -65 -121 -140 -143 -110 -47 14 31 -11
154a1p6m0M4M3J8J8L1O7N2J7k1k1KKl1l1j1K5L9L9J5k2k2J5J2J3J5J5J5J5k0k1j4j4K1K2M6
$$ -11 -87 -127 -83 -40 -22 -4 27 94 146 163 142 121 123 125 94 63 52 77 116 155 170 148 126 141 153 166 181 196 211 226 206 185 171 157 178 200 246
138B46M7J0J1k6k6k7k6JKl5l5OPOPj8j8j8j8OPOPM7M7N2k1n6n6j%l1l1l1l1L9L9k0k1oono
$$ 246 293 303 314 288 262 235 209 210 212 177 142 148 155 161 168 150 132 114 96 102 109 115 122 169 216 268 247 191 135 134 134 103 72 41 10 49 88 68 47 41 35 30 24
120B4jj%jJ1J2J2J1J0J0M6M6jjl7l7J6J6J6J7kkl7l8k2k3k2k2l8l8K1K2K6K6rrj1j3M7M7M
$$ 24 23 22 22 21 32 44 56 67 77 87 133 179 178 177 140 103 119 135 151 168 166 164 127 89 67 44 22 0 -38 -76 -55 -33 -7 19 10 1 -10 -23 24 71 75
102G5Nn6n5ppN2N2POPOL1L1L0L1K0J9K0K0OPO3O2O0j1p9j16j02o5%L5K6K6qqNONN%j%jN7N8
$$ 75 80 24 -31 -38 -45 7 59 66 72 79 85 116 147 177 208 228 247 267 287 293 300 363 425 485 474 395 279 177 112 112 147 173 199 191 183 188 194 199 204 204 203 203 202 259 317
82C17L1k9q2q2o7l2J1M7O3O3L6Jj3j2J3M9K9K9l2l2l1l2p0p0o8rJ9J9K3K2K8K7K7K8mll9l9
$$ 317 348 319 237 155 88 56 67 114 177 240 276 277 264 252 265 314 343 372 340 308 277 245 175 105 37 28 47 66 89 111 139 166 193 221 217 214 175 136
66A36j5j4j5j4k2k2k2k1j4j4K4N8M8J3k3k3j4K3O0N9K9qk3k3m3m3ppJ1J1M7M6L3L3mlj1j2
$$ 136 121 107 92 78 56 34 12 -9 -23 -37 -13 45 93 106 83 60 46 69 129 188 217 209 186 163 120 77 70 63 74 85 132 178 211 244 240 237 226 214
49B14j1j2J5J5k2n8q7n1qK5L3L2jjklklJ8J8J7J8K7K6K7K7k3k4k1k1j9J7L3L3NNl1l0m1m0
$$ 214 203 191 206 221 199 141 54 3 -5 20 53 85 84 83 81 78 76 73 91 109 126 144 171 197 224 251 228 204 183 162 143 160 193 226 231 236 205 175 134 94
32I4K1N7L8Lj1j1l0l0l1l0poK9L0J8J8J8J8ppj0rJ4k2l8l8RRpm2l8l7jL5K7K8noL9M0L9L9
$$ 94 115 172 210 213 202 191 161 131 100 70 63 57 86 116 134 152 170 188 181 174 164 155 169 147 109 71 80 89 82 40 2 -35 -36 -1 26 54 49 43 82 122 161 200
14B00jjjjjjjjMMMMl5l4p1p0n4n5j4K1Q1Q1O8L3j2j2j4j4j5j4j4j4j3j3KL9M3M2M6M5j3j3
$$ 200 199 198 197 196 195 194 193 192 196 200 204 208 173 139 68 -2 -56 -111 -125 -104 -23 58 126 159 147 135 121 107 92 78 64 50 37 24 26 65 108 150 196 241 228 215
-4B15j4j3j3j3j3j3llllk1k2k1k2rj0MM0M5Qk8k9j%%jN7N6N4nl7l6M1M2J2k4k6J0J1k5l9l8
$$ 215 201 188 175 162 149 136 133 130 127 124 103 81 60 38 29 19 23 63 108 116 88 59 58 58 58 57 114 170 224 219 182 146 187 229 241 217 191 201 212 187 148 110
-23A10J5J4jl7l2l3j9J6L7L7L9L9JJKJjjjjl4l4JKk9l0l0k9K6K6j0j0n9o1k4k5N9N8N8N9J7
$$ 110 125 139 138 101 69 36 17 33 70 107 146 185 186 187 189 190 189 188 187 186 152 118 119 121 92 62 32 3 29 55 45 35 -24 -85 -109 -134 -75 -17 41 100 117
-40A17J8N3N4K0K0j5j6k0k0n6n6o1n9jjN7N9K2K3j2j1j1j2K2K1K2K2LLn4n5q2m8MO3J06P0
$$ 117 135 188 242 262 282 267 251 231 211 155 99 38 -21 -22 -23 34 93 115 138 126 115 104 92 114 135 157 179 182 185 131 76 -6 -54 -50 13 119 189
-56A89Rk7l3LJ6J6n1n1n1n0j2j3K4K4N9O0N9O0M1M0j0o9p0o9j4j3J2J2k4k4j2j2O8O8M4j7
$$ 189 198 171 138 141 157 173 122 71 20 -30 -42 -55 -31 -7 52 112 171 231 272 312 302 233 163 94 80 67 79 91 67 43 31 19 87 155 199 182
-72A82m2m3k5k6J1J0K0K0K0K0L2L2n1n2n2n2n1n1l5l5K6K5P1P0L5L5m9m7j3j3j4j4l4JN7N7
$$ 182 140 97 72 46 57 67 87 107 127 147 179 211 160 108 56 4 -47 -98 -133 -168 -142 -117 -46 24 59 94 45 -2 -15 -28 -42 -56 -90 -89 -32 25
-88B5M5J0J0M6N7N8j7n3l2l3qpK8K8L1L2L2L1L7L7J9j7n9r4r7o1NMQPM3M2K8rn7n7n8n6j8
$$ 25 70 80 90 136 193 251 234 181 149 116 108 101 129 157 188 220 252 283 320 357 376 359 300 206 109 48 53 57 65 72 115 157 185 176 119 62 4 -52 -70
-105g0J8N4N5N3J7k3k3rj0K7K6j9j8j6j7K5O1M1M1J4J5k1k2l0l1NNJ6J6J5J6RQPOl6p2p0l4
$$ -70 -52 2 57 110 127 104 81 72 62 89 115 96 78 62 45 70 131 172 213 227 242 221 199 169 138 143 148 164 180 195 211 220 228 235 241 205 133 63 29
-122B9j0K7O6O6M0Mj4j4Pl0m5m5jjL5L4L0L1ooJ3J3J3J3J5J5m2m2j4K3L5k4n5n4j%j6n3n1
$$ 29 19 46 112 178 218 222 208 194 201 171 126 81 80 79 114 148 178 209 203 197 210 223 236 249 264 279 237 195 181 204 239 215 160 106 105 105 89 36 -15
-138a5j6L5L7L8L9N5N5J9K0lko2o3m4m4qrN1N1J5J5K2K2K3K2j9j9j9j9QPQQl3l4l3l3k3k2
$$ -15 -31 4 41 79 118 173 228 247 267 264 262 200 137 93 49 41 32 83 134 149 164 186 208 231 253 234 215 196 177 185 192 200 208 175 141 108 75 52 30
-155C0k2k1O7O7QQmllmL8L8L8L7jjjjjkjkj6j6j7j6JJJKqqqql6l5l6l6k7k6k7k7M9M8N0M9
$$ 30 8 -13 54 121 129 137 133 130 127 123 161 199 237 274 273 272 271 270 269 267 266 264 248 232 215 199 200 201 202 204 196 188 180 172 136 101 65 29 2 -24 -51 -78 -29 19 69 118
-175A18M0M0k0j9J3J3M9N0K4K4j1j1n0n0n0n0k5k5k5k5rpqrN4N4N5N4J3J3J2J3K8K8l3l2n2
$$ 118 158 198 178 159 172 185 234 284 308 332 321 310 260 210 160 110 85 60 35 10 1 -6 -14 -23 31 85 140 194 207 220 232 245 273 301 268 236 184
-191A84n3j7j6J1J2m8m8NOO5O6K8K9l1l1QQPQm1m1p3p1l4K6N2N3J6J6J5J6j4j5j5j4onook3
$$ 184 131 114 98 109 121 73 25 30 36 101 167 195 224 193 162 170 178 185 193 152 111 38 -33 -67 -41 11 64 80 96 111 127 113 98 83 69 63 58 52 46 23
-209B3k3k3k3klkljkjkL8L7L8L8O8O8j5j6l3l3KKj0j1j1j0j8j7j7j8M1M1M1M1KKKKjkkjj7
$$ 23 0 -23 -46 -48 -51 -53 -56 -57 -59 -60 -62 -24 13 51 89 157 225 210 194 161 128 130 132 122 111 100 90 72 55 38 20 61 102 143 184 186 188 190 192 191 189 187 186 169
-228A69j7j6j7L1L1L2L1MNn6n5ooL0L1rrrqm0m1m0l9MNM1M0QPn0n0n2j8L3R2J16N6j4j4K2
$$ 169 152 136 119 150 181 213 244 248 253 197 142 136 130 160 191 182 173 164 156 116 75 35 -4 0 5 46 86 94 101 51 1 -51 -69 -36 56 172 228 214 200 222
-245B22K3K2K3k2k1k2k1k9k8k8k9l1l1NNJ8J8J8J7j6j7j7j6J0J0J1J0K8K9K8K8K0J9J7J8J9
$$ 222 245 267 290 268 247 225 204 175 147 119 90 59 28 33 38 56 74 92 109 93 76 59 43 53 63 74 84 112 141 169 197 217 236 253 271 290
-261B90j7LLN0N0M7M8j4n0o6o6rrrrk6k7m6j1K2K2K5K4j1j2K3K2L4lj8j8n1n2n2n1j5j6K1
$$ 290 273 276 279 329 379 426 474 460 410 344 278 269 260 251 242 216 189 143 132 154 176 201 225 214 202 225 247 281 278 260 242 191 139 87 36 21 5 26
-277B6K1j7j7lL2P3L6k4k5K5K5jo1p6p4l7kL5O9N3N3N7N8L2k9l4l5klK7K7J1k5m8m7j4j4j4
$$ 26 47 30 13 10 42 115 151 127 102 127 152 151 90 14 -60 -97 -99 -64 5 58 111 168 226 258 229 195 160 158 155 182 209 220 195 147 100 86 72 58
-294E8j3K2K2J9K0j5j4nL1M6M6j%jjj7j8j7j7MML7L8Pk9k9PJ9J9J8J9J6k0o0o0o9o7o6o6k2
$$ 58 45 67 89 108 128 113 99 94 125 171 217 216 216 215 214 197 179 162 145 149 153 190 228 235 206 177 184 203 222 240 259 275 255 195 135 66 -1 -67 -133 -155
-311a55J5N4N4O0O1M5Rrj0rj0K4O0O0K3k2k3k5k4K4K4K2K2j4n1l0l0m3m2m3m2j9k0L9L7M2
$$ -155 -140 -86 -32 28 89 134 143 134 124 115 105 129 189 249 272 250 227 202 178 202 226 248 270 256 205 175 145 102 60 17 -25 -44 -64 -25 12 54
-327E4PPM3N1N1J5J5j4m9o5o5n3n5j8j9J3J3J3J3K4K3K4K4J8J8L9Kl5l6KL7L6L5L6L6O8L2
$$ 54 61 68 111 162 213 228 243 229 180 115 50 -3 -58 -76 -95 -82 -69 -56 -43 -19 4 28 52 70 88 127 129 94 58 60 97 133 168 204 240 308 340
-343C40j2m7p1p1n7k2k6k6rK4N3J6k1k1PQM3M4O6O6Q4M8Jl5p4p4q9n2rK7M1M1PPLKKKJ1J1
$$ 340 328 281 210 139 82 60 34 8 -1 23 76 92 71 50 57 65 108 152 218 284 368 416 417 382 308 234 145 93 84 111 152 193 200 207 210 212 214 216 227 238
-360B38k4k5j7j6j7j7J5J4J4J4k9k9k9k9MMMMj9j9j6j6J4N0L0L0NNNMk5k5L3L3K6j0p0p1o3
$$ 238 214 189 172 156 139 122 137 151 165 179 150 121 92 63 67 71 75 79 60 41 25 9 23 73 103 133 138 143 148 152 127 102 135 168 194 184 114 43 -20
-377b0k9L7P2N7K2QQK6K7K3K4J3k3l8l9onool9l9m0l8n0n0j0K5M9M7P1L5k4k4QPNl0l1NK6
$$ -20 -49 -12 60 117 139 147 155 181 208 231 255 268 245 207 168 162 157 151 145 106 67 27 -11 -61 -111 -121 -96 -47 0 71 106 82 58 66 73 78 48 17 22 48
-394D8K6pqM7M7O7L1j7j8k0j9j5j5JL7N1N1j9p8r5n9m4m4j2K5M0M0onooJ2J2L4kj6K1L4L4
$$ 48 74 67 59 106 153 220 251 234 216 196 177 162 147 148 185 236 287 268 190 95 36 -8 -52 -64 -39 1 41 35 30 24 18 30 42 76 74 58 79 113 147
-411A47l1l1k9k9m2oL2L3J7J7J7J6mmmmL3L2K9K9qo8q8n3j7J7L6L6M0M0MMllllL1L1onn7n8
$$ 147 116 85 56 27 -15 -21 11 44 61 78 95 111 107 103 99 95 128 160 189 218 210 142 54 1 -16 1 37 73 113 153 157 161 158 155 152 149 180 211 205 200 143 85
-429H5n8n6QRM3M4MMM0M0K9L0K5K6oo6q9n3mmn8n8m4J5Q9J24R4L5j4j3L1L2mnPPPQPQn2n2
$$ 85 27 -29 -21 -12 31 75 79 83 123 163 192 222 247 273 267 201 112 59 55 51 -7 -65 -109 -94 -5 119 213 248 234 221 252 284 280 275 282 289 296 304 311 319 267 215
-447B15ppK9K8POM2M2L1L0n4n4j7j8O2O2N1j0n9o0l4l4l5l4j4j5n0n1m3m3qqK0J9j6j6k8k8
$$ 215 208 201 230 258 265 271 313 355 386 416 362 308 291 273 335 397 448 438 379 319 285 251 216 182 168 153 103 52 9 -34 -42 -50 -30 -11 -27 -43 -71 -99
-464i9k7k8k3k3O1O0P4P3P4P4MNl2l2m4m5m4m4J6J8L7Jk7k7k8k9k6k7J0J0J6J7J6J6ppmnJ2
$$ -99 -126 -154 -177 -200 -139 -79 -5 68 142 216 220 225 193 161 117 72 28 -16 0 18 55 56 29 2 -26 -55 -81 -108 -98 -88 -72 -55 -39 -23 -30 -37 -41 -46 -34
-481c4M7K7K7KJl5l4j8j9M0M1K2K2L7P4O7O6Ol1l8l8m1m0J3J3J4J3n6n5m0mN1N0J7J7J5J5
$$ -34 13 40 67 69 70 35 1 -17 -36 4 45 67 89 126 200 267 333 339 308 270 232 191 151 164 177 191 204 148 93 53 49 100 150 167 184 199 214
-497B14J4J5KKl2l1k3J3K9K9J1J0k5k6n1n2j5j6RQM5M4K5K4j1j1n0m9o7l2N2Q8Q9N4K3K3O
$$ 214 228 243 245 247 215 184 161 174 203 232 243 253 228 202 151 99 84 68 77 85 130 174 199 223 212 201 151 102 35 3 55 143 232 286 309 332 338
-513C38l1n9n8k2J5K3K4K5K6l1l1NNLLl3l3j3j3k7o2p4l8KL9K7K8J1M6N9N9%l6m1oL2L2KK
$$ 338 307 248 190 168 183 206 230 255 281 250 219 224 229 232 235 202 169 156 143 116 54 -20 -58 -56 -17 10 38 49 95 154 213 213 177 136 130 162 194 196 198
-530A98LKk6k5j2K4L9Lj0j0MMMLl1l1l1l1k6k6k5k5MLMLj6j6K0K0J9K1K0K1M2M3M0M1Rk6q8
$$ 198 201 203 177 152 140 164 203 206 196 186 190 194 198 201 170 139 108 77 51 25 0 -25 -21 -18 -14 -11 -27 -43 -23 -3 16 37 57 78 120 163 203 244 253 227 139
-548A39q7q0m4K2N8O3O4L0L0mmnmqrrqpol9m0n0j2K6O4O3K8j0rl6l6l3l4lL3L5jj5K2L5L5
$$ 139 52 -28 -72 -50 8 71 135 165 195 191 187 182 178 170 161 152 144 137 131 92 52 2 -10 16 80 143 171 161 152 116 80 47 13 10 43 78 77 62 84 119 154
-565A54L6L7L4L4J3k2l6l6m1nN7N6N5J8LLj8j8j8j8m1m1l9l8lL4J3J4j7j8n0n1m3pL2L3J4
$$ 154 190 227 261 295 308 286 250 214 173 168 225 281 336 354 357 360 342 324 306 288 247 206 167 129 126 160 173 187 170 152 102 51 8 1 33 66 80
-581H0J4J3J4jj%jk2k2k2k1j3j2j2j2J4J4J4J5M0M0N9K2l7p3p4l6RM3O3O2K1K2K1K1L7L7%
$$ 80 94 107 121 120 119 119 118 96 74 52 31 18 6 -6 -18 -4 10 24 39 79 119 178 200 163 90 16 -20 -11 32 95 157 178 200 221 242 279 316 316
-598C16Jk3k3J2M9K4l5n7n8j9J6J6k0k7k8L0O6L1k8p7p7n2n1j6j6RRRJ0L5L6L7L6j4j5J9K0
$$ 316 317 294 271 283 332 356 321 264 206 187 203 219 199 172 144 174 240 271 243 166 89 37 -14 -30 -46 -37 -28 -19 -9 26 62 99 135 121 106 125 145
-614A45K4j1n1n1j7j7j8j6M1M2M0M0J5k1j%NONOlmlml1l0l1l1j2j3K4K4K4K5K2K2K8rJ2J2
$$ 145 169 158 107 56 39 22 4 -12 29 71 111 151 166 145 144 144 149 155 160 166 163 159 156 152 121 91 60 29 17 4 28 52 76 101 123 145 173 164 176 188
-631A88K4K5j2j2k0k1J5J6J6J6J4J4M6J1k9k8l3l3o8o9r6r8l7M7J05J04O0%k9k8l3l2ooon
$$ 188 212 237 225 213 193 172 187 203 219 235 249 263 309 320 291 263 230 197 129 60 -36 -134 -171 -124 -19 85 145 145 116 88 55 23 17 11 5 0
-647@LLLLJ2J2J2J3l9l8K0K2lkl7l8M1M0ONk0j9J4J6QQRQRJ0RJ0L8L9k1k2K7K6K7K6KJl4l4
$$ 0 3 6 9 12 24 36 48 61 22 -16 4 26 23 21 -16 -54 -13 27 33 38 18 -1 13 29 37 45 54 62 71 81 90 100 138 177 156 134 161 187 214 240 242 243 209 175
-666A75j9j9M0M1K6K5K6K6m6m5m5m5m5m5m6m4K0K0K0K1M3M4M3M4M7M8j0rK3N9P0J1o4j00o8
$$ 175 156 137 177 218 244 269 295 321 275 230 185 140 95 50 4 -40 -20 0 20 41 84 128 171 215 262 310 300 291 314 373 443 454 390 290 222
-681B22l2l5l6l3l3J2J2J2J2K1K2K2K1L7L6m7m7j5j5j5j5o0n9o0o0K5K4K5K5NOO5O6L8L9L9
$$ 222 190 155 119 86 53 65 77 89 101 122 144 166 187 224 260 213 166 151 136 121 106 46 -13 -73 -133 -108 -84 -59 -34 -29 -23 42 108 146 185 224
-697B24L8k4k4o0o0j6j7j6j7j0rK6K7rqm5m4K9K8oplmmmJ1RJ1J0LLL8L9K0K0j6j7nnnmN0N0
$$ 224 262 238 214 154 94 78 61 45 28 18 9 35 62 53 45 0 -44 -15 13 7 0 -3 -7 -11 -15 -4 5 16 26 29 32 70 109 129 149 133 116 111 106 101 97 147 197
-715A97J4J4RRn1n1k7k6L3L3NNNNNOOOm5m5rrM8M7Q0Q0Qn3n2PL3L2m7m7l8l8kjJ8J8Ol0j8
$$ 197 211 225 234 243 192 141 114 88 121 154 159 164 169 174 179 185 191 197 152 107 98 89 137 184 264 344 352 299 247 254 287 319 272 225 187 149 147 146 164 182 188 158 140
-734A40M2Q4M8j8n4n4j8NM2K4K4j6j6j6j6l1l1l0l1J1J2J2J1k1k2k1k1QPQQl1l1k8k9K6O1
$$ 140 182 266 314 296 242 188 170 175 217 241 265 249 233 217 201 170 139 109 78 89 101 113 124 103 81 60 39 47 54 62 70 39 8 -20 -49 -23 38
$$ [...]
-3135A51
##END=	
##END=	
