##TITLE=	Sep11-2019.10.fid
TH04F Fluoro decomposition Wed

##JCAMP-DX=	6.0	$$ MestReNova 14.1.1-24571
##DATA TYPE=	LINK
##BLOCK_ID=	1
##BLOCKS=	1    
##ORIGIN=	Mestrelab Research S.L.
##OWNER=	hrzepa
##$MNOVA/LINK_BLOCK_TYPE=	ITEM	$$ NMR Spectrum
##$MNOVA/ITEM/POLYGON=	(XY..XY)
5321,5835
8722,5835
8722,8208
5321,8208
5321,5835
##$MNOVA/ITEM/Z=	0
##$MNOVA/ITEM/ANGLE=	0
##TITLE=	Sep11-2019.10.fid
##JCAMP-DX=	6.0	$$ MestReNova 14.1.1-24571
##BLOCK_ID=	2
##DATA TYPE=	NMR SPECTRUM
##DATA CLASS=	XYDATA
##NUMDIM=	1
##ORIGIN=	Bruker BioSpin GmbH
##OWNER=	nmr
##.OBSERVE FREQUENCY=	400.20240119999999706
##.OBSERVE NUCLEUS=	^1H
##.SOLVENT NAME=	MeOD
##.PULSE SEQUENCE=	zg30
##LONGDATE=	2019/09/11 13:42:00.000
##.ACQUISITIONMODE=	SIMULTANEOUS (DQD)
##$ORIGINAL FORMAT=	Bruker XWIN-NMR
##$MNOVA/SCALES_VERSION=	9
##$PARAMETER FILE=	(acqus, ASCII, /Users/hrzepa/Downloads/Polysiphenol%20SI%20NMR%20Original%20Data/1/1c%20-%201H%20-%20400C.19.09.11.010%20-%20TH/10/acqus, 0)
$$ ##TITLE= Parameter file, TOPSPIN		Version 3.2
$$ ##JCAMPDX= 5.0
$$ ##DATATYPE= Parameter Values
$$ ##NPOINTS= 11	$$ modification sequence number
$$ ##ORIGIN= Bruker BioSpin GmbH
$$ ##OWNER= nmr
$$ $$ 2019-09-11 13:42:53.000 +0100  nmr@CZC2439F63
$$ $$ /opt/topspin/data/brad/nmr/Sep11-2019/10/acqus
$$ $$ process /opt/topspin3.2/prog/mod/shimcntl
$$ ##$ACQT0= -2.36344537815126
$$ ##$AMP= (0..31)
$$ 100 100 100 100 100 100 100 100 100 100 100 100 100 100 100 100 100 100
$$ 100 100 100 100 100 100 100 100 100 100 100 100 100 100
$$ ##$AMPCOIL= (0..19)
$$ 0 0 0 0 0 0 0 0 0 0 0 0 0 0 0 0 0 0 0 0
$$ ##$ANAVPT= -1
$$ ##$AQSEQ= 0
$$ ##$AQ_mod= 3
$$ ##$AUNM= <au_zg>
$$ ##$AUTOPOS= <5 >
$$ ##$BF1= 400.2
$$ ##$BF2= 400.2
$$ ##$BF3= 400.2
$$ ##$BF4= 400.2
$$ ##$BF5= 400.2
$$ ##$BF6= 400.2
$$ ##$BF7= 400.2
$$ ##$BF8= 400.2
$$ ##$BYTORDA= 0
$$ ##$CAGPARS= (0..11)
$$ 0 0 0 0 0 0 0 0 0 0 0 0
$$ ##$CFDGTYP= 0
$$ ##$CFRGTYP= 9
$$ ##$CHEMSTR= <none>
$$ ##$CNST= (0..63)
$$ 1 1 145 1 1 1 1 1 1 1 1 1 1 1 1 1 1 1 1 1 1 1 1 1 1 1 1 1 1 1 1 1 1 1 1
$$ 1 1 1 1 1 1 1 1 1 1 1 1 1 1 1 1 1 1 1 1 1 1 1 1 1 1 1 1 1
$$ ##$CPDPRG= (0..8)
$$ <> <> <> <> <mlev> <mlev> <mlev> <mlev> <mlev>
$$ ##$D= (0..63)
$$ 0 1 0 0 0 0 0 0 0 0.06 0 0 0 0 0 0 0.0002 0 0 0 0 0 0 0 0 0 0 0 0 0 0 0
$$ 0 0 0 0 0 0 0 0 0 0 0 0 0 0 0 0 0 0 0 0 0 0 0 0 0 0 0 0 0 0 0 0
$$ ##$DATE= 1568205772
$$ ##$DE= 6.5
$$ ##$DECBNUC= <off>
$$ ##$DECIM= 2496
$$ ##$DECNUC= <off>
$$ ##$DECSTAT= 4
$$ ##$DIGMOD= 1
$$ ##$DIGTYP= 12
$$ ##$DQDMODE= 0
$$ ##$DR= 22
$$ ##$DS= 2
$$ ##$DSPFIRM= 0
$$ ##$DSPFVS= 20
$$ ##$DTYPA= 0
$$ ##$EXP= <proton>
$$ ##$F1LIST= <111111111111111>
$$ ##$F2LIST= <222222222222222>
$$ ##$F3LIST= <333333333333333>
$$ ##$FCUCHAN= (0..9)
$$ 0 2 0 0 0 0 0 0 0 0
$$ ##$FL1= 90
$$ ##$FL2= 90
$$ ##$FL3= 90
$$ ##$FL4= 90
$$ ##$FOV= 20
$$ ##$FQ1LIST= <freqlist>
$$ ##$FQ2LIST= <freqlist>
$$ ##$FQ3LIST= <freqlist>
$$ ##$FQ4LIST= <freqlist>
$$ ##$FQ5LIST= <freqlist>
$$ ##$FQ6LIST= <freqlist>
$$ ##$FQ7LIST= <freqlist>
$$ ##$FQ8LIST= <freqlist>
$$ [...]
$$ ##$Sgu3PowerLevels= (0..7)
$$ 0 0 0 0 0 0 0 0
$$ ##$Sgu4PowerLevels= (0..7)
$$ 0 0 0 0 0 0 0 0
$$ ##$Sgu5PowerLevels= (0..7)
$$ 0 0 0 0 0 0 0 0
$$ ##$Sgu6PowerLevels= (0..7)
$$ 0 0 0 0 0 0 0 0
$$ ##$Sgu7PowerLevels= (0..7)
$$ 0 0 0 0 0 0 0 0
$$ ##$Sgu8PowerLevels= (0..7)
$$ 0 0 0 0 0 0 0 0
$$ ##$SguType= 3
$$ ##$ShimPowMaxUA= (0..63)
$$ 130000 130000 130000 130000 130000 130000 130000 130000 130000 130000 130000
$$ 130000 130000 130000 130000 130000 130000 130000 130000 130000 0 0 0 0
$$ 0 0 0 0 0 0 0 0 0 0 0 0 0 0 0 0 0 0 0 0 0 0 0 0 0 0 0 0 0 0 0 0 0 0 0 0
$$ 0 0 0 0
$$ ##$ShimPowMaxUC= (0..63)
$$ 130000 130000 130000 130000 130000 130000 130000 130000 130000 130000 130000
$$ 130000 130000 130000 130000 130000 130000 130000 130000 130000 0 0 0 0
$$ 0 0 0 0 0 0 0 0 0 0 0 0 0 0 0 0 0 0 0 0 0 0 0 0 0 0 0 0 0 0 0 0 0 0 0 0
$$ 0 0 0 0
$$ ##$ShimPowMaxUG= (0..63)
$$ 524287 524287 524287 524287 524287 524287 524287 524287 524287 524287 524287
$$ 524287 524287 524287 524287 524287 524287 524287 524287 524287 0 0 0 0
$$ 0 0 0 0 0 0 0 0 0 0 0 0 0 0 0 0 0 0 0 0 0 0 0 0 0 0 0 0 0 0 0 0 0 0 0 0
$$ 0 0 0 0
$$ ##$ShimPowRcbType= 3
$$ ##$ShimPowRes= (0..63)
$$ 1e-20 1e-20 1e-20 1e-20 1e-20 1e-20 1e-20 1e-20 1e-20 1e-20 1e-20 1e-20
$$ 1e-20 1e-20 1e-20 1e-20 1e-20 1e-20 1e-20 1e-20 0 0 0 0 0 0 0 0 0 0 0 0
$$ 0 0 0 0 0 0 0 0 0 0 0 0 0 0 0 0 0 0 0 0 0 0 0 0 0 0 0 0 0 0 0 0
$$ ##$ShimPowRng0= (0..63)
$$ 1 1 1 1 1 1 1 1 1 1 1 1 1 1 1 1 1 1 1 1 0 0 0 0 0 0 0 0 0 0 0 0 0 0 0 0
$$ 0 0 0 0 0 0 0 0 0 0 0 0 0 0 0 0 0 0 0 0 0 0 0 0 0 0 0 0
$$ ##$ShimPowRng1= (0..63)
$$ 1 1 1 1 1 1 1 1 1 1 1 1 1 1 1 1 1 1 1 1 0 0 0 0 0 0 0 0 0 0 0 0 0 0 0 0
$$ 0 0 0 0 0 0 0 0 0 0 0 0 0 0 0 0 0 0 0 0 0 0 0 0 0 0 0 0
$$ ##$ShimPowRng2= (0..63)
$$ 1 1 1 1 1 1 1 1 1 1 1 1 1 1 1 1 1 1 1 1 0 0 0 0 0 0 0 0 0 0 0 0 0 0 0 0
$$ 0 0 0 0 0 0 0 0 0 0 0 0 0 0 0 0 0 0 0 0 0 0 0 0 0 0 0 0
$$ ##$ShimPowRng3= (0..63)
$$ 1 1 1 1 1 1 1 1 1 1 1 1 1 1 1 1 1 1 1 1 0 0 0 0 0 0 0 0 0 0 0 0 0 0 0 0
$$ 0 0 0 0 0 0 0 0 0 0 0 0 0 0 0 0 0 0 0 0 0 0 0 0 0 0 0 0
$$ ##$ShimSysFunc= (0..63)
$$ 1 2 3 4 5 7 9 11 15 16 8 10 12 14 6 17 13 18 19 20 0 0 0 0 0 0 0 0 0 0
$$ 0 0 0 0 0 0 0 0 0 0 0 0 0 0 0 0 0 0 0 0 0 0 0 0 0 0 0 0 0 0 0 0 0 0
$$ ##$ShimSysMatrix= 0
$$ ##$ShimSysType= 1
$$ ##$TFXNUM= 0
$$ ##$TRIPLO2= 0
$$ ##$VTU= 2
$$ ##$VTUETH= <149.236.99.20>
$$ ##$VTUTY= <no>
$$ ##$WBREFAM= (0..15)
$$ 135.5 97.7 100 100 100 100 100 100 100 100 100 100 100 100 100 100
$$ ##$WBREFLM= (0..15)
$$ 0 0 0 0 0 0 0 0 0 0 0 0 0 0 0 0
$$ ##$WBREFPH= (0..15)
$$ 72.26 -67.22 0 0 0 0 0 0 0 0 0 0 0 0 0 0
$$ ##$WBSGU= (0..15)
$$ 0 0 0 0 0 0 0 0 0 0 0 0 0 0 0 0
$$ ##$XFAC= 2
$$ ##END=
$$ 
##$DECIM=	2496
##$DSPFVS=	20
##XUNITS=	HZ
##YUNITS=	ARBITRARY UNITS
##FIRSTX=	6407.6102564186803647
##LASTX=	-1605.0879904638193238
##DELTAX=	-0.12226593800080109986
##XFACTOR=	1
##YFACTOR=	0.013435754029049966699
##FIRSTY=	9.9755315780639648438
##MINY=	-11.687920570373535156
##MAXY=	24957.583984375
##NPOINTS=	65536
##XYDATA=	(X++(Y..Y))
$$ [...]
2249A081k3k4k4k3J9J9K0J9n5n5J6J6M7M8NNononJ9K0K0K0L0L1m0m1l7l7OOL0L1j0rJ1N5L2
$$ 1081 1058 1034 1010 987 1006 1025 1045 1064 1009 954 970 986 1033 1081 1086 1091 1085 1080 1074 1069 1088 1108 1128 1148 1178 1209 1169 1128 1091 1054 1060 1066 1096 1127 1117 1108 1119 1174 1206
2244A206l9p7nP8P8k5k5k6k5l5l5l5l5M9M9N0M9n4n4n3n4M7M8M7M7j9j9nL8N6j5p1p1N2N3
$$ 1206 1167 1090 1085 1163 1241 1216 1191 1165 1140 1105 1070 1035 1000 1049 1098 1148 1197 1143 1089 1036 982 1029 1077 1124 1171 1152 1133 1128 1166 1222 1207 1136 1065 1117 1170
2240A170N3N3J4J5k8p0n2J9P3P3n2r4m2K9M3%m0KM0kp6p5K7K7j6j6K8K8m3m3%%K2K1j0j0j0
$$ 1170 1223 1276 1290 1305 1277 1207 1155 1174 1247 1320 1268 1174 1132 1161 1204 1204 1164 1166 1206 1204 1128 1053 1080 1107 1091 1075 1103 1131 1088 1045 1045 1045 1067 1088 1078 1068 1058
2236A058j0N1N2N1N2j4j3j4j3j%%%M2M2k6k6J9O2J2o0p2jN0Pkjk6k5m7m8N2N2l7l6OM9L5l6
$$ 1058 1048 1099 1151 1202 1254 1240 1227 1213 1200 1199 1199 1199 1199 1241 1283 1257 1231 1250 1312 1324 1264 1192 1191 1241 1248 1246 1245 1219 1194 1147 1099 1151 1203 1166 1130 1136 1185 1220 1184
2231A184q8m6K9K9j1j1j2j2L0L1K0K1jjl2l1L9L9k1k2K2K1j9j8jQ5M9l6p4J2M4M4OPp4p3k7
$$ 1184 1096 1050 1079 1108 1097 1086 1074 1062 1092 1123 1143 1164 1163 1162 1130 1099 1138 1177 1156 1134 1156 1177 1158 1140 1139 1224 1273 1237 1163 1175 1219 1263 1269 1276 1202 1129 1102
2226A102N8P2j4l1l1K4K4m6m7O5O6qr4o9J7L4L4M0M0kko7o7NMK2K2K2K2L9L9l2l2j7j7N4N5
$$ 1102 1160 1232 1218 1187 1156 1180 1204 1158 1111 1176 1242 1234 1140 1071 1088 1122 1156 1196 1236 1234 1232 1165 1098 1103 1107 1129 1151 1173 1195 1234 1273 1241 1209 1192 1175 1229 1284
2222A284j9j9m0m0j6j6l7l7L4L5Q2lq9q9m3M2J02J02L7L6J%%%k8k9k8k8R4R4M3m3q0q1M2M2
$$ 1284 1265 1246 1206 1166 1150 1134 1097 1060 1094 1129 1211 1208 1119 1030 987 1029 1131 1233 1270 1306 1307 1307 1307 1307 1279 1250 1222 1194 1288 1382 1425 1382 1302 1221 1263 1305
2217A305j8j7M8M8j9j05j04j9JKPOJ0J0L2L1K5K6j7j7K3K3m7m8k7k8k7k7N7N7N7N7%J%Jj0
$$ 1305 1287 1270 1318 1366 1347 1242 1138 1119 1120 1122 1129 1135 1145 1155 1187 1218 1243 1269 1252 1235 1258 1281 1234 1186 1159 1131 1104 1077 1134 1191 1248 1305 1305 1306 1306 1307 1297
2213A297j1j0j0K2K2K1K2m4m3kjK9K8j4j4rrj0rj4j3K7K6K2k1m2K9Q5J4r3r4n3J7K0K0J5J5
$$ 1297 1286 1276 1266 1288 1310 1331 1353 1309 1266 1264 1263 1292 1320 1306 1292 1283 1274 1264 1255 1241 1228 1255 1281 1303 1282 1240 1269 1354 1368 1275 1181 1128 1145 1165 1185 1200 1215
2208A215n7n6poO4O4P2P3k7k7K2K2m9r2m6K4M8OMMJJj2j3j2j2KLj2n4m7K3P6L3mlO5O5l4l3
$$ 1215 1158 1102 1095 1089 1153 1217 1289 1362 1335 1308 1330 1352 1303 1211 1165 1189 1237 1243 1247 1251 1252 1253 1241 1228 1216 1204 1206 1209 1197 1143 1096 1119 1195 1228 1224 1221 1286 1351 1317 1284
2203A284l3l4j8j8k1k1j2n4p0JO3O2K5K5Q1Q1kp3o8KK9K9l8l8l8l8L0K9L0K9n5n5j3j2%j%
$$ 1284 1251 1217 1199 1181 1160 1139 1127 1073 1003 1004 1067 1129 1154 1179 1260 1341 1339 1266 1198 1200 1229 1258 1220 1182 1144 1106 1136 1165 1195 1224 1169 1114 1101 1089 1089 1088 1088
2199A088%N3N4J1J1M4M5n5n4k2k2k2k2K5K5K5K5k7k7k7k8rj0rj0P1P1P1P1l4l4l5l4m0l9L2
$$ 1088 1088 1141 1195 1206 1217 1261 1306 1251 1197 1175 1153 1131 1109 1134 1159 1184 1209 1182 1155 1128 1100 1091 1081 1072 1062 1133 1204 1275 1346 1312 1278 1243 1209 1169 1130 1162
2194A162L1m2m2K9K9M3M2k8k9J2J2N5N5l7l7ONj4j3n7n6NNM8M8Q3Q3M1M1q1q1J9J8qqqqoo
$$ 1162 1193 1151 1109 1138 1167 1210 1252 1224 1195 1207 1219 1274 1329 1292 1255 1261 1266 1252 1239 1182 1126 1131 1136 1184 1232 1315 1398 1439 1480 1399 1318 1337 1355 1347 1339 1331 1323 1317 1311
2190A311ooO0O0o8o8j6j5N6N5klllKLKKL7L7ononnnL7L7L8L7j02j02llJ7J6J7J7N7N7m2m3
$$ 1311 1305 1299 1359 1419 1351 1283 1267 1252 1308 1363 1361 1358 1355 1352 1354 1357 1359 1361 1398 1435 1429 1424 1418 1413 1408 1403 1440 1477 1515 1552 1450 1348 1345 1342 1359 1375 1392 1409 1466 1523 1481 1438
2185A438m4m4K7K7m2m1m1m2L6L6ppL0L0P2P3J6J7J6J7p5p5l2l3m6m5m6m6O0O1O0O0j4j5j4
$$ 1438 1394 1350 1377 1404 1362 1321 1280 1238 1274 1310 1303 1296 1326 1356 1428 1501 1517 1534 1550 1567 1492 1417 1385 1352 1306 1261 1215 1169 1229 1290 1350 1410 1396 1381 1367
2180A367j4K7K7K7K8m3m3m3m3O0N9J7J7M7M7l2j18o0o0o0o1L5J20Q2kq1MP9P8K2K2p8p7n0
$$ 1367 1353 1380 1407 1434 1462 1419 1376 1333 1290 1350 1409 1426 1443 1490 1537 1505 1387 1327 1267 1207 1146 1181 1301 1383 1381 1300 1304 1383 1461 1483 1505 1427 1350 1300
2176A300n0qpM1M1Q4Q4k2k1k1k2nnnoL2L3P4P5m0m1m0m1L1L2j2j1j9j9j9k0k1k2k1k1o7o7
$$ 1300 1250 1242 1235 1276 1317 1401 1485 1463 1442 1421 1399 1394 1389 1384 1378 1410 1443 1517 1592 1552 1511 1471 1430 1461 1493 1481 1470 1451 1432 1413 1393 1372 1350 1329 1308 1241 1174
2172A174L3L3j3j3j4j3N7N6N6N6mmL8L8p4p4k3O2N7N7l7l7J5J4k8k8l8l7L3L3K0K1O2O3l2
$$ 1174 1207 1240 1227 1214 1200 1187 1244 1300 1356 1412 1408 1404 1442 1480 1406 1332 1309 1371 1428 1485 1448 1411 1426 1440 1412 1384 1346 1309 1342 1375 1395 1416 1478 1541 1509
2167A509l2l2l2LLLKj0j1j1j1n3n3M9J35P4j2n7n8lmlmQ8Q8L6m9o6o7jjllklJKP2P2M0L9n4
$$ 1509 1477 1445 1413 1416 1419 1422 1424 1414 1403 1392 1381 1328 1275 1324 1459 1533 1521 1464 1406 1403 1399 1396 1392 1480 1568 1604 1555 1489 1422 1421 1420 1417 1414 1412 1409 1410 1412 1484 1556 1596 1635 1581
2162A581n4j17l1P1P2O9j6l9l9m1m1m1m1J1J1J1J0J6J5J5J6l4l3L7L8LMl9l8RJ0J0RM2M1K4
$$ 1581 1527 1410 1379 1450 1522 1591 1575 1536 1497 1456 1415 1374 1333 1344 1355 1366 1376 1392 1407 1422 1438 1404 1371 1408 1446 1449 1453 1414 1376 1385 1395 1405 1414 1456 1497 1521
2158A521o1j0P5P0j5j22j23%%m1m1L0L0%JJ%noL7L8KLKLL5L6L5L6k1k0K2K2k6k5p4J1O3O3
$$ 1521 1460 1450 1525 1595 1580 1458 1335 1335 1335 1294 1253 1283 1313 1313 1314 1315 1315 1310 1304 1341 1379 1381 1384 1386 1389 1424 1460 1495 1531 1510 1490 1512 1534 1508 1483 1409 1420 1483 1546
2153A546n4n4rP6P6j0n7n7o2o3k7k7J5J6rqrqM8M8M8M8j5j5j5j5NNP6P5J9J8n3n3k6k6J6J7
$$ 1546 1492 1438 1429 1505 1581 1571 1514 1457 1395 1332 1305 1278 1293 1309 1300 1292 1283 1275 1323 1371 1419 1467 1452 1437 1422 1407 1412 1417 1493 1568 1587 1605 1552 1499 1473 1447 1463 1480
2148A480j6j5N5N5j8j7N3N3l8l8l8l9L3L2j1j0p0o9K9L0M2M2%%k7k6J00J01QQl5l5p4p4K6
$$ 1480 1464 1449 1504 1559 1541 1524 1577 1630 1592 1554 1516 1477 1510 1542 1531 1521 1451 1382 1411 1441 1483 1525 1525 1525 1498 1472 1572 1673 1681 1689 1654 1619 1545 1471 1497
2144A497K5pqL6L5OO%Jm9j35p2O9P3j3JJQPl5l5QRQQQ8Q8M6M6OPOPo0o0J2J1M1M2kjkjkkn2
$$ 1497 1522 1515 1507 1543 1578 1584 1590 1590 1591 1542 1407 1335 1404 1477 1464 1465 1466 1474 1481 1446 1411 1419 1428 1436 1444 1532 1620 1666 1712 1718 1725 1731 1738 1678 1618 1630 1641 1682 1724 1722 1721 1719 1718 1716 1714 1662
2138A662n2J9J8R4R3l4l5p2p3jkk6k6k6k6kjjkN6N6j5j5J9J9J9J8L3L2l8q1l8M8O7O8J7J8
$$ 1662 1610 1629 1647 1741 1834 1800 1765 1693 1620 1619 1617 1591 1565 1539 1513 1511 1510 1509 1507 1563 1619 1604 1589 1608 1627 1646 1664 1697 1729 1691 1610 1572 1620 1687 1755 1772 1790
2134A790k5k5o3o3L7L6NONOm2m1%JnnL5L4m9r2l0J13J01m0r9j4M6M6J0RK7K8j5j5l5l5l5l6
$$ 1790 1765 1740 1677 1614 1651 1687 1692 1698 1703 1709 1667 1626 1626 1627 1622 1617 1652 1686 1637 1545 1515 1628 1729 1689 1590 1576 1622 1668 1678 1687 1714 1742 1727 1712 1677 1642 1607 1571
2129A571O5O6K2K3j4j4j4j4k0k0k0k0OOl6l6L6L5P8P8%%r9r9l0l0J2J2K8K8K9K8K5K5K5K5
$$ 1571 1636 1702 1724 1747 1733 1719 1705 1691 1671 1651 1631 1611 1617 1623 1587 1551 1587 1622 1700 1778 1778 1778 1679 1580 1550 1520 1532 1544 1572 1600 1629 1657 1682 1707 1732 1757
2125A757K4K4j9j8l5l4l4l5j9j9k0j9J3J4J4J3j3j3Q1Q1K0o5j07k2N3N3J5J6L4L5L4L4n7n7
$$ 1757 1781 1805 1786 1768 1733 1699 1665 1630 1611 1592 1572 1553 1566 1580 1594 1607 1594 1581 1662 1743 1763 1698 1591 1569 1622 1675 1690 1706 1740 1775 1809 1843 1786 1729
2121A729n7n7RRRRN8N8J5J5l7l7l7l7K5K6L4n2q3m1N4N5k3o6k4O1kq8m8R4J29M5llJ6o8p2
$$ 1729 1672 1615 1624 1633 1642 1651 1709 1767 1782 1797 1760 1723 1686 1649 1674 1700 1734 1682 1599 1558 1612 1667 1644 1578 1554 1615 1613 1525 1477 1571 1700 1745 1742 1739 1755 1687 1615
2116A615J4Q2L9n9n8LLLLJ2J3l0k9M5M5n4n4JJK1K2N2N2k0j9k4k4o1o2QR3N0l4n2n1j5j4J7
$$ 1615 1629 1711 1750 1691 1633 1636 1639 1642 1645 1657 1670 1640 1611 1656 1701 1647 1593 1594 1595 1616 1638 1690 1742 1722 1703 1679 1655 1594 1532 1540 1633 1683 1649 1597 1546 1531 1517 1534
2112A534J8J7J7O6O6nmM8M9j9k0J5N8M2m4n4j1L0L1k2k2%%J4J3J4J4j1j2m8m9k2O2N7N8rr
$$ 1534 1552 1569 1586 1652 1718 1713 1709 1757 1806 1787 1767 1782 1840 1882 1838 1784 1773 1803 1834 1812 1790 1790 1790 1804 1817 1831 1845 1834 1822 1774 1725 1703 1765 1822 1880 1871 1862
2107A862rrj6j6NNL4L5l6p8n9K5P5P4PPPPk7k6k7k6M6M7k5k4llJ8J8klklM6M7k4k5j2j3K9
$$ 1862 1853 1844 1828 1812 1817 1822 1856 1891 1855 1777 1718 1743 1818 1892 1899 1906 1913 1920 1893 1867 1840 1814 1860 1907 1882 1858 1855 1852 1870 1888 1886 1883 1881 1878 1924 1971 1947 1922 1910 1897 1926
2102A926L0L0K9m1m1M9M9k2k1kjj4n7m3M2L7om2m3k2k1P9J21M8l6n6j3%%j1j1l3l2n0n0K2
$$ 1926 1956 1986 2015 1974 1933 1982 2031 2009 1988 1986 1985 1971 1914 1871 1913 1950 1944 1902 1859 1837 1816 1895 2016 2064 2028 1972 1959 1959 1959 1948 1937 1904 1872 1822 1772 1794
2098A794K1l2l2J0J1L8L9O0O0O8O9rr4j13p1k9k8kjO9P0M8M9j7j7M2J26O1k4r1pRl3p4l1J3
$$ 1794 1815 1783 1751 1761 1772 1810 1849 1909 1969 2037 2106 2097 2003 1890 1819 1790 1762 1760 1759 1828 1898 1946 1995 1978 1961 2003 2129 2190 2166 2075 2068 2077 2044 1970 1939 1952
2093A952J3J8J9Q9R0m4m5jkQQQQppn0n0MLP0O9l8j23j01j7O2O1K5K4J3J2qrl1l1M0M0K0K1
$$ 1952 1965 1983 2002 2091 2181 2137 2092 2091 2089 2097 2105 2113 2121 2114 2107 2057 2007 2011 2014 2084 2153 2115 1992 1891 1874 1936 1997 2022 2046 2059 2071 2063 2054 2023 1992 2032 2072 2092 2113
2088B113N8N8Kq4q3JM0M0k6k6N6N6j6j5l3l3J0RP0P0M6l9n0n0M4M4JJJ%l2l3l3l3P0P0mr0
$$ 2113 2171 2229 2231 2147 2064 2065 2105 2145 2119 2093 2149 2205 2189 2174 2141 2108 2118 2127 2197 2267 2313 2274 2224 2174 2218 2262 2263 2264 2265 2265 2233 2200 2167 2134 2204 2274 2270 2180
2084B180j07k2N2N3j1j1j0j1N8N7J5J6j3j3N2N3j7j01n9K6O0O0K3K3J7J7p8p7nP9L2L1m0m0
$$ 2180 2073 2051 2103 2156 2145 2134 2124 2113 2171 2228 2243 2259 2246 2233 2285 2338 2321 2220 2161 2187 2247 2307 2330 2353 2370 2387 2309 2232 2227 2306 2338 2369 2329 2289
2080B289NR1Q6%r8r7k5O0J3J2K3K3K3K3%%l7l8m6L8Q5Q4k3j09o6J9J04J04Kq4o2o3k5k5kj
$$ 2289 2294 2385 2471 2471 2373 2276 2251 2311 2324 2336 2359 2382 2405 2428 2428 2428 2391 2353 2307 2345 2430 2514 2491 2382 2316 2335 2439 2543 2545 2461 2399 2336 2311 2286 2284 2283
2075B283M0M1Q0Q0r9j00j6O9O3O4J4J4J9o6j04j04J8J8N7N6N7N6j1j1p6p7l6M8O8K4M3M3M0
$$ 2283 2323 2364 2444 2524 2425 2325 2309 2378 2441 2505 2519 2533 2552 2486 2382 2278 2296 2314 2371 2427 2484 2540 2529 2518 2442 2365 2329 2377 2445 2469 2512 2555 2595
2071B595M0k7k8J6J5j8j7j8j8M3M3k9k8RRRRk3k3k3k3J4J4Q5Q5K1K2k0k1o0o1qP6Q2Q1j2j2
$$ 2595 2635 2608 2580 2596 2611 2593 2576 2558 2540 2583 2626 2597 2569 2578 2587 2596 2605 2582 2559 2536 2513 2527 2541 2626 2711 2732 2754 2734 2713 2653 2592 2584 2660 2742 2823 2811 2799
2067B799J0J1N4N3k3k3k3k3m5m5m5m5L2L2j1j0L7L7L7L8M4M4k5o9n8K7M6Lm4jM3M3J6J5J6
$$ 2799 2809 2820 2874 2927 2904 2881 2858 2835 2790 2745 2700 2655 2687 2719 2708 2698 2735 2772 2809 2847 2891 2935 2910 2841 2783 2810 2856 2859 2815 2814 2857 2900 2916 2931 2947
2062B947J5o6o7j8O7O6K4j9j8J7J6N7N6rn3j0P4K5o0r8j2M9M8N5N4M0M1l0l0%%p2p1N0M9k0
$$ 2947 2962 2896 2829 2811 2878 2944 2968 2949 2931 2948 2964 3021 3077 3068 3015 3005 3079 3104 3044 2946 2934 2983 3031 3086 3140 3180 3221 3191 3161 3161 3161 3089 3018 3068 3117 3097
2058C097o3j1P4P5j1J3N5M9PmmL5L6ONj5j5j7j6j7j7M9M8M8M8%jk2k1K6K6j7j6J1J1L3L3K4
$$ 3097 3034 3023 3097 3172 3161 3174 3229 3278 3285 3281 3277 3312 3348 3354 3359 3344 3329 3312 3296 3279 3262 3311 3359 3407 3455 3455 3454 3432 3411 3437 3463 3446 3430 3441 3452 3485 3518 3542
2053C542K4K4K4k8k7P1P2L3L4l7l8n7n8j5j5K1K0J20J19N4N3j7j8j11j11P3P2L1L0P3P3KJ
$$ 3542 3566 3590 3614 3586 3559 3630 3702 3735 3769 3732 3694 3637 3579 3564 3549 3570 3590 3710 3829 3883 3936 3919 3901 3790 3679 3752 3824 3855 3885 3958 4031 4033 4034
2049D034m1m0j2j2l2l3k3k2J9K0nnnnKKKKj1j1O1O0M5M6K4K5o0o0j8j7kkK0K0RJ0J0Rk8k8
$$ 4034 3993 3953 3941 3929 3897 3864 3841 3819 3838 3858 3853 3848 3843 3838 3840 3842 3844 3846 3835 3824 3885 3945 3990 4036 4060 4085 4025 3965 3947 3930 3928 3926 3946 3966 3975 3985 3995 4004 3976 3948
2044C948k8k8nnonJ9K0J9K0j3j2j2j2K3K2K3K2n2n2J04J04M8M8NOm7m6K8J13J10K6j9K3O5
$$ 3948 3920 3892 3887 3882 3876 3871 3890 3910 3929 3949 3936 3924 3912 3900 3923 3945 3968 3990 3938 3886 3990 4094 4142 4190 4195 4201 4154 4108 4136 4249 4359 4385 4366 4389 4454
2040D454K2p9j21o7J7R5R4N7N7m2m3K4K5K4K4J9J8O1O1k5k5mmN6N5R8R8k7k7J5J6l3l3J0J0
$$ 4454 4476 4397 4276 4209 4226 4321 4415 4472 4529 4487 4444 4468 4493 4517 4541 4560 4578 4639 4700 4675 4650 4646 4642 4698 4753 4851 4949 4922 4895 4910 4926 4893 4860 4870 4880
2036D880K1K1%%PQM9N0J9J9klO4O3O1O1n3r6p5J1N0R4P7L5lkO5O6%%J%MMP5P5K2K2K2K2J2
$$ 4880 4901 4922 4922 4922 4929 4937 4986 5036 5055 5074 5072 5069 5133 5196 5257 5318 5265 5169 5094 5105 5155 5249 5326 5361 5358 5356 5421 5487 5487 5487 5488 5488 5492 5496 5571 5646 5668 5690 5712 5734 5746
2031E746J2J1J2O4O4ppN0N1QQk1k0N0N0M5M5KLLKM3M3o1j04l7J05P7rp5l2L4L4ooK8K7j4j5
$$ 5746 5758 5769 5781 5845 5909 5902 5895 5945 5996 6004 6012 5991 5971 6021 6071 6116 6161 6163 6166 6169 6171 6214 6257 6196 6092 6055 6160 6237 6228 6153 6121 6155 6189 6183 6177 6205 6232 6218 6203
2026F203k4k3q9r0rP6J00R9qrqqo0o1j5P1N5l1m8m8N1N2N2N2M4M4k7k8QPN0N0P9P9P9P9N6
$$ 6203 6179 6156 6067 5977 5968 6044 6144 6243 6235 6226 6218 6210 6150 6089 6074 6145 6200 6169 6121 6073 6124 6176 6228 6280 6324 6368 6341 6313 6321 6328 6378 6428 6507 6586 6665 6744 6800
2022F800N6J3J4M8M8NOj7j6N4N4P2P2n0n1qP6J28J28N9N9R6R6R6J0j2j2J16J16P3P4K4K5K5
$$ 6800 6856 6869 6883 6931 6979 6984 6990 6973 6957 7011 7065 7137 7209 7159 7108 7100 7176 7304 7432 7491 7550 7646 7742 7838 7848 7836 7824 7940 8056 8129 8203 8227 8252 8277
2017H277K5M7M7M7M7M8M8M9M8Q3Q4J3J3rj0L8J22J31M5k3k3MQ9Q3Q4O5O5O5O5M0M0Q3Q3K0
$$ 8277 8302 8349 8396 8443 8490 8538 8586 8635 8683 8766 8850 8863 8876 8867 8857 8895 9017 9148 9193 9170 9147 9151 9240 9323 9407 9472 9537 9602 9667 9707 9747 9830 9913 9933
2013I933K0K0K0J01J01J00J01J19J18O7j8j5j5P9P9J02J01N8N9Q8Q8Q8Q8K7K8R8R9J10J10
$$ 9933 9953 9973 9993 10094 10195 10295 10396 10515 10633 10700 10682 10667 10652 10731 10810 10912 11013 11071 11130 11218 11306 11394 11482 11509 11537 11635 11734 11844 11954
2010A1954J10J10O5O4K1K2R6R6R6R6P3P2J15J14O3O3J05J05J13J13M2M3J08J09J08J08Q7Q6
$$ 11954 12064 12174 12239 12303 12324 12346 12442 12538 12634 12730 12803 12875 12990 13104 13167 13230 13335 13440 13553 13666 13708 13751 13859 13968 14076 14184 14271 14357
2006A4357Q6Q7J57J57J58J57J49J50J06J07J69J69J69J68Q8Q7J58J58J52J52J52J52J74J74
$$ 14357 14443 14530 14687 14844 15002 15159 15308 15458 15564 15671 15840 16009 16178 16346 16434 16521 16679 16837 16989 17141 17293 17445 17619 17793
2003A7793J74J74J58J57J58J57K59K59J59J59Q8Q7J87J87K37K37K37K37J88J87J16J16J73
$$ 17793 17967 18141 18299 18456 18614 18771 19030 19289 19448 19607 19695 19782 19969 20156 20393 20630 20867 21104 21292 21479 21595 21711 21884
2001B1884J73L01L00K17K17K17K17K15K14K14K15K64K64K64K64L17L17K46K47K09K09K52K52
$$ 21884 22057 22358 22658 22875 23092 23309 23526 23741 23955 24169 24384 24648 24912 25176 25440 25757 26074 26320 26567 26776 26985 27237 27489
1998B7489K73K72K30K30L32L31L32L32K64K65K64K65K69K70L12L12M11M10L11L12L02L02M01
$$ 27489 27762 28034 28264 28494 28826 29157 29489 29821 30085 30350 30614 30879 31148 31418 31730 32042 32453 32863 33174 33486 33788 34090 34491
1995C4491M01L99M00L99M00N28N29N29N28N11N11N11N11N74N74N73N74O20O20O20O20P04P04
$$ 34491 34892 35291 35691 36090 36490 37018 37547 38076 38604 39115 39626 40137 40648 41222 41796 42369 42943 43563 44183 44803 45423 46127 46831
1992D6831P05P04P62P62Q04Q05Q61Q62Q61Q62Q97Q97Q97Q97Q96Q96J023J023J056J055J055
$$ 46831 47536 48240 49002 49764 50568 51373 52234 53096 53957 54819 55716 56613 57510 58407 59303 60199 61222 62245 63301 64356 65411
1990F5411J055J086J086J214J213J214J215J256J257J303J303J383J468J523J523J509J552
$$ 65411 66466 67552 68638 69852 71065 72279 73494 74750 76007 77310 78613 79996 81464 82987 84510 86019 87571
1987H7571J637J721J727J728J812J953K032K033K053K095K179K320K390K432K496K638K741
$$ 87571 89208 90929 92656 94384 96196 98149 100181 102214 104267 106362 108541 110861 113251 115683 118179 120817 123558
1985A23558K783K828K913L083L224L349L433L540L624L727L868M046M245M400M486M597M739
$$ 123558 126341 129169 132082 135165 138389 141738 145171 148711 152335 156062 159930 163976 168221 172621 177107 181704 186443
1983A86443M952N150N349N604N841O040O261O459O733O988P255P567P940Q308Q644Q900R229
$$ 186443 191395 196545 201894 207498 213339 219379 225640 232099 238832 245820 253075 260642 268582 276890 285534 294434 303663
1981C03663R655J0055J0424J0864J1345J1864J2290J2711J3194J3732J4328J4931J5469J6015
$$ 303663 313318 323373 333797 344661 356006 367870 380160 392871 406065 419797 434125 449056 464525 480540
1980D80540J6554J7181J7834J8407J8890J9386J9982K0569K0995K1328K1640K1978K2233K2323
$$ 480540 497094 514275 532109 550516 569406 588792 608774 629343 650338 671666 693306 715284 737517 759840
1978G59840K2237K2042K1731K1256K0660J9916J8980J7803J6414J4814J3084J1174R161O994
$$ 759840 782077 804119 825850 847106 867766 887682 906662 924465 940879 955693 968777 979951 989112 996106
1976I96106M698K351n9k448m802p046r229j1315j3272j5062j6678j8067j9287k0324k1148
$$ 996106 1000804 1003155 1003096 1000648 995846 988800 979571 968256 954984 939922 923244 905177 885890 865566 844418
1974H44418k1780k2262k2588k2786k2748k2606k2407k2096k1739k1314k0849k0311j9746j9151
$$ 844418 822638 800376 777788 755002 732254 709648 687241 665145 643406 622092 601243 580932 561186 542035
1973E42035j8570j7974j7347j6695j6116j5578j5073j4534j3927j3332j2735j2196j1749j1324
$$ 542035 523465 505491 488144 471449 455333 439755 424682 410148 396221 382889 370154 357958 346209 334885
1971C34885j0830j0348r940r572r226q857q507q138p826p515p239o983o719o407o145n889
$$ 334885 324055 313707 303767 294195 284969 276112 267605 259467 251641 244126 236887 229904 223185 216778 210633 204744
1969B04744n715n516n357n158m944m746m536m338m180m039l882l741l624l539l440l297l126
$$ 204744 199029 193513 188156 182998 178054 173308 168772 164434 160254 156215 152333 148592 144968 141429 137989 134692 131566
1967A31566l040k962k878k777k635k573k530k456k372k304k218k148k062k000k001j948j864
$$ 131566 128526 125564 122686 119909 117274 114701 112171 109715 107343 105039 102821 100673 98611 96611 94610 92662 90798
1965I0798j805j763j742j699j671j629j598j555j522j438j385j342j337j295j213j128j074
$$ 90798 88993 87230 85488 83789 82118 80489 78891 77336 75814 74376 72991 71649 70312 69017 67804 66676 65602
1963F5602j074r89r88r79j063j061r75q45q44q99r00r05q19o63o63p00p00p18p19o19o20o03
$$ 65602 64528 63539 62551 61572 60509 59448 58473 57628 56784 55885 54985 54080 53261 52598 51935 51235 50535 49817 49098 48479 47859 47256
1960D7256o03o04o03n49n50n54m70m35m36n52n52m85m00l99m85m50m49m50m49m59l74k95k94
$$ 47256 46653 46049 45446 44897 44347 43793 43323 42888 42452 41900 41348 40863 40463 40064 39579 39129 38680 38230 37781 37322 36948 36653 36359
1957C6359l99l98l99l99l19l19k76k76l64l64l63l64l39l39m10m09l66l66l65l66l58l57l16
$$ 36359 35960 35562 35163 34764 34445 34126 33850 33574 33210 32846 32483 32119 31780 31441 31031 30622 30256 29890 29525 29159 28801 28444 28128
1954B8128l15l42l42k71k71l11l11l10l11k22k21k16l01k88k88k22k22l23l23k72j86j88j87
$$ 28128 27813 27471 27129 26858 26587 26276 25965 25655 25344 25122 24901 24685 24384 24096 23808 23586 23364 23041 22718 22446 22260 22072 21885
1952B1885k25k24k00j99k00j99k00k00j99k00j34j35k10k94k42j57j11j11j82j81j11j11j34
$$ 21885 21660 21436 21236 21037 20837 20638 20438 20238 20039 19839 19705 19570 19360 19066 18824 18667 18556 18445 18263 18082 17971 17860 17726
1949A7726j34k05k05j74j73j32j31j38j39m4m5p4j59j82j82j23j24j23j24p3p4p3p4r8r8j41
$$ 17726 17592 17387 17182 17008 16835 16703 16572 16434 16295 16251 16206 16132 15973 15791 15609 15486 15362 15239 15115 15042 14968 14895 14821 14723 14625 14484
1946A4484j41p3p3o8j52j37j37j00r9j46j46j03j03q1q1q1q1j18j18m8m7j37j37o2K2L9m6
$$ 14484 14343 14270 14197 14129 13977 13840 13703 13603 13504 13358 13212 13109 13006 12925 12844 12763 12682 12564 12446 12398 12351 12214 12077 12015 12037 12076 12030
1942A2030j21j21j25j24j30m5LLr1r1q3q3q4q3m9n0pon9n8n8n9m3m3K7K8KLLKn3n3J8J8O2
$$ 12030 11909 11788 11663 11539 11409 11364 11367 11370 11279 11188 11105 11022 10938 10855 10806 10756 10749 10743 10684 10626 10568 10509 10466 10423 10450 10478 10480 10483 10486 10488 10435 10382 10400 10418 10480
1938A0480O2J9K0J02J03J50O5nnO1O0k3k3K0J04O3p9j55j55j43k28k28j42m6m5m0m0PPr2r2
$$ 10480 10542 10561 10581 10683 10786 10936 11001 10996 10991 11052 11112 11089 11066 11086 11190 11253 11174 11019 10864 10721 10493 10265 10123 10077 10032 9992 9952 9959 9966 9874 9782
1934I782nmnmj4j3j4j3J00R9M9l6k1k1m9j34j97j98k03k03j92j92j87j86j30m5k6o9p5p4p7
$$ 9782 9777 9773 9768 9764 9750 9737 9723 9710 9810 9909 9958 9922 9901 9880 9831 9697 9500 9302 9099 8896 8704 8512 8325 8139 8009 7964 7938 7869 7794 7720 7643
1930G643p7o0n9j7j7r0r1q5q5m6L9L9m6j44j44k2k2m3m3m3m3k9k9p2p1p1p2k9k9o0o1o0o1
$$ 7643 7566 7506 7447 7430 7413 7323 7232 7147 7062 7016 7055 7094 7048 6904 6760 6738 6716 6673 6630 6587 6544 6515 6486 6414 6343 6272 6200 6171 6142 6082 6021 5961 5900
1926E900j16j17p3p4j01j02l0l0n4n4j3L0Oq0r6n3l8l7PN0Qp7j46j04QN1J1l2o9p0k9l0K8
$$ 5900 5784 5667 5594 5520 5419 5317 5287 5257 5203 5149 5136 5166 5172 5092 4996 4943 4905 4868 4875 4925 4933 4856 4710 4606 4614 4665 4676 4644 4575 4505 4476 4446 4474
1922D474K8j5j5j6j7j6j6J0J0J0J0l6l6L5L5j1j1q2q2k7k7k7k7j4j4j4j4KKJKj4j3n6n6l2
$$ 4474 4502 4487 4472 4456 4439 4423 4407 4417 4427 4437 4447 4411 4375 4410 4445 4434 4423 4341 4259 4232 4205 4178 4151 4137 4123 4109 4095 4097 4099 4100 4102 4088 4075 4019 3963 3931
1918C931l2l2l1k2k1j9j8N3R5N1l4q3m1k7k7j5j5N6N6J5J6l7j21j17j17k3k3J5J6N7N8l6l6
$$ 3931 3899 3867 3836 3814 3793 3774 3756 3809 3904 3955 3921 3838 3797 3770 3743 3728 3713 3769 3825 3840 3856 3819 3698 3581 3464 3441 3418 3433 3449 3506 3564 3528 3492
1914C492l5l6J9J9J9J9r3r4m2M3R3R3K8K8m6m6K5K5J2J2l0l0o7o8N5N5L8m7m7L7N3N2m1m2
$$ 3492 3457 3421 3440 3459 3478 3497 3404 3310 3268 3311 3404 3497 3525 3553 3507 3461 3486 3511 3523 3535 3505 3475 3408 3340 3395 3450 3488 3441 3394 3431 3484 3536 3495 3453
1910C453k7k8K1o5j10j11pP8K3K4K8K9jjkjj2j2j2j2J4J4J4J5l0k9k9l0k0k0K3K2j9j9j9k0
$$ 3453 3426 3398 3419 3354 3244 3133 3126 3204 3227 3251 3279 3308 3307 3306 3304 3303 3291 3279 3267 3255 3269 3283 3297 3312 3282 3253 3224 3194 3174 3154 3177 3199 3180 3161 3142 3122
1905C122j5j5j5j5j1j1n4n4n3n3J9J8%jm3m2mlllJ4J5J4J5j7j7K6K6LMl9l9M5M5k5k6k1k1
$$ 3122 3107 3092 3077 3062 3051 3040 2986 2932 2879 2826 2845 2863 2863 2862 2819 2777 2773 2770 2767 2764 2778 2793 2807 2822 2805 2788 2814 2840 2843 2847 2808 2769 2814 2859 2834 2808 2787 2766
1901B766K7n8j20j20K9P2kq7q5%K8K8L3L3j7j8j7j8rrL1L1om9pP8O3k2m1KNq1j20l6O0O0l4
$$ 2766 2793 2735 2615 2495 2524 2596 2594 2507 2422 2422 2450 2478 2511 2544 2527 2509 2492 2474 2465 2456 2487 2518 2512 2463 2456 2534 2597 2575 2534 2536 2541 2460 2340 2304 2364 2424 2390
1896B390l4j0j1L1L2m5m6k8N8P6rn6n5pqj0j1Ql4o1K5M7Ml7l7qqqqR2R2J5p1o4k1K1O5Q1L8
$$ 2390 2356 2346 2335 2366 2398 2353 2307 2279 2337 2413 2404 2348 2293 2286 2278 2268 2257 2265 2231 2170 2195 2242 2246 2209 2172 2164 2156 2148 2140 2232 2324 2339 2268 2204 2183 2204 2269 2350 2388
1891B388oom3m4q4q4L7Q0O1k4j7j8K0J9%%m3m3QPQQJ4J4o1j45j01j6Q6Q7L9L8L9L8K1K0m7
$$ 2388 2382 2376 2333 2289 2205 2121 2158 2238 2299 2275 2258 2240 2260 2279 2279 2279 2236 2193 2201 2208 2216 2224 2238 2252 2191 2046 1945 1929 2015 2102 2141 2179 2218 2256 2277 2297 2250
1887B250m8j7K6M9l6p6p5j0j0j1j1j1j1k0k0K3K2l6l6l6l6L1L1P4P4k1k0k0k0j4j4K6K5J2
$$ 2250 2202 2185 2211 2260 2224 2148 2073 2063 2053 2042 2031 2020 2009 1989 1969 1992 2014 1978 1942 1906 1870 1901 1932 2006 2080 2059 2039 2019 1999 1985 1971 1997 2022 2034
1883B034l1j8O7R1No9o9K3K4K4K4L7L7l7j22j18l3M1M2N2N2m7m8o8o9LKJ7J7J6J7NMNNL2L2
$$ 2034 2003 1985 2052 2143 2148 2079 2010 2033 2057 2081 2105 2142 2179 2142 2020 1902 1869 1910 1952 2004 2056 2009 1961 1893 1824 1827 1829 1846 1863 1879 1896 1901 1905 1910 1915 1947 1979
1878A979Q0no9o9%Q5M0m4k1K3J6o9o6J9O0O1l4l3PQQQJ2J2J2J3m4m3m3m3J6J7J7J7l8l9l9
$$ 1979 2059 2054 1985 1916 1916 2001 2041 1997 1976 1999 2015 1946 1880 1899 1959 2020 1986 1953 1960 1968 1976 1984 1996 2008 2020 2033 1989 1946 1903 1860 1876 1893 1910 1927 1889 1850 1811
1874A811l9N4N4j6j7j9j9j9j9o1o1J4R9N3l1p2J4J40R7qr2j7K5K0k2j9j8rL5O7j7r2r3mL8
$$ 1811 1772 1826 1880 1864 1847 1828 1809 1790 1771 1710 1649 1663 1762 1815 1784 1712 1726 1866 1963 1955 1863 1846 1871 1891 1869 1850 1832 1823 1858 1925 1908 1816 1723 1719 1757
1869A757lq9p1J4Q9Q8j9j9j9j8L9M0l2l1nnnnn0n0k6N8Q8Q9l4l4k8k8k3k3J2R7R6J2n7n8o2
$$ 1757 1754 1665 1594 1608 1697 1785 1766 1747 1728 1710 1749 1789 1757 1726 1721 1716 1711 1706 1656 1606 1580 1638 1726 1815 1781 1747 1719 1691 1668 1645 1657 1754 1850 1862 1805 1747 1685
1865A685o3RRRRn0n0K1K1M7M7MMKKM5M4%j%jJJp4j59j16l1R5R4O3k3kM2M8Ol9l9nnnnK0K0
$$ 1685 1622 1631 1640 1649 1658 1608 1558 1579 1600 1647 1694 1698 1702 1704 1706 1751 1795 1795 1794 1794 1793 1794 1795 1721 1562 1446 1415 1510 1604 1667 1644 1642 1684 1732 1738 1699 1660 1655 1650 1645 1640 1660 1680
1860A680K0K0j8j7K4O7K9n6m9m8l4l3l4l3N1N2m8m8J5J4J5J4k7k7M1M2j9o0j9O6M5m0j10o8
$$ 1680 1700 1720 1702 1685 1709 1776 1805 1749 1700 1652 1618 1585 1551 1518 1569 1621 1573 1525 1540 1554 1569 1583 1556 1529 1570 1612 1593 1533 1514 1580 1625 1585 1475 1407
1855A407L2L1qqP5P5K7n9j5K7j8o0l1J3L8m6k3O1J27M2n7n7k0k0j7j7j8j7kkM0M0j4j4N1N1
$$ 1407 1439 1470 1462 1454 1529 1604 1631 1572 1557 1584 1566 1506 1475 1488 1526 1480 1457 1518 1645 1687 1630 1573 1553 1533 1516 1499 1481 1464 1462 1460 1500 1540 1526 1512 1563 1614
1851A614L3n3m7m7m4m5m4m4K8K8K7K8llllO5O4pok7k8J5J6L3L3j0j0O0O0J7J7o4o4o5o4J7
$$ 1614 1647 1594 1547 1500 1456 1411 1367 1323 1351 1379 1406 1434 1431 1428 1425 1422 1487 1551 1544 1538 1511 1483 1498 1514 1547 1580 1570 1560 1620 1680 1697 1714 1650 1586 1521 1457 1474
1846A474J7J7J8MNl8l7j1j0L2L3j3j2m9m9OR1M8l7J%O6O7l3l2J0J0K3K3r8r9k5O1O6k0m3M2
$$ 1474 1491 1508 1526 1530 1535 1497 1460 1449 1439 1471 1504 1491 1479 1430 1381 1387 1478 1526 1489 1490 1490 1556 1623 1590 1558 1568 1578 1601 1624 1526 1427 1402 1463 1529 1509 1466 1508
1842A508L2L1q0p9l7l8J4J3J4J3%Jm2m3M0L9L9M0qrm5m5j7O8J11K5n3n4n4n4r6j1O8O9L3L3
$$ 1508 1540 1571 1491 1412 1375 1337 1351 1364 1378 1391 1391 1392 1350 1307 1347 1386 1425 1465 1457 1448 1403 1358 1341 1409 1520 1545 1492 1438 1384 1330 1234 1223 1291 1360 1393 1426
1838A426L3L4k7k6k6k6k2k2k2k2J0RQ0J23P7Pk1k2m7m7m7m7k9k8k8k8J7J7J7J7M8M8n1r4l3
$$ 1426 1459 1493 1466 1440 1414 1388 1366 1344 1322 1300 1310 1319 1399 1522 1599 1606 1585 1563 1516 1469 1422 1375 1346 1318 1290 1262 1279 1296 1313 1330 1378 1426 1375 1281 1248
1833A248L9L8L8J6J6k7k7K5K4K5K5k1k0k1k0k1k0k1k0k9k8k8k8OOM9R1J07L6m9r1l6L5K0k4
$$ 1248 1287 1325 1363 1379 1395 1368 1341 1366 1390 1415 1440 1419 1399 1378 1358 1337 1317 1296 1276 1247 1219 1191 1163 1169 1175 1224 1315 1422 1458 1409 1318 1282 1317 1337 1313
1829A313j9K3jp3j15m4L9L9j5j5K7K7J1J1J2J1M2M2M2M2n1n1n1n1j1j1L2L2LLOOM9R1L7l5
$$ 1313 1294 1317 1316 1243 1128 1084 1123 1162 1147 1132 1159 1186 1197 1208 1220 1231 1273 1315 1357 1399 1348 1297 1246 1195 1184 1173 1205 1237 1240 1243 1249 1255 1304 1395 1432 1397
1825A397n9o0QPM2M3L7L8l9j10r4n1RRJ1J2M0M0lkp8p7poL8L7mnKLM5M5M0M0o0n9l5l5L7L6
$$ 1397 1338 1278 1286 1293 1335 1378 1415 1453 1414 1304 1210 1159 1168 1177 1188 1200 1240 1280 1277 1275 1197 1120 1113 1107 1145 1182 1178 1173 1175 1178 1223 1268 1308 1348 1288 1229 1194 1159 1196 1232
1820A232kkkkO9P0K6K7r9r9k8k8mmmmJ3J2Q4Q4L1L2r7r6J2J2N4N5q2q3l9m0k2k2k2k2M0M1
$$ 1232 1230 1228 1226 1224 1293 1363 1389 1416 1317 1218 1190 1162 1158 1154 1150 1146 1159 1171 1255 1339 1370 1402 1305 1209 1221 1233 1287 1342 1260 1177 1138 1098 1076 1054 1032 1010 1050 1091
1815A091M0M1J2J3n8n8L3L2L2L2mmL9L8%jm3m3l1l2l1l2mnL8L8L0L0j2j3k9k9J4J3N2N2j9
$$ 1091 1131 1172 1184 1197 1139 1081 1114 1146 1178 1210 1206 1202 1241 1279 1279 1278 1235 1192 1161 1129 1098 1066 1062 1057 1095 1133 1163 1193 1181 1168 1139 1110 1124 1137 1189 1241 1222
1811A222k0J5J5J4J5pqpqj3j3j4j3nnL7L7jjj%l3l3J0RPOOOm0m0l7l7K8P0M7k4q3m0N6N7j1
$$ 1222 1202 1217 1232 1246 1261 1254 1246 1239 1231 1218 1205 1191 1178 1173 1168 1205 1242 1241 1240 1239 1239 1206 1173 1183 1192 1199 1205 1211 1217 1177 1137 1100 1063 1091 1161 1208 1184 1101 1061 1117 1174 1163
1805A163n3k7M4R5R5L2o7j18m8Q7Q7qp8k2K0Ll9j2j3k9l0K6R7Q0Rm2JPOl3l3J0J1N3N3OOo5
$$ 1163 1110 1083 1127 1222 1317 1349 1282 1164 1116 1203 1290 1282 1204 1182 1202 1205 1166 1154 1141 1112 1082 1108 1205 1285 1294 1252 1253 1260 1266 1233 1200 1210 1221 1274 1327 1333 1339 1274
1801A274o5popp%jM2M2L2L1l9m0llL9M0J9J9J9J9MMP5P4J12J11J4q6j65j23n4n3o5o4OPL5
$$ 1274 1209 1202 1196 1189 1182 1182 1181 1223 1265 1297 1328 1289 1249 1246 1243 1282 1322 1341 1360 1379 1398 1402 1406 1481 1555 1667 1778 1792 1706 1541 1418 1364 1311 1246 1182 1188 1195 1230
1796A230L4pqn6n7J5N7M1k9n4j1K6K5K9K8JJJJMNMMm2m2m1m2QPQQL7L6Q0P9n4n4n5n4j7j7
$$ 1230 1264 1257 1249 1193 1136 1151 1208 1249 1220 1166 1155 1181 1206 1235 1263 1264 1265 1266 1267 1271 1276 1280 1284 1242 1200 1159 1117 1125 1132 1140 1148 1185 1221 1301 1380 1326 1272 1217 1163 1146 1129
1791A129N4N3K6K5K5K5NNNMK1K2K1K1nom8m8r4r3n2n1J1J2J1J2n8n7J7J02L6m9j14k9N2N2
$$ 1129 1183 1236 1262 1287 1312 1337 1342 1347 1352 1356 1377 1399 1420 1441 1436 1430 1382 1334 1240 1147 1095 1044 1055 1067 1078 1090 1032 975 992 1094 1130 1081 967 938 990 1042
1787A042N8N8k4k4k4k4J7J8K8n7o6K0R3R4KKJKn7n6J7J03M1m4RRJ5J6k7k8n4n4J6J7J5J6J6
$$ 1042 1100 1158 1134 1110 1086 1062 1079 1097 1125 1068 1002 1022 1115 1209 1211 1213 1214 1216 1159 1103 1120 1223 1264 1220 1229 1238 1253 1269 1242 1214 1160 1106 1122 1139 1154 1170 1186
1782A186J5l1l2m2M3J9o6j3j3K9K8K9K9K5K5j7j8MLl9m0J7J6J7J6k0k1K2K1K0K0n1n1M7M6
$$ 1186 1201 1170 1138 1096 1139 1158 1092 1079 1066 1095 1123 1152 1181 1206 1231 1214 1196 1200 1203 1164 1124 1141 1157 1174 1190 1170 1149 1171 1192 1212 1232 1181 1130 1177 1223
1778A223M6M6k3k3k3k2k5k5J8J8jj%jk4k4p2J4M7M7j9j8N6N6K7m3p2l0M1M1OOLLo2j05m9K1
$$ 1223 1269 1315 1292 1269 1246 1224 1199 1174 1192 1210 1209 1208 1208 1207 1183 1159 1087 1101 1148 1195 1176 1158 1214 1270 1297 1254 1182 1152 1193 1234 1240 1246 1249 1252 1190 1085 1036 1057
1773A057J6J5K1K0kllkL2L2j3j2n0r1o5NP2P2NNL9L9l2l2K3K3k0k0l8l8NNllO4O3J3n8o0J0
$$ 1057 1073 1088 1109 1129 1127 1124 1121 1119 1151 1183 1170 1158 1108 1017 952 957 1029 1101 1106 1111 1150 1189 1157 1125 1148 1171 1151 1131 1093 1055 1060 1065 1062 1059 1123 1186 1199 1141 1081 1091
1768A091M3%m2m2k5k4J8J8N7N7m3m2J6J6J6J6j9j8j9j9O7O8mmj6j7j6j7p5p4J0Q1P4L2j1j0
$$ 1091 1134 1134 1092 1050 1025 1001 1019 1037 1094 1151 1108 1066 1082 1098 1114 1130 1111 1093 1074 1055 1122 1190 1186 1182 1166 1149 1133 1116 1041 967 977 1058 1132 1164 1153 1143
1764A143PPPPk0k0M9M8l2p4n1K0N4J2n9n9j0rL3L3PPPPM8M9M4M4op6p9rN1Rr1r1m1m1Q1Q2
$$ 1143 1150 1157 1164 1171 1151 1131 1180 1228 1196 1122 1071 1091 1145 1157 1098 1039 1029 1020 1053 1086 1093 1100 1107 1114 1162 1211 1255 1299 1293 1217 1138 1129 1180 1189 1098 1007 966 925 1006 1088
1759A088P2j3l6l5O2O2l7l7M2M1M2M2nnp7p6l1l2l2l2QQP3P4M2m2o6o6K0K0N6N7O4k1m4m4
$$ 1088 1160 1147 1111 1076 1138 1200 1163 1126 1168 1209 1251 1293 1288 1283 1206 1130 1099 1067 1035 1003 1011 1019 1092 1166 1208 1166 1100 1034 1054 1074 1130 1187 1251 1230 1186 1142
1755A142M4M4n6n5J3J3q1q1m6M0qrM4M4N0l6J8J8N6N5P4P3K7n8o5K0L8L7l5l6l6l6n6n5j0
$$ 1142 1186 1230 1174 1119 1132 1145 1064 983 937 977 969 960 1004 1048 1098 1062 1080 1098 1154 1209 1283 1356 1383 1325 1260 1280 1318 1355 1320 1284 1248 1212 1156 1101 1091
1750A091P5Q5%r7r7k9N7N2N1N0N0Lq1j24l9L6L5N2N1N2N1n1n0n1n1J2J2J2J3O1O1L8m6o6o5
$$ 1091 1166 1251 1251 1154 1057 1028 1085 1137 1188 1238 1288 1291 1210 1086 1047 1083 1118 1170 1221 1273 1324 1273 1223 1172 1121 1133 1145 1157 1170 1231 1292 1330 1284 1218 1153
1746A153%%P6P6k3k3rrn1n2m5m5K6K6PPl5l6J9J8J9J8j8j9K4K4j8j7j8j7k4k4J9J9K0K0k2
$$ 1153 1153 1153 1229 1305 1282 1259 1250 1241 1190 1138 1093 1048 1074 1100 1107 1114 1079 1043 1062 1080 1099 1117 1099 1080 1104 1128 1110 1093 1075 1058 1034 1010 1029 1048 1068 1088 1066
1742A066k3jjO5O4O3k3o9k7O2O3onK1K2n0m9j1j1j2j1j3j4K9K9M1M1M2M1L2L2r5j37q8kM6
$$ 1066 1043 1042 1041 1106 1170 1233 1210 1141 1114 1176 1239 1233 1228 1249 1271 1221 1172 1161 1150 1138 1127 1114 1100 1129 1158 1199 1240 1282 1323 1355 1387 1292 1155 1067 1065 1111
1737A111M6J3J3N0N0M5m0j15j15k4O1P9L7qqpqL1P3N7k8m5kqn0q6q7m6m7l6l6L8L7M9R2J16
$$ 1111 1157 1170 1183 1233 1283 1328 1288 1173 1058 1034 1095 1174 1211 1203 1195 1188 1180 1211 1284 1341 1313 1268 1266 1258 1208 1122 1035 989 942 906 870 908 945 994 1086 1202
1733A202L0k2k3J4J5n1n2J4J4or2r1oR4R3P7rj0j0K7K8J7J6k4o7o6K0O3O3k5j10q6m3k7k8
$$ 1202 1232 1210 1187 1201 1216 1165 1113 1127 1141 1135 1043 952 946 1040 1133 1210 1201 1191 1181 1208 1236 1253 1269 1245 1178 1112 1132 1195 1258 1233 1123 1037 994 967 939
1728I39M7M6Q2Q3L5L5Np9q0OP2P2n0n1j5j6K7K7K3K4j9j9mllloppoklkkj1j1O0O0M4M3KJo0
$$ 939 986 1032 1114 1197 1232 1267 1272 1193 1113 1119 1191 1263 1213 1162 1147 1131 1158 1185 1208 1232 1213 1194 1190 1187 1184 1181 1175 1168 1161 1155 1153 1150 1148 1146 1135 1124 1184 1244 1288 1331 1333 1334 1274
1723A274n9n5n4K0J06L5n0r0r1O0O0M9N0k2k2n1n2rrj3j3j2j3KLLKL2L2L2L2Q7Q8o8o9n5n5
$$ 1274 1215 1160 1106 1126 1232 1267 1217 1127 1036 1096 1156 1205 1255 1233 1211 1160 1108 1099 1090 1077 1064 1052 1039 1041 1044 1047 1049 1081 1113 1145 1177 1264 1352 1284 1215 1160 1105
1719A105m9n0J3R8R9J3l2l2l3l2k6N9Q2Q1l7l8NMN4N4k1j05j04j7j%J6J6J6J7l5l4L6L7N1
$$ 1105 1056 1006 1019 1117 1216 1229 1197 1165 1132 1100 1074 1133 1215 1296 1259 1221 1226 1230 1284 1338 1317 1212 1108 1091 1090 1090 1106 1122 1138 1155 1120 1086 1122 1159 1210
1714A210N1k0j9J6J7J6J7LMM5M6N4N4L1n5p6p5M6M6k5k6P4P4j1j1j2j1l7l7ONK4K4O7O6O1
$$ 1210 1261 1241 1222 1238 1255 1271 1288 1291 1295 1340 1386 1440 1494 1525 1470 1394 1319 1365 1411 1386 1360 1434 1508 1497 1486 1474 1463 1426 1389 1395 1400 1424 1448 1515 1581 1642
1710A642O0j1j0m5m5m4m5m1m1JKOOOOmnmmQQP8P9l8l8l8l8NMl7l8QQRQo1o1J1J0J1J2l0l1
$$ 1642 1702 1691 1681 1636 1591 1547 1502 1461 1420 1421 1423 1429 1435 1441 1447 1443 1438 1434 1430 1438 1446 1524 1603 1565 1527 1489 1451 1456 1460 1423 1385 1393 1401 1410 1418 1357 1296 1307 1317 1328 1340 1310 1279
1705A279m6m5m6m5L3L3L3L4L2L1L2L2pppprrqrP7P7OOL1L2L1L1n0n0K2K1P7P7OPj13j12j4
$$ 1279 1233 1188 1142 1097 1130 1163 1196 1230 1262 1293 1325 1357 1350 1343 1336 1329 1320 1311 1303 1294 1371 1448 1454 1460 1491 1523 1554 1585 1535 1485 1507 1528 1605 1682 1688 1695 1582 1470 1456
1700A456j3J9J9n2n1l8l8L4L3kkm4m4J17J17M6r6j22l6L4L4k3k2K0K0O1O1J9J8k4k5k5k5K1
$$ 1456 1443 1462 1481 1429 1378 1340 1302 1336 1369 1367 1365 1321 1277 1394 1511 1557 1461 1339 1303 1337 1371 1348 1326 1346 1366 1427 1488 1507 1525 1501 1476 1451 1426 1447
1696A447K0k2k2o1o1j9j9l6l6l7l6m8m8Q0P9K5K6j8j7p0o9k8k7P3P3P3P3l6l6L5L5k7k7r7
$$ 1447 1467 1445 1423 1362 1301 1282 1263 1227 1191 1154 1118 1070 1022 1102 1181 1206 1232 1214 1197 1127 1058 1030 1003 1076 1149 1222 1295 1259 1223 1258 1293 1266 1239 1142
1692A142r8k3k3P6P6qqn0n1M7M6M6M6p4p4K6K5J5J6J6J5RRJ0Rj3j3n6n6jkjkJ4J3J4J4k1k1
$$ 1142 1044 1021 998 1074 1150 1142 1134 1084 1033 1080 1126 1172 1218 1144 1070 1096 1121 1136 1152 1168 1183 1192 1201 1211 1220 1207 1194 1138 1082 1081 1079 1078 1076 1090 1103 1117 1131 1110 1089
1687A089k1k0K1K1R2R1k9l0l0l0MMM7M6j7j7j7j7M1M2n8n8K3K2K3K3PQl5l5m4m5N5N5J0Rl3
$$ 1089 1068 1048 1069 1090 1182 1273 1244 1214 1184 1154 1158 1162 1209 1255 1238 1221 1204 1187 1228 1270 1212 1154 1177 1199 1222 1245 1252 1260 1225 1190 1146 1101 1156 1211 1221 1230 1197
1682A197l3J6J6J6J6r9j00n7n6L0L1L1L0qqL4L4K7K6K7K6m5m5K9J14O6k0r3r4m1m2L0K9NN
$$ 1197 1164 1180 1196 1212 1228 1129 1029 972 916 946 977 1008 1038 1030 1022 1056 1090 1117 1143 1170 1196 1151 1106 1135 1249 1315 1295 1202 1108 1067 1025 1055 1084 1089 1094
1678A094NNMLl8l9M8M8R0R0l2l2l2l2j8j8j9j8k6k7M5M5J1J1J1J1j1j1n4n4qpL4L5q4q4J8
$$ 1094 1099 1104 1108 1111 1073 1034 1082 1130 1220 1310 1278 1246 1214 1182 1164 1146 1127 1109 1083 1056 1101 1146 1157 1168 1179 1190 1179 1168 1114 1060 1052 1045 1079 1114 1030 946 964
1674I64J04J04J9KJl6l6l5l6QQQPj0j1n8K6Q3Q2j1j1K1K0K1K1PPq6q7rP5P6j0o8o8p3p3K7
$$ 964 1068 1172 1191 1193 1194 1158 1122 1087 1051 1059 1067 1075 1082 1072 1061 1003 1029 1112 1194 1183 1172 1193 1213 1234 1255 1262 1269 1183 1096 1087 1162 1238 1228 1160 1092 1019 946 973
1669I73K6K7K7%%m3m3l1l1J1J1J26J26J06l6q6q6L3L3lklkm5m5M9M9J3p2p7QN0l6j04j05K1
$$ 973 999 1026 1053 1053 1053 1010 967 936 905 916 927 1053 1179 1285 1249 1163 1077 1110 1143 1140 1138 1135 1133 1088 1043 1092 1141 1154 1082 1005 1013 1063 1027 923 818 839
1665H39J05J5p0p5O6J57P1l4l4L2L2k5k4J8J9j4j4j4j4k9l0R8R8J9K0J9K0o5o5k5J16O4p8
$$ 839 944 959 889 814 880 1037 1108 1074 1040 1072 1104 1079 1055 1073 1092 1078 1064 1050 1036 1007 977 1075 1173 1192 1212 1231 1251 1186 1121 1096 1212 1276 1198
1661A198j08k2J1J2J7J7K0K0k3k3K3K2k0k0J8J9k4k4n3n2oP8P7rk6k6K5K5j7j8n3n3l6N0Q9
$$ 1198 1090 1068 1079 1091 1108 1125 1145 1165 1142 1119 1142 1164 1144 1124 1142 1161 1137 1113 1060 1008 1002 1080 1157 1148 1122 1096 1121 1146 1129 1111 1058 1005 969 1019 1108
1656A108Lj4j4O4O4opJ0Rq5q4p2J4O5O5N1N1k0k1j9k0K2K3MNNNj9j9j9j9L0L0j3j2l2l1l1
$$ 1108 1111 1097 1083 1147 1211 1205 1198 1208 1217 1132 1048 976 990 1055 1120 1171 1222 1202 1181 1162 1142 1164 1187 1191 1196 1201 1206 1187 1168 1149 1130 1160 1190 1177 1165 1133 1102 1071
1652A071l1J4J4n7n7M4M4OPj9O7Q4Q5j1r6q5q5m0M6O2O3Pp8p8PL9L8%JL8L8l2l3K6K7K7K6
$$ 1071 1040 1054 1068 1011 954 998 1042 1048 1055 1036 1103 1187 1272 1261 1165 1080 995 955 1001 1063 1126 1133 1055 977 984 1023 1061 1061 1062 1100 1138 1106 1073 1099 1126 1153 1179
1647A179RQl4l4LKM5M5QPl5l5qqrqkkkkk7k7k6k7J0J0J0J0K3K3O5O5nmm7m7K1K1k1k1j9j9
$$ 1179 1188 1196 1162 1128 1131 1133 1178 1223 1231 1238 1203 1168 1160 1152 1143 1135 1133 1131 1129 1127 1100 1073 1047 1020 1030 1040 1050 1060 1083 1106 1171 1236 1231 1227 1180 1133 1154 1175 1154 1133 1114 1095
1642A095j9k0O4O3M0m4n5n5J0J1N7N6j4j4jkl8l9q6jK2K1MMM6M6nnonj7j6j7j7M7M6MLK2K1
$$ 1095 1076 1056 1120 1183 1223 1179 1124 1069 1079 1090 1147 1203 1189 1175 1174 1172 1134 1095 1009 1008 1030 1051 1055 1059 1105 1151 1146 1141 1135 1130 1113 1097 1080 1063 1110 1156 1160 1163 1185 1206
1637A206K2K1J0J0o1o1K9K9j3j4k5k6o3o3J7J03J20J21K1o4n9n8M0M1kkj5j4n2n1m8L7L2L2
$$ 1206 1228 1249 1259 1269 1208 1147 1176 1205 1192 1178 1153 1127 1064 1001 1018 1121 1241 1362 1383 1319 1260 1202 1242 1283 1281 1279 1264 1250 1198 1147 1099 1136 1168 1200
1633A200j0j0j0rL4L5qqJ6J6J6J5j0j0j0j0J3J2J2J2n6n5J5J5L7L7nnN0M9k4j10p6RQ3Q3j9
$$ 1200 1190 1180 1170 1161 1195 1230 1222 1214 1230 1246 1262 1277 1267 1257 1247 1237 1250 1262 1274 1286 1230 1175 1190 1205 1242 1279 1274 1269 1319 1368 1344 1234 1158 1167 1250 1333 1314
1628A314j9N2N2L6L7o2o3j7j7j1j2k7N9J29M4n2n2j5j5j3j2L0L0J9J9J9J9p6p7l4l4L4L4L5
$$ 1314 1295 1347 1399 1435 1472 1410 1347 1330 1313 1302 1290 1263 1322 1451 1495 1443 1391 1376 1361 1348 1336 1366 1396 1415 1434 1453 1472 1396 1319 1285 1251 1285 1319 1354
1624A354L4q9q9o6J9N9N8K2K1mlm6m6o4o4POooL6L6J6J7J6J7O2O1l7l8m1m1L0L0j1j1K7K6
$$ 1354 1388 1299 1210 1144 1163 1222 1280 1302 1323 1319 1316 1270 1224 1160 1096 1103 1109 1103 1097 1133 1169 1185 1202 1218 1235 1297 1358 1321 1283 1242 1201 1231 1261 1250 1239 1266 1292
1620A292L2n3r6j0L2L2l3l4Q4Q4Q9Nk5k4k9l0j0rj0j0POPPP1P0mq9o9J6L4L4o0o1L8L9L6L5
$$ 1292 1324 1271 1175 1165 1197 1229 1196 1162 1246 1330 1419 1424 1399 1375 1346 1316 1306 1297 1287 1277 1284 1290 1297 1304 1375 1445 1441 1352 1283 1299 1333 1367 1307 1246 1284 1323 1359 1394
1615A394opJ2J3J2J3P9P9k4j09o8J7Q3ll9l9P8P8J9o6o6J9O2O3lmJ5J4N7N7L8L8n7n6m9L6
$$ 1394 1388 1381 1393 1406 1418 1431 1510 1589 1565 1456 1388 1405 1488 1485 1446 1407 1485 1563 1582 1516 1450 1469 1531 1594 1591 1587 1602 1616 1673 1730 1768 1806 1749 1693 1644 1680
1611A680Q7Q8rrn7K8O3O3k5k6P1J56J14J13J36K20K47J05p4j60j62j63j74j73r4rk6k6o3o2
$$ 1680 1767 1855 1846 1837 1780 1808 1871 1934 1909 1883 1954 2110 2224 2337 2473 2693 2940 3045 2971 2811 2649 2486 2312 2139 2045 2036 2010 1984 1921 1859
1607A859k2k1k1k1j3j3j3j3K1K2K1K2jjm3m3mmmml6l5L5L5L8L7L8L8poL0L1Kq3q3JP1P0j9
$$ 1859 1837 1816 1795 1774 1761 1748 1735 1722 1743 1765 1786 1808 1807 1806 1763 1720 1716 1712 1708 1704 1668 1633 1668 1703 1741 1778 1816 1854 1847 1841 1871 1902 1904 1821 1738 1739 1810 1880 1861
1602A861j8k5O1N5N5JJJJl2l1J1J1O4O4K2K1o4o4o3o4L3L4l2l2nQ1Q0nq7q8L4L4k4k4k4k3
$$ 1861 1843 1818 1879 1934 1989 1990 1991 1992 1993 1961 1930 1941 1952 2016 2080 2102 2123 2059 1995 1932 1868 1901 1935 1903 1871 1866 1947 2027 2022 1935 1847 1881 1915 1891 1867 1843 1820
1598A820M4M4k6k7j4j3K9K9LLMLMNM7M6J0J0RJ0m8m9k5O0J10J10J87J86J99K00J47J48M2j00
$$ 1820 1864 1908 1882 1855 1841 1828 1857 1886 1889 1892 1896 1899 1903 1908 1955 2001 2011 2021 2030 2040 1992 1943 1918 1978 2088 2198 2385 2571 2770 2970 3117 3265 3307 3207
1594C207k62k61k36k36j56p1l6l7p3p4K1K1K0K1k1k1q6q7l4N1R4QJ1J1OOl9l9MMn9o0J1J1
$$ 3207 2945 2684 2448 2212 2056 1985 1949 1912 1839 1765 1786 1807 1827 1848 1827 1806 1720 1633 1599 1650 1744 1752 1763 1774 1780 1786 1747 1708 1712 1716 1657 1597 1608 1619
1589A619kjkjl7l7L4L4k3k3k3k3k3k3k3k3O1O0M3m2j20l4O9O8qrL4L4L5L5L5L5o9p0m6L9J
$$ 1619 1617 1616 1614 1613 1576 1539 1573 1607 1584 1561 1538 1515 1492 1469 1446 1423 1484 1544 1587 1545 1425 1391 1460 1528 1520 1511 1545 1579 1614 1649 1684 1719 1650 1580 1534 1573 1574
1585A574KOPL0L0j2j3j0j0K8K7k4j10o7J8L0K9l6l6OPOOooooj8j7k3O2M8M8j7j8m9n0m9n0
$$ 1574 1576 1582 1589 1619 1649 1637 1624 1614 1604 1632 1659 1635 1525 1458 1476 1506 1535 1499 1463 1469 1476 1482 1488 1482 1476 1470 1464 1446 1429 1406 1468 1516 1564 1547 1529 1480 1430 1381 1331
1580A331KKKKR6R5K5K4l5l6l6l5L8L8l3l3PQPPKKKKrrqrPPPPn0n1K1K0k0j9k0k0J4J4N6N7
$$ 1331 1333 1335 1337 1339 1435 1530 1555 1579 1544 1508 1472 1437 1475 1513 1480 1447 1454 1462 1469 1476 1478 1480 1482 1484 1475 1466 1458 1449 1456 1463 1470 1477 1427 1376 1397 1417 1397 1378 1358 1338 1352 1366 1422 1479
1575A479J9K0K0J9RQo3o3r6r6O3J49J55P0K5K4L5L4o4o5n4n5J6J6m1m1m1m1j9j9j9j9K7K7
$$ 1479 1498 1518 1538 1557 1566 1574 1511 1448 1352 1256 1319 1468 1623 1693 1718 1742 1777 1811 1747 1682 1628 1573 1589 1605 1564 1523 1482 1441 1422 1403 1384 1365 1392 1419
1571A419K7K7J0Rl3l3j3j3N8N8J6J5J6J5rj0j0rM8M9OOj5j6K7K8k4k3J9J9j7j7j7j7O5O5J4
$$ 1419 1446 1473 1483 1492 1459 1426 1413 1400 1458 1516 1532 1547 1563 1578 1569 1559 1549 1540 1588 1637 1643 1649 1634 1618 1645 1673 1649 1626 1645 1664 1647 1630 1613 1596 1661 1726 1740
1566A740p1n6n6J0RK2K2Q7Q8j5j00n7K8K9K8j0rMMM6M6l9m0k2O3L0n6klM5M4Q7Q7O4O4Q7J72
$$ 1740 1669 1613 1557 1567 1576 1598 1620 1707 1795 1780 1680 1623 1651 1680 1708 1698 1689 1693 1697 1743 1789 1750 1710 1688 1751 1781 1725 1723 1720 1765 1809 1896 1983 2047 2111 2198 2370
1561B370K52K52K89M31O16Q14R44R44O14J9n50r19j013q71o46m48k70k71k35j49mmm2m1j8
$$ 2370 2622 2874 3163 3594 4210 5024 5968 6912 7526 7545 6995 6076 5063 4192 3546 3098 2828 2557 2322 2173 2169 2165 2123 2082 2064
1558B064j8n6n5n5K9K5K4RRN1N1j1j1n3n3k7k6k7k7N2N2N2N1k2k3K0K0J2J3n8n9qrO2O2P3
$$ 2064 2046 1990 1935 1880 1909 1934 1958 1967 1976 2027 2078 2067 2056 2003 1950 1923 1897 1870 1843 1895 1947 1999 2050 2028 2005 2025 2045 2057 2070 2012 1953 1945 1936 1998 2060 2133
1554B133P3k7k6K0K1n0n1K2K1K1K2R1R2qr3q8N3N9k6q5q5O6O6P1P0j%l0l0k9l0j8j8K4K5k0
$$ 2133 2206 2179 2153 2173 2194 2144 2093 2115 2136 2157 2179 2270 2362 2354 2261 2173 2226 2285 2259 2174 2089 2155 2221 2292 2362 2361 2361 2331 2301 2272 2242 2224 2206 2230 2255 2235
1550B235k0k0j9M0M0kko6o5L3L3J3J2J3J2N1N0N1N0ONNOjjjjJ8J8Q9Q9N9O0j1j1P3P4J16J17
$$ 2235 2215 2195 2176 2216 2256 2254 2252 2186 2121 2154 2187 2200 2212 2225 2237 2288 2338 2389 2439 2445 2450 2455 2461 2460 2459 2458 2457 2475 2493 2582 2671 2730 2790 2779 2768 2841 2915 3031 3148
1545C148J18J18L20M05M59O01Q53J050R82N00j47o86r94r94q08o09m09l24k51j66m1m1p7p8
$$ 3148 3266 3384 3704 4109 4568 5169 6022 7072 8054 8554 8407 7721 6727 5733 4925 4316 3907 3583 3332 3166 3125 3084 3007 2929
1542B929n3n3j1j0l5l5L6L6L4L3rrl2l1l1l2m0m0KKK9L0K9K9n8n8j01j01P6P5ONl8l7q0q1
$$ 2929 2876 2823 2812 2802 2767 2732 2768 2804 2838 2871 2862 2853 2821 2790 2759 2727 2687 2647 2649 2651 2680 2710 2739 2768 2710 2652 2551 2450 2526 2601 2607 2612 2574 2537 2457 2376
1538B376nnR4R4k0k0k0k0N4N5J2J2J8J8J9J8j5j5j5j5mmnmk9k9k9k9K0K0K0K0OPo5o4K2K1
$$ 2376 2371 2366 2460 2554 2534 2514 2494 2474 2528 2583 2595 2607 2625 2643 2662 2680 2665 2650 2635 2620 2616 2612 2607 2603 2574 2545 2516 2487 2507 2527 2547 2567 2573 2580 2515 2451 2473 2494
1533B494R3R2L0L0j2j2poO5O5ppopK3K2K3K2kllkM3M4M3M3qqqql5l5j07j06poppp1p1j%L4
$$ 2494 2587 2679 2709 2739 2727 2715 2708 2702 2767 2832 2825 2818 2812 2805 2828 2850 2873 2895 2893 2890 2887 2885 2928 2972 3015 3058 3050 3042 3034 3026 2991 2956 2849 2743 2736 2730 2723 2716 2645 2574 2573 2573 2607
1528B607L4rrl6l6OPKLKKM2M3k9k9K5K5j8j7l5l6L6L5noL7L7kkm4m5%%M2M3N0N1QQM2M2M2
$$ 2607 2641 2632 2623 2587 2551 2557 2564 2566 2569 2571 2573 2615 2658 2629 2600 2625 2650 2632 2615 2580 2544 2580 2615 2610 2604 2641 2678 2676 2674 2630 2585 2585 2585 2627 2670 2720 2771 2779 2787 2829 2871 2913
1522B913M2J8J7J7J7K9K9l7l6K7J12J12K7j0rK8K7J03J03N2l3n3n2j5j5o9o9k7k7n5n5n5n5
$$ 2913 2955 2973 2990 3007 3024 3053 3082 3045 3009 3036 3148 3260 3287 3277 3268 3296 3323 3426 3529 3581 3548 3495 3443 3428 3413 3344 3275 3248 3221 3166 3111 3056 3001
1518C001q4q5q4q4llmll0l1l0l1J3J3l0l0l9m0L1L2K2K2m9m9J1J0N3N3J5J4J1J2n4r7k6N8
$$ 3001 2917 2832 2748 2664 2661 2658 2654 2651 2621 2590 2560 2529 2542 2555 2525 2495 2456 2416 2447 2479 2501 2523 2474 2425 2436 2446 2499 2552 2567 2581 2592 2604 2550 2453 2427 2485
1514B485J12K8p6p5k6k6o9o8n1n1K0K1J3J3n8n8K4K3m2m2L1J17P4j1k6k6l2l1lkkkJ4J5J5
$$ 2485 2597 2625 2549 2474 2448 2422 2353 2285 2234 2183 2203 2224 2237 2250 2192 2134 2158 2181 2139 2097 2128 2245 2319 2308 2282 2256 2224 2193 2190 2188 2186 2184 2198 2213 2228
1510B228J4n1n1j16j17p3J1L4L5O9O9M6m0l1l1l2l1n6K8N2N2j3j2j3j3o6o7K7K7M8l8l2l3
$$ 2228 2242 2191 2140 2024 1907 1834 1845 1879 1914 1983 2052 2098 2058 2027 1996 1964 1933 1877 1905 1957 2009 1996 1984 1971 1958 1892 1825 1852 1879 1927 1889 1857 1824
1506A824L5L5l1l0l7M9M3M3k6k6M5M4L2L1o3o3k6O0N4N4l7l7NNl9l9PR2J60P5n0n1l0N5PP
$$ 1824 1859 1894 1863 1833 1796 1845 1888 1931 1905 1879 1924 1968 2000 2031 1968 1905 1879 1939 1993 2047 2010 1973 1978 1983 1944 1905 1912 2004 2164 2239 2189 2138 2108 2163 2170 2177
1501B177j6j7K7K6o0o0o1o0N2N3N8k7m3m4N1N1k4k4k4k5PPPPN1N1N1N1M8M8n6j40j44n9M4
$$ 2177 2161 2144 2171 2197 2137 2077 2016 1956 2008 2061 2119 2092 2049 2005 2056 2107 2083 2059 2035 2010 2017 2024 2031 2038 2089 2140 2191 2242 2290 2338 2282 2142 1998 1939 1983
1497A983M4nnnnL9L8mml5l5QPP3P4K1o3r2r3k7k7M8M7M8M7j2j3L1L0llk2k1K4O6N1l5l2J1
$$ 1983 2027 2022 2017 2012 2007 2046 2084 2080 2076 2041 2006 2014 2021 2094 2168 2189 2126 2034 1941 1914 1887 1935 1982 2030 2077 2065 2052 2083 2113 2110 2107 2085 2064 2088 2154 2205 2170 2138 2149
1492B149M9M9l6p8l4N1N3J0k6J5M9M8m7r0n5K9J07J06J3J3l0l0M1M1Q1Q1k3o6m7L8M8M9L2
$$ 2149 2198 2247 2211 2133 2099 2150 2203 2213 2187 2202 2251 2299 2252 2162 2107 2136 2243 2349 2362 2375 2345 2315 2356 2397 2478 2559 2536 2470 2423 2461 2509 2558 2590
1488B590L3M4M3MML3P6O0k6n1j0L2L3J0J1Q1Q2rql0l0n6n7K3J09O4O4P0P0P0P1j%L8L8M2M1
$$ 2590 2623 2667 2710 2714 2718 2751 2827 2887 2861 2810 2800 2832 2865 2875 2886 2967 3049 3040 3032 3002 2972 2916 2859 2882 2991 3055 3119 3189 3259 3329 3400 3399 3399 3437 3475 3517 3558
1484C558j5K8J07J92J29M4L0P3P9P8J0J0l4l5l4l4J5J6J6J6j9j9j9j9m5m5q7q8q8q9j7j8j1
$$ 3558 3543 3571 3678 3870 3999 4043 4073 4146 4225 4303 4313 4323 4289 4254 4220 4186 4201 4217 4233 4249 4230 4211 4192 4173 4128 4083 3996 3908 3820 3731 3714 3696 3685
1480C685j1m9m8l2N4P2K9noL5L4j3j3K9K9l3l3p6p6l4l3L7L8m3m3%jppJ4J5L9L9M0L9M2M2
$$ 3685 3674 3625 3577 3545 3599 3671 3700 3695 3689 3724 3758 3745 3732 3761 3790 3757 3724 3648 3572 3538 3505 3542 3580 3537 3494 3494 3493 3486 3479 3493 3508 3547 3586 3626 3665 3707 3749
1475C749O4O3J11J12M1M0J4J3n8n7llJ9J8l5l5QPm9m9k5N9P8P9J49J49J20L4J3R8J36J36M2
$$ 3749 3813 3876 3987 4099 4140 4180 4194 4207 4149 4092 4089 4086 4105 4123 4088 4053 4061 4068 4019 3970 3945 4004 4082 4161 4310 4459 4579 4613 4626 4724 4860 4996 5038
1471E038M2P2P2k8k7o7o6j09j10j57j58j34m9rrq3j68j21j22n6n6n1n0r4r3q9q9j8j8K0K0
$$ 5038 5080 5152 5224 5196 5169 5102 5036 4927 4817 4660 4502 4368 4319 4310 4301 4218 4050 3929 3807 3751 3695 3644 3594 3500 3407 3318 3229 3211 3193 3213 3233
1467C233q0p9k8k8k8k7m7m6N2N3N5N5J3J2MMl9l9n7n7J4J4K3K3K4K3L4L5O1k4n9n9M4J30P7
$$ 3233 3153 3074 3046 3018 2990 2963 2916 2870 2922 2975 3030 3085 3098 3110 3114 3118 3079 3040 2983 2926 2940 2954 2977 3000 3024 3047 3081 3116 3177 3153 3094 3035 3079 3209 3286
1463C286P7O2O1J8J7J3R7J17J18nnk5k4p6j61k37k38j63p8k3k3j8j7m3m2m2m2L0K9m1m1J8
$$ 3286 3363 3425 3486 3504 3521 3534 3631 3748 3866 3861 3856 3831 3807 3731 3570 3333 3095 2932 2854 2831 2808 2790 2773 2730 2688 2646 2604 2634 2663 2622 2581 2599
1459B599J8J8J9l1l1J2J2KKl5l6K4J09J09K4MMl9l9m7L8O1O2n8n7j4j5jjm9L6P9P9J3J3kl
$$ 2599 2617 2635 2654 2623 2592 2604 2616 2618 2620 2585 2549 2573 2682 2791 2815 2819 2823 2784 2745 2698 2736 2797 2859 2801 2744 2730 2715 2714 2713 2664 2700 2779 2858 2871 2884 2882 2879
1455B879klK1K0k1k2J4J5N7N7P8P9J50J49J49J49J49J48J62J62J19J19R0R0j5j56k05k05j42
$$ 2879 2877 2874 2895 2915 2894 2872 2886 2901 2958 3015 3093 3172 3322 3471 3620 3769 3918 4066 4228 4390 4509 4628 4718 4808 4793 4637 4432 4227 4085
1451D085j43j43j42j80j80j40n5o1o0j08j08l8l7noL8L7j12j12l7M8L7m9q5%L1L2L1L2j9j04
$$ 4085 3942 3799 3657 3477 3297 3157 3102 3041 2981 2873 2765 2727 2690 2685 2679 2717 2754 2642 2530 2493 2541 2578 2529 2444 2444 2475 2507 2538 2570 2551 2447
1447B447j03j9O3O3l1l1k4k3o7o6J6J6N9N8k7k7k7k7M1M0M1M0n5n5J6J6J3J3j14j14kjO9O9
$$ 2447 2344 2325 2388 2451 2420 2389 2365 2342 2275 2209 2225 2241 2300 2358 2331 2304 2277 2250 2291 2331 2372 2412 2357 2302 2318 2334 2347 2360 2246 2132 2130 2129 2198 2267
1443B267K6K6K6K6m7m7K4K4J6J6J6J6l4l5l5l4lllkJ0J0J0J0pqn0n0L2L2j0j0j0rq0q0RRR
$$ 2267 2293 2319 2345 2371 2324 2277 2301 2325 2341 2357 2373 2389 2355 2320 2285 2251 2248 2245 2242 2240 2250 2260 2270 2280 2273 2265 2215 2165 2197 2229 2219 2209 2199 2190 2110 2030 2039 2048 2057
1438B057Rl1l2l1l2M0L9l2l1j7j6j7j6l1l2l1l2J8J7J7J7m8m9oollklj1j1L1L2K1K0k1k2l6
$$ 2057 2066 2035 2003 1972 1940 1980 2019 1987 1956 1939 1923 1906 1890 1859 1827 1796 1764 1782 1799 1816 1833 1785 1736 1730 1724 1721 1718 1716 1713 1702 1691 1722 1754 1775 1795 1774 1752 1716
1434A716l6l6l6K7K7j5j6n1n1rqM6M6MMj5j5n7n7M0M0lkk6k6P3P3j0j0n3n2J3J4k9k9QPN0
$$ 1716 1680 1644 1608 1635 1662 1647 1631 1580 1529 1520 1512 1558 1604 1608 1612 1597 1582 1525 1468 1508 1548 1545 1543 1517 1491 1564 1637 1627 1617 1564 1512 1525 1539 1510 1481 1489 1496 1546
1429A546N0JKKJNMPPp8l6or2o6J8J21J22jj%jj2j2L0L0k9k9J3J4KLKLK8K9K8K8j3j4K9L0q1
$$ 1546 1596 1597 1599 1601 1602 1607 1611 1618 1625 1547 1511 1505 1413 1347 1365 1486 1608 1607 1606 1606 1605 1593 1581 1611 1641 1612 1583 1596 1610 1612 1615 1617 1620 1648 1677 1705 1733 1720 1706 1735 1765 1684
1424A684q1q1q0k7k7P3P2M9M8OOo2o3o2o2o7o7MMK3K3O5O5Q4Q3j6j5n4n4P3P4J3J4J3J3j8
$$ 1684 1603 1522 1442 1415 1388 1461 1533 1582 1630 1636 1642 1580 1517 1455 1393 1326 1259 1263 1267 1290 1313 1378 1443 1527 1610 1594 1579 1525 1471 1544 1618 1631 1645 1658 1671 1653
1420A653j8j7j8K4K5K5K5N1N1RRonL7L6k1k2r2r3k7k8J5J4k4k4k4k5K2K3K2K2K2K2K2K2j9
$$ 1653 1635 1618 1600 1624 1649 1674 1699 1750 1801 1810 1819 1813 1808 1845 1881 1860 1838 1746 1653 1626 1598 1613 1627 1603 1579 1555 1530 1552 1575 1597 1619 1641 1663 1685 1707 1688
1415A688j8j9j8K2K2k0k1q0q0k9N6K8K9L4L4L2L3j0j0j5j6j5j5j8j7K4K5M5M6k6k6J6J6Q6
$$ 1688 1670 1651 1633 1655 1677 1657 1636 1556 1476 1447 1503 1531 1560 1594 1628 1660 1693 1683 1673 1658 1642 1627 1612 1594 1577 1601 1626 1671 1717 1691 1665 1681 1697 1783
1411A783Q7m8m8n9K6Kq3j00j01N0N0K7n8m5m6K0K1QPN1N0NOo6o5l0l0J2J2o1o2L2L2l9j24
$$ 1783 1870 1822 1774 1715 1741 1743 1660 1560 1459 1509 1559 1586 1528 1483 1437 1457 1478 1486 1493 1544 1594 1599 1605 1539 1474 1444 1414 1426 1438 1377 1315 1347 1379 1340 1216
1407A216l4J09J19L4M3M3L4n1j22l7P3P2QPJ5J5J6J5m7m6K4K5O2O1K0J9jjjjk0k0K3K3O6O5
$$ 1216 1182 1291 1410 1444 1487 1530 1564 1513 1391 1354 1427 1499 1507 1514 1529 1544 1560 1575 1528 1482 1506 1531 1593 1654 1674 1693 1692 1691 1690 1689 1669 1649 1672 1695 1761 1826
1402A826K3K3RQM6M6N2l3p9p9J2R7M9M9N6N6O1k4r0r0O0O1K7K7O9P0K5K6m6m5k7k6M4M4m6
$$ 1826 1849 1872 1881 1889 1935 1981 2033 2000 1921 1842 1854 1951 2000 2049 2105 2161 2222 2198 2108 2018 2078 2139 2166 2193 2262 2332 2357 2383 2337 2292 2265 2239 2283 2327 2281
1398B281m6m6m6ONNNPPl6l5N0N1k1k0m7m6m6m6n8n8J4J3J5J5k8k7l3l4l3l3j2j1n5n4N1N1
$$ 2281 2235 2189 2143 2149 2154 2159 2164 2171 2178 2142 2107 2157 2208 2187 2167 2120 2074 2028 1982 1924 1866 1880 1893 1908 1923 1895 1868 1835 1801 1768 1735 1723 1712 1657 1603 1654 1705
1393A705N2N1%%p1p1K3K3K4K3o6o5k3k3kkkkj7j7j7j7nnnmj1j1j1j1O0O1l9l9J9K0J9J9n3
$$ 1705 1757 1808 1808 1808 1737 1666 1689 1712 1736 1759 1693 1628 1605 1582 1580 1578 1576 1574 1557 1540 1523 1506 1501 1496 1491 1487 1476 1465 1454 1443 1503 1564 1525 1486 1505 1525 1544 1563 1510
1389A510n4j1j1J4J3J4J4k2k3K1K0M2M3%%%%m3m2MMNML4L3o5o6j0j1O0O1K4K5K5K5k7k6k7
$$ 1510 1456 1445 1434 1448 1461 1475 1489 1467 1444 1465 1485 1527 1570 1570 1570 1570 1570 1527 1485 1489 1493 1498 1502 1536 1569 1504 1438 1428 1417 1477 1538 1562 1587 1612 1637 1610 1584 1557
1384A557k7k3k3M3M2kq8m0m0J0J0J0J0J7J6J6J7L8L9l3l3O1O0J8J8qrN7N7Q2mk6k6J12J12
$$ 1557 1530 1507 1484 1527 1569 1567 1479 1439 1399 1409 1419 1429 1439 1456 1472 1488 1505 1543 1582 1549 1516 1577 1637 1655 1673 1665 1656 1713 1770 1852 1848 1822 1796 1908 2020
1380B020O9P0j6j7j6j7L6L5qpJ11J10L1n4j8j9J9J9NNl8l8OOl7j22q6N6R8R8J7J6k5k6J7J7
$$ 2020 2089 2159 2143 2126 2110 2093 2129 2164 2156 2149 2260 2370 2401 2347 2329 2310 2329 2348 2353 2358 2320 2282 2288 2294 2257 2135 2049 2105 2203 2301 2318 2334 2309 2283 2300 2317
1375B317N9N9R4R4K3K3j8j9j8j9l8l7j4P0L6L7l0k9m2m2j13j13n9o0n9o0k1k0k1k0j0j0j0
$$ 2317 2376 2435 2529 2623 2646 2669 2651 2632 2614 2595 2557 2520 2506 2576 2612 2649 2619 2590 2548 2506 2393 2280 2221 2161 2102 2042 2021 2001 1980 1960 1950 1940 1930
1371A930j0PPOPL1L0opL7J23J23L7p5p5k9N6J08J08P0P1O1O2rj0m8m8nnk1k0k1k0l4l4RRO2
$$ 1930 1920 1927 1934 1940 1947 1978 2008 2002 1995 2032 2155 2278 2315 2240 2165 2136 2192 2300 2408 2478 2549 2610 2672 2663 2653 2605 2557 2552 2547 2526 2506 2485 2465 2431 2397 2406 2415 2477
1367B477O1K0J9OONOO7O6K5K4M1M2pr2n8j5l4j19j11k7K0K0q2q2l9m0L3L2L3L3PPr2r3K0K1
$$ 2477 2538 2558 2577 2583 2589 2594 2600 2667 2733 2758 2782 2823 2865 2858 2766 2708 2693 2659 2540 2429 2402 2422 2442 2360 2278 2239 2199 2232 2264 2297 2330 2337 2344 2252 2159 2179 2200
1362B200k3k2k5k5k3k2KM4K9n7n0qj3n6n5n5J2J3N5N5j4j4M0Q2L8m8n1qJ0J1K9J14P5j1q9
$$ 2200 2177 2155 2130 2105 2082 2060 2062 2106 2135 2078 2028 2020 2007 1951 1896 1841 1853 1866 1921 1976 1962 1948 1988 2070 2108 2060 2009 2001 2011 2022 2051 2165 2240 2229 2140
1358B140m7N1N2L2L2j0j1KKM5M5j8j8N3N2L8L8k8k7NR0R3Qj9K4K4j9k5O0J04O2kkO6O6j8j8
$$ 2140 2093 2144 2196 2228 2260 2250 2239 2241 2243 2288 2333 2315 2297 2350 2402 2440 2478 2450 2423 2428 2518 2611 2619 2600 2624 2648 2629 2604 2664 2768 2830 2828 2826 2892 2958 2940 2922
1353B922n6n5l1N3P2L0n3n3M7J32J21L6j1j0J6J6J6J6NONO%JJ00R9J0RN2N2kkkjR6R7R1R2
$$ 2922 2866 2811 2780 2833 2905 2935 2882 2829 2876 3008 3129 3165 3154 3144 3160 3176 3192 3208 3213 3219 3224 3230 3230 3231 3331 3430 3440 3449 3501 3553 3551 3549 3547 3546 3642 3739 3830 3922
1349C922L4n1n0L4J27J26J09K4K8K7J50J51J55J55J13J13J43J42K14K13J90J91K33K33K04
$$ 3922 3956 3905 3855 3889 4016 4142 4251 4275 4303 4330 4480 4631 4786 4941 5054 5167 5310 5452 5666 5879 6069 6260 6493 6726 6930
1346F930K05K75K76K63K63J64J63R9R8j%nmmnj44j44j39j39m4M2Q8Q8N0l5l0k9O7O8K5K6L5
$$ 6930 7135 7410 7686 7949 8212 8376 8539 8638 8736 8735 8735 8730 8726 8722 8717 8573 8429 8290 8151 8107 8149 8237 8325 8375 8340 8310 8281 8348 8416 8441 8467 8502
1342H502L6P8P8N2N2N1N2Q3Q4Q3Q4J55J55J98J97J43J42J43J43J85J85K84K84L07L07L06L07
$$ 8502 8538 8616 8694 8746 8798 8849 8901 8984 9068 9151 9235 9390 9545 9743 9940 10083 10225 10368 10511 10696 10881 11165 11449 11756 12063 12369 12676
1338A2676K68K69L16L17L73M58M81M81M14M14N50O36O16O16O64O64P48P47Q52Q52Q89R74J064
$$ 12676 12944 13213 13529 13846 14219 14677 15158 15639 16053 16467 17017 17653 18269 18885 19549 20213 20961 21708 22560 23412 24301 25275 26339
1336B6339J206J272J356J485J626J699J784J891K033K240K438K701K956L155L353L648L959
$$ 26339 27545 28817 30173 31658 33284 34983 36767 38658 40691 42931 45369 48070 51026 54181 57534 61182 65141
1334F5141M177M375M554M753M831M831M835M835M795M653M463M378M503M644M758M842M965
$$ 65141 69318 73693 78247 83000 87831 92662 97497 102332 107127 111780 116243 120621 125124 129768 134526 139368 144333
1331A44333N050N026M883M701M389M053L684L383L128K914K829K855K855K871K786K543K117
$$ 144333 149383 154409 159292 163993 168382 172435 176119 179502 182630 185544 188373 191228 194083 196954 199740 202283 204400
1329B04400J500O21l20j199j872k469k919l174l276l275l179l094l088l230l504l930m312
$$ 204400 205900 206521 206201 205002 203130 200661 197742 194568 191292 188017 184838 181744 178656 175426 171922 167992 163680
1327A63680m681m955n154n266n265n154m955m736m594m495m495m514m600m743m828m848m848
$$ 163680 158999 154044 148890 143624 138359 133205 128250 123514 118920 114425 109930 105416 100816 96073 91245 86397 81549
1325H1549m764m623m391m135l941l685l420l164k952k753k515k261k115j973j839j696j559
$$ 81549 76785 72162 67771 63636 59695 56010 52590 49426 46474 43721 41206 38945 36830 34857 33018 31322 29763
1323B9763j417j298j156j105j104j068r83q75p90p62p62o70o69n94n93n32m47m53m52m24m24
$$ 29763 28346 27048 25892 24787 23683 22615 21632 20757 19967 19205 18443 17773 17104 16510 15917 15385 14938 14485 14033 13609 13185
1321A3185l53l53l99m00l19k35k68k69k20k21k20k20j82j83j87k72l15k29j98j97k40j54p2
$$ 13185 12832 12479 12080 11680 11361 11126 10858 10589 10369 10148 9928 9708 9526 9343 9156 8884 8569 8340 8142 7945 7705 7551 7479
1318G479p1j09j08j10j09j09j09q2q2k04k04j72q6o4o3j01j01n8n8q0q0j22j22o9o9k6k6k5
$$ 7479 7408 7299 7191 7081 6972 6863 6754 6672 6590 6386 6182 6010 5924 5860 5797 5696 5595 5537 5479 5399 5319 5197 5075 5006 4937 4911 4885 4860
1314D860k4o8o7o8o8o8o8o9o9m6L9L1L1l5l4K0J9p9p9llmlj9k0k0j9l8l7l7l8k5k5k6k5n8
$$ 4860 4836 4768 4701 4633 4565 4497 4429 4360 4291 4245 4284 4315 4346 4311 4277 4297 4316 4237 4158 4155 4152 4148 4145 4126 4106 4086 4067 4029 3992 3955 3917 3892 3867 3841 3816 3758
1310C758n7n2n2n3L1L2n3m8m9J8J7p2p2k9l0j2j3j3j2n0m9K2K1m4m5q8q7j25j25K6K5l4j18
$$ 3758 3701 3649 3597 3544 3575 3607 3554 3506 3457 3475 3492 3420 3348 3319 3289 3277 3264 3251 3239 3189 3140 3162 3183 3139 3094 3006 2919 2794 2669 2695 2720 2686 2568
1306B568m8L7j3j3pqj1j1j3j4j5n8m1M3M6Ml8l8k6k6J1J1K0o5j12o9ppmnK3K4K3K3J3J2J3
$$ 2568 2520 2557 2544 2531 2524 2516 2505 2494 2481 2467 2452 2394 2353 2396 2442 2446 2408 2370 2344 2318 2329 2340 2360 2295 2183 2114 2107 2100 2096 2091 2114 2138 2161 2184 2197 2209 2222
1301B222J2j5j5j5j5j9j9o1o1j0rL1L1q4j27q6N6R1M9J1J1%Jm2m2j2j2j1j2l2l3l2l2PPPP
$$ 2222 2234 2219 2204 2189 2174 2155 2136 2075 2014 2004 1995 2026 2057 1973 1846 1760 1816 1907 1956 1967 1978 1978 1979 1937 1895 1883 1871 1860 1848 1816 1783 1751 1719 1726 1733 1740 1747
1297A747K9K9L0K9PPl5l6j9k0j9k0m6m6opJ8k5n2L3J21P7k0k1K1K0K1K1p3p4nnRl4o0K5P4
$$ 1747 1776 1805 1835 1864 1871 1878 1843 1807 1788 1768 1749 1729 1683 1637 1631 1624 1642 1617 1565 1598 1719 1796 1776 1755 1776 1796 1817 1838 1765 1691 1686 1681 1690 1656 1596 1621 1695
1292A695L2j0j0RRRQJ3J2n9n8JKKJM4M3k7k8J0J0o0o1L7L7l5l4q3q4o1K5J13J14qqJ4J5J4
$$ 1695 1727 1717 1707 1716 1725 1734 1742 1755 1767 1708 1650 1651 1653 1655 1656 1700 1743 1716 1688 1698 1708 1648 1587 1624 1661 1626 1592 1509 1425 1364 1389 1502 1616 1608 1600 1614 1629 1643
1288A643J5N2N3N2N3j2j1rrN7J00Q2mjjjq5j08j07j3j3K9L0j4j3l9l9l9l8J5J5k7k8k3k3P1
$$ 1643 1658 1710 1763 1815 1868 1856 1845 1836 1827 1884 1984 2066 2062 2061 2060 2059 1974 1866 1759 1746 1733 1762 1792 1778 1765 1726 1687 1648 1610 1625 1640 1613 1585 1562 1539 1610
1283A610P1nr1j33m9O6O5k8p0j3P2M6Lj7j6n9n9J7N9J8o8m9L5P7L4KKM1M2p8p7k6N9Q6Q5M8
$$ 1610 1681 1676 1585 1452 1403 1469 1534 1506 1436 1423 1495 1541 1544 1527 1511 1452 1393 1410 1469 1487 1419 1370 1405 1482 1516 1518 1520 1561 1603 1525 1448 1422 1481 1567 1652 1700
1279A700M8j3j3j3j3J0J0j16j59j10k4K4K4L4L4l4l5k2J9Mq1p2k9j7j6N6N5N6N5k3k3k3k4
$$ 1700 1748 1735 1722 1709 1696 1706 1716 1600 1441 1331 1307 1331 1355 1389 1423 1389 1354 1332 1351 1355 1274 1202 1173 1156 1140 1196 1251 1307 1362 1339 1316 1293 1269
1275A269J2J1J1J1J0J0n6n6%Q6L8L8k4k4o1o1m7L9L4L3k9k8J3J4M8M9J1J1j9O6O6j9n8n9Q6
$$ 1269 1281 1292 1303 1314 1324 1334 1278 1222 1222 1308 1346 1384 1360 1336 1275 1214 1167 1206 1240 1273 1244 1216 1229 1243 1291 1340 1351 1362 1343 1409 1475 1456 1398 1339 1425
1271A425Q7M3m2l7l7K3K3O6O6lko9o8p0J5R0Q9O4k0p3p2m3m3m3m3NOM8M9J6J6J6J7o9o8k7
$$ 1425 1512 1555 1513 1476 1439 1462 1485 1551 1617 1614 1612 1543 1475 1405 1420 1510 1599 1663 1643 1570 1498 1455 1412 1369 1326 1331 1337 1385 1434 1450 1466 1482 1499 1430 1362 1335
1266A335k6J7J6J7J6L2L1r0r1k1O5K1K2QR4R3Qjkjjl9M6O9O9nnO5O6L4L4L4L3l0l0l0k9q7
$$ 1335 1309 1326 1342 1359 1375 1407 1438 1348 1257 1236 1301 1322 1344 1352 1446 1539 1547 1546 1544 1543 1542 1503 1549 1618 1687 1682 1677 1742 1808 1842 1876 1910 1943 1913 1883 1853 1824 1737
1262A737q6l5N0P3P2PPj2j2N9N9M2M1M7l8p1p1N1N1OPM3M3K7n9n8K6M5M5k0k1l6l6p4p3m2
$$ 1737 1651 1616 1666 1739 1811 1818 1825 1813 1801 1860 1919 1961 2002 2049 2011 1940 1869 1920 1971 1977 1984 2027 2070 2097 2038 1980 2006 2051 2096 2076 2055 2019 1983 1909 1836 1794
1257A794M4mnrj0j0j0m9n0K2K1n8n7j05k0J8J8K8n6o4o4Q1Q2K1o4j35m9L0L0qpk0k1k0k1n0
$$ 1794 1838 1834 1829 1820 1810 1800 1790 1741 1691 1713 1734 1676 1619 1514 1494 1512 1530 1558 1502 1438 1374 1455 1537 1558 1494 1359 1310 1340 1370 1362 1355 1335 1314 1294 1273 1223
1253A223n0M9M8k4k5k4k5K1K0K1K0k1k1K2K1OOOOj2j2j1j2j8j8M7M8m5j29q7kJKPPQ8Q9Q8
$$ 1223 1173 1222 1270 1246 1221 1197 1172 1193 1213 1234 1254 1233 1212 1234 1255 1261 1267 1273 1279 1267 1255 1244 1232 1214 1196 1243 1291 1246 1117 1030 1028 1029 1031 1038 1045 1133 1222 1310
1248A310Q9j4j4n7n7n6n7j4j4J2J3J2J2L1L0K4K5m6j31r7M5J03J9p5p5L5J21M9l5j0j0j0j0
$$ 1310 1399 1385 1371 1314 1257 1201 1144 1130 1116 1128 1141 1153 1165 1196 1226 1250 1275 1229 1098 1001 1046 1149 1168 1093 1018 1053 1174 1223 1188 1178 1168 1158 1148
1244A148o1K4J9J9J5J4N7N7q3q4J6J6llm5m5poooK1K2k2k1p9p9K0K0%J%JKLKLL1L2L2L2j3
$$ 1148 1087 1111 1130 1149 1164 1178 1235 1292 1209 1125 1141 1157 1154 1151 1106 1061 1054 1048 1042 1036 1057 1079 1057 1036 957 878 898 918 918 919 919 920 922 925 927 930 961 993 1025 1057 1044
1239A044j3L0P2N8j4j6j6k6o8o0L9Q2M0k9k9M0L9l1l1k5k6k5k5N9N8J7J6j4j4j4j4o3o2L8
$$ 1044 1031 1061 1133 1191 1177 1161 1145 1119 1051 991 1030 1112 1152 1123 1094 1134 1173 1142 1111 1086 1060 1035 1010 1069 1127 1144 1160 1146 1132 1118 1104 1041 979 1017
1235A017L7L2L1L2L2ONl6l7PQPQNNo6o5J5J6J6J6RJ0l1p4n7M2J03O0j1q2q4j4O6O5P0O9J4
$$ 1017 1054 1086 1117 1149 1181 1187 1192 1156 1119 1126 1134 1141 1149 1154 1159 1093 1028 1043 1059 1075 1091 1100 1110 1079 1005 948 990 1093 1153 1142 1060 976 962 1028 1093 1163 1232 1246
1230A246J3J4J3rqn2n1PPPPJ5J5k7k7m8m7K4K4M7M8n2n1nnM3m2p9p8M4M4M4M5n5n4N8N9L6
$$ 1246 1259 1273 1286 1277 1269 1217 1166 1173 1180 1187 1194 1209 1224 1197 1170 1122 1075 1099 1123 1170 1218 1166 1115 1110 1105 1148 1106 1027 949 993 1037 1081 1126 1071 1017 1075 1134 1170
1226A170n0o6o7kjK8K8K8K8o2o2j1P4Q0P9j4j4MNMMjkkjj3j3j3j3K6K6K5K6l4l4l4l4N2N1
$$ 1170 1120 1054 987 985 984 1012 1040 1068 1096 1034 972 961 1035 1115 1194 1180 1166 1170 1175 1179 1183 1182 1180 1178 1177 1164 1151 1138 1125 1151 1177 1202 1228 1194 1160 1126 1092 1144 1195
1221A195j9j9m3m3m3m3ONOOj8j8j8j8KKM4M4LLl4l4k7N9N4N3k2k3k2k2rj0L4L3K8K7m4m4L1
$$ 1195 1176 1157 1114 1071 1028 985 991 996 1002 1008 990 972 954 936 938 940 984 1028 1031 1034 1000 966 939 998 1052 1105 1083 1060 1038 1016 1007 997 1031 1064 1092 1119 1075 1031 1062
1216A062L1j2j2POJ7o8n9K7J01J01n3n4n3n4j7j7P6P7P0j5l8l9L9L9M4m0j1j1L1n3o2o1L2
$$ 1062 1093 1081 1069 1076 1082 1099 1031 972 999 1100 1201 1148 1094 1041 987 970 953 1029 1106 1176 1161 1123 1084 1123 1162 1206 1166 1155 1144 1175 1122 1060 999 1031
1212A031L3k9k9J4J4nnO6O6rrrro8o7k5k5N1N1N1N1n7n6J5J4J4J3k9k9J7J6Q8Q8L2L1j1j1
$$ 1031 1064 1035 1006 1020 1034 1029 1024 1090 1156 1147 1138 1129 1120 1052 985 960 935 986 1037 1088 1139 1082 1026 1041 1055 1069 1082 1053 1024 1041 1057 1145 1233 1265 1296 1285 1274
1207A274n9o0o0n9LKl9m0RRRRM1M2M1M2m3m3%jk0k1k1k0L0L1L1L1JJM3M4ppm9n0j7j7K5K5
$$ 1274 1215 1155 1095 1036 1039 1041 1002 962 971 980 989 998 1039 1081 1122 1164 1121 1078 1078 1077 1057 1036 1015 995 1025 1056 1087 1118 1119 1120 1163 1207 1200 1193 1144 1094 1077 1060 1085 1110
1203A110jjkjm7m6m6m7M2M2k8k9k5k6J7J7P3P3L1L0j2j2j2j2KJM4M3L6L5o4o4k6k5J8J7j3
$$ 1110 1109 1108 1106 1105 1058 1012 966 919 961 1003 975 946 921 895 912 929 1002 1075 1106 1136 1124 1112 1100 1088 1090 1091 1135 1178 1214 1249 1185 1121 1095 1070 1088 1105 1092
1198A092j4N7N7N0N1p8p7oom8m8k0k0K3K2M3M4%JPQM8M7o0j04o1K4M5m1n3j1M5M5k3k4J7J7
$$ 1092 1078 1135 1192 1242 1293 1215 1138 1132 1126 1078 1030 1010 990 1013 1035 1078 1122 1122 1123 1130 1138 1186 1233 1173 1069 1008 1032 1077 1036 983 972 1017 1062 1039 1015 1032 1049
1193A049J6J7K8K7P0P0J4J5n7n7n9o0j6j7J5J5J5J5j2j2j3j2J5J5J5J5n0n0pqK6K6K6K6l2
$$ 1049 1065 1082 1110 1137 1207 1277 1291 1306 1249 1192 1133 1073 1057 1040 1055 1070 1085 1100 1088 1076 1063 1051 1066 1081 1096 1111 1061 1011 1004 996 1022 1048 1074 1100 1068
1189A068l2p1p2K4O6N3l2j8O6P9L8rrL0L1k7k7k7k6lkkkj5j5N6N7j1j0L2L2K8K8j4j4j7j7
$$ 1068 1036 965 893 917 983 1036 1004 986 1052 1131 1169 1160 1151 1181 1212 1185 1158 1131 1105 1102 1100 1098 1096 1081 1066 1122 1179 1168 1158 1190 1222 1250 1278 1264 1250 1233 1216
1185A216j7j8k6k7J6J5k9l0j6K6J4p0p4J1Q7Km4m5L6L5opJ4J4N2N1M5m0q5m2L5P6L8m7n0L5
$$ 1216 1199 1181 1155 1128 1144 1159 1130 1100 1084 1110 1124 1054 980 991 1078 1080 1036 991 1027 1062 1056 1049 1063 1077 1129 1180 1225 1185 1100 1058 1093 1169 1207 1160 1110 1145
1180A145P5P6N5k9n3n3J5J6J5J5k8k8k8k8kkkkllm5m6J9J8J8J9K6K6K7K6l4l3l4l4M4M3JJ
$$ 1145 1220 1296 1351 1322 1269 1216 1231 1247 1262 1277 1249 1221 1193 1165 1163 1161 1159 1157 1154 1151 1106 1060 1079 1097 1115 1134 1160 1186 1213 1239 1205 1172 1138 1104 1148 1191 1192 1193
1176A193o1o1o1o1N9N9J6J6k3k4K0J9M7M7n2n2j2j2k8k8J8J04O4k1m9oPPK8K8L9m7n5K9K5
$$ 1193 1132 1071 1010 949 1008 1067 1083 1099 1076 1052 1072 1091 1138 1185 1133 1081 1069 1057 1029 1001 1019 1123 1187 1166 1117 1111 1118 1125 1153 1181 1220 1173 1118 1147 1172
1171A172j8m4%jm4o3k1K3K3mmJ8J7k6k6M5M4L2L1j1j1l0k9rqJ9J8J9J9j5j4K9K8RRRRl2l2
$$ 1172 1154 1110 1110 1109 1065 1002 981 1004 1027 1023 1019 1037 1054 1028 1002 1047 1091 1123 1154 1143 1132 1102 1073 1064 1056 1075 1093 1112 1131 1116 1102 1131 1159 1168 1177 1186 1195 1163 1131
1167A131J0N2L5n1q7lQ4J27N9k6l2J0N3N2K8K7K8K8J9J9O7j8j41j40l8M8O0O1nnn7n7L6L7
$$ 1131 1141 1193 1228 1177 1090 1087 1171 1298 1357 1331 1299 1309 1362 1414 1442 1469 1497 1525 1544 1563 1630 1612 1471 1331 1293 1341 1401 1462 1457 1452 1395 1338 1374 1411
1162A411kq7l9l9L0L0QRm6m7mmn4n4j2j1nnJ7J6N7N6m3m3KKK3K3pqpqK7K7K7K7n8n8l7l7K1
$$ 1411 1409 1322 1283 1244 1274 1304 1312 1321 1275 1228 1224 1220 1166 1112 1100 1089 1084 1079 1096 1112 1169 1225 1182 1139 1141 1143 1166 1189 1182 1174 1167 1159 1186 1213 1240 1267 1209 1151 1114 1077 1098
1157A098K2O4O4j2j2l3l3RRRRJ6J6n4n5o7o6L3L3k7k7M4M5L7L7onm2m1m7L8M1M1MMJ6J6J5
$$ 1098 1120 1184 1248 1236 1224 1191 1158 1167 1176 1185 1194 1210 1226 1172 1117 1050 984 1017 1050 1023 996 1040 1085 1122 1159 1153 1148 1106 1065 1018 1056 1097 1138 1142 1146 1162 1178 1193
1153A193J6q9r0r5j0P1P1L4L3o7o7k5J17J34M8p4p3n5L0M7M8J3p1k4k4mnn2L3K7K7j2j3Pl5
$$ 1193 1209 1120 1030 935 925 996 1067 1101 1134 1067 1000 975 1092 1226 1274 1200 1127 1072 1102 1149 1197 1210 1139 1115 1091 1087 1082 1030 1063 1090 1117 1105 1092 1099 1064
1148A064q0NN8N8l6l5L2L2j0j1j9k0j9j9K0K1k1k2J5J5L6L7K8K8j5j5m3m4m3m4M6M5L1j0j2
$$ 1064 984 989 1047 1105 1069 1034 1066 1098 1088 1077 1058 1038 1019 1000 1020 1041 1020 998 1013 1028 1064 1101 1129 1157 1142 1127 1084 1040 997 953 999 1044 1075 1065 1053
1144A053P3Q9M6J1J0j3j4l9m0LLjkkkJ2J1N4N4n6n7l5l5k3k3k3k3L2L3j0j0J9J8lmppppJ3
$$ 1053 1126 1215 1261 1272 1282 1269 1255 1216 1176 1179 1182 1181 1179 1177 1175 1187 1198 1252 1306 1250 1193 1158 1123 1100 1077 1054 1031 1063 1096 1086 1076 1095 1113 1110 1106 1099 1092 1085 1078 1091
1139A091J2l0l0LLl9m0RRN2N2K6K7NNK9K8K9K9j2j2j1j2mlmlPOPPJ4J3J3J4KLM0M0m1j25q6
$$ 1091 1103 1073 1043 1046 1049 1010 970 979 988 1040 1092 1118 1145 1150 1155 1184 1212 1241 1270 1258 1246 1235 1223 1219 1216 1212 1209 1216 1222 1229 1236 1250 1263 1276 1290 1292 1295 1335 1375 1334 1209 1123
1134A123%P6L3rL3P1j3n6K9J08O5r3j79p7RK4j9j2L0M9Pl3l2j4j3N9O0J7J8J8J9J8J9PQj4
$$ 1123 1123 1199 1232 1223 1256 1327 1314 1258 1287 1395 1460 1367 1188 1111 1120 1144 1125 1113 1143 1192 1199 1166 1134 1120 1107 1166 1226 1243 1261 1279 1298 1316 1335 1342 1350 1336
1130A336j4n4n5J6J6N8N8J5J5J9J9lkl8l8q1q0N2N2L0L1rrp4p5k3O2M3%K0J05O3k3p4l3L8
$$ 1336 1322 1268 1213 1229 1245 1303 1361 1376 1391 1410 1429 1426 1424 1386 1348 1267 1187 1239 1291 1321 1352 1343 1334 1260 1185 1162 1224 1267 1267 1287 1392 1455 1432 1358 1325 1363
1125A363L8NMj6j7KJKJj0j1j0j1k9l0jm3o5K0O8O9k4k4M6M7L6L6ppOOj5j5l0k9J2J3N2N3N2
$$ 1363 1401 1406 1410 1394 1377 1379 1380 1382 1383 1373 1362 1352 1341 1312 1282 1281 1238 1173 1193 1261 1330 1306 1282 1328 1375 1411 1447 1440 1433 1439 1445 1430 1415 1385 1356 1368 1381 1433 1486 1538
1120A538N2l5l4L5P8O6j9l9l9J0J0l2l2l1l1J2J1M6M5k6k5o9o9k7k7J9J9J8J9q0p9J9K0j4
$$ 1538 1590 1555 1521 1556 1634 1700 1681 1642 1603 1613 1623 1591 1559 1528 1497 1509 1520 1566 1611 1585 1560 1491 1422 1395 1368 1387 1406 1424 1443 1363 1284 1303 1323 1309
1116A309j4K9K8j3j4j3j4j0j1j1j1M6M5M5M5k2k2mQ1R2Po7o8L9L8L8L8l0k9J3J3L4L4o0o0
$$ 1309 1295 1324 1352 1339 1325 1312 1298 1288 1277 1266 1255 1301 1346 1391 1436 1414 1392 1388 1469 1561 1568 1501 1433 1472 1510 1548 1586 1556 1527 1540 1553 1587 1621 1561 1501
1112A501j6O8M5KL7L7M3m2j18p5K7J11P4j1q6q6l8l8L3L3J4J3k9k9M5M4mq9p7l5QPonnoM8
$$ 1501 1485 1553 1598 1600 1637 1674 1717 1675 1557 1482 1509 1620 1694 1683 1597 1511 1473 1435 1468 1501 1515 1528 1499 1470 1515 1559 1555 1466 1389 1354 1362 1369 1363 1358 1353 1347 1395
1108A395M8NNJ2J2J3J2k6k6M5M5M9M9Kq2q0NK1k1r8n5M5M6mmnmj1j2N8J01P2j4o1j04q8mP4
$$ 1395 1443 1448 1453 1465 1477 1490 1502 1476 1450 1495 1540 1589 1638 1640 1558 1478 1483 1504 1483 1385 1330 1375 1421 1417 1413 1408 1404 1393 1381 1439 1540 1612 1598 1537 1433 1345 1341 1415
1103A415P4j8j9j8j9k2k3k2k3n1n1P7P6M2M1%jm8m8m8m8J3J2N5N5L8L8o1o1l5l5L6L6j3j2
$$ 1415 1489 1471 1452 1434 1415 1393 1370 1348 1325 1274 1223 1300 1376 1418 1459 1459 1458 1410 1362 1314 1266 1279 1291 1346 1401 1439 1477 1416 1355 1320 1285 1321 1357 1344 1332
1099A332j3j3L6L5ppj1j0L7m8p2p1P4P3O6j9K3K3pr2r2pK8K8L4L3k3k3k3k3K3K3j9k0qpn1
$$ 1332 1319 1306 1342 1377 1370 1363 1352 1342 1379 1331 1259 1188 1262 1335 1401 1382 1405 1428 1421 1329 1237 1230 1258 1286 1320 1353 1330 1307 1284 1261 1284 1307 1288 1268 1260 1253 1202
1094A202n0ppppO5O6K2K3k0j9P4P4K5n9o0K6L7L7j%N0N0k1k1k9k8J5J4K6K7j6j6n4n3n9K7
$$ 1202 1152 1145 1138 1131 1124 1189 1255 1277 1300 1280 1261 1335 1409 1434 1375 1315 1341 1378 1415 1414 1414 1464 1514 1493 1472 1443 1415 1430 1444 1470 1497 1481 1465 1411 1358 1299 1326
1090A326J04J05N9k7kjm5m4n0L5N8N8KJM4M4J9J9R1R0M2M3M2M2J3J3J3J3M2M2k9k9k7k6k7
$$ 1326 1430 1535 1594 1567 1565 1564 1519 1475 1425 1460 1518 1576 1578 1579 1623 1667 1686 1705 1796 1886 1928 1971 2013 2055 2068 2081 2094 2107 2149 2191 2162 2133 2106 2080 2053
1085B053k6k7k7P3P3popon6n6n6n7l2l2L9L9M2M2M3M2J8J8k4k5J19J19M0m6K3K3J7J8JJM3
$$ 2053 2027 2000 1973 2046 2119 2112 2106 2099 2093 2037 1981 1925 1868 1836 1804 1843 1882 1924 1966 2009 2051 2069 2087 2063 2038 2157 2276 2316 2270 2293 2316 2333 2351 2352 2353 2396
1081B396M3O2O1J8J9O9O9N2l4qP6P7qq9mJ22J21J09K3q0p9j21l5J01J01J61J62K29L13N27
$$ 2396 2439 2501 2562 2580 2599 2668 2737 2789 2755 2747 2823 2900 2892 2803 2799 2921 3042 3151 3174 3094 3015 2894 2859 2960 3061 3222 3384 3613 3926 4453
1077D453P82P60L35k57o26o43n58m59l74j95j10j23j23p6p5r1r2m5M0N3l3n0n0J5J5Q7Q6R3
$$ 4453 5235 5995 6330 6073 5447 4804 4246 3787 3413 3218 3108 2985 2862 2786 2711 2620 2528 2483 2523 2576 2543 2493 2443 2458 2473 2560 2646 2739
1074B739R2N0N0P9P8P9P8J53J53J53J53J77J76K47K47K26K27J51J50Q4kM0M1Nq0q0NJ08J08
$$ 2739 2831 2881 2931 3010 3088 3167 3245 3398 3551 3704 3857 4034 4210 4457 4704 4930 5157 5308 5458 5542 5540 5580 5621 5626 5546 5466 5471 5579 5687
1070E687jq5j32k16k78l20l40l40l47k63j99k00j94j94q9q8j8j8qqn0n1j6j7o0n9n3n2M7M6
$$ 5687 5686 5601 5469 5253 4975 4655 4315 3975 3628 3365 3166 2966 2772 2578 2489 2401 2383 2365 2357 2349 2299 2248 2232 2215 2155 2096 2043 1991 2038 2084
1067B084M6M6k5k6nonoPPOPj05j04n6K9pn0r3j36j24q1qL6J6k7noJq3j02j02n7K8M6Mq3q3
$$ 2084 2130 2176 2151 2125 2120 2114 2109 2103 2110 2117 2123 2130 2025 1921 1865 1894 1887 1837 1744 1608 1484 1403 1395 1431 1447 1420 1415 1409 1410 1327 1225 1123 1066 1094 1140 1144 1061 978
1062I78J8J02N1l3l1N5P1K9J5J6J1J2J2J2J9J9J9J9k3k3k2k3j7j7JQ5J38N3PPj6j5n9n8J04
$$ 978 996 1098 1149 1116 1085 1140 1211 1240 1255 1271 1282 1294 1306 1318 1337 1356 1375 1394 1371 1348 1326 1303 1286 1269 1270 1355 1493 1546 1553 1560 1544 1529 1470 1412 1516
1058A516J04NMK7K7K6K7K6K5m5m5K1K1k2k2j9j9j9j9n9n9O9O8J2J2J2J2K0K1k2k2L0K9L0K9
$$ 1516 1620 1625 1629 1656 1683 1709 1736 1762 1787 1742 1697 1718 1739 1717 1695 1676 1657 1638 1619 1560 1501 1570 1638 1650 1662 1674 1686 1706 1727 1705 1683 1713 1742 1772 1801
1053A801K7K7O9P0m4m3m3m3j2j1j1j2M9M9M9M9k4k3k4k4M9M8k3k3QQQPj6j6n8n9KKL9L9Qp7
$$ 1801 1828 1855 1924 1994 1950 1907 1864 1821 1809 1798 1787 1775 1824 1873 1922 1971 1947 1924 1900 1876 1925 1973 1950 1927 1935 1943 1951 1958 1942 1926 1868 1809 1811 1813 1852 1891 1899 1822
1049A822p7RM4M4k2k2N2N1N1N1R0R0j0rONl6l7k6k7m4j29r8j4k5k4n0n0N0M9P4P4N7k9l9M6
$$ 1822 1745 1754 1798 1842 1820 1798 1850 1901 1952 2003 2093 2183 2173 2164 2170 2175 2139 2102 2076 2049 2005 1876 1778 1764 1739 1715 1665 1615 1665 1714 1788 1862 1919 1890 1851 1897
1044A897O4O3k4k5P4P4O0O0j1j1L2L3L2L2K7K6j1j1J3R9R2R3L6L6ppj1j0m8m7m6M0R1R1M9
$$ 1897 1961 2024 2000 1975 2049 2123 2183 2243 2232 2221 2253 2286 2318 2350 2377 2403 2392 2381 2394 2493 2585 2678 2714 2750 2743 2736 2725 2715 2667 2620 2574 2614 2705 2796 2845
1040B845M8M9M8k5k4k5k5OOJ2J2L8J24J76J75Q5Q5J50J50K8n7j0rk8k8k9k8j9j9k4k4Lq2j05
$$ 2845 2893 2942 2990 2965 2941 2916 2891 2897 2903 2915 2927 2965 3089 3265 3440 3525 3610 3760 3910 3938 3881 3871 3862 3834 3806 3777 3749 3730 3711 3687 3663 3666 3584 3479
1036C479j05l2l2l3l2LKKLq8q7q8q7j29j30j29j29m1m2j8O6J04J04J09J09K21K20J69Q4J09
$$ 3479 3374 3342 3310 3277 3245 3248 3250 3252 3255 3167 3080 2992 2905 2776 2646 2517 2388 2347 2305 2287 2353 2457 2561 2670 2779 3000 3220 3389 3473 3582
1032C582J09O1O1OPPPJ6J7N9N9M7M7J0J0J10J95J90J90J93J93J98J99J83K68K92K91J77J76
$$ 3582 3691 3752 3813 3819 3826 3833 3840 3856 3873 3932 3991 4038 4085 4095 4105 4215 4410 4600 4790 4983 5176 5374 5573 5756 6024 6316 6607 6784 6960
1029F960K19K18J75J74J32J32J06J06O3O4NOO8O8nj47j20l5K4o0j30j30L6J21J21J21K31L15
$$ 6960 7179 7397 7572 7746 7878 8010 8116 8222 8285 8349 8354 8360 8428 8496 8491 8344 8224 8189 8213 8153 8023 7893 7929 8050 8171 8292 8523 8838
1025H838L38L38L39L39L38L39L93L93M63M64M18M19L19L19K94K93L42K56K11K12K86L71M59
$$ 8838 9176 9514 9853 10192 10530 10869 11262 11655 12118 12582 13000 13419 13738 14057 14351 14644 14986 15242 15453 15665 15951 16322 16781
1022A6781M58N35N35N41N41N83N84N45N45N51N50O38P23Q14R55J060J146J248J391J556J698
$$ 16781 17239 17774 18309 18850 19391 19974 20558 21103 21648 22199 22749 23387 24110 24924 25879 26939 28085 29333 30724 32280 33978
1020C3978J826J911K007K091K142K226K330K529K766K964L218L474L827M253M673N155N772
$$ 33978 35804 37715 39722 41813 43955 46181 48511 51040 53806 56770 59988 63462 67289 71542 76215 81370 87142
1018H7142O481P322Q202R286J0619J2204J4047J6287J9095K2508K6507L1185L6716M3392N1247
$$ 87142 93623 100945 109147 118433 129052 141256 155303 171590 190685 213193 239700 270885 307601 350993 402240
1016D02240O0240P0306Q1015R1423R9847J04300J02359R2008P2180M3624Q984k7456o0959
$$ 402240 462480 532786 613801 705224 805071 909371 1011730 1103738 1175918 1219542 1228526 1201070 1140111
1014A140111q7303j03989j10538j08434j00295q8863p6471o4664n4144m5151l7694l1551k6475
$$ 1140111 1052808 948819 838281 729847 629552 540689 464218 399554 345410 300259 262565 231014 204539
1013B04539k2274j8843j6100j3916j2083j0523r158p996p079o257n580m985m486m062l674
$$ 204539 182265 163422 147322 133406 121323 110800 101642 93646 86567 80310 74730 69745 65259 61197 57523
1011E7523l307l004k750k512k257k052j968j882j740j549j351j263j264j137j053j024j023
$$ 57523 54216 51212 48462 45950 43693 41641 39673 37791 36051 34502 33151 31888 30624 29487 28434 27410 26387
1009B6387r83q97r45r45r74r74r22r23q66p25o11n27m78m78m30m30m24m24k68k68k57k58k57
$$ 26387 25404 24507 23562 22617 21643 20669 19747 18824 17958 17233 16622 16095 15617 15139 14709 14279 13855 13431 13163 12895 12638 12380 12123
1006A2123k58k22k22k17k17j95j10l0l1m0m1q9q9j75k61k12k13k10k10k81k81l24l24k82k82
$$ 12123 11865 11643 11421 11204 10987 10792 10682 10652 10621 10581 10540 10451 10362 10187 9926 9714 9501 9291 9081 8800 8519 8195 7871 7589 7307
1003G307k61k61l04l04k51k52k51k51j58j58j16j15n1n1qqK6K6K7K6J6J6N8N9L7L8L7L7P1
$$ 7307 7046 6785 6481 6177 5926 5674 5423 5172 5014 4856 4740 4625 4574 4523 4515 4507 4533 4559 4586 4612 4628 4644 4702 4761 4798 4836 4873 4910 4981
999D981P1K8K9l7l6l6l7o0n9o0o0q0q0p5p5n6K9N2N2K8K8K8K8J45J46J45J46J14J13P1P1j5
$$ 4981 5052 5080 5109 5072 5036 5000 4963 4903 4844 4784 4724 4644 4564 4489 4414 4358 4387 4439 4491 4519 4547 4575 4603 4748 4894 5039 5185 5299 5412 5483 5554 5539
996E539j5n7n7q1q0j75j74j45o0M3M3j6j01j53j53r8r9r8r8j55j55q4q5j06j06j02j01j43
$$ 5539 5524 5467 5410 5329 5249 5074 4900 4755 4695 4738 4781 4765 4664 4511 4358 4260 4161 4063 3965 3810 3655 3571 3486 3380 3274 3172 3071 2928
992B928p2j2j2k6k7M5M4K4K4K4K4K1K1np7q3j3L8nq7q7RJ0j00j01n8n8l6l6OM9op8n8j6LL
$$ 2928 2856 2844 2832 2806 2779 2824 2868 2892 2916 2940 2964 2985 3006 3001 2924 2841 2828 2866 2861 2774 2687 2696 2706 2606 2505 2447 2389 2353 2317 2323 2372 2366 2288 2230 2214 2217 2220
988B220M9M8O3O4K1K0k8k9M2M2L1L1L2L1J4J4J3J4J7J7k5k5k9k9M3M2OOl6l7q9q9q8q9jjp2
$$ 2220 2269 2317 2380 2444 2465 2485 2457 2428 2470 2512 2543 2574 2606 2637 2651 2665 2678 2692 2709 2726 2701 2676 2647 2618 2661 2703 2709 2715 2679 2642 2553 2464 2376 2287 2286 2285 2213
983B213p2j09j08m0m0m1q4n7J4O4O5O9O9L6L5L6L5J1J1n9o0k5k6Ll9k7M4O8K5l7l6L1P4L3
$$ 2213 2141 2032 1924 1884 1844 1803 1719 1662 1676 1740 1805 1874 1943 1979 2014 2050 2085 2096 2107 2048 1988 1963 1937 1940 1901 1874 1918 1986 2011 1974 1938 1969 2043 2076
979B076l8o0j7L7Q0Q0L7o2j03n5J7L4qn0n1NOP6P6M3M2%%qqn1n1L3L3rrMMMMM3M3JJRRJ0R
$$ 2076 2038 1978 1961 1998 2078 2158 2195 2133 2030 1975 1992 2026 2018 1968 1917 1922 1928 2004 2080 2123 2165 2165 2165 2157 2149 2098 2047 2080 2113 2104 2095 2099 2103 2107 2111 2154 2197 2198 2199 2208 2217 2227 2236
974B236j00j01k9l0J9J8J9J8j1j2q2q3m0m1m0m1N8N8J6J5k7k7M4M4rrrrJ9J8J9J9lmlmj8j8
$$ 2236 2136 2035 2006 1976 1995 2013 2032 2050 2039 2027 1945 1862 1822 1781 1741 1700 1758 1816 1832 1847 1820 1793 1837 1881 1872 1863 1854 1845 1864 1882 1901 1920 1917 1913 1910 1906 1888 1870
969A870K5K4j7j7j7j7P3P3P4P3M8M9k3k2l8l7NMO6O5K3K2n3n4r6r6p1p1k9k9j1j2q2q3n4n5
$$ 1870 1895 1919 1902 1885 1868 1851 1924 1997 2071 2144 2192 2241 2218 2196 2158 2121 2126 2130 2196 2261 2284 2306 2253 2199 2103 2007 1936 1865 1836 1807 1796 1784 1702 1619 1565 1510
965A510n5n5l0k9J3J2LKKLqpp8p8L6L6L6L6L5L4L4L5J5J6N8N8P4P4P4P4N0N0QPm3m4kjk8k9
$$ 1510 1455 1400 1370 1341 1354 1366 1369 1371 1373 1376 1368 1361 1283 1205 1241 1277 1313 1349 1384 1418 1452 1487 1502 1518 1576 1634 1708 1782 1856 1930 1980 2030 2038 2045 2002 1958 1956 1955 1927 1898
960A898p1p2kkklj3j2N8N8K9K9K9K9J2J1J2J1M2M2Q5Q4Q5Q6Q5Q5L4L4K9K8P7rllP0P0J9o6
$$ 1898 1827 1755 1753 1751 1749 1746 1733 1721 1779 1837 1866 1895 1924 1953 1965 1976 1988 1999 2041 2083 2168 2252 2337 2423 2508 2593 2627 2661 2690 2718 2795 2786 2783 2780 2850 2920 2939 2873
955B873o1o1o6o6r6r6r6r6k4k4k4k4k7k7mQ1Q7Q8l5l5N4N4J7J7K8J14J13K8l7l8j%N4N4j6
$$ 2873 2812 2751 2685 2619 2523 2427 2331 2235 2211 2187 2163 2139 2112 2085 2081 2162 2249 2337 2302 2267 2321 2375 2392 2409 2437 2551 2664 2692 2655 2617 2616 2616 2670 2724 2708
951B708j7NMN8k7o9J7J13J14P2j4qqm7m7m8m7j1j1j1j1Q3Q3L2n4o5o4JJllk5j11j25j24lk
$$ 2708 2691 2696 2700 2758 2731 2662 2679 2792 2906 2978 2964 2956 2948 2901 2854 2806 2759 2748 2737 2726 2715 2798 2881 2913 2859 2794 2730 2731 2732 2729 2726 2701 2590 2465 2341 2338 2336
946B336m7m6nmOOo5o5q3q4M4M4L0L0L0L0klM0M0M3M3n6n6K0K0k2k3L8L8o2o1j2j2L0L1PQo4
$$ 2336 2289 2243 2238 2234 2240 2246 2181 2116 2033 1949 1993 2037 2067 2097 2127 2157 2155 2152 2192 2232 2275 2318 2262 2206 2226 2246 2224 2201 2239 2277 2215 2154 2142 2130 2160 2191 2198 2206 2142
941B142o3q8q9j7j7K6K7j6j6l9l8l8l8o6o6k4k4j8j8j8j9J0J0l3l3L9M0M0M0mnL9L8k0j9o2
$$ 2142 2079 1991 1902 1885 1868 1894 1921 1905 1889 1850 1812 1774 1736 1670 1604 1580 1556 1538 1520 1502 1483 1493 1503 1470 1437 1476 1516 1556 1596 1592 1587 1626 1664 1644 1625 1563
937A563o2JJM3M4k5k5k5k5L6L6oplmL8L9o6o6k4k3K9L0L0K9L4L5L4L4J0RJ37J38Q0P9j9j9
$$ 1563 1501 1502 1503 1546 1590 1565 1540 1515 1490 1526 1562 1556 1549 1546 1542 1580 1619 1553 1487 1463 1440 1469 1499 1529 1558 1592 1627 1661 1695 1705 1714 1851 1989 2069 2148 2129 2110
933B110o8o8o8o8r2r2k1k0OPOPqpqpk1k1K2K1J1J1J1J1L2L2L2L3m3m2K9J13N4q9j50o5llK
$$ 2110 2042 1974 1906 1838 1746 1654 1633 1613 1619 1626 1632 1639 1631 1624 1616 1609 1588 1567 1589 1610 1621 1632 1643 1654 1686 1718 1750 1783 1740 1698 1727 1840 1894 1805 1655 1590 1587 1584 1586
928A586KJ2J1J1J1NNl3l2K2J08J02J03Q0Q0Q0Q1Q0Q0P5P5o5j50j45j45j06j06j53o9J1J1k6
$$ 1586 1588 1600 1611 1622 1633 1638 1643 1610 1578 1600 1708 1810 1913 1993 2073 2153 2234 2314 2394 2469 2544 2479 2329 2184 2039 1933 1827 1674 1605 1616 1627 1601
924A601k6n0n0K1K1O8O9n9n9m5m5P7P8J00J5o5o4K0K1K0K0l2l2l2l3nmnnPPM9M9M4M4L9L9
$$ 1601 1575 1525 1475 1496 1517 1585 1654 1595 1536 1491 1446 1523 1601 1701 1716 1651 1587 1607 1628 1648 1668 1636 1604 1572 1539 1534 1530 1525 1520 1527 1534 1583 1632 1676 1720 1759 1798
919A798O2k4p4p5k8k8M3M4N5N6J17J18O0q1j29j28mnr8r8l8M8Mq0p8p8O7O7Q0mn6n7k4k5k5
$$ 1798 1860 1836 1762 1687 1659 1631 1674 1718 1773 1829 1946 2064 2124 2043 1914 1786 1782 1777 1679 1581 1543 1591 1595 1515 1437 1359 1426 1493 1573 1569 1513 1456 1432 1407 1382
915A382k5K5K5K4K5l0l0J2J2O9P0l1l0j9j9j9j9JJp0o9n1n1K0K1K2K1K2K2L9L8L8L9j0rn2
$$ 1382 1357 1382 1407 1431 1456 1426 1396 1408 1420 1489 1559 1528 1498 1479 1460 1441 1422 1423 1424 1354 1285 1234 1183 1203 1224 1246 1267 1289 1311 1350 1388 1426 1465 1455 1446 1394
911A394n3M4M4k7k7N2N2N2N2l1l2J1J1q3q3m1m0kkkkK7K7j5j6J9J8O1O1l4l3l3l3M3M3M4M3
$$ 1394 1341 1385 1429 1402 1375 1427 1479 1531 1583 1552 1520 1531 1542 1459 1376 1335 1295 1293 1291 1289 1287 1314 1341 1326 1310 1329 1347 1408 1469 1435 1402 1369 1336 1379 1422 1466 1509
906A509M0M1M0M1N4N4J1J2p0p1k7k8m8m8m8m9K9K9K9K9ononR1R1l7l6j6j6j7j6k4k4k4k4J8
$$ 1509 1549 1590 1630 1671 1725 1779 1790 1802 1732 1661 1634 1606 1558 1510 1462 1413 1442 1471 1500 1529 1523 1518 1512 1507 1598 1689 1652 1616 1600 1584 1567 1551 1527 1503 1479 1455 1473
902A473J7J8J7m5m5m6m5L0K9j3j3J3J4J3J4N4N3R7R6k8k7k8k8M5M4Km0m1L0N7J5j3K9P0K7
$$ 1473 1490 1508 1525 1480 1435 1389 1344 1374 1403 1390 1377 1390 1404 1417 1431 1485 1538 1635 1731 1703 1676 1648 1620 1665 1709 1711 1671 1630 1660 1717 1732 1719 1748 1818 1845
897A845k7k7m4q7q5j4P1P1J0Rl2l3j3j3K6K7lm6k2M9P4L3o3o3K1R1M9k2m5m5n0n0m1m2K9K9
$$ 1845 1818 1791 1747 1660 1575 1561 1632 1703 1713 1722 1690 1657 1644 1631 1657 1684 1681 1635 1613 1662 1736 1769 1706 1643 1664 1755 1804 1782 1737 1692 1642 1592 1551 1509 1538 1567
893A567J9J8k5k4jkM1M2P4P5L4o5j62j21j0O1J4n7l6OL8L9kklmlmJ2J1J2J1j0j0j0j0QPQQ
$$ 1567 1586 1604 1579 1555 1554 1552 1593 1635 1709 1784 1818 1753 1591 1470 1460 1521 1535 1478 1442 1448 1486 1525 1523 1521 1518 1514 1511 1507 1519 1530 1542 1553 1543 1533 1523 1513 1521 1528 1536 1544
888A544n4n4n4n4qqO1O0J31Q8jp3j02o0j7j8M0M0M0M0k5k5o3o3k1M9R3K1n8n7nO5P6L2l8l8
$$ 1544 1490 1436 1382 1328 1320 1312 1373 1433 1564 1652 1651 1578 1476 1416 1399 1381 1421 1461 1501 1541 1516 1491 1428 1365 1344 1393 1486 1507 1449 1392 1387 1452 1528 1560 1522 1484
884A484K8K7K8K7L0L0J2p4q8lJ23J22N2l3n1n1j2P3R2M9k0k0k3k2rj0rrj9j8j9j8mlmlr0r1
$$ 1484 1512 1539 1567 1594 1624 1654 1666 1592 1504 1501 1624 1746 1798 1765 1714 1663 1651 1724 1816 1865 1845 1825 1802 1780 1771 1761 1752 1743 1724 1706 1687 1669 1665 1662 1658 1655 1565 1474
879A474k1k2j9o1m5M1J02N9l3l4nQ0Q2km4%M0M1L1L1P9on9n8L4P7Q5%m9m8l5l4k9k9K6J10
$$ 1474 1453 1431 1412 1351 1306 1347 1449 1508 1475 1441 1436 1516 1598 1596 1552 1552 1592 1633 1664 1695 1774 1768 1709 1651 1685 1762 1847 1847 1798 1750 1715 1681 1652 1623 1649 1759
875A759J53O7q6q5QQl7l7l7l7mmm7m6o0n9L9M0O6O5mm7q4JM5Lp3p3k5O1M3M3M8M8ooono8o8
$$ 1759 1912 1979 1893 1808 1816 1824 1787 1750 1713 1676 1672 1668 1621 1575 1515 1456 1495 1535 1601 1666 1662 1615 1531 1532 1577 1580 1507 1434 1409 1470 1513 1556 1604 1652 1646 1640 1634 1629 1561 1493
870A493LLl1l2j8K5J2p3p3J3O0J7k4k4P6P6L3L4LKLLj8j8j9j8o9p0L0L0N6N5j5j5k2k1K1K1
$$ 1493 1496 1499 1468 1436 1418 1443 1455 1382 1309 1322 1382 1399 1375 1351 1427 1503 1536 1570 1573 1575 1578 1581 1563 1545 1526 1508 1439 1369 1399 1429 1485 1540 1525 1510 1488 1467 1488 1509
865A509R0R0O7j8p5p6P6P5K5K5R1R0K2o2j6j5POOOl8l8k0O4O6k0o5o6l3l4RRj0rj0rJ8J8l3
$$ 1509 1599 1689 1756 1738 1663 1587 1663 1738 1763 1788 1879 1969 1991 1929 1913 1898 1905 1911 1917 1923 1885 1847 1827 1891 1957 1937 1872 1806 1773 1739 1748 1757 1747 1738 1728 1719 1737 1755 1722
860A722j19q1q1M1M2QQQQn4n4n4n3j5j5n7n8l5l5PQK6K5j6j7O3O3O3O3k6k5k6k5j5j5K7K8
$$ 1722 1603 1522 1441 1482 1524 1532 1540 1548 1556 1502 1448 1394 1341 1326 1311 1254 1196 1161 1126 1133 1141 1167 1192 1176 1159 1222 1285 1348 1411 1385 1360 1334 1309 1294 1279 1306 1334
856A334N3N2j8j8m5m4K6K6NOM8M7K9K8m2m3j01j01n0L6J6J6J6J6%q4q5JN0N1j6j5N4N5j6j7
$$ 1334 1387 1439 1421 1403 1358 1314 1340 1366 1371 1377 1425 1472 1501 1529 1487 1444 1343 1242 1192 1228 1244 1260 1276 1292 1292 1208 1123 1124 1174 1225 1209 1194 1248 1303 1287 1270
851A270pqL5L5J8J9k4k4K0K0k3k2l0l0M1M1m3m3j%llllN4N3m7m6n8n9j6j6m6m5llN8N8N8N8
$$ 1270 1263 1255 1290 1325 1343 1362 1338 1314 1334 1354 1331 1309 1279 1249 1290 1331 1288 1245 1244 1244 1241 1238 1235 1232 1286 1339 1292 1246 1188 1129 1113 1097 1051 1006 1003 1000 1058 1116 1174 1232
846A232k1k1K1K1L1L0m0m1j1j1j1j1JJP2P2m2m2%%n7n7j4j5M3M4k8k8j2j2j3j2L0K9K9L0J5
$$ 1232 1211 1190 1211 1232 1263 1293 1253 1212 1201 1190 1179 1168 1169 1170 1242 1314 1272 1230 1230 1230 1173 1116 1102 1087 1130 1174 1146 1118 1106 1094 1081 1069 1099 1128 1157 1187 1202
842A202J6J5J6j0rrj0lmmlL0L0j3j2P2P1n6n6k8k9J4J4ononk5k5k5k5l1l2J2J1Q4Q5j4j5k1
$$ 1202 1218 1233 1249 1239 1230 1221 1211 1208 1204 1200 1197 1227 1257 1244 1232 1304 1375 1319 1263 1235 1206 1220 1234 1228 1223 1217 1212 1187 1162 1137 1112 1081 1049 1061 1072 1156 1241 1227 1212 1191
837A191k2K1K1onL7L7j3j2k4O2L9m6j12k7P9P9m4m4k2k2k3k2J2J2J2J1K4K4M5M5kjR2R3Nq0
$$ 1191 1169 1190 1211 1205 1200 1237 1274 1261 1249 1225 1287 1326 1280 1168 1141 1220 1299 1255 1211 1189 1167 1144 1122 1134 1146 1158 1169 1193 1217 1262 1307 1305 1304 1396 1489 1494 1414
833A414q0NM5M4k1k0onk7k7N4N3L1n5n9n8PPk9k9J4J4q0q0l4N1J06K0k6k5M3M3K1K2n4n4j02
$$ 1414 1334 1339 1384 1428 1407 1387 1381 1376 1349 1322 1376 1429 1460 1405 1346 1288 1295 1302 1273 1244 1258 1272 1192 1112 1078 1129 1235 1255 1229 1204 1247 1290 1311 1333 1279 1225 1123
828A123j7J06J06L2n4k9k9RQl1l2J2J1L8L9J7J7n0n0pqK3K2m8m9MLMMJ19J19L9m6k9l0QQK7
$$ 1123 1106 1212 1318 1350 1296 1267 1238 1247 1255 1224 1192 1204 1215 1253 1292 1309 1326 1276 1226 1219 1211 1234 1256 1208 1159 1163 1166 1170 1174 1293 1412 1451 1405 1376 1346 1354 1362 1389
823A389K6Rp6j10k5M9N0O2O2M0m6p1p0K3K3l9l9MMj9j9j8j9mmR5R4O9O9l0l1l0k9n1n1J7J7
$$ 1389 1415 1424 1348 1238 1213 1262 1312 1374 1436 1476 1430 1359 1289 1312 1335 1296 1257 1261 1265 1246 1227 1209 1190 1186 1182 1277 1371 1440 1509 1479 1448 1418 1389 1338 1287 1304 1321
819A321k6k5m7m6N3N3K3K3m8m8k8k8P2P1K8K7POl4l4L7L7J11J11j6j7j3j4N7N7l1l2n3n3L4
$$ 1321 1295 1270 1223 1177 1230 1283 1306 1329 1281 1233 1205 1177 1249 1320 1348 1375 1382 1388 1354 1320 1357 1394 1505 1616 1600 1583 1570 1556 1613 1670 1639 1607 1554 1501 1535
815A535L5L4L5l1l0J2J2P8P9m9m9j7j7N4N4J0J1l2l3m2m3%jl8l8J18J18R6R7llp0p0j13j13
$$ 1535 1570 1604 1639 1608 1578 1590 1602 1680 1759 1710 1661 1644 1627 1681 1735 1745 1756 1724 1691 1649 1606 1606 1605 1567 1529 1647 1765 1861 1958 1955 1952 1882 1812 1699 1586
810A586k8k8ppKKP3P3j8j9l9m0j5j6K7K7L9L9l2l2N2N2RJ0n6n5j3j2LMMLk1k1k1k1k0k1o2
$$ 1586 1558 1530 1523 1516 1518 1520 1593 1666 1648 1629 1590 1550 1535 1519 1546 1573 1612 1651 1619 1587 1639 1691 1700 1710 1654 1599 1586 1574 1577 1581 1585 1588 1567 1546 1525 1504 1484 1463 1401
806A401o3M2M3k8k8m1m2KJP6P6P6P5%jjjQQq6q6o4K0O7O7K1o4m2%Ml8l6PP6P6QPpqL5L4M9
$$ 1401 1338 1380 1423 1395 1367 1326 1284 1286 1287 1363 1439 1515 1590 1590 1589 1588 1587 1595 1603 1517 1431 1367 1387 1454 1521 1542 1478 1436 1436 1440 1402 1366 1373 1449 1525 1533 1540 1533 1525 1560 1594 1643
800A643M9K0O2N3l1j04o2QPj12j12QR3K7n7o7J9L6L7L6L6l5p6m0M4J8k4m4m4nmk1k0K2K2J4
$$ 1643 1692 1712 1774 1827 1796 1692 1630 1638 1645 1533 1421 1429 1522 1549 1492 1425 1444 1480 1517 1553 1589 1554 1478 1438 1482 1500 1476 1432 1388 1383 1379 1358 1338 1360 1382 1396
796A396J4J4J4J0Rq4q4n1L5N8N8R4R5J9o5m6L8L6m9j01n9L8Q1O0k5p4p4l8l8NNL8L7L8L7m1
$$ 1396 1410 1424 1438 1448 1457 1373 1289 1238 1273 1331 1389 1483 1578 1597 1532 1486 1524 1560 1511 1410 1351 1389 1470 1530 1505 1431 1357 1319 1281 1286 1291 1329 1366 1404 1441 1400
792A400m1JJO5O4opL4L3L3L4k7k7o5o4m2M3R0M7k8k8l0l1K3K2k0k0KKKKk6k6k7k6n4n5M5M5
$$ 1400 1359 1360 1361 1426 1490 1484 1477 1511 1544 1577 1611 1584 1557 1492 1428 1386 1429 1519 1566 1538 1510 1480 1449 1472 1494 1474 1454 1456 1458 1460 1462 1436 1410 1383 1357 1303 1248 1293 1338
787A338j5j6j5j6RQo3o2O3O3O9j7j8j8k4k3LLLLm0m0K5K5Rp6p5RO9P0N1l3l9l8K7K7L0L0L1
$$ 1338 1323 1307 1292 1276 1285 1293 1230 1168 1231 1294 1363 1346 1328 1310 1286 1263 1266 1269 1272 1275 1235 1195 1220 1245 1254 1178 1103 1112 1181 1251 1302 1269 1230 1192 1219 1246 1276 1306 1337
782A337L0mmmmJ3J4QQJ2p3r1r1K6J11O8j6o5o4k7k7o1o1j0P6P6P5L9L8L0K9m1m2M0M1K6j16
$$ 1337 1367 1363 1359 1355 1351 1364 1378 1386 1394 1406 1333 1242 1151 1177 1288 1356 1340 1275 1211 1184 1157 1096 1035 1025 1101 1177 1252 1291 1329 1359 1388 1347 1305 1345 1386 1412 1296
778A296j52o6MNj7j7Q3Q2k3k2M3M3K3o3j4j5MNl8l8L0K9K9L0K9K9j4j4j1j2j2j2N2N2k0j9
$$ 1296 1144 1078 1082 1087 1070 1053 1136 1218 1195 1173 1216 1259 1282 1219 1205 1190 1194 1199 1161 1123 1153 1182 1211 1241 1270 1299 1285 1271 1260 1248 1236 1224 1276 1328 1308 1289
773A289m8m8N0N1j0j0O0O1k4k3k4k3N8N9j2j2mnmmPPPPLLM6M6K3K2m8m9q9q9J0J0N0M9QPJ0
$$ 1289 1241 1193 1243 1294 1284 1274 1334 1395 1371 1348 1324 1301 1359 1418 1406 1394 1390 1385 1381 1377 1384 1391 1398 1405 1408 1411 1457 1503 1526 1548 1500 1451 1362 1273 1283 1293 1343 1392 1400 1407 1417
768A417J1N3N4m1m0q3q2L8L9L9L8o5o5L4L4k2k2k2k2J6J5J6J5J6J6J5J6J3J2J3J3m0m0KKl4
$$ 1417 1428 1481 1535 1494 1454 1371 1289 1327 1366 1405 1443 1378 1313 1347 1381 1359 1337 1315 1293 1309 1324 1340 1355 1371 1387 1402 1418 1431 1443 1456 1469 1429 1389 1391 1393 1359
764A359l4QQJ9J8k3k4M2M2%%kkm5m4m6m5N4N3L0L0j2j3L0L0L0L0k3k4k3k3l8l7NNK9L0j3j3
$$ 1359 1325 1333 1341 1360 1378 1355 1331 1373 1415 1415 1415 1413 1411 1366 1322 1276 1231 1285 1338 1368 1398 1386 1373 1403 1433 1463 1493 1470 1446 1423 1400 1362 1325 1330 1335 1364 1394 1381 1368
759A368J8J8J8J8J1J1J1J1M9M8K8n7l4POl8n1rJ8o8r4j0R3R3P3P4L0L1n5n6j2j3k0k1k0k0
$$ 1368 1386 1404 1422 1440 1451 1462 1473 1484 1533 1581 1609 1552 1518 1525 1531 1493 1442 1433 1451 1383 1289 1279 1372 1465 1538 1612 1642 1673 1618 1562 1550 1537 1517 1496 1476 1456
755A456m3m2N7N7N8N8m0q3p4J0J11J10P7ql1l2PPPPj0rO1O1l4l5QQk4k4k7k7qn1p5J0O8O8
$$ 1456 1413 1371 1428 1485 1543 1601 1561 1478 1404 1414 1525 1635 1712 1704 1673 1641 1648 1655 1662 1669 1659 1650 1711 1772 1738 1703 1711 1719 1695 1671 1644 1617 1609 1558 1483 1493 1561 1629
750A629K8K8m5q7m0M4P5P4RQo2o2k0k0K2K2k1k1OOONo1o2o2o2opL5L6M8M9ONl7l8NNj5j5j5
$$ 1629 1657 1685 1640 1553 1513 1557 1632 1706 1715 1723 1661 1599 1579 1559 1581 1603 1582 1561 1567 1573 1579 1584 1523 1461 1399 1337 1331 1324 1359 1395 1443 1492 1498 1503 1466 1428 1433 1438 1423 1408 1393
745A393j5kjkkJ5J4J3J2m3q4o6J9J11J12J7J7J1J2l2l1lkkkLLM6M5l0l1l1l0k7k7J2J3J8k4
$$ 1393 1378 1376 1375 1373 1371 1386 1400 1413 1425 1382 1298 1232 1251 1362 1474 1491 1508 1519 1531 1499 1468 1465 1463 1461 1459 1462 1465 1511 1556 1526 1495 1464 1434 1407 1380 1392 1405 1423 1399
740A399n4L1P6qn5n5K0K0J9K0O4O4N9N8j1r6j38n3P6P6j8j8L3L3L3L3l1l1l1l0J2J3k9p1m7
$$ 1399 1345 1376 1452 1444 1389 1334 1354 1374 1393 1413 1477 1541 1600 1658 1647 1551 1413 1360 1436 1512 1494 1476 1509 1542 1575 1608 1577 1546 1515 1485 1497 1510 1481 1410 1363
736A363L7N4J1o5o5p3J2P7P8O0k6nnk3o6r9j4O3O4L5L6qpo0o0O7O7J7J7k6k6n0n1k7N7R2R1
$$ 1363 1400 1454 1465 1400 1335 1262 1274 1351 1429 1489 1463 1458 1453 1430 1364 1265 1251 1314 1378 1413 1449 1441 1434 1374 1314 1381 1448 1465 1482 1456 1430 1380 1329 1302 1359 1451 1542
731A542K7K6m7m6nmK6K6m5m6j3j3K9K9jjJ2N5N8k7p1k8L1L1qrL5L5pql1l1l1l1o5o6L4L4j9
$$ 1542 1569 1595 1548 1502 1497 1493 1519 1545 1500 1454 1441 1428 1457 1486 1485 1484 1496 1551 1609 1582 1511 1483 1514 1545 1537 1528 1563 1598 1591 1583 1552 1521 1490 1459 1394 1328 1362 1396 1377
727A377k0P5P4O1k5j9k0OOo5o5L0K9l5l6j4P1P2j4%%L8L7J3J3J3J2o0o1J0J0J1J0N4N3L9L9
$$ 1377 1357 1432 1506 1567 1542 1523 1503 1509 1515 1450 1385 1415 1444 1409 1373 1359 1430 1502 1488 1488 1488 1526 1563 1576 1589 1602 1614 1554 1493 1503 1513 1524 1534 1588 1641 1680 1719
722A719o0o0j2j1L1L1NNNOp6p5n2L3N8N9l6l5l9l8L2L3MNNNL4L3o6o6j4j4j5j4OOn9o0nQ0
$$ 1719 1659 1599 1587 1576 1607 1638 1643 1648 1653 1659 1583 1508 1456 1489 1547 1606 1570 1535 1496 1458 1490 1523 1527 1532 1537 1542 1576 1609 1543 1477 1463 1449 1434 1420 1426 1432 1373 1313 1308 1388
717A388M2m2o6K0L7L7QQN1N1jjjjj3j3j3j4L7L6P8P9k7k6M4M4rrn2n2p9q0n7K8L1L1l4l5M2
$$ 1388 1430 1388 1322 1342 1379 1416 1424 1432 1483 1534 1533 1532 1531 1530 1517 1504 1491 1477 1514 1550 1628 1707 1680 1654 1698 1742 1733 1724 1672 1620 1541 1461 1404 1432 1463 1494 1460 1425 1467
712A467M2M2M1K4K3K3K3m0l9kkjp3p3kO4O4lkl9l9l9l9M3M3JJ%jM2M2j6j7j6j6k7k6k6k6J9
$$ 1467 1509 1551 1592 1616 1639 1662 1685 1645 1606 1604 1602 1601 1528 1455 1453 1517 1581 1578 1576 1537 1498 1459 1420 1463 1506 1507 1508 1508 1507 1549 1591 1575 1558 1542 1526 1499 1473 1447 1421 1440
707A440J9J9J9Q5Q5%p2l4PK2K2L6L6L3l8p0p0l1l2l9m0m0l9J4J4N7N7O4O4Po4n7j5%%p3p4
$$ 1440 1459 1478 1497 1582 1667 1667 1595 1561 1568 1590 1612 1648 1684 1717 1679 1609 1539 1508 1476 1437 1397 1357 1318 1332 1346 1403 1460 1524 1588 1595 1531 1474 1459 1459 1459 1386 1312
703A312l0l1J0J0N2N3K2K2k1k0J8J9k4o7k4M8M7k4l1J1Q2Q1k0k0k3k2m7q9o5NM0mj7j8J0R
$$ 1312 1282 1251 1261 1271 1323 1376 1398 1420 1399 1379 1397 1416 1392 1325 1301 1349 1396 1372 1341 1352 1434 1515 1495 1475 1452 1430 1383 1294 1229 1234 1274 1270 1253 1235 1245 1254
699A254RRO1O0l8q2l1L9L9M0j4j4j3j4k4k4k4k4k7k7M4M4K9K9K9K9N3N3N3N3l2l1l1l1K4K5
$$ 1254 1263 1272 1333 1393 1355 1273 1242 1281 1320 1360 1346 1332 1319 1305 1281 1257 1233 1209 1182 1155 1199 1243 1272 1301 1330 1359 1412 1465 1518 1571 1539 1508 1477 1446 1470 1495
694A495j8j8j6j6n9n9KKKLJ7J7J7J7m0m0m1m0Q7Q7M5M5n7n7P0P1M1M1l0k9J4J5J4J5j00j00
$$ 1495 1477 1459 1443 1427 1368 1309 1311 1313 1315 1318 1335 1352 1369 1386 1346 1306 1265 1225 1312 1399 1444 1489 1432 1375 1445 1516 1557 1598 1568 1539 1553 1568 1582 1597 1497 1397
690A397k9k9N1N0QQM7M7k4k4qrL4L4j2j2n4n5n3n2J8J8K6K6K6K6PQl5l6M1M0kll3l3RRM3M3
$$ 1397 1368 1339 1390 1440 1448 1456 1503 1550 1526 1502 1494 1485 1519 1553 1541 1529 1475 1420 1367 1315 1333 1351 1377 1403 1429 1455 1462 1470 1435 1399 1440 1480 1478 1475 1442 1409 1418 1427 1470 1513
685A513M3M3m8m8m8m8j2j1j2j1O2O3K0K0k5k6J6J7jjjjl0k9P0P0K6K7K7K7n0m9n0m9j18j18
$$ 1513 1556 1599 1551 1503 1455 1407 1395 1384 1372 1361 1423 1486 1506 1526 1501 1475 1491 1508 1507 1506 1505 1504 1474 1445 1515 1585 1611 1638 1665 1692 1642 1593 1543 1494 1376 1258
680A258j8j8K8K9K8K9k5k4k5k4L3L3L3L3K7K6j6j6ppN9O0L9l1j7K4M8Nl9l9l9l9M4J15J09
$$ 1258 1240 1222 1250 1279 1307 1336 1311 1287 1262 1238 1271 1304 1337 1370 1397 1423 1407 1391 1384 1377 1436 1496 1535 1504 1487 1511 1559 1564 1525 1486 1447 1408 1452 1567 1676
676A676L8p3p4kkkjOOOOK8K8K8K7J6J5Q7Q6O5O6onk5k4J9J8N7N7N1N1j3j11k04k03n8P0N4
$$ 1676 1714 1641 1567 1565 1563 1561 1560 1566 1572 1578 1584 1612 1640 1668 1695 1711 1726 1813 1899 1964 2030 2024 2019 1994 1970 1989 2007 2064 2121 2172 2223 2210 2099 1895 1692 1634 1704 1758
672A758m5j08j07j4j5J9J9J9J9j1j1j2j1POo4o5L3L4L3L3p0p0JKK6K6K6K6K0K0k2k3O6O7n
$$ 1758 1713 1605 1498 1484 1469 1488 1507 1526 1545 1534 1523 1511 1500 1507 1513 1449 1384 1417 1451 1484 1517 1447 1377 1378 1380 1406 1432 1458 1484 1504 1524 1502 1479 1545 1612 1607
667A607nJ7J7J8J7RRo2o1k8k8J5J5K2K2k1k1j6j6Q3Q3L0L1j2j2n0n1n1n0N6N5L6n0l9Lk6k7
$$ 1607 1602 1619 1636 1654 1671 1680 1689 1627 1566 1538 1510 1525 1540 1562 1584 1563 1542 1526 1510 1593 1676 1706 1737 1725 1713 1663 1612 1561 1511 1567 1622 1658 1608 1569 1572 1546 1519
663A519j1j1j1j1n1n2M8M8J7J7J7J7j3j3j3j3O1O2J8J9K7K7j6j6K8K8K7K8PPl6l6k8k9k6k6
$$ 1519 1508 1497 1486 1475 1424 1372 1420 1468 1485 1502 1519 1536 1523 1510 1497 1484 1545 1607 1625 1644 1671 1698 1682 1666 1694 1722 1749 1777 1784 1791 1755 1719 1691 1662 1636 1610
658A610O6J07L8m8q2MK1k1n3L1J09J08RQl4l4j7j7j8j7L8L8M0M1O5J08Q9Mp2p1noL3L3L4L3
$$ 1610 1676 1783 1821 1773 1691 1695 1716 1695 1642 1673 1782 1890 1899 1907 1873 1839 1822 1805 1787 1770 1808 1846 1886 1927 1992 2100 2189 2193 2121 2050 2045 2039 2072 2105 2139 2172
654B172j0j0m7m8LQ9J30M6NNm3m3r2r1k1k1L1L1J8k4k0O6J36R3lm6J8J8k2k1k2k2L6L5poj2
$$ 2172 2162 2152 2105 2057 2060 2149 2279 2325 2330 2335 2292 2249 2157 2066 2045 2024 2055 2086 2104 2080 2060 2126 2262 2355 2352 2306 2324 2342 2320 2299 2277 2255 2291 2326 2319 2313 2301
649B301j3Q8Q7J5J5J6J5p2p2jjJ9J9K0J9L9L8L9L9j4j5j2j1J9O2Q6%o1o2k4k4K4K3N3J0l4
$$ 2301 2288 2376 2463 2478 2493 2509 2524 2452 2380 2379 2378 2397 2416 2436 2455 2494 2532 2571 2610 2596 2581 2569 2558 2577 2639 2725 2725 2664 2602 2578 2554 2578 2601 2654 2664 2630
645B630N1R1Nj24j24l1l0j8j8N3N3ONM3M2j4j00n8K8PQJ3J3k2k2M9M9k1k2K1K1JJJKL5L6L0
$$ 2630 2681 2772 2777 2653 2529 2498 2468 2450 2432 2485 2538 2544 2549 2592 2634 2620 2520 2462 2490 2497 2505 2518 2531 2509 2487 2536 2585 2564 2542 2563 2584 2585 2586 2587 2589 2624 2660 2690
640B690L0l4j18q2MP1j4o1j8J3p3j12k7J12J11J8J8k9k9k9k9N5N6j5j6j9j8j9j9M6M5K6o0
$$ 2690 2720 2686 2568 2486 2490 2561 2547 2486 2468 2481 2408 2296 2269 2381 2492 2510 2528 2499 2470 2441 2412 2467 2523 2508 2492 2473 2455 2436 2417 2463 2508 2534 2474
636B474j11o9K7K8j7o0m3M1P1K8p0p0rrrrk1k1N1N0O2O2K0J9K0K1K0K1K5K6R7R7O4O5O5O5
$$ 2474 2363 2294 2321 2349 2332 2272 2229 2270 2341 2369 2299 2229 2220 2211 2202 2193 2172 2151 2202 2252 2314 2376 2396 2415 2435 2456 2476 2497 2522 2548 2645 2742 2806 2871 2936 3001
632C001J60J61J60P6l4j18j47j47j59j59q8q8p4p5l2l2k9k9q2LP1j5j41j40n7K8j4j4N4J39
$$ 3001 3161 3322 3482 3558 3524 3406 3259 3112 2953 2794 2706 2618 2544 2469 2437 2405 2376 2347 2265 2268 2339 2324 2183 2043 1986 2014 2000 1986 2040 2179
628B179M9r3r5rL3L3l0l1M1M0m5m4lkL9L9l3l2m6m6lmj8j7Q1Q2L1L2m0l9m7m8m7m8LLR6R7
$$ 2179 2228 2135 2040 2031 2064 2097 2067 2036 2077 2117 2072 2028 2025 2023 2062 2101 2068 2036 1990 1944 1941 1937 1919 1902 1983 2065 2096 2128 2088 2049 2002 1954 1907 1859 1862 1865 1961 2058
623B058M2m2o0o1m2M2L8L7m8m8noo6o6RR3J17L1j4j5m9m8l1N4L1n3m8L8O9O9k5k5J8J7J8J8
$$ 2058 2100 2058 1998 1937 1895 1937 1975 2012 1964 1916 1911 1905 1839 1773 1782 1875 1992 2023 2009 1994 1945 1897 1866 1920 1951 1898 1850 1888 1957 2026 2001 1976 1994 2011 2029 2047
619B047k2k2o4o5J1J1N4N3L2L2o2o3m2M2O6O5J6J5n5n5o9p0N8N9l9l9LMkkkjNNONj6j6K7K7
$$ 2047 2025 2003 1939 1874 1885 1896 1950 2003 2035 2067 2005 1942 1900 1942 2008 2073 2089 2104 2049 1994 1925 1855 1913 1972 1933 1894 1897 1901 1899 1897 1895 1894 1899 1904 1910 1915 1899 1883 1910 1937
614A937KKM6M5ononm2m2JJL1L1L1L1J4J5q6q5j6j6j5j6lkM0M0L6L6o4o3K5K6O8O8k3k2k2k3
$$ 1937 1939 1941 1987 2032 2026 2021 2015 2010 1968 1926 1927 1928 1959 1990 2021 2052 2066 2081 1995 1910 1894 1878 1863 1847 1844 1842 1882 1922 1958 1994 1930 1867 1892 1918 1986 2054 2031 2009 1987 1964
609A964%%%%j3j4j3j4M9M9OOl0l1l0l0L0L0L0L0m0m1m0m0M0L9mlPOl6l6n0n0P8P7%%m3m3J5
$$ 1964 1964 1964 1964 1964 1951 1937 1924 1910 1959 2008 2014 2020 1990 1959 1929 1899 1929 1959 1989 2019 1979 1938 1898 1858 1898 1937 1933 1930 1937 1943 1907 1871 1821 1771 1849 1926 1926 1926 1883 1840 1855
604A855J5Q6Q6ppm9n0k5k6k6k5M8M8k3k3l1l0M0M0K0J9N6N6O7j8p0p0qrqrN5N6J2J3m8m7m8
$$ 1855 1870 1956 2042 2035 2028 1979 1929 1904 1878 1852 1827 1875 1923 1900 1877 1846 1816 1856 1896 1916 1935 1991 2047 2114 2096 2026 1956 1948 1939 1931 1922 1977 2033 2045 2058 2010 1963 1915
600A915m7N5N5J3J3j2j2L0L0k5k4k5k5J9J9k3k3j%jjL9L8L8L9n4n3j1j1o4o4PPjjllM9Ok3
$$ 1915 1868 1923 1978 1991 2004 1992 1980 2010 2040 2015 1991 1966 1941 1960 1979 1956 1933 1932 1932 1931 1930 1969 2007 2045 2084 2030 1977 1966 1955 1891 1827 1834 1841 1840 1839 1836 1833 1882 1888 1865
595A865O3J02J7k9k9k9k9k9k9M2M2k9k9L2L1L2L1Q7Q7J5J6RQo1j04p5J0K5j6l9l9JJl1l1J1
$$ 1865 1928 2030 2047 2018 1989 1960 1931 1902 1873 1915 1957 1928 1899 1931 1962 1994 2025 2112 2199 2214 2230 2239 2247 2186 2082 2007 2017 2042 2026 1987 1948 1949 1950 1919 1888 1899
590A899J2K5K6m5m5j6j6q7q6k6k6k3k3O2J04L7m7j9J22J80R4nr1n6L0M1kj5j5K8K7l8l8qP7
$$ 1899 1911 1936 1962 1917 1872 1856 1840 1753 1667 1641 1615 1592 1569 1631 1735 1772 1725 1706 1828 2008 2102 2097 2006 1950 1980 2021 2019 2004 1989 2017 2044 2006 1968 1960 2037
586B037P8qK3K4J9J8RRRRq6q6j1P4O6j9o5o6K0K0k3k2L9L9or2r2pJ18J19J7o9k0k1L1L0o9
$$ 2037 2115 2107 2130 2154 2173 2191 2200 2209 2218 2227 2141 2055 2044 2118 2184 2165 2100 2034 2054 2074 2051 2029 2068 2107 2101 2009 1917 1910 2028 2147 2164 2095 2075 2054 2085 2115 2046
582B046o9n5n6M4M4rrL4L4O1O0J8J8N5N5j6j6j1j2j1j2m0l9N9N9O5O5o3o3PPQPk1k2k1k1%
$$ 2046 1977 1922 1866 1910 1954 1945 1936 1970 2004 2065 2125 2143 2161 2216 2271 2255 2239 2228 2216 2205 2193 2153 2114 2173 2232 2297 2362 2299 2236 2243 2250 2258 2265 2244 2222 2201 2180 2180
577B180jm3m3m1m1L0L0J1J2J1J2K9K9K9K9K8K8Mq0j08j08l3N1M6M7RRM4M3M4M4o6o5k3k3L
$$ 2180 2179 2136 2093 2052 2011 2041 2071 2082 2094 2105 2117 2146 2175 2204 2233 2261 2289 2293 2213 2105 1997 1964 2015 2061 2108 2117 2126 2170 2213 2257 2301 2235 2170 2147 2124 2127
572B127MLMM7M7MMJ1J0N4N3RRo2o1j9j8K5K4K0K0K0K1l1l0l0l0K5K5K5K5L6L5L6L6k6k7k6
$$ 2127 2131 2134 2138 2185 2232 2236 2240 2251 2261 2315 2368 2377 2386 2324 2263 2244 2226 2251 2275 2295 2315 2335 2356 2325 2295 2265 2235 2260 2285 2310 2335 2371 2406 2442 2478 2452 2425 2399
568B399k6L7L7ooO9O8O9O8Q8Q7o9o9o1o1O6O6P2P2P3P2K5K5J24J24J40J39J82J81J70J69M2
$$ 2399 2373 2410 2447 2441 2435 2504 2572 2641 2709 2797 2884 2815 2746 2685 2624 2690 2756 2828 2900 2973 3045 3070 3095 3219 3343 3483 3622 3804 3985 4155 4324 4366
564D366M2k5k5j5P0K37M92N74L75K8k84n04n04m73m73k32k32j78j78k2k2k9k9k9k9j6j7j16
$$ 4366 4408 4383 4358 4343 4413 4650 5142 5716 6091 6119 5835 5331 4827 4354 3881 3649 3417 3239 3061 3039 3017 2988 2959 2930 2901 2885 2868 2752
560B752j16L2L3L2L2M8M8k2k3k4k3k4k4j0j0j1j0L5L5L4L5k3k3M8M8%%%%K6K6j7j7M3M2J%
$$ 2752 2636 2668 2701 2733 2765 2813 2861 2839 2816 2792 2769 2745 2721 2711 2701 2690 2680 2715 2750 2784 2819 2796 2773 2821 2869 2869 2869 2869 2869 2895 2921 2904 2887 2930 2972 2973 2973
556B973L0L0j2j2n8n9R8R8PPQPJ5J5l3N2J00J00L5L4M5M5k6k6J1J1J11J10P6P6L4L3J72J72
$$ 2973 3003 3033 3021 3009 2951 2892 2990 3088 3095 3102 3110 3117 3132 3147 3114 3166 3266 3366 3401 3435 3480 3525 3499 3473 3484 3495 3606 3716 3792 3868 3902 3935 4107 4279
552D279J20L5m3m3r1r1j22j22q0p9NONOK5K5K5K5l0l1K1J06Q8Q7jjQ9J74J31M6%jj%k7N9J15
$$ 4279 4399 4434 4391 4348 4257 4166 4044 3922 3842 3763 3768 3774 3779 3785 3810 3835 3860 3885 3855 3824 3845 3951 4039 4126 4125 4124 4213 4387 4518 4564 4564 4563 4562 4562 4535 4594 4709
547D709J16J05J91L52M94M34K93Q2j16l14l13l02k18j88j88j31m6K4K4j3j4k5k6k6k6J1J0
$$ 4709 4825 4930 5121 5473 5967 6401 6694 6776 6660 6346 6033 5731 5513 5325 5137 5006 4960 4984 5008 4995 4981 4956 4930 4904 4878 4889 4899
544D899J1J0M7M7M7M7j5j4j4j5k9k9K2J08J08J08J4J5P4P4N6k9%Q5J02J03rqJ00J85J56J57
$$ 4899 4910 4920 4967 5014 5061 5108 5093 5079 5065 5050 5021 4992 5014 5122 5230 5338 5352 5367 5441 5515 5571 5542 5542 5627 5729 5832 5823 5815 5915 6100 6256 6413
540F413O2O3J08J09J88K74L02L01K70K70L39M24N24O67Q40J096J428J854K275K473K239J416
$$ 6413 6475 6538 6646 6755 6943 7217 7519 7820 8090 8360 8699 9123 9647 10314 11154 12250 13678 15532 17807 20280 22519 23935
537B3935J02j288k213k525k334j908j522j153q29n74l82k98k66j81r6r6q7q6QPl8j24j23l8
$$ 23935 24037 22749 20536 18011 15677 13769 12247 11094 10265 9691 9309 9011 8745 8564 8468 8372 8285 8199 8207 8214 8176 8052 7929 7891
534G891rrrP6Q0Q0m3m2jkO9P0M5M5k6k7N2N1N1N1J32J32L3L3J10J10Q7KJ4J3k9k9j5O9K7K7
$$ 7891 7882 7873 7864 7940 8020 8100 8057 8015 8014 8012 8081 8151 8196 8241 8215 8188 8240 8291 8342 8393 8525 8657 8690 8723 8833 8943 9030 9032 9046 9059 9030 9001 8986 9055 9082 9109
530I109K1J06J01J01K7K6O9O9P5P5P5P4J26J25J02J7l4l4QRR1J77J29J28J54J53K01J16J07
$$ 9109 9130 9236 9337 9438 9465 9491 9560 9629 9704 9779 9854 9928 10054 10179 10281 10298 10264 10230 10238 10247 10338 10515 10644 10772 10926 11079 11280 11396 11503
526A1503J07K30K29K26K27J92J93K10L53M81O24P53J065J412J781K380L259M011L698J898
$$ 11503 11610 11840 12069 12295 12522 12714 12907 13117 13470 13951 14575 15328 16393 17805 19586 21966 25225 29236 32934 34832
524C4832o26k685l507l345k806k185j590j105p93n62m20k71j29p2p3N6N6O1O1J30K14L10L10
$$ 34832 34206 31521 28014 24669 21863 19678 18088 16983 16190 15628 15208 14937 14808 14736 14663 14719 14775 14836 14897 15027 15241 15551 15861
521A5861M68P24P96N41k8m54n20l23q5jP7J63K91L76L39L39L72M58M53M52L90L90N17N17N56
$$ 15861 16329 17053 17849 18390 18362 17908 17388 17065 16980 16979 17056 17219 17510 17886 18225 18564 18936 19394 19847 20299 20689 21079 21596 22113 22669
518B2669N55O32P73Q43Q42Q51R37J020J106J110J111J221J306J413J414J406J405J448J448
$$ 22669 23224 23856 24629 25472 26314 27165 28102 29122 30228 31338 32449 33670 34976 36389 37803 39209 40614 42062 43510
516D3510J494J494J338J197R45N77P1m69r68j451j851k220k460k603k717k718k641k443k247
$$ 43510 45004 46498 47836 49033 49978 50555 50626 50157 49189 47738 45887 43667 41207 38604 35887 33169 30528 28085 25838
514B5838j991j725j527j364j279j163j022q94q09p37n96n37n37n19m35k97k98l24l23j96j96
$$ 25838 23847 22122 20595 19231 17952 16789 15767 14873 14064 13327 12731 12194 11657 11138 10703 10406 10108 9784 9461 9265 9069
511I069j92j91j49j49k17k18k17k17j12j12j11j12p3p4p3p3r1r1r1r1l5l6l5l6o2o2j05j05
$$ 9069 8877 8686 8537 8388 8171 7953 7736 7519 7407 7295 7184 7072 6999 6925 6852 6779 6688 6597 6506 6415 6380 6344 6309 6273 6211 6149 6044 5939
508E939j05j04o3o2n2n3n2n3q8q7j7j6m2m1l9l9J5N8L9m7p2p3l6l5J0J0l2l3m0m1m0m0j02
$$ 5939 5834 5730 5667 5605 5553 5500 5448 5395 5307 5220 5203 5187 5145 5104 5065 5026 5041 5099 5138 5091 5019 4946 4910 4875 4885 4895 4863 4830 4790 4749 4709 4669 4567
504D567j02l1l1l8l7ONj5j5n8n7m7m6m6m6p6p6l4l4l0l0l0l0l6l6PPl7l7OOn7n7j5K7k0j05
$$ 4567 4465 4434 4403 4365 4328 4334 4339 4324 4309 4251 4194 4147 4101 4055 4009 3933 3857 3823 3789 3759 3729 3699 3669 3633 3597 3604 3611 3574 3537 3543 3549 3492 3435 3420 3447 3427 3322
499C322o2K3Rl2j5P1N9k5r6n3l1l1k8k9L1L0L0L1j8j7o0o0l6l6l6l6K6K6K5K6J3J2n8n9n1
$$ 3322 3260 3283 3292 3260 3245 3316 3375 3350 3254 3201 3170 3139 3111 3082 3113 3143 3173 3204 3186 3169 3109 3049 3013 2977 2941 2905 2931 2957 2982 3008 3021 3033 2975 2916 2865
495B865n0m6m5K8J14P0j4o6o6%jLMLLk6k6k6k6o4o3k1k1J%P1P1J6J6J6J6k5k5k5k5pqpqk7
$$ 2865 2815 2769 2724 2752 2866 2936 2922 2856 2790 2790 2789 2792 2796 2799 2802 2776 2750 2724 2698 2634 2571 2550 2529 2530 2530 2601 2672 2688 2704 2720 2736 2711 2686 2661 2636 2629 2621 2614 2606 2579
490B579k7k7k8j5j6o4K2M4M3k1k2L9M0lmj9k0o3o2l1l0M0M0J7J6k7k6m3m2m3m3K8K9M9N0K5
$$ 2579 2552 2525 2497 2482 2466 2402 2424 2468 2511 2490 2468 2507 2547 2544 2540 2521 2501 2438 2376 2345 2315 2355 2395 2412 2428 2401 2375 2332 2290 2247 2204 2232 2261 2310 2360 2385
485B385K6j8j7r2r1J1R6N5k9r6j0K0K1o9o8m0M5M0M0l5l5PQK2K3KKononK8K9m2m3n3n3M6M5
$$ 2385 2411 2393 2376 2284 2193 2204 2300 2355 2326 2230 2220 2240 2261 2192 2124 2084 2129 2169 2209 2174 2139 2146 2154 2176 2199 2201 2203 2197 2192 2186 2181 2209 2238 2196 2153 2100 2047 2093 2138
481B138O8O7mmk5k5l0N5P1P1n2n1L1L1l9m0k1k1k1k1k7k8M4M3K3K3p0p1k6N9N4N4rj0n2n3
$$ 2138 2206 2273 2269 2265 2240 2215 2185 2240 2311 2382 2330 2279 2310 2341 2302 2262 2241 2220 2199 2178 2151 2123 2167 2210 2233 2256 2186 2115 2089 2148 2202 2256 2247 2237 2185 2132
476B132p0p1J%P7P7N6N5m0m0q2q3l1l2O8O7J4J4n6n7k5k5P4P4Q1Q0J0J0n2n2j0j0K3K2k0k0
$$ 2132 2062 1991 1992 1992 2069 2146 2202 2257 2217 2177 2095 2012 1981 1949 2017 2084 2098 2112 2056 1999 1974 1949 2023 2097 2178 2258 2268 2278 2226 2174 2164 2154 2177 2199 2179 2159
472B159lkJ8J9k9k8J4J4o6o5L3L4M1M1K0J9j5j5n8n8m3m3K8K8J5J4J5J4MLl9l9O6O7nmJ3J4
$$ 2159 2156 2154 2172 2191 2162 2134 2148 2162 2096 2031 2064 2098 2139 2180 2200 2219 2204 2189 2131 2073 2030 1987 2015 2043 2058 2072 2087 2101 2105 2108 2069 2030 2096 2163 2158 2154 2167 2181
467B181n7n7J6J6nnKKK2K3l2l2J1J0RRQRk6k5m7m6J19J19P6P6n4n3l3l3n8n8J3J3M6M6k5k5
$$ 2181 2124 2067 2083 2099 2094 2089 2091 2093 2115 2138 2106 2074 2085 2095 2104 2113 2121 2130 2104 2079 2032 1986 2105 2224 2300 2376 2322 2269 2236 2203 2145 2087 2100 2113 2159 2205 2180 2155
463B155qqqqK8K7m4m3J7J7J7J7N6N6N6N6nmm3m3j3N8N9j3o2o1MNK8K8K8K7l1l1J1J1J4J4k9
$$ 2155 2147 2139 2131 2123 2151 2178 2134 2091 2108 2125 2142 2159 2215 2271 2327 2383 2378 2374 2331 2288 2275 2333 2392 2379 2317 2256 2260 2265 2293 2321 2349 2376 2345 2314 2325 2336 2350 2364 2335
458B335k8k5k4J8J8J9J9J9J9m4m3kjL5L6qpn5n5k6M5J00N8m4q5pL6Ro2p9l7NOk8k8k4k3QP9
$$ 2335 2307 2282 2258 2276 2294 2313 2332 2351 2370 2326 2283 2281 2280 2315 2351 2343 2336 2281 2226 2200 2245 2345 2403 2359 2274 2267 2303 2312 2250 2171 2134 2139 2145 2117 2089 2065 2042 2050 2129
453B129J30Q7kp2p5nL1L0qqN0N1PQo2o3n9o0M5Q7O1j0r3r4k7k7L8L7L5L5lm5o1J0P5P5L7L8
$$ 2129 2259 2346 2344 2272 2197 2192 2223 2253 2245 2237 2287 2338 2345 2353 2291 2228 2169 2109 2154 2241 2302 2292 2199 2105 2078 2051 2089 2126 2161 2196 2193 2148 2087 2097 2172 2247 2284 2322
448B322k7k7k7k6o3o2K1R2P6Nn0n0k7k7k7k7K9L0j3j3K0J9J9J9qqqqJ1J0J1J1%J%%n4n3n4
$$ 2322 2295 2268 2241 2215 2152 2090 2111 2203 2279 2284 2234 2184 2157 2130 2103 2076 2105 2135 2122 2109 2129 2148 2167 2186 2178 2170 2162 2154 2165 2175 2186 2197 2197 2198 2198 2198 2144 2091 2037
444B037n4L2L2L2L3p1p1lkl6p9rP7P8pp7l5N6N6j2j2k7k7k7k7j2j3L1L1L3L4qrL1L1L1L2R
$$ 2037 1983 2015 2047 2079 2112 2041 1970 1967 1965 1929 1850 1841 1918 1996 1989 1912 1877 1933 1989 1977 1965 1938 1911 1884 1857 1845 1832 1863 1894 1927 1961 1953 1944 1975 2006 2037 2069 2078
439B078J0o2o1LKm0m0%%%%m0l9KLL3L2j0rllm5m6M6M5k6k5O8O8K2o2j7O8kq8q8lL8ml3l2P
$$ 2078 2088 2026 1965 1968 1970 1930 1890 1890 1890 1890 1890 1850 1811 1813 1816 1849 1881 1871 1862 1859 1856 1811 1765 1811 1856 1830 1805 1873 1941 1963 1901 1884 1952 1950 1862 1774 1771 1809 1805 1772 1740 1747
434A747Pj2j2j0rj6K7N3l1o8k4J7J7k7k7J5J5K1K1K0K1MMLMJJJJlkm6m5J3J4J3J3j0j0L2L3
$$ 1747 1754 1742 1730 1720 1711 1695 1722 1775 1744 1676 1652 1669 1686 1659 1632 1647 1662 1683 1704 1724 1745 1749 1753 1756 1760 1761 1762 1763 1764 1761 1759 1713 1668 1681 1695 1708 1721 1711 1701 1733 1766
429A766k2k1P2P2O2k3o9o9o0K5P6P7o4o3o8J6%%NNk3k3K0K0M1M1n9n8k4k3k4k3O4O4K2K2l
$$ 1766 1744 1723 1795 1867 1929 1906 1837 1768 1708 1733 1809 1886 1822 1759 1691 1707 1707 1707 1712 1717 1694 1671 1691 1711 1752 1793 1734 1676 1652 1629 1605 1582 1646 1710 1732 1754 1751
424A751lp4p4L1L0L1L1J6J6J6J6k9k8M2M3M8M8k3k3L6L7L6L7J5J5Q1Q1Q9Lp6p6m7m7j12j13
$$ 1751 1748 1674 1600 1631 1661 1692 1723 1739 1755 1771 1787 1758 1730 1772 1815 1863 1911 1888 1865 1901 1938 1974 2011 2026 2041 2122 2203 2292 2295 2219 2143 2096 2049 1937 1824
420A824o8J7J2J1noL6L7j3j2j2j2ppm9n0j4j5j5j5j3j4j3j3l9l8l3l2n1L4L9m6p5RQ3Q4l7
$$ 1824 1756 1773 1785 1796 1791 1785 1821 1858 1845 1833 1821 1809 1802 1795 1746 1696 1682 1667 1652 1637 1624 1610 1597 1584 1545 1507 1474 1442 1391 1425 1464 1418 1343 1352 1435 1519 1482
415A482l7j4P1O1O1K4K4mnrj0J2p2r2r1J8Q9M7k5j4j4l2p5k0N2N4j8k6M4Q3J2j0j0J3k8o4
$$ 1482 1445 1431 1502 1563 1624 1648 1672 1668 1663 1654 1644 1656 1584 1492 1401 1419 1508 1555 1530 1516 1502 1470 1395 1375 1427 1481 1463 1437 1481 1564 1576 1566 1556 1569 1541 1477
411A477QO4O5J6J7O0N9m7m7mml6l5QPk6k6M4M5O6O6J06J05J6k7K5R6Q8M5k5k5%%J%popoj7
$$ 1477 1485 1549 1614 1630 1647 1707 1766 1719 1672 1668 1664 1628 1593 1601 1608 1582 1556 1600 1645 1711 1777 1883 1988 2004 1977 2002 2098 2186 2231 2206 2181 2181 2181 2182 2182 2175 2169 2162 2156 2139
406B139j8n9o0k9k8M2M2m0m0KM5J4n7n8n7n8n8n8n8l0l0k9l0j6j6N4N5llllmnL8L7k1k1k1
$$ 2139 2121 2062 2002 1973 1945 1987 2029 1989 1949 1951 1996 2010 1953 1895 1838 1780 1722 1664 1606 1576 1546 1517 1487 1471 1455 1509 1564 1561 1558 1555 1552 1548 1543 1581 1618 1597 1576 1555
402A555k0l2l2J1J1O9O9O9O9l9l9l9l9l0l0P0P0K2K3k0k0l8l8NMK0J9k2k3JKKJMLMLL5L6o4
$$ 1555 1535 1503 1471 1482 1493 1562 1631 1700 1769 1730 1691 1652 1613 1583 1553 1623 1693 1715 1738 1718 1698 1660 1622 1627 1631 1651 1670 1648 1625 1626 1628 1630 1631 1635 1638 1642 1645 1680 1716 1652
397A652o4PPn9n8KQ7Q7KMNM2M2OOn9o0o1K4P5P6n3n2M1M1M2m2m3M2M6M6RQoopoK2K1K2K1K3
$$ 1652 1588 1595 1602 1543 1485 1487 1574 1661 1663 1667 1672 1714 1756 1762 1768 1709 1649 1588 1612 1687 1763 1710 1658 1699 1740 1782 1740 1697 1739 1785 1831 1840 1848 1842 1836 1829 1823 1845 1866 1888 1909 1932
392A932K4k0j9rrp9q0J0J1J1J0k8k9k8k9k6k6k5k6J4J3N7N6K2K2K1K2J1J0J1J1j0j0rj0m5
$$ 1932 1956 1936 1917 1908 1899 1820 1740 1750 1761 1772 1782 1754 1725 1697 1668 1642 1616 1591 1565 1579 1592 1649 1705 1727 1749 1770 1792 1803 1813 1824 1835 1825 1815 1806 1796 1751
387A751m4K6K6J6J5J6J5k7k7M4M4K0K0k2k3j6j6K7K7LMM1M0N5l1n3n4k5k4M1M1J3p2p2J2L6
$$ 1751 1707 1733 1759 1775 1790 1806 1821 1794 1767 1811 1855 1875 1895 1873 1850 1834 1818 1845 1872 1875 1879 1920 1960 2015 1984 1931 1877 1852 1828 1869 1910 1923 1851 1779 1791 1827
383A827L6l0k9M7M8M8M7m1m2N7N8N3N3j8j7jjjjl3l3J0J0l6l6NMQl5k1O4P7qk1K1J0J0J3J3
$$ 1827 1863 1833 1804 1851 1899 1947 1994 1953 1911 1968 2026 2079 2132 2114 2097 2096 2095 2094 2093 2060 2027 2037 2047 2011 1975 1980 1984 1992 1957 1936 2000 2077 2069 2048 2069 2079 2089 2102 2115
378B115K8K7K8K8L4L3L4L4L5L6ppP4P4MLL8L8L8L8P9P9L7L7L2L1j1j1l6l6l6l6K1K2k1k1k0
$$ 2115 2143 2170 2198 2226 2260 2293 2327 2361 2396 2432 2425 2418 2492 2566 2570 2573 2611 2649 2687 2725 2804 2883 2920 2957 2989 3020 3009 2998 2962 2926 2890 2854 2875 2897 2876 2855 2835
373B835k0N1N1L5L5pqK5K5O8O7J6J6Q7Q7J56J56J13J14N9O0J62K47J87J02J25J69J36N1L4
$$ 2835 2815 2866 2917 2952 2987 2980 2972 2997 3022 3090 3157 3173 3189 3276 3363 3519 3675 3788 3902 3961 4021 4183 4430 4617 4719 4844 5013 5149 5200 5234
370E234L3Q4J27K07K93L78L36K23J38L8m6j37j78j70j70j73j72j01j01n8n9q8q9m6m6k8k9
$$ 5234 5267 5351 5478 5685 5978 6356 6692 6915 7053 7091 7045 6908 6730 6560 6390 6217 6045 5944 5843 5785 5726 5638 5549 5503 5457 5429 5400
366E400k8k9N2N3p6p5n1n0M9M8l1l2O7O8J34J34J35J34K96K95K96K95J66J66j8j9o2o2l0J40
$$ 5400 5372 5343 5395 5448 5372 5297 5246 5196 5245 5293 5262 5230 5297 5365 5499 5633 5768 5902 6198 6493 6789 7084 7250 7416 7398 7379 7317 7255 7225 7365
363G365K36K35K89K88N12N12M78L93L05J34k54n37o65o65o49n64m87l18k52k52j47j48p6p7
$$ 7365 7601 7836 8125 8413 8925 9437 9915 10308 10613 10747 10493 9956 9291 8626 7977 7413 6926 6608 6356 6104 5957 5809 5733 5656
360E656J7J7q2q2J9K0K0J9j08j07o6o5lkm5m5K8K7m3m3ooR3R4J31J30O0O1l0k9M1M1M1M1M0
$$ 5656 5673 5690 5608 5526 5545 5565 5585 5604 5496 5389 5323 5258 5255 5253 5208 5163 5191 5218 5175 5132 5126 5120 5213 5307 5438 5568 5628 5689 5659 5630 5671 5712 5753 5794 5834
356E834M1J31J32K31K31J47J47J05J05j19j19j61j62k28k29j86j86r9r8n6n6J8J8J9J8L0K9
$$ 5834 5875 6006 6138 6369 6600 6747 6894 6999 7104 6985 6866 6705 6543 6315 6086 5900 5714 5615 5517 5461 5405 5423 5441 5460 5478 5508 5537
352E537j2j3j06j06o3o3q1q2q2q1M0M0kkk0k1N0N0L1L0j2j2K4K3p6p6llm6m5j8j7j8j7rj0
$$ 5537 5525 5512 5406 5300 5237 5174 5093 5011 4929 4848 4888 4928 4926 4924 4904 4883 4933 4983 5014 5044 5032 5020 5044 5067 4991 4915 4912 4909 4863 4818 4800 4783 4765 4748 4739 4729
348D729rrr1r1k0k0O0O1J8J9k7k7k7k7m8m7j42j41j00j4Pl6l8Ok1k2k8k8o6o5m7L8L3L3j2
$$ 4729 4720 4711 4620 4529 4509 4489 4549 4610 4628 4647 4620 4593 4566 4539 4491 4444 4302 4161 4061 4047 4054 4018 3980 3986 3965 3943 3915 3887 3821 3756 3709 3747 3780 3813 3801
344C801j2L0L1j8j9j8j8J%r4j37r0N1N5q8j96j12j2j2j47j47r5j1l6l7l2l2k1k2k1k2m3m4
$$ 3801 3789 3819 3850 3832 3813 3795 3777 3778 3778 3684 3547 3457 3508 3563 3475 3279 3167 3155 3143 2996 2849 2754 2743 2707 2670 2638 2606 2585 2563 2542 2520 2477 2433
340B433m3m4n9n8j7j6MLM6M6KKKKM4M4M3M4m6m7m9m9rn2l8M7M5m0q1l9K8K7m0m1P5P5MMo3
$$ 2433 2390 2346 2287 2229 2212 2196 2200 2203 2249 2295 2297 2299 2301 2303 2347 2391 2434 2478 2432 2385 2336 2287 2278 2226 2188 2235 2280 2240 2159 2120 2148 2175 2135 2094 2169 2244 2248 2252 2189
335B189o3q4q5L0L0P3P3LLm0l9P4P4n4n4k9l0rqQRj3j3p7p7poj0j1J1J1pqppk0k0k1k0O4O4
$$ 2189 2126 2042 1957 1987 2017 2090 2163 2166 2169 2129 2090 2164 2238 2184 2130 2101 2071 2062 2054 2062 2071 2058 2045 1968 1891 1884 1878 1868 1857 1868 1879 1872 1864 1857 1850 1830 1810 1789 1769 1833 1897
330A897O5O4p7p6l3l4p5p6l2l3O6O6nnqrL5L4J02J03L2L1L8L7J6J6r1r2k1k2j03j04o2o1n1
$$ 1897 1962 2026 1949 1873 1840 1806 1731 1655 1623 1590 1656 1722 1717 1712 1704 1695 1730 1764 1866 1969 2001 2032 2070 2107 2123 2139 2048 1956 1935 1913 1810 1706 1644 1583 1532
325A532n1n1n1j0rj0rL1L1L1L1KLr7r7K0K1R1R1n4n3n3n4N7N6J4J4j8j8j8j8J0J0l3l3KKK
$$ 1532 1481 1430 1379 1369 1360 1350 1341 1372 1403 1434 1465 1467 1470 1373 1276 1296 1317 1408 1499 1445 1392 1339 1285 1342 1398 1412 1426 1408 1390 1372 1354 1364 1374 1341 1308 1310 1312 1314
321A314JK6K6K5K6rrqrL2L3j0j0l6l6j4j5k8k7opj5j6j5j6rrJ7J7j6O9J12K7o5o4k8k7l1l1
$$ 1314 1315 1341 1367 1392 1418 1409 1400 1392 1383 1415 1448 1438 1428 1392 1356 1342 1327 1299 1272 1266 1259 1244 1228 1213 1197 1188 1179 1196 1213 1197 1266 1378 1405 1340 1276 1248 1221 1190 1159
316A159J1J2k8k8J4J5pppoj6j6j6j6OPOOL4L4rqL0L0l5l5qP8P8qLKk1j05j25m0L5L4m1m2L0
$$ 1159 1170 1182 1154 1126 1140 1155 1148 1141 1134 1128 1112 1096 1080 1064 1070 1077 1083 1089 1123 1157 1148 1140 1170 1200 1165 1130 1122 1200 1278 1270 1273 1275 1254 1149 1024 984 1019 1053 1012 970 1000
311A000K9J0J0N2N3j7j7NMk2k1jjK6K6M6M7L2L2l9l9o7o7MLM1M1l0l0p0o9KKLLM6M5N3N3j9
$$ 1000 1029 1039 1049 1101 1154 1137 1120 1125 1129 1107 1086 1085 1084 1110 1136 1182 1229 1261 1293 1254 1215 1148 1081 1085 1088 1129 1170 1140 1110 1040 971 973 975 978 981 1027 1072 1125 1178 1159
306A159j8k7k7J4N7M6m0q3m1K3K3NNRRj2j3J4J4n7n7k3k4M7M7L0L0m1m1l4l4RRj2j1n4n4N8
$$ 1159 1141 1114 1087 1101 1158 1204 1164 1081 1040 1063 1086 1091 1096 1105 1114 1102 1089 1103 1117 1060 1003 980 956 1003 1050 1080 1110 1069 1028 994 960 969 978 966 955 901 847 905
302I05N8J5J6k0j9JKj6j7N5N4l1l1L9M0l0k9J4J3k0j9KK%J%JK4K4j8j8j9j9N1N2onm9m8k5
$$ 905 963 978 994 974 955 956 958 942 925 980 1034 1003 972 1011 1051 1021 992 1006 1019 999 980 982 984 984 985 985 986 1010 1034 1016 998 979 960 1011 1063 1057 1052 1003 955 930
297I30k6M6M5M6M6k6k5q8q9j7j7M9N0M9N0J1J2l1l2j09j10J7J8O9P0l1l0j2j3K9L0N3N3J0
$$ 930 904 950 995 1041 1087 1061 1036 948 859 842 825 874 924 973 1023 1034 1046 1015 983 874 764 781 799 868 938 907 877 865 852 881 911 964 1017 1027
292A027J0J4J4k9k9o5o5OOJ2J2J2J2M5M6M6M5p7p7ooQQQQK9K8p1p1o1o0L9L9LMMLj4j4K8K9
$$ 1027 1037 1051 1065 1036 1007 942 877 883 889 901 913 925 937 982 1028 1074 1119 1042 965 959 953 961 969 977 985 1014 1042 971 900 839 779 818 857 860 864 868 871 857 843 871 900
287I00j7j8j7j8K4K5K4K4j0j1j0j0m3m2m2m2M1M2M1M2M2M2k8k9J4J4J3J4mmmmm8m9K3K3M2
$$ 900 883 865 848 830 854 879 903 927 917 906 896 886 843 801 759 717 758 800 841 883 925 967 939 910 924 938 951 965 961 957 953 949 901 852 875 898 940
283I40M1k9k9K2K2M3M3K6K7K7K6o8o9o8o9K1K0K0K0j7j7j8j7%J%JQRQQjkk3k3J2J2N5N5m8
$$ 940 981 952 923 945 967 1010 1053 1079 1106 1133 1159 1091 1022 954 885 906 926 946 966 949 932 914 897 897 898 898 899 907 916 924 932 931 929 906 883 895 907 962 1017 969
278I69m8m7m8mlm7m6m0m0Q7Q8N2N2m7m7JJk0k0RRl3l4M7M7M7M7MNl7l8L8L8l3l3rrJ3J2PO
$$ 969 921 874 826 822 819 772 726 686 646 733 821 873 925 878 831 832 833 813 793 802 811 778 744 791 838 885 932 936 941 904 866 904 942 909 876 867 858 871 883 890 896
273H96o1o2K5O7K3o3l9M%m1k5J8L3L4M3M2%%K7K6j6n7o9J6L3j0o2o2k3k2K1K1O4O4J0J0J0
$$ 896 835 773 798 865 888 825 786 790 790 749 724 742 775 809 852 894 894 894 921 947 931 874 805 821 854 844 782 720 697 675 696 717 781 845 855 865 875
269H75J0k9k8J3J4%%%%M8M7m6m6j0P5P6j0m2m2m2m1m2M2N9J6p0j13p2J4K8j4j1L1L3rm6lQ3
$$ 875 885 856 828 841 855 855 855 855 855 903 950 904 858 848 923 999 989 947 905 863 822 780 822 881 897 827 714 642 656 684 670 659 690 723 714 668 665 748
264G48J26L0n5l4N2M8l6q7m4K5O7L1n4m6m6j8j8nL8O8j7o2j9Q4Q3j6j02o1K5O5K4MMKKL7L8
$$ 748 874 904 849 815 867 915 879 792 748 773 840 871 817 771 725 707 689 684 722 790 773 711 692 776 859 843 741 680 705 770 794 798 802 804 806 843 881
259H81L8L8qqrqJ1J1n9o0KLj1n4lQ2L7m8p8p8j2j3N3N2N2N2NMl5l6rL4N2j8m2%P2P1k1k1k1
$$ 881 919 957 949 941 932 924 935 946 887 827 829 832 821 767 764 846 883 835 757 679 667 654 707 759 811 863 868 872 837 801 792 826 878 860 818 818 890 961 940 919 898
254H98k0m0m0m0m0J6J6k7k6JKMMlM0N5j5p5p6J9K0L3L3L4L3j1j1K9K8j1n4k9M1L7nm7lK5j7
$$ 898 878 838 798 758 718 734 750 723 697 698 700 704 708 705 745 800 785 710 634 653 673 706 739 773 806 795 784 813 841 830 776 747 788 825 820 773 770 795 778
250G78o1o1M0M0lkj1j0qqPM9K6m5o0j8K5K5K8K7P0%p9l6L6P9K6j7n9n9mL9N5j7o6o7K8K7n
$$ 778 717 656 696 736 733 731 720 710 702 694 701 750 776 731 671 653 678 703 731 758 828 828 749 713 749 828 854 837 778 719 715 754 809 792 726 659 687 714 709
245G09oL7L7OPOPM0M1n9n9m1m1l6l7M1J11Q8j2n3j0L0j2o7NQ7Q7k7p0j7N4Pl5opk0k0N1N1
$$ 709 703 740 777 783 790 796 803 843 884 825 766 725 684 648 611 652 763 851 839 786 776 806 794 727 732 819 906 879 809 792 846 853 818 812 805 785 765 816 867
240H67K2K2K2K2k1k1k1k1N3N3l1j01j04l3K2K2l6l7OOpqppK9L0L0L0%%L8L9k2r3p7l5j0j1
$$ 867 889 911 933 955 934 913 892 871 924 977 946 845 741 708 730 752 716 679 685 691 684 676 669 662 691 721 751 781 781 781 819 858 836 743 666 631 621 610
235F10L4L4%%%jK4K3K3K3l9l8K7K8mp5l6L4L7l4l4L7N5j6l8NO3O3K3K3K0K0J5J6Mo6r2n1K4
$$ 610 644 678 678 678 678 677 701 724 747 770 731 693 720 748 744 669 633 667 704 670 636 673 728 712 674 679 742 805 828 851 871 891 906 922 926 860 768 717 741
231G41K4K7K7M8M8NNk9l0k9l0MMMMONl7l8k6k7J6J6J2J3J2J3k0j9k0j9L1L2J7k5m1L1J10J10
$$ 741 765 792 819 867 915 920 925 896 866 837 807 811 815 819 823 829 834 797 759 733 706 722 738 750 763 775 788 768 749 729 710 741 773 790 765 724 755 865 975
226I75N9k6m9n0l0l1J2J2j4j4j4j4p8p7l4l5L0L1j3j2ppL6L5j8j9K2K1nm8l4N0O0k6k5O0Q3
$$ 975 1034 1008 959 909 879 848 860 872 858 844 830 816 738 661 627 592 622 653 640 628 621 614 650 685 667 648 670 691 686 638 604 654 714 688 663 723 806
221H06jj8K5K7j6j6K6J6k7o7k4J1J1J4J4M4M5k6k6J8J8q1q0q0q1rrJ5J5J5J5j3j2j3j3L9L8
$$ 806 805 787 812 839 823 807 833 849 822 755 731 742 753 767 781 825 870 844 818 836 854 773 693 613 532 523 514 529 544 559 574 561 549 536 523 562 600
217F00RN2Q8Lm6m6K6K7L9Q2Q1nj06o3P2P1q1q2J8J7k2k2K0O3K1o4rP6P0j4j0j1K7K7NMm1j27
$$ 600 609 661 749 752 706 660 686 713 752 834 915 910 804 741 813 884 803 721 739 756 734 712 732 795 816 752 743 819 889 875 865 854 881 908 913 917 876 749
212G49p6RN0PoprrNMM7M7K0K0n2n1k0k0K3K2onooononJ7J8m9m8O0J45P7o4q8q7k5k6POl6l6
$$ 749 673 682 732 739 733 726 717 708 713 717 764 811 831 851 799 748 728 708 731 753 747 742 736 730 724 719 713 708 725 743 694 646 706 851 928 864 776 689 664 638 645 651 615 579
207E79J0J1J0J0J5J4O3k2p5p5K8J14K6K7K6K7%q5j08j08J3J3J2J3L3L2j0j0j2j2j2j3J%%%
$$ 579 589 600 610 620 635 649 712 690 615 540 568 682 708 735 761 788 788 703 595 487 500 513 525 538 571 603 593 583 571 559 547 534 535 535 535 535
202E35K8K7j6j5OPM9N0k0k0n7n7L3J18J19L3m7m8n2n3M3M3M3M3NMMNj7j7n4n4p4J2Q5Q6L9
$$ 535 563 590 574 559 565 572 621 671 651 631 574 517 550 668 787 820 773 725 673 620 663 706 749 792 797 801 805 810 793 776 722 668 594 606 691 777 816
198H16m5o9o9QPM9N0k9k9l0k9M6M5k5k6k3k2J9K0K4K4j9j8k8k7J5J5O5O5q6j29o2Q1R1NMM5
$$ 816 771 702 633 641 648 697 747 718 689 659 630 676 721 696 670 647 625 644 664 688 712 693 675 647 620 635 650 715 780 694 565 503 584 675 680 684 729
193G29M1lk8k9J1J1mmmnpqqqL5L4j2r7p9OM8Nm5m5k4O0N9N9ppmlL9L9k3k3o0o1K0J05J21P8
$$ 729 770 767 739 710 721 732 728 724 720 715 708 700 692 684 719 753 741 644 565 571 619 624 579 534 510 570 629 688 681 674 670 667 706 745 722 699 639 578 598 703 824 902
188I02L3rl1l1m2m3m2m2J1J1l2l2J2J1J1J2rrO2O1K1K1k2k2pppoj0rm7m6k3O2Q2L8k1k2k4
$$ 902 935 926 895 864 822 779 737 695 706 717 685 653 665 676 687 699 690 681 743 804 825 846 824 802 795 788 781 775 765 756 709 663 640 702 784 822 801 779 755
183G55k4J4J3k9l0j5j6j5j6J7J6J7J6K0K0O2O2p8p9l6l6M9M9k0j9K0O3M7l8o9k7j3j4K2K2
$$ 755 731 745 758 729 699 684 668 653 637 654 670 687 703 723 743 805 867 789 710 674 638 687 736 716 697 717 780 827 789 720 693 680 666 688 710
179G10K2K2m1m1N3N2L1n4j01j00k6O0Q3Q3J%M3M3k2k2k2k3m0m1L0L0L8L7n6n6o2K3M7M6o0
$$ 710 732 754 713 672 725 777 808 754 653 553 527 587 670 753 754 754 797 840 818 796 774 751 711 670 700 730 768 805 749 693 631 654 701 747 687
175F87o0J0J1J4J4J4J4N1N0N1N0K2K2k0k1j03j04K5K4qqL5J20P5o7j32j33rP6K8K8L9L9M4
$$ 687 627 637 648 662 676 690 704 755 805 856 906 928 950 930 909 806 702 727 751 743 735 770 890 965 898 766 633 624 700 728 756 795 834 878
171H78m1o3o4L0L0j6j6j6j6n4n4j2j2k4k4M6M7N4N3J1J2k9k8J4J4P1P0n8n7j4j3j3j4m8m8
$$ 878 837 774 710 740 770 754 738 722 706 652 598 586 574 550 526 572 619 673 726 737 749 720 692 706 720 791 861 803 746 732 719 706 692 644 596
166E96N2N1K4K4j9j8L6L6l4l5m1m1JKQ6Q7R5m6j10j10QRN2N2RJ0j7j6j6j6n9n9O9O9J4J5J4
$$ 596 648 699 723 747 728 710 746 782 748 713 672 631 632 634 720 807 902 856 746 636 644 653 705 757 766 776 759 743 727 711 652 593 662 731 745 760 774
162G74J4k4k5k5k4k9k9P0P0M6M7k5k4n1n0qqmmmmL6L6L7L6J4J4J4J5m8m8nnklm5m5k5k5J8
$$ 774 788 764 739 714 690 661 632 702 772 818 865 840 816 765 715 707 699 695 691 687 683 719 755 792 828 842 856 870 885 837 789 784 779 777 774 729 684 659 634 652
157F52J7RRQRK7K8K7K8m0m0LKrrL4L3klm5m6K0J9J9K0j5j5j6j5NMMNK8K9K8K8j01j01jkK2
$$ 652 669 678 687 695 704 731 759 786 814 774 734 737 739 730 721 755 788 786 783 738 692 712 731 750 770 755 740 724 709 714 718 722 727 755 784 812 840 739 638 637 635 657
152F57K2k0k1m6m5N3J38Q9n3q7jK1K1m5m5l1l0J2J2QQN0N0j6j7K5K6Q3Q3J2J3k5k4o7o6rj0
$$ 657 679 659 638 592 547 600 738 827 774 687 686 707 728 683 638 607 577 589 601 609 617 667 717 701 684 709 735 818 901 913 926 901 877 810 744 735 725
147G25rrl4l4L7L7j7j7j7j7PPl6l5J02J02L1L1l9l9q1q2M6M6M6M6ONNNq7q7M0M1L6L6l5l5
$$ 725 716 707 673 639 676 713 696 679 662 645 652 659 623 588 690 792 823 854 815 776 695 613 659 705 751 797 803 808 813 818 731 644 684 725 761 797 762 727
143G27K3K2m8m8l1l1J2J2M1M1l0l0J2J3J2J3K8K8K8K7l2l2O7O7M6M7k4k4p0o9p0o9RQl4l3
$$ 727 750 772 724 676 645 614 626 638 679 720 690 660 672 685 697 710 738 766 794 821 789 757 824 891 937 984 960 936 866 797 727 658 667 675 641 608
138F08L9L8L9L9J4J3N6N7k9k8p0p1K8K8j5j5m8m9K3K2M3M4k7k8n0n1K0K1J7J7k6k6M0M0n9
$$ 608 647 685 724 763 777 790 846 903 874 846 776 705 733 761 746 731 683 634 657 679 722 766 739 711 661 610 630 651 668 685 659 633 673 713 654
134F54o0J9J9J18J18J7J7k5k6k5k5M6M6rj0n1n2N6N6j5j5l3l4l3l4K2K2k1k1l2l2R5R6KLm0
$$ 654 594 613 632 750 868 885 902 877 851 826 801 847 893 884 874 823 771 827 883 868 853 820 786 753 719 741 763 742 721 689 657 752 848 850 853 813
130H13m0M0M1kkkkjkl6l7l6l6MMMMJKJKK8K9j4j4llL9L9j9k0j9k0J8J8k5k5nmmnOOl6l6j6
$$ 813 773 813 854 852 850 848 846 845 843 807 770 734 698 702 706 710 714 715 717 718 720 748 777 763 749 746 743 782 821 802 782 763 743 761 779 754 729 724 720 716 711 717 723 687 651 635
124F35j5j6j5J4J4Q4Q5J8J8k4k5%jj%N5N4j6j6j2j3n5n5K3K2K3K3k9k9k8k9qqn1n0J7J7J7
$$ 635 620 604 589 603 617 701 786 804 822 798 773 773 772 771 771 826 880 864 848 836 823 768 713 736 758 781 804 775 746 718 689 681 673 622 572 589 606 623
119F23J7Q0Q1L8L8n6n7J4J4n4n5j2j3O8O7l1l2l9l9L2L2K5K5K5K5k6k7k6k7rrL4L4OPn9n9
$$ 623 640 720 801 839 877 821 764 778 792 738 683 671 658 726 793 762 730 691 652 684 716 741 766 791 816 790 763 737 710 701 692 726 760 766 773 714 655
115F55k1O5N8N9K9K9K9K9m7m8m7m7M5M5k6k6l3l2l2l2L3L3L4L3j8j8N1N0m7r0k0O6O2k2l6
$$ 655 634 699 757 816 845 874 903 932 885 837 790 743 788 833 807 781 748 716 684 652 685 718 752 785 767 749 800 850 803 713 693 759 821 799 763
111G63PK9K9L2L1j3j3K5K4j2r8j01j5L9l%M2O4K1k1K1O3J9j04j05l2N3R9R9L7m7p0p1k7k8
$$ 763 770 799 828 860 891 878 865 890 914 902 804 703 688 727 724 724 766 830 851 830 851 914 933 829 724 692 745 844 943 980 933 863 792 765 737
106G37k8k8M5M4n0n0oQ0R8N5ppn3n3n3n4j1j1kjM1M1M5M4M5M5k6k7j3L0K8n8j25q2L0J15K4
$$ 737 709 681 726 770 720 670 664 744 842 897 890 883 830 777 724 670 659 648 646 645 686 727 772 816 861 906 880 853 840 870 898 840 715 633 663 778 802
102H02o1n3L2J23L8n8j01o0K6kll9m0POPOK0K0K0K0K0K0K0K0k2k3k3k2N1N2RRQPl6l6J1J1
$$ 802 741 688 720 843 881 823 722 662 688 686 683 644 604 611 617 624 630 650 670 690 710 730 750 770 790 768 745 722 700 751 803 812 821 829 836 800 764 775 786
97G86J0J1j0rrj0P7P6l1j03m2Q4R1K1m3m3nmJ1J1J1J1j6j5j6j5m8m9onO6O6K3K4n9o0J2J2
$$ 786 796 807 797 788 779 769 846 922 891 788 746 830 921 942 899 856 851 847 858 869 880 891 875 860 844 829 781 732 726 721 787 853 876 900 841 781 793 805
92H05K2K3k1k0J3J2l0l0j3j2N8N9K0K0k2k2j5j6K8K7n1n2qrJ3J4J3J4j2j2n4n5K3K3K3K3k
$$ 805 827 850 829 809 822 834 804 774 761 749 807 866 886 906 884 862 847 831 859 886 835 783 775 766 779 793 806 820 808 796 742 687 710 733 756 779 777
88G77kkkN2N1j9o3j2N9N5j5p7p7j0j1K2K1K2K1L9L8k7k8l6M8P1P1j8j8o1o0j1j0j0j0K6K6
$$ 777 775 773 771 823 874 855 792 780 839 894 879 802 725 715 704 726 747 769 790 829 867 840 812 776 824 895 966 948 930 869 809 798 788 778 768 794 820
83H20K6K6l8l9l6l6M7Q9M5m0r8n5pqjQ4Q4jo1o1L3L2K8K7K8K7k2k1M9M9J0RMNpr3o8k6J7J7
$$ 820 846 872 834 795 759 723 770 859 904 864 766 711 704 696 695 779 863 862 801 740 773 805 833 860 888 915 893 872 921 970 980 989 993 998 991 898 830 804 821 838
78H38J9K0LLl9l9rrrrllo9o8k0O6J08K2l0l0L5L5OOONJ7J7N9N9J1J0J1J0m6m7m6m7K1K1K0
$$ 838 857 877 880 883 844 805 796 787 778 769 766 763 694 626 606 672 780 802 772 742 777 812 818 824 830 835 852 869 928 987 998 1008 1019 1029 983 936 890 843 864 885 905
73I05K1k6k6k5k6OOQRNM8P2j3q2q2j0P4K8j5J4J4J0J0N1R4L8m6r2m8QQJ0J1j4j5k2O3O1J8
$$ 905 926 900 874 849 823 829 835 843 852 857 905 977 964 882 800 790 864 892 877 891 905 915 925 976 1070 1108 1062 970 922 930 938 948 959 945 930 908 971 1032 1050
69A050k3k3L8L7l3l4kkj6n8n7K8P1P1O5k0j4j5%J%JmmL8L9K1K1k2k1J8J9J8J8M4M4k6k7n0
$$ 1050 1027 1004 1042 1079 1046 1012 1010 1008 992 934 877 905 976 1047 1112 1092 1078 1063 1063 1064 1064 1065 1061 1057 1095 1134 1155 1176 1154 1133 1151 1170 1188 1206 1250 1294 1268 1241 1191
64A191n0n0n0M6M5KLL8L8L8L8K0K0p9p9J2J1km4K7J13P6o6j30m4N5N5K8K8J0p4p9OOp9q3L
$$ 1191 1141 1091 1041 1087 1132 1134 1137 1175 1213 1251 1289 1309 1329 1250 1171 1183 1194 1192 1148 1175 1288 1364 1298 1168 1124 1179 1234 1262 1290 1300 1226 1147 1153 1159 1080 997 1000
59A000J33J33K8K7K4K5%m2k6N9R7N5J3J3j9j9K4K4P4P5LMn0n0m7m7M6Q9P0j5J4J5RRL1L2m0
$$ 1000 1133 1266 1294 1321 1345 1370 1370 1328 1302 1361 1458 1513 1526 1539 1520 1501 1525 1549 1623 1698 1701 1705 1655 1605 1558 1511 1557 1646 1716 1701 1715 1730 1739 1748 1779 1811 1771
55A771m0o8o8k2k3N1R3P5j1n5n6RJ0j1j2N9O0Q5Q5L3n1l5l6N9N8O8O7J10J11j2j3L1L0M8M7
$$ 1771 1731 1663 1595 1573 1550 1601 1694 1769 1758 1703 1647 1656 1666 1655 1643 1702 1762 1847 1932 1965 1914 1879 1843 1902 1960 2028 2095 2205 2316 2304 2291 2322 2352 2400 2447
51B447n2n2p2p1K8K8l1l0J2J3M1M2L6L6l5j20j72j72q2q2q2q2j3j3j2j3K3K4K4K3J9J9K4o2
$$ 2447 2395 2343 2271 2200 2228 2256 2225 2195 2207 2220 2261 2303 2339 2375 2340 2220 2048 1876 1794 1712 1630 1548 1535 1522 1510 1497 1520 1544 1568 1591 1610 1629 1653 1591
46A591p8p9M3M4O9O9O9O9l9l9j6O9J41J40J51J51J80K66L59M44N10N95O15O14M62L21J44n3
$$ 1591 1513 1434 1477 1521 1590 1659 1728 1797 1758 1719 1703 1772 1913 2053 2204 2355 2535 2801 3160 3604 4114 4709 5324 5938 6400 6721 6865 6812
43F812l23n22n73n73n13m29l40k55j72j71j62j61k18j33l0l0q5j70j65q0jQ3J12J11M9M9M3
$$ 6812 6489 5967 5394 4821 4308 3879 3539 3284 3112 2941 2779 2618 2400 2267 2237 2207 2122 1952 1787 1707 1706 1789 1901 2012 2061 2110 2153
40B153M3j1r7r7j1l8l8j4P0N0l5j66j67j14j14m3m3j8j9q9q9p3p4kkJ3J4J3J4J9J9J9K0o8
$$ 2153 2196 2185 2088 1991 1980 1942 1904 1890 1960 2010 1975 1809 1642 1528 1414 1371 1328 1310 1291 1202 1113 1040 966 964 962 975 989 1002 1016 1035 1054 1073 1093 1025
35A025o8m4M0N7N6l7l8o7o8LLm6m7mnJ6J5J5J5j0j1j0j1J2J2J1J2k0k1o3o3L8L8L8L9j7j7
$$ 1025 957 913 953 1010 1066 1029 991 924 856 859 862 816 769 765 760 776 791 806 821 811 800 790 779 791 803 814 826 806 785 722 659 697 735 773 812 795 778
31G78K5K6POPPl1l2l1l2mmmmk0k1k5N9Q6Q6M9M9k8k9k8k8K0J9J7J7l7p9l8M7N4l1p7p7l6l6
$$ 778 803 829 836 842 849 856 825 793 762 730 726 722 718 714 694 673 648 707 793 879 928 977 949 920 892 864 884 903 920 937 900 821 783 830 884 853 776 699 663 627
26F27j6O9J00N7RJ0J1p3p7RP1K9o4o4rP6M9Pj8o0q7kR1R2K2o3n3L3M6Ll8l9L0L0k5k6pP7Q4
$$ 627 611 680 780 837 846 856 867 794 717 726 797 826 762 698 689 765 814 821 803 743 656 654 745 837 859 796 743 776 822 825 787 748 778 808 783 757 750 827 911
21I11jp5p6k5k6J6J7%jM2M2k4k5O6O6Pj34j03j7M4M5M4M5O4k1m4m4kjp3p2K8K7K8K8J8J8k5
$$ 911 910 835 759 734 708 724 741 741 740 782 824 800 775 841 907 914 780 677 660 704 749 793 838 902 881 837 793 791 790 717 645 673 700 728 756 774 792 767
17G67k4M9M8k2k2K6K6K6K5pqqqn3n4J7J7L4L3o6o6J9K0J9J9K4K5K4K4K8K8j5j4n3n2r0q9r4
$$ 767 743 792 840 818 796 822 848 874 899 892 884 876 868 815 761 778 795 829 862 796 730 749 769 788 807 831 856 880 904 932 960 945 931 878 826 736 647 553
12E53qM4M3M1M1J07J07P4j1o2o3rrrqn5n5J5J6K5K5K5K5k6k7J7J6j6j5o3K2O0O0l4l3N6N6
$$ 553 545 589 632 673 714 821 928 1002 991 929 866 857 848 839 831 776 721 736 752 777 802 827 852 826 799 816 832 816 801 738 760 820 880 846 813 869 925
7I25L3n2q4q4J0J0L1L0m0m1k4k5P5P5P1P2k8k8m8m7nnK3K4m7m7l0k9M1M2K8K8j4j4n6n6j4
$$ 925 958 906 822 738 748 758 789 819 779 738 714 689 764 839 910 982 954 926 878 831 826 821 844 868 821 774 744 715 756 798 826 854 840 826 770 714 700
3G00j3M0M0L5L4L2n2p6p6L6L7k9k9mQ0Q0nj6j6K1K1l1l2J2J1K0J9n1n2P4P3K8n8l5N0M5m0
$$ 700 687 727 767 802 836 868 816 740 664 700 737 708 679 675 755 835 830 814 798 819 840 809 777 789 800 820 839 788 736 810 883 911 853 818 868 913 873
-2H73o2o3LLk6k7J5J6OPM4M4L1n4p7p7K0K0K1K0L9M0L9M0p6p6l3l4M5M5LKMMq9r0p4J1R1R1
$$ 873 811 748 751 754 728 701 716 732 738 745 789 833 864 810 733 656 676 696 717 737 776 816 855 895 819 743 710 676 721 766 769 771 775 779 690 600 526 537 628 719
-6G19J00J00J05K0o0o0k2k3o0o0o0n9J1J1J1J1J2J3n2n3L9J25L0n4r4rL2j0o1o1L5L6J8J9
$$ 719 819 919 1024 1044 984 924 902 879 819 759 699 640 651 662 673 684 696 709 657 604 643 768 798 744 650 641 673 663 602 541 576 612 630 649
-11F49J9J9LLJ6N9K7n7n7K8N7J6k6k7k8k8k8k8J1J2J1J1P8P8k2k1%j%%K9K8K8K9m7m6mmjj
$$ 649 668 687 690 693 709 768 795 738 681 709 766 782 756 729 701 673 645 617 628 640 651 662 740 818 796 775 775 774 774 774 803 831 859 888 841 795 791 787 786 785
-16G85m3m4L5L5P8P8l9l8l8l9l8l8QR3R3Ql8l8J2J3J2J3rrn1n1J4J4J4J4l5l5p8p7K7K8j6
$$ 785 742 698 733 768 846 924 885 847 809 770 732 694 702 795 888 896 858 820 832 845 857 870 861 852 801 750 764 778 792 806 771 736 658 581 608 636 620
-20F20j5m0m0L0L1O0O0l9m0O1O1j0j0nnnnj3j4j1j1J5N8J7o9p1J4O0O0KKJKk4k4M7M7L4L5
$$ 620 605 565 525 555 586 646 706 667 627 688 749 739 729 724 719 714 709 696 682 671 660 675 733 750 681 610 624 684 744 746 748 749 751 727 703 750 797 831 866
-25H66qql4l4l4l4o0o0M0L9j1j1L1L1K0J9k3k3MMM7M7k0k0k0k0j7j7j7j7NNNNM6M7MMmnmn
$$ 866 858 850 816 782 748 714 654 594 634 673 662 651 682 713 733 752 729 706 710 714 761 808 788 768 748 728 711 694 677 660 665 670 675 680 726 773 777 781 777 772 768 763
-30G63L0K9K9K9M0M0lkq8q7J1J2k2k1k2k1J9K0J9J9K7K6m4m5m4m5K7K6J4J4J4J4K1K1K1K1
$$ 763 793 822 851 880 920 960 957 955 867 780 791 803 781 760 738 717 736 756 775 794 821 847 803 758 714 669 696 722 736 750 764 778 799 820 841 862
-34H62l5l6OPm2m3m2m2J6J6J5J6N7N8J4J5klklK4K4K4K4o3o4PPk0k0K2K3rqn0n1kkM1M0J4
$$ 862 827 791 797 804 762 719 677 635 651 667 682 698 755 813 827 842 840 837 835 832 856 880 904 928 865 801 808 815 795 775 797 820 811 803 753 702 700 698 739 779 793
-39G93J4J4J4rqn1n1K8K7j5j5OOOOj0j0rj0K3K4m7m7K7K7j9j04n8K7R3Ql2l2Q4Q5M5m0o3o3
$$ 793 807 821 835 826 818 767 716 744 771 756 741 747 753 759 765 755 745 736 726 749 773 726 679 706 733 714 610 552 579 672 680 648 616 700 785 830 790 727 664
-44F64K0J9J9K0j0j0j0rK5K6K5K6k8k7L8L8n5j41j01M0P1P0m8m9j1j1O0O0K8K8j5j4K1K1O4
$$ 664 684 703 722 742 732 722 712 703 728 754 779 805 777 750 788 826 771 630 529 569 640 710 662 613 602 591 651 711 739 767 752 738 759 780 844
-48H44O3ONo6o6l2l2J1J0K2K1K1K1o2o3o2o2K6K6K6K7J5J5J5J5J0J0l3l2o1o0j8j8k1k1J02
$$ 844 907 913 918 852 786 754 722 733 743 765 786 807 828 766 703 641 579 605 631 657 684 699 714 729 744 754 764 731 699 638 578 560 542 521 500 602
-53F02J02M4m1PPLLo7o8J3J3J3J3J11J12L1n3k1k0n9n9n8Q4J24L8o1o1N5N6J4p1o5o6L4L4
$$ 602 704 748 707 714 721 724 727 660 592 605 618 631 644 755 867 898 845 824 804 745 686 628 712 836 874 813 752 807 863 877 806 741 675 709 743
-57G43L4L4m1m1JJj1j2N9N9M2M1k9k9n7n6J4J5MNNMj0j1K6K7M8l6q3q3j9O6O0O1J3J2l0l0
$$ 743 777 811 770 729 730 731 720 708 767 826 868 909 880 851 794 738 752 767 771 776 781 785 775 764 790 817 865 829 746 663 644 710 770 831 844 856 826 796
-62G96l8l9O1O1L9L9j2r7q7q8Q6Q6L7m8m8L7J8J7k0k0ONl7l6J6J7N9O0LMl9l9J5J4J0RM4m2
$$ 796 758 719 780 841 880 919 907 810 723 635 721 807 844 796 748 785 803 820 800 780 786 791 754 718 734 751 810 870 873 877 838 799 814 828 838 847 891 849
-66H49q8q8rP7P7rLKllm1m1KKj8j7j8j7rqN8N7J8o7o8J8M5M5N0N1KLm0m0n2n1rrK2K2K2K2
$$ 849 761 673 664 741 818 809 812 814 811 808 767 726 728 730 712 695 677 660 651 643 701 758 776 709 641 659 704 749 799 850 852 855 815 775 723 672 663 654 676 698 720 742
-72G42jkm3m4PQP8P9K1K1J6J6J9o7j37n2L7L7n2n1l9M5O9O9J8J7n4n3M9M9k5j10n6K9J8J9
$$ 742 741 739 696 652 659 667 745 824 845 866 882 898 917 850 713 661 698 735 683 632 593 638 707 776 794 811 757 704 753 802 777 667 611 640 658 677
-76F77n2n3J9J8M4M3k8k8jjMMJ7J03J02J7m9m9n5n4jjP0P0L3L4q9q8r0mM7M7K8K8K7K8rj0
$$ 677 625 572 591 609 653 696 668 640 639 638 642 646 663 766 868 885 836 787 732 678 677 676 746 816 849 883 794 706 616 612 659 706 734 762 789 817 808 798
-81G98j0rj0rj0rLLLLl4l4L6L7MLM6M6J6J6J6J6l4l4l4l5J3J3J3J3p1p0MQ9J32M8n6n5k4k4
$$ 798 788 779 769 760 750 741 744 747 750 753 719 685 721 758 762 765 811 857 873 889 905 921 887 853 819 784 797 810 823 836 765 695 699 788 920 968 912 857 833 809
-85H09J9J9l9m0l9m0JJ%Jm4m3jjP0O9P5j0o4o4JKK7K7K7K7qqpqj0j1j1j0l2l2m2M2N0l6k5
$$ 809 828 847 808 768 729 689 690 691 691 692 648 605 604 603 673 742 817 807 743 679 680 682 709 736 763 790 782 774 767 759 749 738 727 717 685 653 611 653 703 667 642
-90F42k5N9N9J7J7poooO7O7l1l2m0l9LLJ5J4J5J4K4K3O0O0L2n4p7p7KLo8o8NMl3l2rP6P1P1
$$ 642 617 676 735 752 769 762 756 750 744 811 878 847 815 775 736 739 742 757 771 786 800 824 847 907 967 999 945 868 791 793 796 728 660 665 669 636 604 595 671 742 813
-95H13P3P3kq7l9M5Q3lq3q3J0J1LMLLN0N0jq6p9p8M4M4nmnnj9j9N2N2JJm1m1L7L7M2m3p6p6
$$ 813 886 959 957 870 831 876 959 956 873 790 800 811 814 818 821 824 874 924 923 837 758 680 724 768 763 759 754 749 730 711 763 815 816 817 776 735 772 809 851 808 732 656
-101F56K1J06M2m2l2l2oopoM4M3KJj2j1m9m8K8J13O6O5l0k9p2p2k1k1K2K2qqL4L4L0K9m1m1
$$ 656 677 783 825 783 751 719 713 707 700 694 738 781 783 784 772 761 712 664 692 805 871 936 906 877 805 733 712 691 713 735 727 719 753 787 817 846 805 764
-105G64K2K1K2K2n5n5j2j2j5j6j5j6J02J01P9pp2p2M4M5Kq3l6l5K5K4m6m6J8J7J7J8k7k6k0
$$ 764 786 807 829 851 796 741 729 717 702 686 671 655 757 858 937 930 858 786 830 875 877 794 758 723 748 772 726 680 698 715 732 750 723 697 677
-110F77k1%Q5Q5%p3p2l6l5p4p3N4N4RJ0J0RK2K2K2K2J%M3M3ppL1L0j7j02j02j6KLkQ3R7J1
$$ 677 656 656 741 826 826 753 681 645 610 536 463 517 571 580 590 600 609 631 653 675 697 698 698 741 784 777 770 801 831 814 712 610 594 596 599 597 680 777 788
-114G88l4l4rrj4j4rr4r4rJ14J13P7P6J0J1q9q8pqppm7m8N3N2k4k3oP9R9J4l2l3J7J6k3k4
$$ 788 754 720 711 702 688 674 665 571 477 468 582 695 772 848 858 869 780 692 685 677 670 663 616 568 621 673 649 626 620 699 798 812 780 747 764 780 757 733
-119G33K9P1N3l3j05j06l4N1N3J1l2l1LMLLJ9K0J9J9P0P0jkl1l1k9k8M3Q6O7j8jkopn5n5j3
$$ 733 762 833 886 853 748 642 608 659 712 723 691 660 663 667 670 673 692 712 731 750 820 890 889 887 856 825 796 768 811 897 964 946 945 943 937 930 875 820 807
-124H07j2J2J2l0l1LKKLJ4J5J5J4j5j5n3n3k2O2O5j9p4l2L6L5K2k1m5M0O7O7n3n3m0Kj1r7
$$ 807 795 807 819 789 758 761 763 765 768 782 797 812 826 811 796 743 690 668 730 795 776 702 670 706 741 763 742 697 737 804 871 818 765 725 727 716 619
-128F19o2K2R2N0m1m2K7K7onL7L6%%m3m3jjO4O5L6m9o8k5KKNNK1K2k1k1lkp4p3l7l7L3L4M4
$$ 619 557 579 671 721 680 638 665 692 686 681 718 754 754 754 711 668 667 666 730 795 831 782 714 689 691 693 698 703 724 746 725 704 701 699 625 552 515 478 511 545 589
-133E89M4M3M4NNl8l8K3K2K2K3RRRRJ0RJ0RM5M5q3q2k8k9J4J5l0l0M0M1q3q2m1m0M6M5MLK
$$ 589 633 676 720 725 730 692 654 677 699 721 744 753 762 771 780 790 799 809 818 863 908 825 743 715 686 700 715 685 655 695 736 653 571 530 490 536 581 585 588 590
-138E90KLKJ5J5N7N7K3K2K2K2l0l1l1l1L3L3rrk0k0k0k0M3M4%Jp0p0K9L0k0j9k0k0O3O3qq
$$ 590 592 595 597 612 627 684 741 764 786 808 830 800 769 738 707 740 773 764 755 735 715 695 675 718 762 762 763 693 623 652 682 662 643 623 603 666 729 721 713
-143G13n6n6J5J5k7k8M4M3O3O2qrm1m1KJl4l5l4l4K8K9K9K8jkkjL2L2l9l9N6N6m2m3k0k0K3
$$ 713 657 601 616 631 604 576 620 663 726 788 780 771 730 689 691 692 658 623 589 555 583 612 641 669 668 666 664 663 695 727 688 649 705 761 719 676 656 636 659
-148F59K2RQo2o2Q3Q3L3j36j15N5P7P7J4J5k8k8m5m5lkklM0M0L4L3rj0opL6L6J2J1J2J2j0
$$ 659 681 690 698 636 574 657 740 773 637 522 577 654 731 745 760 732 704 659 614 611 609 607 604 644 684 718 751 742 732 726 719 755 791 803 814 826 838 828
-152H28j0j1j0popoq0q0J9J9J9J9J9J9J2J3l0k9K7K8P1P0k1k1o3o4kklkj04j04nnO8O7llK5
$$ 828 818 807 797 790 784 777 771 691 611 630 649 668 687 706 725 737 750 720 691 718 746 817 887 866 845 782 718 716 714 711 709 605 501 496 491 559 626 623 620 645
-157F45K5j8j7j1j1O0O0J1J2J1J1M3M2n6n7rrrrJ4J4N6N6j9j8j9j8M0M0l1l0n3n3J8J8o1o0
$$ 645 670 652 635 624 613 673 733 744 756 767 778 821 863 807 750 741 732 723 714 728 742 798 854 835 817 798 780 820 860 829 799 746 693 711 729 668 608
-162F08j7j8n2n3J9J9%%%%M6M6LM%%J%k0k0N0N1J0J1l2l2K2K2K1K2l0l0R7R8j8j8o0o1K3K2
$$ 608 591 573 521 468 487 506 506 506 506 506 552 598 601 605 605 605 606 606 586 566 616 667 677 688 656 624 646 668 689 711 681 651 748 846 828 810 750 689 712 734
-167G34K2K2j0j0j0j0M1M1l1l0l2l2J0J1k0k0k0k1J5J4N7N7K9K9m3m2k0k0k0k0k8k8M3M3M6
$$ 734 756 778 768 758 748 738 779 820 789 759 727 695 705 716 696 676 656 635 650 664 721 778 807 836 793 751 731 711 691 671 643 615 658 701 747
-171G47M7M6M6q6q7j5j6QPl5l5l0l0l0l1J1J1J0J1P3P4L1L0o2o2o2o2L6L6L7L6J6J5n5n5P
$$ 747 794 840 886 800 713 698 682 690 697 662 627 597 567 537 506 517 528 538 549 622 696 727 757 695 633 571 509 545 581 618 654 670 685 630 575 582
-175E82POPP2P2L0K9k3k3k4k3l2l2J0J0J%J%k3k4J9J9J0J0l3l3ooopL1L1L0L1qqrqjkjjK7
$$ 582 589 595 602 674 746 776 805 782 759 735 712 680 648 658 668 669 669 670 670 647 623 642 661 671 681 648 615 609 603 597 590 621 652 682 713 705 697 688 680 679 677 676 675 702
-181G02K7j5j5l6l5L1L0mr0m8L8J33J34Kq3%%m3m3k3O2J4J4j3j2j3j2j1j1L2L2k5k4J9J8k2
$$ 702 729 714 699 663 628 659 689 685 595 547 585 718 852 854 771 771 771 728 685 662 724 738 752 739 727 714 702 691 680 712 744 719 695 714 732 710
-185G10k1K1K0k0k0o2o3k6k7J6J6J7J7J6J7Q9Q9J8J8n2n2n2n2J9J9J9J9M7M7Kq4m8L7P5j1
$$ 710 689 710 730 710 690 628 565 539 512 528 544 561 578 594 611 700 789 807 825 773 721 669 617 636 655 674 693 740 787 789 705 657 694 769 758
-189G58n1n2M3M3k6k7J7J6NNl7l8j6j5j6j6KKKLOOM8M9j9j9j9j8l3l3J0RM2M2M1M2l7l8ON
$$ 758 707 655 698 741 715 688 705 721 726 731 694 656 640 625 609 593 595 597 599 602 608 614 662 711 692 673 654 636 603 570 580 589 631 673 714 756 719 681 687 692
-194F92L5L4L5L4j7j7j6j7j00j01p7QO1O1K3K3L5L4l2l1p4J1J14J15j0r5n3L3O8O9k6k5j0
$$ 692 727 761 796 830 813 796 780 763 663 562 485 493 554 615 638 661 696 730 698 667 593 604 718 833 823 728 675 708 776 845 819 794 784
-198G84j1j0j0n3n2j0j0k3k4M3M2K5o0j02j8N8N8qpL3L3L3L3K5K5m5m6l9l8MLK9K9j4j4PO
$$ 784 773 763 753 700 648 638 628 605 581 624 666 691 631 529 511 569 627 619 612 645 678 711 744 769 794 749 703 664 626 630 633 662 691 677 663 670 676
-203F76l6l5j9j8N3N3L0L0j2j3JJJJj0j0L3L3MLl9l8qqL4L5j8j9o1o1L6L7J3p1j6j6j5j6m9
$$ 676 640 605 586 568 621 674 704 734 722 709 710 711 712 713 703 693 726 759 763 766 727 689 681 673 707 742 724 705 644 583 619 656 669 598 582 566 551 535 486
-208D86L6P9po2o2O0O0O2O2J9J9o9o9N9N8M2M1j%n4n3n3n3l2l2L9L9kkm4m4OOOOJ17J17O6
$$ 486 522 601 594 532 470 530 590 652 714 733 752 683 614 673 731 773 814 813 813 759 706 653 600 568 536 575 614 612 610 566 522 528 534 540 546 663 780 846
-212H46k0kkL5L5r5r6k4k4K3K2K3K3QQN0N0p8p7ppK3K3j9k0p6p7nok1k0k1k1J0J0N3N2N3N2
$$ 846 826 824 822 857 892 797 701 677 653 676 698 721 744 752 760 810 860 782 705 698 691 714 737 718 698 622 545 540 534 513 493 472 451 461 471 524 576 629 681
-217F81J0J0j0j1j0j1l4l5RQkjM1M1%%m2m2L0L0m1m1M7M7k4k4L5L5L4L5K3K3p6p6n1n1J9K0
$$ 681 691 701 691 680 670 659 625 590 599 607 605 604 645 686 686 686 644 602 632 662 621 580 627 674 650 626 661 696 730 765 788 811 735 659 608 557 576 596
-222E96kkjkL3L2L2L3j1j1n4n3j1j1j1j1L0K9L0L0QQl5l4J1J2o0n9mlmlN2N2N3N2m6m6m6m5
$$ 596 594 592 591 589 622 654 686 719 708 697 643 590 579 568 557 546 576 605 635 665 673 681 646 612 623 635 575 516 512 509 505 502 554 606 659 711 665 619 573 528
-227E28N9O0J7J7l7l6l7l6L2L3P5P5k8k7k8k7m3m2m3m2L9L9L9L9k9k8M2M3OOl6l7K9K8K8K9
$$ 528 587 647 664 681 644 608 571 535 567 600 675 750 722 695 667 640 597 555 512 470 509 548 587 626 597 569 611 654 660 666 630 593 622 650 678 707
-231G07p4p3llJ5J5J5J5p6p6nnmlO8O7nmnnM5M5n5n4M0L9M0L9l0k9l0l0K0K0k2k3J7J6N9N9
$$ 707 633 560 557 554 569 584 599 614 538 462 457 452 448 445 513 580 575 571 566 561 606 651 596 542 582 621 661 700 670 641 611 581 601 621 599 576 593 609 668 727
-236G27k2k2k1k2m4m4m4m3J1J2J2J2j3j2L1L0L1L2L2L1jjm4m4J9K0q1q0j6j6K6K6N7N7j4j5
$$ 727 705 683 662 640 596 552 508 465 476 488 500 512 499 487 518 548 579 611 643 674 673 672 628 584 603 623 542 462 446 430 456 482 539 596 582 567
-240E67NMM7M7k9l0k9l0J3J2N4N5KJo9p0kkkkOOPOk1k1k2k1K8K7j5j5L4L4l7l7k3k3J9K0K0
$$ 567 572 576 623 670 641 611 582 552 565 577 631 686 688 689 620 550 548 546 544 542 548 554 561 567 546 525 503 482 510 537 522 507 541 575 538 501 478 455 474 494 514
-245E14K1n1n0K7K7K8K7P8P7PPl5l5L5L6OPM9M8l4l4l4l4NMNNJ7J7k6k6l9l9MLqpn1n0L0K9
$$ 514 535 484 434 461 488 516 543 621 698 705 712 677 642 677 713 719 726 775 823 789 755 721 687 692 696 701 706 723 740 714 688 649 610 614 617 609 602 551 501 531 560
-250E60L0K9J1J1J1J1m9n0m9n0j2j3j3j3L1L0L1L0L4L4qrJ5J5J6J5ppppQQQQK6K6j7j7QPo3
$$ 560 590 619 630 641 652 663 614 564 515 465 453 440 427 414 445 475 506 536 570 604 596 587 602 617 633 648 641 634 627 620 628 636 644 652 678 704 687 670 678 685 622
-255F22o3k7k6k7k7O7O7K4K5kkkkk8k9J4J4M6M5M5M5K3K3m8m7l7l7NOl9l9MMonm8m8L8L9L9
$$ 622 559 532 506 479 452 519 586 610 635 633 631 629 627 599 570 584 598 644 689 734 779 802 825 777 730 693 656 661 667 628 589 593 597 591 586 538 490 528 567 606
-260F06L9k4k4k3k4J5J6J5J5j9k0j9k0JJ%JN4N4j7j8l0l0J2J2L5L6l6l5m6m6N3N3k7k8J6J5
$$ 606 645 621 597 574 550 565 581 596 611 592 572 553 533 534 535 535 536 590 644 627 609 579 549 561 573 608 644 608 573 527 481 534 587 560 532 548 563
-265E63Q3Q2m5m5n5n5j2j2O3O2qqn0n1n1n1P7P8OPL8L8mnj0rj0j0lmmlk1k0P9P9J5J5J5J6
$$ 563 646 728 683 638 583 528 516 504 567 629 621 613 563 512 461 410 487 565 571 578 616 654 650 645 635 626 616 606 603 599 595 592 571 551 630 709 724 739 754 770
-270G70l0k9k9k9k9k8J4J4N3N4j7j7p7p7K2K2J2J2l1l1J7J8q2q2m3m3N7N6N6N5j6j5ppL6L5
$$ 770 740 711 682 653 624 596 610 624 677 731 714 697 620 543 565 587 599 611 580 549 566 584 502 420 377 334 391 447 503 558 542 527 520 513 549 584
-274E84k8k9M2M2L2L1j1j1m8m9ooM0M0l1l1l6l6R2R2K5K5p4p4JJJJm6m5K6K5j4j4j5j4j8j8
$$ 584 556 527 569 611 643 674 663 652 604 555 549 543 583 623 592 561 525 489 581 673 698 723 649 575 576 577 578 579 533 488 514 539 525 511 496 482 464 446
-279D46N3N2l3l4l4l4L4L3J05J04J3J2J2J3J2J2q7q7J5J5J5J5m7m7nmK4K3K4K4n8n7j6j5L7
$$ 446 499 551 518 484 450 416 450 483 588 692 705 717 729 742 754 766 679 592 607 622 637 652 605 558 553 549 573 596 620 644 586 529 513 498 535
-283E35L6L6L6M9M9n1n0j7j7j6j7p9p8K0K1O1O2O1O2J6J6k6k6o9o8L0L1j5j5j4j5k5k6J7J8
$$ 535 571 607 643 692 741 690 640 623 606 590 573 494 416 436 457 518 580 641 703 719 735 709 683 614 546 576 607 592 577 563 548 523 497 514 532
-287E32ppopOOOOn1n1P7P7J5J5k7k8NOM8M8n6n6n6n5J4J4J4J4L8L7L7L7M1M2q6q7k6k7k7k7
$$ 532 525 518 512 505 511 517 523 529 478 427 504 581 596 611 584 556 561 567 615 663 607 551 495 440 454 468 482 496 534 571 608 645 686 728 642 555 529 502 475 448
-292D48klllK8K9K8K8M0M1l0l1k9l0M1M1l3l2L8L9n0n0n0n0j2j1Q7Q8O5O6l4l4k9k9M1M2k3
$$ 448 446 443 440 437 465 494 522 550 590 631 601 570 541 511 552 593 560 528 566 605 555 505 455 405 393 382 469 557 622 688 654 620 591 562 603 645 622
-297F22k3k2k3K2K1m9n0L9L9L8L9j4j3K9K8M0L9o1o0j01j01K7K7P7P7L4L5k6k7k7k6n3n3j1
$$ 622 599 577 554 576 597 548 498 537 576 614 653 639 626 655 683 723 762 701 641 540 439 466 493 570 647 681 716 690 663 636 610 557 504 493
-301D93j0L9M0klJ8J8k5k5L8L9L8L8m9n0poK5K5j8j7j9j9j8j9j8j8K5K4l1l2J1J1j0rL3L3
$$ 493 483 522 562 560 557 575 593 568 543 581 620 658 696 647 597 590 584 609 634 616 599 580 561 543 524 506 488 513 537 506 474 485 496 486 477 510 543
-305E43K3K3K3K3k3k3k3k3m4m4k6N8P5j1n6n7j2j2j2j2L3L3rj0O2O1L9m7m3m3m3m3L1J17J16
$$ 543 566 589 612 635 612 589 566 543 499 455 429 487 562 551 495 438 426 414 402 390 423 456 447 437 499 560 599 552 509 466 423 380 411 528 644
-310F44L1p6p5j0j0ONl7l7O1O0L8m8j6j6K1K1J5J5J5J5OOl7l7m1m1JJM7M7L0n6o4K0J0J0l0
$$ 644 675 599 524 514 504 510 515 478 441 502 562 600 552 536 520 541 562 577 592 607 622 628 634 597 560 519 478 479 480 527 574 604 548 484 504 514 524 494
-314D94l0M1M0m0m1KKO1O1J9J8p3p4klk5k5J7J8L8L8L7L8M3M3n7n6qqn0n1o7o7O1O0J6J5J5
$$ 494 464 505 545 505 464 466 468 529 590 609 627 554 480 478 475 450 425 442 460 498 536 573 611 654 697 640 584 576 568 518 467 400 333 394 454 470 485 500
-319E00J6l4l3L8L7QPm0M4P3P2k1k2p9p9n6L0R3R3q0q0o2K3J8J8J8J7J8J7llO8O8o5o6MM7
$$ 500 516 482 449 487 524 532 539 499 543 616 688 667 645 566 487 431 461 554 647 567 487 425 448 466 484 502 519 537 554 551 548 616 684 619 553 557 604
-323F04K5o0o1K5Nl8l2J0Q2Q2Q0P9K7n8q1q2llmll5l6L5L6K5K6j7j7L1L1m0l9l2l1l2l2M3
$$ 604 629 569 508 533 538 500 468 478 560 642 722 801 828 770 689 607 604 601 597 594 559 523 558 594 619 645 628 611 642 673 633 594 562 531 499 467 510
$$ [...]
-1605F05
##END=	
##END=	
