##TITLE=	Mar14-2018.41.fid
MN 5(0)

##JCAMP-DX=	6.0	$$ MestReNova 14.1.1-24571
##DATA TYPE=	LINK
##BLOCK_ID=	1
##BLOCKS=	1    
##ORIGIN=	Mestrelab Research S.L.
##OWNER=	hrzepa
##$MNOVA/LINK_BLOCK_TYPE=	ITEM	$$ NMR Spectrum
##$MNOVA/ITEM/POLYGON=	(XY..XY)
5321,5835
8722,5835
8722,8208
5321,8208
5321,5835
##$MNOVA/ITEM/Z=	0
##$MNOVA/ITEM/ANGLE=	0
##TITLE=	Mar14-2018.41.fid
##JCAMP-DX=	6.0	$$ MestReNova 14.1.1-24571
##BLOCK_ID=	2
##DATA TYPE=	NMR SPECTRUM
##DATA CLASS=	XYDATA
##NUMDIM=	1
##ORIGIN=	Bruker BioSpin GmbH
##OWNER=	nmr
##.OBSERVE FREQUENCY=	100.64143942070799653
##.OBSERVE NUCLEUS=	^13C
##.SOLVENT NAME=	DMSO
##.PULSE SEQUENCE=	zgpg30
##LONGDATE=	2018/03/17 17:32:00.000
##.ACQUISITIONMODE=	SIMULTANEOUS (DQD)
##$ORIGINAL FORMAT=	Bruker XWIN-NMR
##$MNOVA/SCALES_VERSION=	9
##$PARAMETER FILE=	(acqus, ASCII, /Users/hrzepa/Downloads/Polysiphenol%20SI%20NMR%20Original%20Data/1/1b%20-%2013C%20-%20400C.18.03.14.041/41/acqus, 0)
$$ ##TITLE= Parameter file, TOPSPIN		Version 3.2
$$ ##JCAMPDX= 5.0
$$ ##DATATYPE= Parameter Values
$$ ##NPOINTS= 11	$$ modification sequence number
$$ ##ORIGIN= Bruker BioSpin GmbH
$$ ##OWNER= nmr
$$ $$ 2018-03-17 17:32:02.351 +0000  nmr@CZC2439F63
$$ $$ /opt/topspin/data/brad/nmr/Mar14-2018/41/acqus
$$ $$ process /opt/topspin3.2/prog/mod/shimcntl
$$ ##$ACQT0= -1.90126054427203
$$ ##$AMP= (0..31)
$$ 100 100 100 100 100 100 100 100 100 100 100 100 100 100 100 100 100 100
$$ 100 100 100 100 100 100 100 100 100 100 100 100 100 100
$$ ##$AMPCOIL= (0..19)
$$ 0 0 0 0 0 0 0 0 0 0 0 0 0 0 0 0 0 0 0 0
$$ ##$ANAVPT= -1
$$ ##$AQSEQ= 0
$$ ##$AQ_mod= 3
$$ ##$AUNM= <au_zg>
$$ ##$AUTOPOS= <40 >
$$ ##$BF1= 100.63037
$$ ##$BF2= 400.2
$$ ##$BF3= 100.63037
$$ ##$BF4= 100.63037
$$ ##$BF5= 100.63037
$$ ##$BF6= 100.63037
$$ ##$BF7= 100.63037
$$ ##$BF8= 100.63037
$$ ##$BYTORDA= 0
$$ ##$CAGPARS= (0..11)
$$ 0 0 0 0 0 0 0 0 0 0 0 0
$$ ##$CFDGTYP= 0
$$ ##$CFRGTYP= 9
$$ ##$CHEMSTR= <none>
$$ ##$CNST= (0..63)
$$ 1 1 145 1 1 1 1 1 1 1 1 1 1 1 1 1 1 1 1 1 1 1 1 1 1 1 1 1 1 1 1 1 1 1 1
$$ 1 1 1 1 1 1 1 1 1 1 1 1 1 1 1 1 1 1 1 1 1 1 1 1 1 1 1 1 1
$$ ##$CPDPRG= (0..8)
$$ <waltz16> <> <waltz16> <> <mlev> <mlev> <mlev> <mlev> <mlev>
$$ ##$D= (0..63)
$$ 0 1 0.00345 0 0 0 0 0 0 0.06 0 0.03 2e-05 3e-06 0 0 0.0002 0 0 0 0 0 0
$$ 0 0 0 0 0 0 0 0 0 0 0 0 0 0 0 0 0 0 0 0 0 0 0 0 0 0 0 0 0 0 0 0 0 0 0 0
$$ 0 0 0 0 0
$$ ##$DATE= 1521307921
$$ ##$DE= 6.5
$$ ##$DECBNUC= <off>
$$ ##$DECIM= 704
$$ ##$DECNUC= <off>
$$ ##$DECSTAT= 4
$$ ##$DIGMOD= 1
$$ ##$DIGTYP= 12
$$ ##$DQDMODE= 0
$$ ##$DR= 21
$$ ##$DS= 4
$$ ##$DSPFIRM= 0
$$ ##$DSPFVS= 20
$$ ##$DTYPA= 0
$$ ##$EXP= <c13>
$$ ##$F1LIST= <111111111111111>
$$ ##$F2LIST= <222222222222222>
$$ ##$F3LIST= <333333333333333>
$$ ##$FCUCHAN= (0..9)
$$ 0 1 2 0 0 0 0 0 0 0
$$ ##$FL1= 83
$$ ##$FL2= 83
$$ ##$FL3= 83
$$ ##$FL4= 83
$$ ##$FOV= 20
$$ ##$FQ1LIST= <freqlist>
$$ ##$FQ2LIST= <freqlist>
$$ ##$FQ3LIST= <freqlist>
$$ ##$FQ4LIST= <freqlist>
$$ ##$FQ5LIST= <freqlist>
$$ ##$FQ6LIST= <freqlist>
$$ ##$FQ7LIST= <freqlist>
$$ [...]
$$ 90 74 58 42 26 10 0 0
$$ ##$Sgu3PowerLevels= (0..7)
$$ 0 0 0 0 0 0 0 0
$$ ##$Sgu4PowerLevels= (0..7)
$$ 0 0 0 0 0 0 0 0
$$ ##$Sgu5PowerLevels= (0..7)
$$ 0 0 0 0 0 0 0 0
$$ ##$Sgu6PowerLevels= (0..7)
$$ 0 0 0 0 0 0 0 0
$$ ##$Sgu7PowerLevels= (0..7)
$$ 0 0 0 0 0 0 0 0
$$ ##$Sgu8PowerLevels= (0..7)
$$ 0 0 0 0 0 0 0 0
$$ ##$SguType= 3
$$ ##$ShimPowMaxUA= (0..63)
$$ 130000 130000 130000 130000 130000 130000 130000 130000 130000 130000 130000
$$ 130000 130000 130000 130000 130000 130000 130000 130000 130000 0 0 0 0
$$ 0 0 0 0 0 0 0 0 0 0 0 0 0 0 0 0 0 0 0 0 0 0 0 0 0 0 0 0 0 0 0 0 0 0 0 0
$$ 0 0 0 0
$$ ##$ShimPowMaxUC= (0..63)
$$ 130000 130000 130000 130000 130000 130000 130000 130000 130000 130000 130000
$$ 130000 130000 130000 130000 130000 130000 130000 130000 130000 0 0 0 0
$$ 0 0 0 0 0 0 0 0 0 0 0 0 0 0 0 0 0 0 0 0 0 0 0 0 0 0 0 0 0 0 0 0 0 0 0 0
$$ 0 0 0 0
$$ ##$ShimPowMaxUG= (0..63)
$$ 524287 524287 524287 524287 524287 524287 524287 524287 524287 524287 524287
$$ 524287 524287 524287 524287 524287 524287 524287 524287 524287 0 0 0 0
$$ 0 0 0 0 0 0 0 0 0 0 0 0 0 0 0 0 0 0 0 0 0 0 0 0 0 0 0 0 0 0 0 0 0 0 0 0
$$ 0 0 0 0
$$ ##$ShimPowRcbType= 3
$$ ##$ShimPowRes= (0..63)
$$ 1e-20 1e-20 1e-20 1e-20 1e-20 1e-20 1e-20 1e-20 1e-20 1e-20 1e-20 1e-20
$$ 1e-20 1e-20 1e-20 1e-20 1e-20 1e-20 1e-20 1e-20 0 0 0 0 0 0 0 0 0 0 0 0
$$ 0 0 0 0 0 0 0 0 0 0 0 0 0 0 0 0 0 0 0 0 0 0 0 0 0 0 0 0 0 0 0 0
$$ ##$ShimPowRng0= (0..63)
$$ 1 1 1 1 1 1 1 1 1 1 1 1 1 1 1 1 1 1 1 1 0 0 0 0 0 0 0 0 0 0 0 0 0 0 0 0
$$ 0 0 0 0 0 0 0 0 0 0 0 0 0 0 0 0 0 0 0 0 0 0 0 0 0 0 0 0
$$ ##$ShimPowRng1= (0..63)
$$ 1 1 1 1 1 1 1 1 1 1 1 1 1 1 1 1 1 1 1 1 0 0 0 0 0 0 0 0 0 0 0 0 0 0 0 0
$$ 0 0 0 0 0 0 0 0 0 0 0 0 0 0 0 0 0 0 0 0 0 0 0 0 0 0 0 0
$$ ##$ShimPowRng2= (0..63)
$$ 1 1 1 1 1 1 1 1 1 1 1 1 1 1 1 1 1 1 1 1 0 0 0 0 0 0 0 0 0 0 0 0 0 0 0 0
$$ 0 0 0 0 0 0 0 0 0 0 0 0 0 0 0 0 0 0 0 0 0 0 0 0 0 0 0 0
$$ ##$ShimPowRng3= (0..63)
$$ 1 1 1 1 1 1 1 1 1 1 1 1 1 1 1 1 1 1 1 1 0 0 0 0 0 0 0 0 0 0 0 0 0 0 0 0
$$ 0 0 0 0 0 0 0 0 0 0 0 0 0 0 0 0 0 0 0 0 0 0 0 0 0 0 0 0
$$ ##$ShimSysFunc= (0..63)
$$ 1 2 3 4 5 7 9 11 15 16 8 10 12 14 6 17 13 18 19 20 0 0 0 0 0 0 0 0 0 0
$$ 0 0 0 0 0 0 0 0 0 0 0 0 0 0 0 0 0 0 0 0 0 0 0 0 0 0 0 0 0 0 0 0 0 0
$$ ##$ShimSysMatrix= 0
$$ ##$ShimSysType= 1
$$ ##$TFXNUM= 0
$$ ##$TRIPLO2= 0
$$ ##$VTU= 2
$$ ##$VTUETH= <149.236.99.20>
$$ ##$VTUTY= <no>
$$ ##$WBREFAM= (0..15)
$$ 135.5 97.7 100 100 100 100 100 100 100 100 100 100 100 100 100 100
$$ ##$WBREFLM= (0..15)
$$ 0 0 0 0 0 0 0 0 0 0 0 0 0 0 0 0
$$ ##$WBREFPH= (0..15)
$$ 72.26 -67.22 0 0 0 0 0 0 0 0 0 0 0 0 0 0
$$ ##$WBSGU= (0..15)
$$ 0 0 0 0 0 0 0 0 0 0 0 0 0 0 0 0
$$ ##$XFAC= 2
$$ ##END=
$$ 
##$DECIM=	704
##$DSPFVS=	20
##XUNITS=	HZ
##YUNITS=	ARBITRARY UNITS
##FIRSTX=	25273.966162542779784
##LASTX=	-3134.691258222480883
##DELTAX=	-0.43348832563920436378
##XFACTOR=	1
##YFACTOR=	0.054341188499576698057
##FIRSTY=	9.39957427978515625
##MINY=	-19.846872329711914062
##MAXY=	8308.046875
##NPOINTS=	65536
##XYDATA=	(X++(Y..Y))
$$ [...]
9426G9K8K9K9K9kjkjklkkK8K9K8K8j7j6j7j7j6j7L9M0J6J5m0m0m9m8k4L2M6M6poKLLLrrrr
9407A87L0L1L1L1rrrrj6j6j6j6m8m8m9m8j7j6L9L9kkkkk3k2L3L3qrqqO3O3O2O3ONONn9n9O
9388B03N3N2K3j3j4jjN2N2M5jl2l1J4J3J4J4j%n7n7k5k5k5k5qrqrk0k0k0k0L4L5L5L5l3l3
9371A86l3l3PPPQPPQPK6K6K6K5qqqqJ5J4m2m2n4n5n2n1lM2L3NJ6J7J4J5J4J4J4J4J0J1J0J0
9353B18K9K9k8k7o7o8j1j1L9L9L9L9J3J3J3J3QQm8m8k7k7L0K9M5M6M5M5l4l4l1l1m0OL6L6
9337B86k8k7k8k8n0n1n1n0QPQOK4K3K3K3K0K0K0J9J6J6l8l8k8J9O8R6P3M5K2nk7k7k9k9m6
9321B62m6m6m6l8l8J9J8K6K6K4K3j8o4n1k3NN1M3J5QQLLj9o6n3k5QL6K2K2L4L4L4L4KLKLn2
9304A83n1NNK7K8K7K7k3k2k3k2L7L8O4J7l8l9m1m2n3n3n0m9oM9L3OnoppLKLL%JO3O3Qm8l0
$$ plain form
9426 79 107 136 165 194 192 191 189 188 186 183 181 179 207 236 264 292 275 259 242 225 209 192 231 271 287 302 262 222 173 125 101 133 179 225 218 212 214 217 220 223 214 205 196 187
9407 187 217 248 279 310 301 292 283 274 258 242 226 210 162 114 65 17 0 -16 23 62 60 58 56 54 31 9 42 75 67 58 50 42 105 168 230 293 299 304 310 315 256 197 203
9388 203 256 308 331 318 304 303 302 354 406 451 450 418 387 401 414 428 442 441 441 384 327 302 277 252 227 219 210 202 193 173 153 133 113 147 182 217 252 219 186
9371 186 153 120 127 134 141 149 156 163 171 178 204 230 256 281 273 265 257 249 264 278 236 194 140 85 33 -18 -21 21 54 59 75 92 106 121 135 149 163 177 187 198 208 218
9353 218 247 276 248 221 154 86 75 64 103 142 181 220 233 246 259 272 280 288 240 192 165 138 168 197 242 288 333 378 344 310 279 248 208 214 250 286
9337 286 258 231 203 175 125 74 23 -27 -19 -12 -4 2 26 49 72 95 115 135 155 174 190 206 168 130 102 121 189 285 358 403 425 420 393 366 337 308 262
9321 262 216 170 124 86 48 67 85 111 137 161 184 166 102 51 28 33 84 127 142 150 158 161 164 145 79 26 1 9 45 67 89 123 157 191 225 227 230 232 235 183
9304 183 132 137 142 169 197 224 251 228 206 183 161 198 236 300 317 279 240 199 157 104 51 1 -48 -54 -5 28 34 29 23 16 9 12 14 17 20 20 21 84 147 155 107 77
9286G7kL5O3M6M6K5l1o4o5l7l7K8K8N8N7K4l3m4m4k0j9l4l3L3L2L6L5j2j1JKJKrqL5L4K5l1
9269A89m4j5K4K3K6K5nnmnPPPPm0m0m0m0L0L0K9L0K0K0M4M5J5m0p1m4J9J9K1K0j2j3j2j3K2
9252B36K3K2K2onp1p2n4n4ppK1K1K1K0ONNNK6K7K6K6rj0rrKKLKp1p1o9p1k6k7k6k6L5L6L6
9234g2L5M2M3M2M3J9J8J8J9lkllllllJ3J3J0Rj0o6o6j0M7M8L5k0j4j3J1J2l0l1kkooopM0L9
9215A72k6k6J6J7J6J7m9m9m9m8klK4K6J4J4l2l2j7j8M7M7K7K7kjJ1J1N8N8Q3Q2M9qn2n2rr
9198C32J%m6m6p9p8n0n0KJm2m3j2M3P6P7O4O3L6L6k0k0k0k0KKKKPON3N3J1J0j8j7k7k8n5n5
9181A53j6j5M0M1L4L5o0n9m8m8K7N5L5j1p7p7l3l4K3K2L8L8J1J0J4J5M2M2M0M1M0M1kkkkj7
9165C34j7j7j7K4K3mnp5p5m5KN8N8N8N7L1j5m6m5l3l2nmK5K5K4K5k1k1k1k2K0K0l6l6m7m7
$$ plain form
9286 77 75 110 173 219 265 290 259 195 130 93 56 84 112 170 227 251 218 174 130 110 91 57 24 57 89 125 160 148 137 138 140 141 143 134 126 161 195 220 189
9269 189 145 130 154 177 203 228 223 218 214 209 216 223 230 237 197 157 117 77 107 137 166 196 216 236 280 325 340 300 229 185 204 223 244 264 252 239 227 214 236
9252 236 259 281 303 297 292 221 149 95 41 34 27 48 69 90 110 116 121 126 131 157 184 210 236 227 217 208 199 201 203 206 208 137 66 -3 -74 -100 -127 -153 -179 -144 -108 -72
9234 -72 -37 5 48 90 133 152 170 188 207 204 202 199 196 193 190 187 184 197 210 220 229 219 153 87 77 124 172 207 187 173 160 171 183 153 122 120 118 112 106 100 93 133 172
9215 172 146 120 136 153 169 186 137 88 39 -9 -11 -14 10 36 50 64 32 0 -17 -35 12 59 86 113 111 110 121 132 190 248 331 413 462 454 402 350 341 332
9198 332 333 333 287 241 162 84 34 -16 -14 -13 -55 -98 -110 -67 9 86 150 213 249 285 265 245 225 205 207 209 211 213 220 226 279 332 343 353 335 318 291 263 208 153
9181 153 137 122 162 203 237 272 212 153 105 57 84 139 174 163 86 9 -24 -58 -35 -13 25 63 74 84 98 113 155 197 237 278 318 359 357 355 353 351 334
9165 334 317 300 283 307 330 326 321 246 171 126 128 186 244 302 359 390 375 329 284 251 219 214 210 235 260 284 309 288 267 246 224 244 264 228 192 145 98
9149I8RJ0M6M6j0j0k0k0QQRRm7m7PPQPK2K3K2K2llmlJ7J6J7J6j9k0k0j9o6o6j0j0mlkjK6N5
9130A01L7rq4q3l0L5Q4Q5O0O1O1O2O3Pl1n9n2MJ7j1m8m8l2l1l2l2j5j6k4n1m7RO8P0J9J9r
9114A18ro9o8rM7N5K6j0j0k8k7%%L2L3Q6Q7J13Q4Jn5r4r4o9p0l5l5J9K1j7j6j6j6K9L0L0L1
9098I5J0J0J1J0j2j1m8p5o3pN4N2N4N3llM1M0J8l8n1k2J5J5NMn1n1l4l3K1K3mlN3N2M9M9p
9081B18pk7k7n6n5n7n8l0l0L2L2O1N9POOPQQQQJ7J7J7J6J7J7J6J7qrqrjkjjmlllk0j9k0j9
9062A17mlmlLMLMJ6J7J6J6K8K8K8K9J4J5J5J5m8m8m9m8n5n5q6l1L5L4L9L8K5K5Nn2o6j0M8
9045E5M9L1L1L1L1nmmmm5m4J1J2%%n7n6K3K2K3K2j1j1j2j1m7m6m6m7J1J0m2m2L4R0Q9L4K6
9028A01K6K2K2j2j3j2j3l4l5N9N9J6J7J6J7mllmj4j4j4j4j4j4j4j4JJJJO0N9O0N9K8K8K7K8
$$ plain form
9149 98 107 117 163 209 199 189 169 149 157 165 174 183 136 89 96 103 111 118 140 163 185 207 204 201 197 194 211 227 244 260 241 221 201 182 116 50 40 30 26 23 21 20 46 101
9130 101 138 129 45 -38 -68 -33 51 136 196 257 318 380 443 450 419 360 308 312 329 318 270 222 190 159 127 95 80 64 40 -11 -58 -49 19 89 108 127 118
9114 118 109 40 -28 -37 10 65 91 81 71 43 16 16 16 48 81 167 254 367 451 452 397 303 209 140 70 35 0 19 40 23 7 -9 -25 4 34 64 95
9098 95 105 115 126 136 124 113 65 -10 -73 -80 -26 26 80 133 130 127 168 208 226 188 137 115 130 145 150 154 103 52 18 -15 6 29 25 22 75 127 176 225 218
9081 218 211 184 157 101 46 -11 -69 -99 -129 -97 -65 -4 55 62 68 74 81 89 97 105 113 130 147 164 180 197 214 230 247 239 230 222 213 212 210 209 208 204 201 198 195 175 156 136 117
9062 117 113 110 106 103 106 110 113 117 133 150 166 182 210 238 266 295 309 324 339 354 306 258 209 161 106 51 -35 -66 -31 3 42 80 105 130 135 83 17 7 55
9045 55 104 135 166 197 228 223 219 215 211 166 122 133 145 145 145 88 32 55 77 100 122 111 100 88 77 30 -16 -62 -109 -98 -88 -130 -172 -138 -48 41 75 101
9028 101 127 149 171 159 146 134 121 87 52 111 170 186 203 219 236 232 229 226 222 208 194 180 166 152 138 124 110 111 112 113 114 174 233 293 352 380 408 435 463
9011D63m0m1j1L6K1K1K4K4J5J4m1m2m0m0m1m0%JLMJ5O1O1J5noqql1l2l2l1j2j2j1j2m9n0P
8994A50Pl7l8l8l7JJN8N7N2N1M9M8k1o9n8l0rrppk8k7k8k7J7J7J7J7LLKLJ5J4J5J4pqpqK8
8976A39K8K7K8j9j9k0j9l9m0n2k4ON1Q4Q3kkkkL4L4k3k2m1m1m0m1j3j3M3M4J9K0K0K0M8M8
8960C02pqm0l9m3J3N2N3K8K8J5J5m1m1j7j7P3P3M7rp1p0kkkkqqqqm4m4m4m4L6L5k0k1j6j7
8943G7M0M0M6M6j0j0j3j3j0o6p1p0n1ON1N0N5N4N1N1N1N1%jjjjjK3K3J1m5j07j07m5m6J1J1
8926G9N7N6K8K8j6j6o8o8m1J6P8P8J0J0J0J0J0J1m5m6k3k3L3L3L5L5J1m6q8q7l6l4MMKMM2
8910D7M3M2M2nnnnqqrqK8K9k8k7j4j3j4j3LLN9O0N9N9LMOOPOm6m6m6m7l7l8l7l8k6k8n4pM6
8891f0M6M8M9J8J9J8J9MMMNK3K4nmj4j4M2M2L9L8j7j7j7j7m5m4KKk5p2q8m0K3K2NML3L2J1
$$ plain form
9011 463 423 382 371 407 428 449 473 497 512 526 485 443 403 363 322 282 282 283 286 290 305 366 427 442 437 431 423 415 384 352 320 289 277 265 254 242 193 143 150
8994 150 157 120 82 44 7 8 9 67 124 176 227 276 324 303 234 176 146 137 128 121 114 86 59 31 4 21 38 55 72 75 78 80 83 98 112 127 141 134 126 119 111 139
8976 139 167 194 222 203 184 164 145 106 66 14 -10 -4 47 131 214 212 210 208 206 240 274 251 229 188 147 107 66 53 40 83 127 146 166 186 206 254 302
8960 302 295 287 247 208 165 178 230 283 311 339 354 369 328 287 270 253 326 399 446 437 366 296 294 292 290 288 280 272 264 256 212 168 124 80 116 151 131 110 94 77
8943 77 117 157 203 249 239 229 216 203 193 127 56 -14 -65 -59 -8 42 97 151 202 253 304 355 355 354 353 352 351 350 373 396 407 362 255 148 103 57 68 79
8926 79 136 192 220 248 232 216 148 80 39 55 133 211 221 231 241 251 261 272 227 181 158 135 168 201 236 271 282 236 148 61 25 -9 -5 -1 1 5 47
8910 47 90 132 174 169 164 159 154 146 138 129 121 149 178 150 123 109 96 82 69 72 75 134 194 253 312 315 319 325 331 338 344 298 252 206 159 122 84 47 9 -17 -45 -99 -106 -60
8891 -60 -14 34 83 101 120 138 157 161 165 169 174 197 221 216 212 198 184 226 268 307 345 328 311 294 277 232 188 190 192 167 95 7 -33 -10 12 17 21 54 86 97
8874I7J1m5m4RRJ0Rj0j0j1j0K3K3l3l2k8k7%JN3N3Q1Q1M9M9ppn6n7n7n6l3l3K3K3P0P0P0O9
8857C27L7L8j9j9k8k8%JJ7J8k0m8k8J8L5Ok9l0n9n9n0n0M3M4M5M4M5M4RRRRj6j5m4m4n9n8
8840I5k7J9N9Q6P1K5rj0j2j3kjkkk2k3k3k3j0j1j0j1K8K7K5K5K5k2l9j1M3M2j2j2l7l6J9K0
8824B29%%k7k8J0RJ0Rj3j3j3j3j2j1j1j2K9K8K9K8L1L1L1L0l4l5K2K1J0Rm7m6o1o1l2l3L6
8808A00L5O4O3MMn2n2l2l2l2l2N1N2N1N1kjkjl0k9K6K7N8N7KKlllll6l7l6l7MLLMj2j2j1j2
8789A59j2j2M5M4kln9n8n4n2LJLML1L1J2J2J2J2pppoOOOOL9L8j7j8l7l7qrM0M0L9M0RRm7m7
8770A48l8l8J8J9L7L7L4L4k5p2p0k4J5M3J7j0rro4o3l2J4M0M1K1k6n4n6ooK2K2L4L3ONL4L4
8754A06OOj4j3J4J5j9j9RJ0M0M1M1M0OONOJ1J1j6j7K2K3nn1m8jJ4j4l1l2l3l3oooolklkl1
$$ plain form
8874 97 108 63 19 28 37 47 56 46 36 25 15 38 61 28 -4 -32 -59 -59 -58 -5 48 129 210 259 308 301 294 238 181 124 68 35 2 25 48 118 188 258 327
8857 327 364 402 383 364 336 308 308 309 326 344 324 276 248 266 301 307 278 248 189 130 80 30 73 117 162 206 251 295 304 313 322 331 315 300 256 212 153 95
8840 95 68 87 146 232 303 328 319 309 297 284 282 281 279 277 255 232 209 186 176 165 155 144 172 199 224 249 274 252 213 202 245 287 275 263 226 190 209 229
8824 229 229 229 202 174 184 193 203 212 199 186 173 160 148 137 126 114 143 171 200 228 259 290 321 351 317 282 304 325 335 344 297 251 190 129 97 64 100
8808 100 135 199 262 266 270 218 166 134 102 70 38 89 141 192 243 241 240 238 237 207 178 204 231 289 346 348 350 347 344 341 338 302 265 229 192 196 199 202 206 194 182 171 159
8789 159 147 135 180 224 222 219 160 102 48 -4 -1 0 3 7 38 69 81 93 105 117 110 103 96 90 96 102 108 114 153 191 174 156 119 82 74 65 105 145 184 224 233 242 195 148
8770 148 110 72 90 109 146 183 217 251 226 154 84 60 75 118 135 125 116 107 43 -20 -52 -38 2 43 64 38 -16 -72 -78 -84 -62 -40 -6 27 33 38 72 106
8754 106 112 118 104 91 105 120 101 82 91 101 141 182 223 263 269 275 280 286 297 308 292 275 297 320 315 264 216 215 229 215 184 152 119 86 80 74 68 62 59 57 54 52 21
8735B1k9K4K6L9L8L9L8nmnnK3K2N4lk8k8l2l2o3o3l8J7N7N7NMk8k8k8k8L4L3L4L4J3J2J3J3
8718B03ooonM4M5M4M5j4j5o6o7o8j1j5j5k1k2L4L4J7J7j2j1l1l0K6K6L2L2Q5Q5N2mo6o6nn
8702B54nnJ6J5m1m0l4l4K3K2J2J2J2J2l1l0l0l0m3m2j7L7P8P9Q5L0kknnj4j4j4j4l6l6o3q
8685I2O2J18J13J9o9r8n7j1mlj%N1N1nnl9l8j1j0j6j6j5j6j7j8j4j5j3L4O2O2j0l7nO1R6O7
8669C45J0j8lmnoj7j8m5m6ONn1n0o0n8mlN2N2N3N3J7J7J7J8K9L0JKl4l3K3K2L0L0k6k7k9k9
8651B46jkOOm7m8j3L3L5L6J1J2J2J1j4j4j6j6j8m7n9j2j3m2l8qJ8M7M9K1ooqqj3j3j3j3L5
8635I0L4O0O0L0j5m6m6jjK7K7j8j9j8j8opopk1k2L4L5K9K9L0K9J8J7p3p3j1L5K4lNOMMP1P0
8617C57M0ol0l1l3l3l6l5l6l6j4j5j5j4RRJ0RJ6J7J4J5l9o7p7l1M3M2M6M5K1K1l5l5k8k9K8
$$ plain form
8735 21 -8 16 42 81 119 158 196 191 187 182 177 200 222 276 273 245 217 185 153 90 27 -11 6 63 120 125 129 101 73 45 17 51 84 118 152 165 177 190 203
8718 203 197 191 185 180 224 269 313 358 344 329 263 196 128 117 102 87 66 44 78 112 129 146 134 123 92 62 88 114 146 178 263 348 400 396 330 264 259 254
8702 254 249 244 260 275 234 194 160 126 149 171 183 195 207 219 188 158 128 98 55 13 -4 33 111 190 275 305 303 301 296 291 277 263 249 235 199 163 100 92
8685 92 154 272 385 404 335 237 180 169 165 162 161 161 212 263 258 253 214 176 165 155 139 123 108 92 75 57 43 28 15 49 111 173 163 126 121 182 278 345
8669 345 355 337 334 330 325 319 302 284 239 193 199 204 153 103 43 -15 -19 -22 30 82 135 188 205 222 239 257 286 316 317 319 285 252 275 297 327 357 331 304 275 246
8651 246 245 243 249 255 208 160 147 180 215 251 262 274 286 297 283 269 253 237 219 172 113 101 88 46 8 0 18 65 114 135 129 123 115 107 94 81 68 55 90
8635 90 124 184 244 274 259 213 167 166 165 192 219 201 182 164 146 140 133 127 120 99 77 111 146 175 204 234 263 281 298 225 152 141 176 200 197 202 208 212 216 287 357
8617 357 397 391 361 330 297 264 228 193 157 121 107 92 77 63 72 81 91 100 116 133 147 162 123 56 -21 -52 -9 33 79 124 145 166 131 96 68 39 67
8601F7K8L5L5L4L5LLLLL3L3L3L3l1l0l0l0j4j3j3j3jkjkl3l3l4l3j2j3j2j2j0qj0j0KKKKj3
8582b7j3j3j4P4P4P4P5L4L5k0j9K9N8K2m3q2q1k9L6N2N2J%NMNN%jJ6j3lmnnonlmqJ9MLMLj4
8563B72J4J3j5n2n2n0k2J9J9j1j0L0N7M4M4Ok3m3m3m5m5l2l2k9k8PN3M3J5LLKJJ5J5J5J5k1
8546A52k1k0j9l6qL3L2M3M2M0L9K1k6j6J2J8J8L5Pjjlkj9j9j9k0l1l2m7k0%%KKJ6J6J6J6j0
8529A90rj0j0kkkjl2l2PL5Ok1k0QK3K3M0J3k1k1l8j0J9J9K0K0k0k0j7j7K3O9N7K9j4m3k8k8
8512A83NNk2k3j1j2M2M2K1k5k7k8k1k2r0o2NN1M4J5k2k2l6qM1R0Q9M2Pk2k4MK6K6K8K7k1k1
8495B74k1k1l7l7l8l7L0L0L0L0J0J0m7m6lkK6K5l5l5o0o0m7%O6O6M0L9M0L9rrl7l7n5n5J1
8479C8N8M8K0L8L9J8J8J8J8O1O1MNl2l1l2l1m3m3m3m3j3j3j2j3K5K6K5K5KJl6o4l4J3Jk7m2
$$ plain form
8601 67 95 130 165 199 234 237 240 243 246 279 312 345 378 347 317 287 257 243 230 217 204 203 201 200 198 165 132 98 65 53 40 28 16 6 -2 -12 -22 -20 -18 -16 -14 -27
8582 -27 -40 -53 -67 7 81 155 230 264 299 279 260 289 347 369 326 244 163 134 170 222 274 275 275 280 284 289 294 294 293 309 296 293 289 284 279 273 268 265 261 253 272 276 279 283 286 272
8563 272 286 299 284 232 180 130 108 127 146 135 125 155 212 256 300 306 283 240 197 152 107 75 43 14 -14 -7 46 89 104 107 110 112 113 128 143 158 173 152
8546 152 131 111 92 56 48 81 113 156 198 238 277 298 272 256 268 286 304 339 346 345 344 341 339 320 301 282 262 231 199 152 132 132 132 134 136 152 168 184 200 190
8529 190 181 171 161 159 157 155 154 122 90 97 132 138 117 97 105 128 151 191 204 183 162 124 114 133 152 172 192 172 152 135 118 141 210 267 296 282 239 211 183
8512 183 188 193 171 148 137 125 167 209 230 205 178 150 129 107 17 -45 -40 11 55 70 48 26 -10 -18 23 113 202 244 251 229 205 209 235 261 289 316 295 274
8495 274 253 232 195 158 120 83 113 143 173 203 213 223 176 130 127 125 151 176 141 106 46 -14 -61 -61 5 71 111 150 190 229 220 211 174 137 82 27 38
8479 38 96 144 164 202 241 259 277 295 313 374 435 439 444 412 381 349 318 275 232 189 146 133 120 108 95 120 146 171 196 198 199 163 99 65 78 79 52 10
8463A0m1J3J3k2k1OPL7L9L9L9j2j2j1j2%%%%N3N3N4N3M4M4j2j2j6j6M0M0l0l1l0l0j8j8j8
8446B22j8j8j7j8j8QPQQppM9M8K9K9K6K5L5j2l2lJ3j4n3n3k4k4MLJ3J2J3J2j1j2j1j2l3l4
8429A33l4l3N7N8N7N8mmlmJ3J3J3J3k1k2k1k1l5l6l6l6l0l0kkN9N9K9j8l6l7J7J6K2K1opj2
8413A48j1m0m0K5K4K5K5L7L8J0l7l0kk1k1J4J3J3J4OPN3N3%%k8k8PPPPNNNNJ5J5l2l2nmnn
8394B42qpqqJ2J2J2J2l6l7l6l7l6l5J9O6O7K0j6j6K3K2K3K2LKKKjkjjkjjjl3l2l2l2K1K2K2
8375B07K1m9m8m6m6l4J3N2N3K4K5llkkK5K6j1j2n8n8j8j7M8M8L5L6l1l0l6l7J1J0j1j1j1j0
8359E0L6L7L6L7ONMMn0p7q8m1K0K1K2K4J2J2J1J2j0j1j0j0J0J1J1J0N8N8N8N7l8l8l8l8KK
8343A77LKN5N5K7K7k0j9o6o6k1k0k1k0j7j8j7j7K2K3K2K3j4j4j4j4K9K9K9K9L3L3ONk6k5K1
$$ plain form
8463 10 -31 -18 -5 -27 -48 -42 -35 2 41 80 119 107 95 84 72 72 72 72 72 125 178 232 285 329 373 361 349 333 317 357 397 367 336 306 276 258 240 222
8446 222 204 186 169 151 133 141 148 156 164 157 150 199 247 276 305 331 356 391 379 347 344 357 343 290 237 213 189 193 196 209 221 234 246 235 223 212 200 167 133
8429 133 99 66 123 181 238 296 292 288 285 281 294 307 320 333 312 290 269 248 213 177 141 105 75 45 43 41 100 159 188 170 134 97 114 130 152 173 167 160 148
8413 148 137 97 57 82 106 131 156 193 231 241 204 174 172 151 130 144 157 170 184 190 197 250 303 303 303 275 247 254 261 268 275 280 285 290 295 310 325 293 261 256 252 247 242
8394 242 234 227 219 211 223 235 247 259 223 186 150 113 77 42 61 127 194 214 198 182 205 227 250 272 275 277 279 281 280 278 277 276 274 273 272 271 238 206 174 142 163 185 207
8375 207 228 179 131 85 39 5 18 70 123 147 172 169 166 164 162 187 213 202 190 132 74 56 39 87 135 170 206 175 145 109 72 83 93 82 71 60 50
8359 50 86 123 159 196 202 207 211 215 165 88 0 -41 -21 0 22 46 58 70 81 93 83 72 62 52 62 73 84 94 152 210 268 325 287 249 211 173 175 177
8343 177 180 182 237 292 319 346 326 307 241 175 154 134 113 93 76 58 41 24 46 69 91 114 100 86 72 58 87 116 145 174 207 240 246 251 225 200 221
8327B21K1M1M1k5k5l1l1klLLLLk5k6n4n3ppL7L8P8N0rn5n9j3K3K3J4J3j5j4j6j6L2L1M9M9
8310B87K2K1PQPPj1j0l9l9m0m0PQJKM9M8L2L2L0K9j2n9m9k0l0k9k8k8k1k0k1k1j3j2j3j2J9
8293D9J9J9J8K0K0l6l6n0m8n2LO3O1L9L8J9J8M7M7j6j6j6j6K7K6l0l0k4k3MNJKJK%j%jk1k2
8275A10k1k2K2K2K1K2qql6l7k3k4L3L2N9N8L0L0K0K0p3p4k6k7JJl4l5l3l5RRO5O5Q2Q3N7K
8259C37o7o7m2m2j1j1j1j1L8L9j7j8k7k7k8k7OPO3O2N6N5L1k5n6n5klM8M8N1nl5l5J8J8K3
8243B78K2K3K2J0J0RJ0l5l4l5l4k3k3k3k3K5K4K4K5L0L0k4k4QL6L7QJJjjm1m2m1m2l3l3l3
8226H8l2l0k8j7J0L8L8j6j6jjK7K7J%JJpoppL2L1M8J9K2K3K0K1J9J9L4Pqqj0rj0j0j0rNNL
8207B97LJ7j0j1J7M1M1Mk5k0QJ9J9k5k5k3k3rK0J9qj8j8j8j8n4k6J5J5K6K7K6K6j5j6j4j4
$$ plain form
8327 221 242 283 324 299 274 243 212 210 207 210 213 216 219 194 168 114 61 54 47 84 122 200 250 241 186 127 114 137 160 174 187 172 158 142 126 158 189 238 287
8310 287 309 330 337 345 352 359 348 338 299 260 220 180 187 195 196 198 247 295 327 359 389 418 406 347 298 278 248 219 191 163 142 122 101 80 67 55 42 30 49
8293 49 68 87 105 125 145 109 73 23 -25 -77 -74 -11 50 89 127 146 164 211 258 242 226 210 194 221 247 217 187 163 140 144 149 150 152 153 155 155 154 154 153 132 110
8275 110 89 67 89 111 132 154 146 138 102 65 42 18 51 83 142 200 230 260 280 300 227 153 127 100 101 102 68 33 0 -35 -26 -17 48 113 195 278 335 337
8259 337 270 203 161 119 108 97 86 75 113 152 135 117 90 63 35 8 14 21 84 146 202 257 288 263 207 152 150 147 195 243 294 289 254 219 237 255 278
8243 278 300 323 345 355 365 374 384 349 315 280 246 223 200 177 154 179 203 227 252 282 312 288 264 272 308 345 353 354 355 354 353 312 270 229 187 154 121 88
8226 88 56 26 -2 -19 -9 29 67 51 35 34 33 60 87 88 88 89 90 83 77 70 63 95 126 174 193 215 238 258 279 298 317 351 358 350 342 332 323 313 303 293 284 289 294 297
8207 297 300 317 307 296 313 354 395 399 374 354 362 381 400 375 350 327 304 295 315 334 326 308 290 272 254 200 174 189 204 230 257 283 309 294 278 264 250
8191B50l6qL1L0k3n1k5Lol5l3mK8K9L0L0qrqrQQQQj6j6j5j6K5K6K6K6M0M0poNNNNMML2L3K3
8172D31K4k4k3l4l5opk2k3p0o9mmK4K4J5J5m8m8k9J7L8L7J3J4J3J3nnM2M1ONk2k3k2k2k2k2
8155A83k4k3k4k4K9K9L0L1K3N2O0J3n1p9o6o6k2k2k0k0n2k5L4Q0Q3N5M1J3j7m5n5rL8O5K4
8139B39m1j00r8l8K8N0N1RQopopj6j6j7j6K0K1K3K2M8P7N8J2m2m2l2K5N2K4k4n1l3npl5j5
8123A13j6j7j7rqrrJ2J1N8N8J2J2M0M0J8J9rrm3m3m6RM2M2k0k0l4l5l4l4o4o2KJJ9J8J7J9
8106B4l3l4L6R1Q7N8M7M6L0k7p9p9p1p0k4k3M4M6M5M5K9L0K9L0LMMLj7j7j8j7K2K3K2K2j1
8090C00j2j1j2k3k3k3k4j3j4j4j4jjm5m4j3M4N9N9J6J7J7J7j7j6j7j6k6k7k6k7j6j7J3J3P7
8074A40J05P3J8l7l8m0m1l2l3l2l2J1J2J1J1j9k0j9j9JKJJJ8J8J8J7O3O3O2O3LKLKk0k1m8
$$ plain form
8191 250 214 206 237 267 244 193 168 171 165 130 97 93 121 150 180 210 202 193 185 176 184 192 200 208 192 176 161 145 170 196 222 248 288 328 321 315 320 325 330 335 339 343 375 408 431
8172 431 455 431 408 374 339 333 326 304 281 211 142 138 134 158 182 197 212 164 116 87 104 142 179 192 206 219 232 227 222 264 305 311 316 294 271 249 227 205 183
8155 183 159 136 112 88 117 146 176 207 230 282 342 355 304 225 159 93 71 49 29 9 -43 -68 -34 46 129 184 225 238 221 176 121 112 150 215 239
8139 239 198 98 0 -38 -10 40 91 100 108 102 95 89 82 66 50 33 17 37 58 81 103 151 228 286 298 256 214 182 207 259 283 259 208 175 170 163 128 113
8123 113 97 80 63 54 46 37 28 40 51 109 167 179 191 231 271 289 308 299 290 247 204 158 167 209 251 231 211 177 142 108 74 10 -52 -50 -49 -30 -12 5 24
8106 24 -9 -43 -7 84 171 229 276 322 352 325 246 167 96 26 2 -21 23 69 114 159 188 218 247 277 280 284 288 291 274 257 239 222 244 267 289 311 300
8090 300 288 277 265 242 219 196 172 159 145 131 117 116 115 70 26 13 57 116 175 191 208 225 242 225 209 192 176 150 123 97 70 54 37 50 63 140
8074 140 245 318 336 299 261 221 180 148 115 83 51 62 74 85 96 77 57 38 19 20 22 23 24 42 60 78 95 158 221 283 346 349 351 354 356 336 315 267
8058B67m9n3n3MLmmmnk0k1L6L5L8L8L5L4J8k9n8n9r2r1o1j3NL3M8M7N6N5Q1Q1N2Ok5k4m3m3
8041B21m3m3L8L8Ql9l2l2ppJ4J3J2J2k0m7n7j0M4P2N8N9L7L7j9j9J3J2J3J2k3k4k4k3k7k7
8025A90k7k8MLn2n3l5l4qpK0K0M7M8P0P0k1k0KN0M9Lj4j4j7j6J3J4J4J3k6k6k6k6QQRQL4L4
8008B81L4L4l6l6l6l5J8J8J8J8j4j4j4j3j8j7j7j7L2L1k4k4j9j8L4L4k0o7o9o8j5j5M1M0K9
7993E6K9k8k7MMNMk2k2L4L5M2M2J5l2l2J4M1M2L1L1K9K8Jm5p3p2o3j7J4J3m4m4j5L2M5M4K0
7976A19k7n3k6J2J1RRRQK6K5K6K5J8J9J8J9o1o1o1o1j5j6j7j6J3J2J3J3j8j7j8j7K8K7K7K8
7960C0PORQLL0J4J5J6J6J5J4jk9j2j2OL4J6J7j6m4m4j6OOQQOPOOK4K5K2K3K6kl2l3k3k2QL6
7941A87M3M2J6J6j9j8j8j7LL1L0Lj3j3l1kJ1J2J4J3pqrrl0n7n5k8J5M3M4J7k8k9k8k8mK4Q
$$ plain form
8058 267 218 165 112 116 119 115 111 107 102 82 61 97 132 170 208 243 277 295 266 208 149 57 -34 -95 -108 -103 -70 -22 25 81 136 217 298 350 356 331 307 264 221
8041 221 178 135 173 211 219 180 148 116 109 102 116 129 141 153 133 86 29 19 63 135 193 252 289 326 307 288 301 313 326 338 315 291 267 244 217 190
8025 190 163 135 139 142 90 37 2 -32 -40 -47 -27 -7 40 88 158 228 207 187 189 239 288 291 277 263 246 230 243 257 271 284 258 232 206 180 188 196 205 213 247 281
8008 281 315 349 313 277 241 206 224 242 260 278 264 250 236 223 205 188 171 154 186 217 193 169 150 132 166 200 180 113 44 -24 -39 -54 -13 27 56
7993 56 85 57 30 34 38 43 47 25 3 37 72 114 156 171 139 107 121 162 204 235 266 295 323 324 279 206 134 71 54 68 81 37 -7 -22 10 55 99 119
7976 119 92 39 13 25 36 45 54 63 71 97 122 148 173 191 210 228 247 186 125 64 3 -12 -28 -45 -61 -48 -36 -23 -10 -28 -45 -63 -80 -52 -25 2 30
7960 30 37 43 52 60 63 93 107 122 138 154 169 183 182 153 141 129 135 169 185 202 186 142 98 82 88 94 102 110 116 123 129 135 159 184 206 229 255 253 221 188 165 143 151 187
7941 187 230 272 288 304 285 267 249 232 235 266 296 299 286 273 242 240 251 263 277 290 283 275 266 257 227 170 115 87 102 145 189 206 178 149 121 93 89 113 121
7924A21Qj9j9l5pL9L9K8%l8l7rJ9L9L9M0M1K7K8K7K7pqqpk9k8m4j6L3L3L3j3m5m6jjk5k4j2
7907A43J7K2K3mmqppqk7k6k7k7ooooL5L4L5L4M2M1M2M1m2m3m2m3mmnmm0m0o9o7k5k5mM2Q7
7889A2Q7M4M4KKLKL9L9qqKKKKl2l2l2l2OPN3N3K4K4k3k3nol3l4o9o9k2k1K3K3mnl5l4MN0N7
7870G9N8L2L2RRl8l7o6o5m2MO0Q9N5Rj9j8k2k2k0k1PPO3O2K3k4m7m8k2k3K6K6K5K6ooooj4
7853A29j3j3j3k5k6k6k5j5j4m0QP7J06O3J6nnl3l3j2L4O5O4RQQRl1l0l1l1K2K1K2K1qpj8m5
7836A83n6rM1O9L6L6L8L8%%k8k8k2k1L4L4J2J2j7j6l5l5ppJKJKQQQQm6m7m7m7k0j9L6L6M3
7818A79M4M3M3KJN4N4K4m2r6r5n9j2J8J7K5K5mlk5k5k5k5K2K3K2K2k7k8k8k8j9j8L7L8O6O6
7802B66J0J1J8J8rj0n4n3k6k5rrj0rj3j4M3M2Q7Q6O2Oj2j3m4m4k9k9kjk1k2PPM8M8K0K0j5
$$ plain form
7924 121 129 110 91 56 49 88 127 155 155 117 80 71 90 129 168 208 249 276 304 331 358 351 343 335 328 299 271 227 211 244 277 310 297 252 206 205 204 179 155 143
7907 143 160 182 205 201 197 189 182 175 167 140 114 87 60 54 48 42 36 71 105 140 174 216 257 299 340 298 255 213 170 166 162 157 153 113 73 4 -63 -88 -113 -117 -75 12
7889 12 99 143 187 189 191 194 196 235 274 266 258 260 262 264 266 234 202 170 138 144 151 204 257 281 305 282 259 254 248 215 181 112 43 21 0 23 46 42 37 2 -32 -28 22 79
7870 79 137 169 201 210 219 181 144 78 13 -29 -25 35 124 179 188 169 151 129 107 87 66 73 80 143 205 228 204 157 109 87 64 90 116 141 167 161 155 149 143 129
7853 129 116 103 90 65 39 13 -12 -27 -41 -81 -73 4 110 173 189 184 179 146 113 101 135 200 264 273 281 289 298 267 237 206 175 197 218 240 261 253 246 228 183
7836 183 127 118 159 228 264 300 338 376 376 376 348 320 298 277 311 345 357 369 352 336 301 266 259 252 253 255 256 258 266 274 282 290 244 197 150 103 83 64 100 136 179
7818 179 223 266 309 311 312 366 420 444 402 306 211 152 140 158 175 200 225 221 218 193 168 143 118 140 163 185 207 180 152 124 96 77 59 96 134 200 266
7802 266 276 287 305 323 314 304 250 197 171 146 137 128 118 109 96 82 125 167 254 340 402 408 396 383 339 295 266 237 235 234 213 191 198 205 253 301 321 341 326
7785C26j5j5j5J9J8J8J9rqqrk9l0k9l0k9l0l0l0k1k2L5L4%%%%J7J6J7J7m9m9k1k1n1n2QO3
7768EP7N0ql6j4J3L5O2P1M3j5m4m7j8K0K0J7J8J7J8k3k2L4L3K8K8K7K8k8k7k9k9Lk5m1J6N0
7752C07N0llqro5o4o7o6j0j1KJL0K9J4J3J4J4K0K1l6l5qqJ8J9Mk3k3MJ3J3L0Ll7l8l7l7J0
7735D1L9K2K3J3J3J3J3ppL2N9N0K2RJ0Qk1l2l3j8j8m4m5j0J8L1L0K9K8J6j2k5k5KJMLj3J6
7718B35N5N6N5N5nl3j7j7pqpprrrro8o7o5o4j9K8J8j1lmnnj%lkll1j4j5KKKKnnllK9N9M2M3
7697A50L3L2L3L3nmnmj9j9kk9l5oL2L2QQk0k0l9l9j1j1j7j6J3O1N7N7NMk3k3j9j9m3J3P6P5
7680B94N0N1nok8k8k7k8k0k0j9k0k1k0k1k1J6J5ro5j12j14l9N4J05J03J7J6NNk3k3j4j4M2
7664G6M2K1K1K2K1nnqM7M6M6m1m0k9K8mlm5m4J8P3M4M4qrm8m9n2ML7L7j5j6J%k7k8k1k1p9
$$ plain form
7785 326 311 296 281 300 318 336 355 346 338 330 321 292 262 233 203 174 144 114 84 63 41 76 110 110 110 110 110 127 143 160 177 128 79 58 37 -14 -66 -58 5
7768 5 82 132 124 88 74 87 122 184 255 298 283 239 192 174 194 214 231 249 266 284 261 239 273 306 334 362 389 417 389 362 333 304 307 282 241 257 307
7752 307 357 354 351 343 334 269 205 138 72 62 51 53 54 84 113 127 140 154 168 188 209 173 138 130 122 140 159 163 140 117 121 134 147 177 180 143 105 68 31 41
7735 41 80 102 125 138 151 164 177 170 163 195 254 304 326 335 345 353 332 300 267 249 231 187 142 132 150 181 211 240 268 284 272 247 222 224 225 229 232 219 235
7718 235 290 346 401 456 451 418 401 384 377 369 362 355 346 337 328 319 251 184 119 55 36 64 82 71 68 64 59 54 53 53 50 48 45 14 0 -15 -13 -11 -9 -7 -12 -17 -20 -23 6 65 107 150
7697 150 183 215 248 281 276 272 267 263 244 225 223 194 159 153 185 217 225 233 213 193 154 115 104 93 76 60 73 134 191 248 253 257 234 211 192 173 130 143 219 294
7680 294 344 395 390 384 356 328 301 273 253 233 214 194 173 153 132 111 127 142 133 68 -44 -158 -197 -143 -38 65 82 98 103 108 85 62 48 34 76
7664 76 118 139 160 182 203 198 193 185 232 278 324 283 243 214 242 238 235 190 146 164 237 281 325 317 308 260 211 159 163 200 237 222 206 207 207 180 152 131 110 31
7647C1j35j20o5jN6J02J01M8N0MNk4k3j4j3J4J4J%K8K9J4J4J5J4QRQQm5m6m2m2L6R2O0O0q
7631B43rrqrqqrqqrqj6j5j6j6M3M3M2M3j6j7j6j7K8K8K8K8o3o2o0n9j1M5L0JJ8J9J6J7J0R
7613B14J0RK2K2K2K2NONOk5k5k5k4L9M0K4l2o3o3l9l9ONOOk4k4k4k4llM4M4M1M1J2J3M1M2
7595C10M1M1k7k7n6n5MMM7M7J6m1n5n5l0l0k9l0RJ0RJ0LML1L2LLN0N0M0M0opl3l4l3l3k0k0
7578A83o5o4q5n8kN4R3R4P9K3j9p4p5p5l8l9K6K7K8L0K9L0K2K2K2K2k8k8k8k8J4J5J4J5qp
7563A21l6l6QRN4N5N9O0pol5l4l5l4mllmK3K3k3k4j8j8j8j8n6n7mN1J03J03P4J7K0K0j2j2
7546C03l3l4l3l4K3K3K3K3pppqn4n4k6k6m1m0pM8J01J00L3k3o6o6j7M0P5P6O4Qn4n3j0j1M1
7530B70M0O9O9J8J7J8J8m8m9m8m8j9j9j9j9K0K1M6M5J2m4n9n9k4k5MLl6l6l7l6K4K4K4K4j9
$$ plain form
7647 31 -104 -224 -289 -290 -234 -132 -31 17 67 71 76 52 29 15 2 16 30 31 31 59 88 102 116 131 145 153 162 170 178 133 87 45 3 39 131 191 251 243
7631 243 234 225 217 208 200 192 183 175 167 158 150 134 119 103 87 130 173 215 258 242 225 209 192 220 248 276 304 241 179 119 60 49 94 124 125 143 162 178 195 205 214
7613 214 224 233 255 277 299 321 326 332 337 343 318 293 268 244 283 323 347 315 252 189 150 111 117 122 128 134 110 86 62 38 35 32 76 120 161 202 214 227 268 310
7595 310 351 392 365 338 282 227 231 235 282 329 345 304 249 194 164 134 105 75 84 94 103 113 116 120 151 183 186 189 239 289 329 369 363 356 323 289 256 223 203 183
7578 183 118 54 -31 -89 -91 -37 56 150 229 252 233 159 84 9 -29 -68 -42 -15 13 43 72 102 124 146 168 190 162 134 106 78 92 107 121 136 128 121
7563 121 85 49 57 66 120 175 234 294 287 281 246 212 177 143 139 136 133 129 152 175 152 128 110 92 74 56 0 -57 -61 -10 93 196 270 287 307 327 315 303
7546 303 270 236 203 169 192 215 238 261 254 247 240 232 178 124 98 72 31 -9 -16 32 133 233 266 243 177 111 94 134 209 285 349 357 303 250 240 229 270
7530 270 310 379 448 466 483 501 519 471 422 374 326 307 288 269 250 270 291 337 382 394 350 291 232 208 183 187 190 154 118 81 45 69 93 117 141 122
7514A22k0j9k0rrrr%%N6N6K1K1l5l5PPPPM4M3M4M3MMNMqpqpJKKKj5j4j5j4K4K4K5K4k0k0k0
7494B86k1j4j5j2j2J1N7L2L1J2J3J3J2k7k7k7k8j5j5j6j5l1l1K6K5j7j7j7j7l5l4l2l1PN3
7479G2K8K7OONOO8O7J1J1k0k1k0k0j4j3j3j4l6l6K8P5O2J5j1j2PPOPnmnmj6j6J5O1P0P0K8
7461D78Jk0q6j29q4KM7N1Ml8l8m1m1%j%%j2j2j2j2%JJJO3O2PPj0rrrooooK0K0J9K0K7K6K7
7442B97K6J3J2J3J2j3j3j4j3J7J7J6J7NONNk8k7k7k8rj0qqK7N6J1l7p2p3p3p2rL9K8jJ2J1
7426A10J0J0k1k1k1k1J9J8J9J9M8M9M8M9k5k6k5k5m4m3J2J3M7M8rqn0n0n0n0o5o6K7K8M7M9
7410E0M9M8K0J9J9K0j2j2j3j2MNMMMNMMJ6J6J6J6K4K5K4K4m4m4J2J3K9K9KJL4L4k2k2m1m0
7393C12n0p8p2k5K4N2P2P2M4lk7k8K2K2mn1q1q1n0n0POM9M9M9M8jjkjL0L0L1L0l8l7l8l8k2
$$ plain form
7514 122 102 83 63 54 45 36 27 27 27 83 139 160 181 146 111 118 125 132 139 183 226 270 313 317 321 326 330 322 315 307 300 301 303 305 307 292 278 263 249 273 297 322 346 326 306 286
7494 286 265 251 236 224 212 223 280 312 343 355 368 381 393 366 339 312 284 269 254 238 223 192 161 187 212 195 178 161 144 109 75 43 12 19 72
7479 72 100 127 133 139 144 150 218 285 296 307 287 266 246 226 212 199 186 172 136 100 128 203 265 280 269 257 264 271 277 284 279 275 270 266 250 234 249 310 380 450 478
7461 478 479 459 373 244 160 162 209 260 264 226 188 147 106 106 105 105 105 93 81 69 57 57 58 59 60 123 185 192 199 189 180 171 162 156 150 144 138 158 178 197 217 244 270 297
7442 297 323 336 348 361 373 360 347 333 320 337 354 370 387 392 398 403 408 380 353 326 298 289 279 271 263 290 346 357 320 248 175 102 30 21 60 88 87 99 110
7426 110 120 130 109 88 67 46 65 83 102 121 169 218 266 315 290 264 239 214 170 127 139 152 199 247 238 230 180 130 80 30 -35 -101 -74 -46 1 50
7410 50 99 147 167 186 205 225 213 201 188 176 180 185 189 193 197 202 206 210 226 242 258 274 298 323 347 371 327 283 295 308 337 366 368 369 403 437 415 393 352 312
7393 312 262 184 112 87 111 163 235 307 351 348 321 293 315 337 333 282 201 120 70 20 27 33 82 131 180 228 227 226 224 223 253 283 314 344 306 269 231 193 171
7376A71k2k2k2J1J1J2J1l1l0n5n3MO8Q6Q6L7j0l9m0l0l0kkK5K5K6K5K7K7K7K8k6k5k6k5mn
7360B08mmk0k0k0k0ONOOJ4J5J4J4j8j8m2m3m2J4P6P6N6N7N3N3Nn1p5p6qrrrj5j4M1M2L6L5
7342C15L6L6j8j7j7j7K2K3K2K3l9l9l9l9k4k4k3k4k9k9K7K7J8J9j0j0%%%%QPm5m5k9K7N1N2
7326A96O6O6J0J0k3k3n1n1k3k2k2k3klllJ4J4J3J4J2J2J2J2J2J2O5O4Qm9p3p3j5j6j6j6OO
7309A17OOj5j5j5j5j4j3j3j4O0O1N7N6M5j2l6l7k9k9l0k9j1j0j0j1j0j1j0j1L7L7L7L7L0L0
7294B16L0L0k5k5k5k4K4K4K4K5J0J0J0J0OPk2k1M2M2K6k9p4p4l0l1pqM0L9K0K0qqm6m5m6m6
7277F1J7J7l0l0m6m8%jL6L6O4O4QPPQL6L7L6L7L9L9qqj7j6j7j7j3j3j3j3k2k2j8j9nN0O3O2
7260C48J9l6p1p0l1l2J6J5k9l0k9l0L1L1N9N8N1N0LLKJj4p0n5n6POK7K6K6K7K7K6K7K7o1o2
$$ plain form
7376 171 149 127 105 116 127 139 150 119 89 34 -19 -15 53 139 225 262 252 213 173 143 113 111 109 134 159 185 210 237 264 291 319 293 268 242 217 213 208
7360 208 204 200 180 160 140 120 126 131 137 143 157 172 186 200 182 164 122 79 37 51 127 203 259 316 369 422 427 376 301 225 217 208 199 190 175 161 202 244 280 315
7342 315 351 387 369 352 335 318 340 363 385 408 369 330 291 252 228 204 181 157 128 99 126 153 171 190 180 170 170 170 170 170 178 185 140 95 66 93 144 196
7326 196 262 328 338 348 325 302 251 200 177 155 133 110 108 105 102 99 113 127 140 154 166 178 190 202 214 226 291 355 363 314 241 168 153 137 121 105 111 117
7309 117 123 129 114 99 84 69 55 42 29 15 75 136 193 249 294 282 246 209 180 151 121 92 81 71 61 50 40 29 19 8 45 82 119 156 186 216
7294 216 246 276 251 226 201 177 201 225 249 274 284 294 304 314 320 327 305 284 326 368 394 365 291 217 187 156 149 141 181 220 240 260 252 244 198 153 107 61
7277 61 78 95 65 35 -11 -59 -59 -60 -24 12 76 140 148 155 162 170 206 243 279 316 355 394 386 378 361 345 328 311 298 285 272 259 237 215 197 178 173 223 286 348
7260 348 367 331 260 190 159 127 143 158 129 99 70 40 71 102 161 219 270 320 323 326 328 329 315 245 190 134 141 147 174 200 226 253 280 306 333 360 299 237
7243B37n8n8l4K2L7L7OPMNJ4j5m2m2j5L2O9O8L0j6l7l7k7k7m3j4K9K9Kk6rJ9M6M6K4mj8m6
7227A95n3k5NL4L2MopMMLMK3K3K3K3RJ0PQJ7j2m2m3l9l9j1j1MNj2J6N6N5K6kPPNNj%K5K6L8
7207D00J0k0k1NNnl3m1j3L5L5K6K7K6K7RQl9o7n8l0k0k0m5m5l2nJ9J8L8RJ5M3K4K4k3n0l5
7191B01l4j6j5j6j5ONOOpoooRQQRk4k3L3L3J0J0RJ0J0J0RJ0jjjjNOOOk2k2k2k3rrj0rmno0
7170E8o0j1j2M4M5L2L3N7J0l2o1p4k7J7J8K0K1MMMMN4N4O6L9Om1p0p0l0J6M6M6K1K1K1K1j9
7154B75j9j9j9n0n1ONPPOPK6K7K6K7J1J1J1J0K2K1K2K1N7N8j0n6o0n9o2o3k0k1k1k1J8J7l8
7137A09l8l7l5J9K0J2J1J2J2L7L8j8j9llllJ3J2J3J3OOONkllkJ5J6L1Ln5n5k8J8K4ml9m0m
7119E7K5QRJ0J1J0J1L4L4ol5j5j6l3nK8K7L0K9noonj4j4j2j2kK6O3O4O8K1m6m6j3j4j4j4j6
$$ plain form
7243 237 179 121 87 109 146 183 189 196 200 205 219 204 162 120 105 137 206 274 304 288 251 214 187 160 117 103 132 161 163 137 128 147 193 239 263 259 241 195
7227 195 142 117 122 156 188 192 186 179 183 187 190 194 217 240 263 286 295 305 312 320 337 325 283 240 201 162 151 140 144 149 137 153 209 264 290 288 295 302 307 312 311 311 336 362 400
7207 400 410 390 369 374 379 374 341 300 287 322 357 383 410 436 463 472 480 441 374 316 286 266 246 201 156 124 119 138 156 194 203 218 261 285 309 286 236 201
7191 201 167 151 136 120 105 111 116 122 128 121 115 109 103 112 120 128 137 113 90 123 156 166 176 185 195 205 215 224 234 233 232 231 230 235 241 247 253 231 209 187 164 155 146 136 127 123 118 58
7170 58 -2 -13 -25 19 64 96 129 186 196 164 103 29 2 19 37 57 78 82 86 90 94 148 202 268 307 313 272 202 132 102 118 164 210 231 252 273 294 275
7154 275 256 237 218 168 117 123 128 135 142 148 155 181 208 234 261 272 283 294 304 326 347 369 390 447 505 495 439 379 320 258 195 175 154 133 112 130 147 109
7137 109 71 34 -1 18 38 50 61 73 85 122 160 142 123 120 117 114 111 124 136 149 162 168 174 180 185 183 180 177 175 190 206 237 240 185 130 102 120 144 140 101 61 57
7119 57 82 90 99 109 120 130 141 175 209 203 168 153 137 104 99 127 154 184 213 208 202 196 191 177 163 151 139 137 163 226 290 358 379 333 287 274 260 246 232 216
7102B16j6j7j6%%kkJ2j6j%j6j5j5j5j0j1K8N7M8K1l8o6n0k1JK9K0K0NL3M7J9k0j9l4l4l3l2
7085E7OL3J8J8K6K5k8k9J2M0K5K4L5L4L4L5j%%jpqppl4l3l2l1k2OL0N9M3M3Mk4l1l1l3l3k4
7067A91k4k4k4l2l2m6j7K7N6O8O9K6kk6n4n7n7j7J0J9J8L2N9L9J1k8k7k7k6KJj9k0pK0K6K6
7051A34K6K6Nk3qqk0k1m6m7qK1M3P1P5M7ln0o7o7m0m0%K7O7O6O9M1j9m8m1j3kkmmj6m4m4m3
7034a0nK1P9P8N0Ll0l0nnMMk2k2m1j2K6K7Qk0k0QmmklopNL4L5L6jk8k6K1M9M9L1L1k5k6p1
7015A74p1j5j5M0M1O8O9L0L0k7k6n3n4k5K2O4L6k2m9l1kNNk6p3j14q7LN1M3J4mK4O2O3K9K9
6999B08K9K9n5n4k7J9J6j2rJ8L7L7j8j7j8j7j8j7j0j0M6M7J8J8J8J9L3L3k2k3l4l5ooLMk4
6983B00k5k3k2m8m8j8K8N8N8J6J6j2j2L6L7RRk8k8k8k8L0L1KLj2j1M4M5l9l9j1j1K9L0k7k7
$$ plain form
7102 216 200 183 167 167 167 165 163 175 159 158 158 142 127 112 97 87 76 104 161 209 230 192 126 76 55 56 85 105 125 130 163 210 229 209 190 156 122 89 57
7085 57 63 96 114 132 158 183 155 126 138 178 203 227 262 296 330 365 364 364 364 363 356 348 341 334 300 267 235 204 182 188 218 277 320 363 367 343 312 281 248 215 191
7067 191 167 143 119 87 55 9 -8 19 75 143 212 238 236 210 156 99 42 25 35 54 72 104 163 202 213 185 158 131 105 107 108 89 69 62 82 108 134
7051 134 160 186 191 168 160 152 132 111 65 18 10 31 74 145 220 267 264 214 147 80 40 0 0 27 94 160 229 270 251 203 162 149 147 145 141 137 121 77 33 -10
7034 -10 -15 6 85 163 213 216 186 156 151 146 150 154 132 110 69 57 83 110 118 98 78 86 82 78 76 73 67 60 65 99 134 170 169 141 115 136 185 234 265 296 271 245 174
7015 174 103 88 73 113 154 222 291 321 351 324 298 245 191 166 188 252 288 266 217 186 184 189 194 168 95 -19 -106 -103 -52 -9 5 1 25 87 150 179 208
6999 208 237 266 211 157 130 149 165 153 144 162 199 236 218 201 183 166 148 131 121 111 157 204 222 240 258 277 310 343 321 298 264 229 223 217 220 224 200
6983 200 175 152 130 82 34 16 44 102 160 176 192 180 168 204 241 250 259 231 203 175 147 177 208 210 213 201 190 234 279 240 201 190 179 208 238 211 184
6967A84%j%jj1j1j1j1nmnmL9M0M0M0l7l7l8l7JKJJl0l1kM5P4M7RJ0K8K9k8k8l9l9m0l9PPQ
6948A23PPQPPMMMMk2k1k2k2PQPPK8K9K8K8n1n0n1n1L5L6L6L5K2K2K3K2K8K8k9k8l6l7l6l6
6930A12RRRJ0J0J1QQk3o9n7k9nK3RRQQL4j2l3l3l5l5L2L1L2L2j2j2j1j2m2m4J3J3JKJJL6L6
6912D3L7L6M4M5J4l2m6m6ONnl3m9QL9L9j3j3K0K0J9K0j9j9L7L8M2M1j6j6o9r7n7jO7O7J4J4
6896A84NNNNj6j6j6j5J0J0RJ0l4l5l5l5M6M6M6M6l8l8j5M1L3Ml3l2j3j3j3j2l4l3M1O9O3Q
6879B10n3n3qpM9M9N2N3mlm3m2m2m2m1m1j8L8O3L5k4n2k1k1k3k2K0K0K1K0M3M2M2M2K6K6K5
6863C16K6OOOOK2K1l5l5j5j5j6j5j9j8j9j9L0K9L0K9MMMMMLK0rn7n8j9RQQoK2L3L4N1K3qq
6845C87rj0j6j7j7j6K5K5K3K3K6km0m1qK1KLj6m5m4j7lljjjkjjrj0pqJ0L8L6Qm4p2n8n9m0
$$ plain form
6967 184 184 183 183 182 171 160 149 138 133 129 124 120 159 199 239 279 242 205 167 130 131 133 134 135 105 74 72 117 191 238 247 257 285 314 286 258 219 180 140 101 108 115 123
6948 123 130 137 145 152 159 163 167 171 175 153 132 110 88 95 103 110 117 145 174 202 230 179 129 78 27 62 98 134 169 191 213 236 258 286 314 285 257 221 184 148 112
6930 112 121 130 139 149 159 170 178 186 163 94 37 8 3 26 35 44 52 60 94 82 49 16 -19 -54 -22 9 41 73 61 49 38 26 -16 -60 -47 -34 -33 -31 -30 -29 7 43
6912 43 80 116 160 205 219 187 141 95 101 106 101 68 19 27 66 105 92 79 99 119 138 158 139 120 157 195 237 278 262 246 177 80 23 22 89 156 170 184
6896 184 189 194 199 204 188 172 156 141 151 161 170 180 146 111 76 41 87 133 179 225 187 149 134 175 208 212 179 147 134 121 108 96 62 29 70 139 202 210
6879 210 157 104 96 89 138 187 239 292 288 285 242 200 158 116 75 34 16 54 117 152 128 76 55 34 11 -11 9 29 50 70 113 155 197 239 265 291 316
6863 316 342 348 354 360 366 388 409 374 339 324 309 293 278 259 241 222 203 233 262 292 321 325 329 333 337 341 344 364 355 298 240 221 230 238 246 240 262 295 329 380 403 395 387
6845 387 378 368 352 335 318 302 327 352 375 398 424 422 382 341 333 354 356 359 343 298 254 237 234 231 230 229 228 226 225 224 215 205 198 190 200 238 274 282 238 166 108 49 9
6826Im0%K8K1K3K4K4N1N0J0j8m2m3m3m3lK4RRJ3J2lK6L7L8N6K7K8K7K5K5nnnnk6k6m0j2K7
6809B64N5N7K9j5j5j5j5QL7N5rp3j02p0nPPJ1J1k9k8m5j6J0J0K8%j4j4j6j6OPOOJ4J4Q9J16
6792C50R1M4ol5n4n5n6n6J0J1J0J1j3j3j3j3l0k9k9l0L5L5L5L5M1M0j5j5k4k3k3k3oonoMM
6775A78MMJ0Rm6m6j8j7j8j7k0j9%k8oL9O9O8M7M7M7M7L7L6L7L7J%k8p6j01j00m8m7LMMMM0
6758A37M0M0M0J5J4J4J5poool8l9qL8N1N0K4k3l9l8m2m2K7K6K7K6j8j8j8j8k7k8k8k7K0J9
6742A47K0K0l0k9n8n8o4o5J9J9K7K8%%K1J9K1K1M2M2M2M2L4L3j3j4lkllj7j8j7j8ppppJ8J9
6725A94K0K0OL5M8qn1p9r7m0kK6L0Kj6j6K9K9K4K3mnk4k3k4k4K8K8j9j8JKL0K9QRN4N5j1j1
6708B58j5j4l1q6r5o6l7J9N4Q1P4J8j4j5QQQQ%j%%J9J9J9J9M0M0J2J1ONm0l9o0l1KN8O5Qn6
$$ plain form
6826 9 -31 -31 -3 18 41 65 89 140 190 200 182 140 97 54 11 8 32 41 50 63 75 72 98 135 173 229 256 284 311 336 361 356 351 346 341 315 289 249 237 264
6809 264 319 376 405 390 375 360 345 353 390 445 436 363 261 191 186 193 200 211 222 193 165 120 104 114 124 152 152 138 124 108 92 98 105 111 117 131 145 234 350
6792 350 441 485 479 444 390 335 279 223 233 244 254 265 252 239 226 213 183 154 125 95 130 165 200 235 276 316 301 286 262 239 216 193 187 181 176 170 174 178
6775 178 182 186 196 205 159 113 95 78 60 43 23 4 4 -24 -30 9 78 146 193 240 287 334 371 407 444 481 482 482 454 378 277 177 129 82 85 89 93 97 137
6758 137 177 217 257 272 286 300 315 308 302 296 290 252 213 205 243 294 344 368 345 306 268 226 184 211 237 264 290 272 254 236 218 191 163 135 108 128 147
6742 147 167 187 157 128 70 12 -52 -117 -98 -79 -52 -24 -24 -24 -3 16 37 58 100 142 184 226 260 293 280 266 263 261 258 255 238 220 203 185 178 171 164 157 175 194
6725 194 214 234 240 275 323 315 264 185 88 48 46 72 102 104 88 72 101 130 154 177 173 168 144 121 97 73 101 129 110 92 93 95 125 154 162 171 225 280 269 258
6708 258 243 229 198 112 17 -49 -86 -67 -13 68 142 160 146 131 139 147 155 163 163 162 162 162 181 200 219 238 278 318 330 341 347 352 312 273 213 182 184 242 307 315 259
6690B59n5k5L1O5O5L1L1j6j7jjjjl0l0l0l0%%%%J6J7J6J6j4j4j5j4J7J6J7J7L3L3l2l2k0k0
6673B82QQRQj9j9j%%%RJ0L4L4oo2p7p7pqppk3k2M2M3J2J3j6j5M4M4M4M4j5j4j5j5KJKJjjj
6653B66jpoM2R8R3L8l1l0l3l3o1o1o4o4KJJJJJpql6l6l6l4K8L0L3L4L3L4J7J8k9k9m4m3LM
6636H5L7L8L7L7POPOnonnj9j9j9k0n2n2ooJ9J9J9J9L8L8L8L9L4L5L5L5MNMMl9m0l8l8KK9M1
6617C48pk9l0l3l2j9k0K8K8j9j8j7j6K6N4O5J8l9m0m2m2M4M5M4M4KJJJk7k6k6k7J0RQl9n4
6601A74n5QPM0L9M0L9KLM9N0L9L9pqm3m3m3m3l8l9RQj2j2J6M4Lm3l1kJ9J8ppJ4J5k4p2q4q3
6583b1n3k5pL9P7P7O5J9jkJ0J0L5L6Rl8n7n6k8JL1L2J8J7J8J7K1K1k7k6%J%%mmmmrj0k5LL7
6564A93L7N3K5Jk6k9%N3N3K4mk6k5k7k7j9k0l5qK9K9J8rl1l1J5J4J4J3L8L9mn1n2n3l8l7n4
$$ plain form
6690 259 204 179 210 275 340 371 402 386 369 368 367 366 365 335 305 275 245 245 245 245 245 261 278 294 310 296 282 267 253 270 286 303 320 353 386 354 322 302 282
6673 282 290 298 307 315 296 277 276 276 276 276 285 295 329 363 357 295 218 141 134 126 119 112 89 67 109 152 164 177 161 146 190 234 278 322 307 293 278 263 265 266 268 269 268 267 266
6653 266 265 258 252 294 392 485 523 492 462 429 396 335 274 210 146 148 149 150 151 152 153 146 138 102 66 30 -4 24 54 87 121 154 188 205 223 194 165 121 78 81 85
6636 85 122 160 197 234 241 247 254 260 255 249 244 239 220 201 182 162 110 58 52 46 65 84 103 122 160 198 236 275 309 344 379 414 418 423 427 431 392 352 314 276 278 307 348
6617 348 341 312 282 249 217 198 178 206 234 215 197 180 164 190 244 309 327 288 248 206 164 208 253 297 341 343 344 345 346 319 293 267 240 250 259 267 228 174
6601 174 119 127 134 174 213 253 292 294 297 346 396 435 474 467 459 416 373 330 287 249 210 219 227 215 203 219 263 266 223 192 190 209 227 220 213 227 242 218 146 62 -21
6583 -21 -74 -99 -106 -67 10 87 152 171 170 168 178 188 223 259 268 230 173 117 89 90 121 153 171 188 206 223 244 265 238 212 212 213 213 213 209 205 201 197 188 178 153 156 193
6564 193 230 283 308 309 283 254 254 307 360 384 380 354 329 302 275 256 236 201 193 222 251 269 260 229 198 213 227 241 254 292 331 327 276 224 171 133 96 42
6548D2k6K1K1J2j6k9%K9K9K8K9LKj2J6K6K7j1l8m9m8o5l8J4M0L9J1kjJ0j9j8J0K6K7K9K8K9
6531A76K8K9K9onmmJ6M3K5K5j1n8m7j9lljkK5K5K5K5POK3ok0k1k2k3L6L6L6L6QQPQMNMMPP
6512D58m9m9n2n3n2n3%%j%J1J1J2J1L9L8L9L8ooool6l7l6l7j6j5j6j5k0k0k0k0L5L5L3L2K9
6495B00j8m4m4RN6Q3Q3L2j5m4m5k4k5n1mL7L8j6j5onnnKKKKnonnJJJJL3L2L3L2N1N1K1k6n6
6476C34n6n9n8qqM9M8K4K4K4K4j3j3j3j2J9J9qn6p0m2nnk2k1k2k2j7j7l0kN4J01J00N3J9k8
6460B85n9o0n3k5J5J5j8j8K0M7M1pl4l4j5j4j2j2K6P3M7M7J6J6J6J6nnnnJ4J5lK5M1J3m6p4
6443B84m3j5l1l1oK1OOK5K5M2J4qJ9J6j2m4p3p3m4k0RonK0K0K0K1llK5P1O3J6m8m9j1j1j2
6426A75j1K6K6N2Nqqj1j1J8J8J8J8J8J7J8J8l5l6l4l3OL4M2mm9p8r1m5K8K8L1L1J5J5J5J5
$$ plain form
6548 42 16 37 58 70 54 25 25 54 83 111 140 143 145 133 149 175 202 191 153 104 56 -9 -47 -33 7 46 57 55 54 64 45 27 37 63 90 119 147 176
6531 176 204 233 262 256 251 247 243 259 302 327 352 341 283 236 217 214 211 210 208 233 258 283 308 315 321 344 338 318 297 275 252 288 324 360 396 404 412 419 427 431 436 440 444 451 458
6512 458 409 360 308 255 203 150 150 150 149 149 160 171 183 194 233 271 310 348 342 336 330 324 288 251 215 178 162 147 131 116 96 76 56 36 71 106 139 171 200
6495 200 182 138 94 103 159 242 325 357 342 298 253 229 204 153 149 186 224 208 193 187 182 177 172 174 176 178 180 175 169 164 159 160 161 162 163 196 228 261 293 344 395 416 390 334
6476 334 278 219 161 153 145 194 242 266 290 314 338 325 312 299 287 306 325 317 261 191 149 144 139 117 96 74 52 35 18 -12 -14 40 141 241 294 313 285
6460 285 226 166 113 88 103 118 100 82 102 149 190 183 149 115 100 86 74 62 88 161 208 255 271 287 303 319 314 309 304 299 313 328 325 350 391 404 358 284
6443 284 241 226 195 164 158 179 185 191 216 241 283 297 289 308 324 312 268 195 122 78 58 67 61 56 76 96 116 137 134 131 156 227 290 306 258 209 198 187 175
6426 175 164 190 216 268 273 265 257 246 235 253 271 289 307 325 342 360 378 343 307 273 240 246 280 322 318 269 191 100 55 83 111 142 173 188 203 218 233
6410B33L2L1L1L2QQQRj3j3j3j3j9j9k0j9oom4p3l0jk0j9l5l3ML4MNONJ0RJ0RK6K6K4K4nl2
6392A55j7j7llllj5j4j3j3J2L9M0J2J3J3J2J1QQqK1L5L5L7L6POK3om8m9n0n0l0l1k7k8k6K1
6375I0M9M9L7Rl1l1k0k0j7j7j6L1P5M6kl1l2mK5K6M2J5l6l6J9J8qqpon0k2J8J8J6J6J5J6k5
6358B11k5k5k5j0j0qqK2N1N0K3j1j1K4N2K9k8n1n0kkkkK5K5K5K5mnmmmnmmk8k7k8k7QRRRm3
6339A40m2J8P4R9P0N0K1PPMNk0j9k0k0k7k7k7k7m7m7J0Rk1k2k1k1ooooM7M7M7M7R1R0O6Ro9
6321D57o9j6j6ppppj8j9j8j8j1j1j1j2J5J4J4J4J4J4J4J5QRRQJ0J0m6m6J5J5J6J5rj0rrK2
6304C32K2K2K1OONOQRQQm0m1m1m0n6n5n6n5QPQQJ0J0J0J0MLLLj3j4j3j4j3j4j3j3ononO5O6
6285A55P8N0mn2k6k7nononnl0l0m8jO7O6M9N0ppj2j2J5J6k3k4ON3M8M7M7M7L5j2m2m2n7n8
$$ plain form
6410 233 265 296 327 359 367 375 383 392 379 366 353 340 321 302 282 263 257 251 207 134 104 103 83 64 29 -4 0 34 38 43 49 54 64 73 83 92 118 144 168 192 187 155
6392 155 138 121 118 115 112 109 94 80 67 54 66 105 145 157 170 183 195 206 214 222 214 235 270 305 342 378 385 391 414 408 360 311 261 211 181 150 123 95 69 90
6375 90 139 188 225 234 203 172 152 132 115 98 82 113 188 234 232 201 169 165 190 216 258 273 237 201 220 238 230 222 215 209 159 137 155 173 189 205 220 236 211
6358 211 186 161 136 126 116 108 100 122 173 223 246 235 224 248 300 329 301 250 200 198 196 194 192 217 242 267 292 288 283 279 275 271 266 262 258 230 203 175 148 156 165 174 183 140
6339 140 98 116 190 289 359 409 430 437 444 448 453 433 414 394 374 347 320 293 266 219 172 182 191 170 148 127 106 100 94 88 82 129 176 223 270 361 451 517 526 457
6321 457 388 372 356 349 342 335 328 310 291 273 255 244 233 222 210 225 239 253 267 281 295 309 324 332 341 350 358 368 378 332 286 301 316 332 347 338 328 319 310 332
6304 332 354 376 397 403 409 414 420 428 437 445 453 413 372 331 291 235 180 124 69 77 84 92 100 110 120 130 140 144 147 150 153 140 126 113 99 86 72 59 46 40 35 29 24 89 155
6285 155 233 283 279 227 201 174 169 163 158 152 147 142 112 82 34 33 100 166 215 265 258 251 239 227 242 258 235 211 217 270 318 365 412 459 494 482 440 398 341 283
6267B83n8n7PPPPnnnmmlmmQRQQJJJJl2l2l3l2K0K0M9M8L2L3k4k4m0m0J5J6llllj5j5j6j5N7
6247A59N7N7N7L6L6L6L6nmrqJ0m7q9j17r9m4JK9K3K2K4K4qrqrL8L9j8j8QRk0k0J%J%jkjjq
6228A58ppqK3K4K3K3L7L8L7L8NMn1n1l3l3K3K4J8J9J5J5j3p0n2k4J3M0N5N5L3L4k3k3l0k9
6212C00k9l0j7j8j8j7QQQQkjkjK5K6K6K6l2l3nmL9L9l5o3m2J5K5ll9l8J5J6QQk0k0K6K6K6
6194B09K7L8L8j7j8n4n4n4n4m7m6m7m7K6K5K6K5N2N3N2N3J3J2J3J3J9J9J9J9kkkkl0k9o2p
6178A77K6km0l9K0K0K0K0rqqqJ6J6m0m0j2j2j2j2NOM2P1L3k2J1J1J1J1J1J1k3k2k3k3J7J6
6161B16l6l6lN3L7J0kjllk0j9k0j9nmJ5j3pN0J00M4n4j10p8J5N3N4LMLLLLk2k1k2k1J3J3J4
6144A87J3L9L9L9L9qrqql9l9l8l9k2k2k2k2k5k6k5k5l3l3K3K3L6L5L6L5L2L1L1L2J6J6J6J6
$$ plain form
6267 283 225 168 175 182 189 196 191 186 181 177 173 170 166 162 170 179 187 195 196 197 198 199 167 135 102 70 90 110 159 207 239 272 248 224 184 144 159 175 172 169 166 163 148 133 117 102 159
6247 159 216 273 330 366 402 438 474 469 465 456 448 458 411 322 205 106 62 63 92 115 137 161 185 177 168 160 151 189 228 210 192 200 209 189 169 170 170 171 171 170 168 167 166 158
6228 158 151 144 136 159 183 206 229 266 304 341 379 384 388 337 286 253 220 243 267 285 304 319 334 321 251 199 175 188 228 283 338 371 405 382 359 329 300
6212 300 271 241 224 206 188 171 179 187 195 203 201 200 198 197 222 248 274 300 268 235 230 226 265 304 269 206 164 179 204 201 162 124 139 155 163 171 151 131 157 183 209
6194 209 236 274 312 295 277 223 169 115 61 14 -32 -79 -126 -100 -75 -49 -24 28 81 133 186 199 211 224 237 256 275 294 313 311 309 307 305 275 246 184 177
6178 177 203 201 161 122 142 162 182 202 193 185 177 169 185 201 161 121 109 97 85 73 78 84 126 197 230 208 219 230 241 252 263 274 251 229 206 183 200 216
6161 216 180 144 141 194 231 241 239 238 235 232 212 193 173 154 149 145 160 147 140 190 290 334 280 170 92 107 160 214 217 221 224 227 230 233 211 190 168 147 160 173 187
6144 187 200 239 278 317 356 348 339 331 323 284 245 207 168 146 124 102 80 55 29 4 -21 -54 -87 -64 -41 -5 30 66 101 133 164 195 227 243 259 275 291
6128B91K7K7Kn4m8m8NNM0M1M0M1%j%jklkln0n1m7m6n7%O1O2M4M4j2j2kkkkm1m0m1m1L1L0L0
6109B13L1j%%%K5K6K5K5nnnnl3l4l4l3mlN3N3QQo7r4o7j1M9N0J0J1J1J1k5k4k4k5k2k2L4L4
6091A34n0n0J0O6P3M4QQk0k0j9k0J2J1J2J1j9j9j9j9L4L4L5L4N0N1K6l0n1n0n4n4o8o7j2j2
6076@LKLKj6j6J1N7R5O8J0j8j8J0M6M6J9k7k9k9KKL0L0L5L6L3L3Jm6p5p6qrrqj2j3j2j2K9
6058A70K9L0K9LMLMk6k6k6k6K9K8K9K9K3K3on4o7o7j3j4M9N0M7M8Ok1l2J5M1M1M5M4o3o2o2
6041B54o3l1l1K3K4j2l9ON3O5O6M0M0L7L6n7n6o5o4l6l6J9K0J9K0K0K0K0K0K0K1qpOOn0n0
6025B50j1j0J8J8m6m5m5m5J0J0J0J1k2k2k2k2k0j9K0M8O2O1QPK0K0L5Pl8l7n4k6J1L8K5K4
6010B29MLLLJ5J5J3J3J6j2LLK2K1l4l5j9j9j9k0PPOPk8k8J3M1N7N6M4J7j0l8k2k3J3M0K3K3
$$ plain form
6128 291 318 345 347 293 245 197 202 207 247 288 328 369 369 368 368 367 365 362 360 357 307 256 209 163 106 106 167 229 273 317 305 293 291 289 287 285 244 204 163 122 153 183 213
6109 213 244 243 243 243 243 268 294 319 344 339 334 329 324 291 257 223 190 186 183 236 289 297 305 238 144 77 66 115 165 175 186 197 208 183 159 135 110 88 66 100 134
6091 134 84 34 44 110 183 227 235 243 223 203 184 164 176 187 199 210 191 172 153 134 168 202 237 271 321 372 398 368 317 267 213 159 91 24 12 0
6076 0 3 5 8 10 -6 -22 -11 46 141 209 219 201 183 193 239 285 304 277 248 219 221 223 253 283 318 354 387 420 421 375 300 224 216 207 198 190 178 165 153 141 170
6058 170 199 229 258 261 265 268 272 246 220 194 168 197 225 254 283 306 329 323 269 202 135 122 108 157 207 254 302 308 287 255 270 311 352 397 441 378 316 254
6041 254 191 160 129 152 176 164 125 131 184 249 315 355 395 432 468 411 355 290 226 190 154 173 193 212 232 252 272 292 312 332 353 345 338 344 350 300 250
6025 250 239 229 247 265 219 174 129 84 94 104 114 125 103 81 59 37 17 -2 18 66 128 189 197 204 224 244 279 286 248 211 157 131 142 180 205 229
6010 229 233 236 239 242 257 272 285 298 314 302 305 308 330 351 317 282 263 244 225 205 212 219 225 232 204 176 189 230 287 343 387 404 394 356 334 311 324 364 387 410
5992D10kl0j4j4j6j6j8j8k2n0l5l4j6j5j5j5kkmmj2m0l9j2RRJ1J0NOj1J8J8J9K2K1N5Q2P9
5975C18N0jo7q6q6m9k2KL0L9J1k5k5K5P2O1L3OPj1J7J7J8J6J7k4p1o0l2KKn2n3KJJJj0rM6
5958A11M7P9P9J2l5o1o1qqmnmnL1L1Lm4l5pJ4M3O0O0NOk8k9k8k8LMLMqqpqJ9J9K0J9K2K2j6
5939B79m4qL9K7kk2k3k4k4rrqrl1l1mM3N7J0n1n2J0N6M4J5Nk3j0rk4k3k4k4j7j6j7j7N0M9
5922A29M9N0K3K4K4K3pqqpL6L6Ql8n8l0PQRRQPJ8j1k1K6O1O1Qn8r2r1l9l9llN3N3K7K7K7K8
5904C26m6m5m4m3N4Q3L8j0k9l0K4K4Q1Q2K7K8J8M6N6J0l4l3l7l6k1k0k0k0ppppk0k0k0k0o1
5888B60o0nmJ7J8J8J7JJJJL6L6L6L6k7k7k7k7k7k7k7k7J4J4J4J4K6K6K6K6l6l6l5l6N7N7N4
5871C78N3K5k3n2n2m4m5j6L1M1J3k2k2J4O1N0K2mlnnk2k1k2k1K4K4K4K4k1k0k1k0KLKLO4O5
$$ plain form
5992 410 408 378 364 350 334 318 300 282 260 210 175 141 125 110 95 80 78 76 72 68 56 16 -23 -35 -26 -17 -6 4 9 15 4 22 40 59 81 102 157 239 318
5975 318 368 367 300 214 128 79 57 59 89 128 139 114 89 114 186 247 280 286 293 282 299 316 334 350 367 343 272 212 180 182 184 132 79 81 82 83 84 74 65 111
5958 111 158 237 316 328 293 232 171 163 155 151 146 142 137 168 199 202 158 123 116 130 173 233 293 298 304 276 247 219 191 194 198 201 205 197 189 182 174 193 212 232 251 273 295 279
5939 279 235 227 266 293 291 269 246 222 198 189 180 172 163 132 101 97 140 197 207 156 104 114 170 214 229 234 211 201 192 168 145 121 97 80 64 47 30 80 129
5922 129 178 228 251 275 299 322 315 307 299 292 328 364 372 334 276 246 253 261 270 279 287 294 312 301 280 306 367 428 436 378 286 195 156 117 114 111 164 217 244 271 298 326
5904 326 280 235 191 148 202 285 323 313 284 254 278 302 383 465 492 520 538 584 640 650 616 583 546 510 489 469 449 429 422 415 408 401 381 361 341 321 260
5888 260 200 195 191 208 226 244 261 262 263 264 265 301 337 373 409 382 355 328 301 274 247 220 193 207 221 235 249 275 301 327 353 317 281 246 210 267 324 378
5871 378 431 456 433 381 329 285 240 224 255 296 309 287 265 279 340 390 412 408 405 400 395 373 352 330 309 333 357 381 405 384 364 343 323 325 328 330 333 397 462
5855D62QQnnonK2K3l3l4k0k1k0k1llllj3j4j3j3nnnmKLL1L0J8J8l5l6j9K8K9K9QPQQj%K7K8
5835D52%Jn5n6m2m3j4j5L2L3L2L2k1k1m9m8j0j0M6M7J0J0m6m6k8k8K9K8O2O2O1J4k8k7l0l0
5819C04l1l2l1l1qqJ9K0m5m6j5L1N3N2%%K3K3M9M8J4l4o3o3l6l5K1K1J6J6J6J6l9l9m0l9K0
5803A27J9K0J9L3L3L2L1n0p9q9m2K4K5K8K7J9J9J9J9K3K4nmn3n2LMool4l4J0J1O6O7N0N0K3
5786C71K2j0ro6o6l9l8J8J7MMMLO2O3P5M7J4l2l5l5j7j7n5q2o4j7M9M8K9K9JJmlllj2j2j2
5769B30j2RRRRJ2J3J3J2qrqrJ2J3RJ0J3l3o3o3k1k1k2k1l8l9J8J8llK3K3L0JrL8M1M0M4M3
5751C10j9k0k0j9j9j9j9j8K5K6K5K6MNMMJ9J9J9J9ooL7L7K9k7n6k8K4N2M1j5n2n2k8k8k7k7
5735B20k7k7j5j5j6j5K4K4O8O7N7%j5j5J2J2l5l5l8l8RQQQQQNNm2m2J5J5N9N8M1j5l0l1rr
$$ plain form
5855 462 470 478 473 468 462 457 479 502 469 435 415 394 374 353 350 347 344 341 328 314 301 288 283 278 273 269 271 274 305 335 353 371 336 300 281 309 338 367 375 382 390 398 397 397 424 452
5835 452 452 453 398 342 300 257 243 228 260 293 325 357 336 315 266 218 208 198 244 291 301 311 265 219 191 163 192 220 282 344 405 419 391 364 334 304
5819 304 273 241 210 179 171 163 182 202 157 111 96 127 180 232 232 232 255 278 327 375 389 355 292 229 193 158 179 200 216 232 248 264 225 186 146 107 127
5803 127 146 166 185 218 251 283 314 264 185 96 54 78 103 131 158 177 196 215 234 257 281 276 272 219 167 170 174 168 162 128 94 104 115 181 248 298 348 371
5786 371 393 383 374 308 242 203 165 183 200 204 208 212 215 277 340 415 462 476 444 409 374 357 340 285 203 139 122 171 219 248 277 278 279 275 272 269 266 254 242 230
5769 230 218 227 236 245 254 266 279 292 304 296 287 279 270 282 295 304 314 327 294 231 168 147 126 104 83 45 6 24 42 39 36 59 82 112 113 104 142 183 223 267 310
5751 310 291 271 251 232 213 194 175 157 182 208 233 259 263 268 272 276 295 314 333 352 346 340 377 414 443 416 360 332 356 408 449 434 382 330 302 274 247 220
5735 220 193 166 151 136 120 105 129 153 221 288 345 345 330 315 327 339 304 269 231 193 202 210 218 226 234 242 247 252 210 168 183 198 257 315 356 341 311 280 271 262
5718B62l7l7OOPOk9k9l0k9J9J8J8J8L5L6PPJ2J3l5l4j3j3L5L6O1Q9P6J9m1o8p2m4nnllj7j8
5700B24j7j8MLMLQQQQNON2N2L4L3NOk3k3o6o6l4K2L9O6N5K7jjK9N7M0qm5m5m6m5l4J3L3L4
5682D06j1j1j1j1JJJJooooppppj3j4j4j4N2N2O5L6k5p2r4r4n3n3ponnM2M2K0K1ppK7K7jjL
5663B16KKKJ7J7J7J7j1j1j1j1J%JJK8K9K9K8K9K8K9K9l7l8l7l7j1j2j1j2k8k8k8k8k7k8L7
5646A53L8M5M6kjl3l3nmJ0J0j7j8k6k6k5k6K4K4K4K4K8K8K9K8K8K8j8j9j3j2m1m1m0m0J6J6
5630A59rj0l8l7lkN4N4K1K2l5l4J9J9K0J9L2L2L2L2j8j7j8j7J2J3J3J3k7k7k7k7jjkjnoon
5613A93JKJKK4K5K5K4QRQQ%%%jk1k1k1k2K1K0K3K2K6N4O8J1l4o2l9j2jk8o4o4l8J8M3M3K7
5595B78K8K8K7J9J8J9J8l3l2l2l3K2K2pok4k4L3L2ppl3l3j5J2L0k6n7k9L0N7N8N8Q5Q4M1j5
$$ plain form
5718 262 225 188 194 200 207 213 184 155 125 96 115 133 151 169 204 240 247 254 266 279 244 210 197 184 219 255 316 405 481 500 459 391 319 275 270 265 262 259 242 224
5700 224 207 189 193 196 200 203 211 219 227 235 240 246 298 350 384 417 422 428 405 382 316 250 216 238 277 343 398 425 424 423 452 509 549 541 496 451 405 360 326 339 372 406
5682 406 395 384 373 362 363 364 365 366 360 354 348 342 335 328 321 314 301 287 273 259 311 363 428 464 439 367 273 179 126 73 66 60 55 50 92 134 154 175 168 161 188 215 214 213 216
5663 216 218 220 222 239 256 273 290 279 268 257 246 247 247 248 249 277 306 335 363 392 420 449 478 441 403 366 329 318 306 295 283 255 227 199 171 144 116 153
5646 153 191 236 282 280 279 246 213 208 204 214 224 207 189 163 137 112 86 110 134 158 182 210 238 267 295 323 351 333 314 301 289 248 207 167 127 143 159
5630 159 150 140 102 65 62 60 114 168 189 211 176 142 161 180 200 219 251 283 315 347 329 312 294 277 289 302 315 328 301 274 247 220 219 218 216 215 210 204 198 193
5613 193 194 196 197 199 223 248 273 297 305 314 322 330 330 330 330 329 308 287 266 244 265 285 308 330 356 410 478 489 455 393 354 342 341 313 249 185 147 165 208 251 278
5595 278 306 334 361 380 398 417 435 402 370 338 305 327 349 342 336 312 288 321 353 346 339 306 273 258 270 300 274 217 188 218 275 333 391 476 560 601 586
5579E86l9m0m3m3j5j5M6M5j1p6j03j04p7l1rrK2K2onnoN5N5K5k2m0m0J4J3M3M4M3M3K4K5l2
5563C34l1K6K7K7K6j2j1j2j2poppk4k5L1L2j4j3J4J5J4J5m2m2k2k2OOK1K1qpk0k1QQQQQPO2
5545C59O1NMk0k0k0k0OPL4L5j4j4p0p0o7o7j1j2JJL0K9MNMNK2K3K3K2kkkkNMNNJ5J6J5J5J4
5526C61J4j5j4l1l1K5K6N4N4lkqrqqk1k1m8m9o0o0L3L3M4M3M3M4M0M0j6j6l1l0lkrrrqn6n6
5508B21l2K5J9K0K3K3J0J1J0J0NNNOj5j4J4J4M0L9j6j6rrj1j0n6q4r7m2L4O3O6L7NNk5k5l0
5491B19k9K7K7j3j2j3j2%jK8K8J1J1M6P3M1n2q9q8m1J6L6L7N4kk3k3J4P0N5K6onqpl8l7r0
5474B30r0p0j5J0J0J9K0M7M7lmlmO1O1L8j8k5LL6L6Pn0m5m6j8j7J1J1JJk8k7k8k8K4K4L6k0
5457A94m4m5J9J8J9J8K3K4l3l3k4k3k4k3j3j2J2O8P4P3J6m1p9p9k6k6K1K1M9M9K4K3K4K4R
$$ plain form
5579 586 547 507 464 421 406 391 437 482 471 395 292 188 111 80 71 62 84 106 100 95 90 84 139 194 219 197 157 117 131 144 187 231 274 317 341 366 334
5563 334 303 329 356 383 409 397 386 374 362 355 349 342 335 311 286 317 349 335 322 336 351 365 380 338 296 274 252 258 264 285 306 298 291 271 250 258 266 274 282 290 297 359
5545 359 420 425 429 409 389 369 349 355 362 396 431 417 403 333 263 196 129 118 106 107 108 138 167 171 176 180 185 207 230 253 275 273 271 269 267 272 276 281 286 301 317 332 347 361
5526 361 375 360 346 315 284 309 335 389 443 440 438 430 421 413 405 384 363 315 266 206 146 179 212 256 299 342 386 426 466 450 434 403 373 370 368 359 350 341 333 277 221
5508 221 189 214 233 253 276 299 309 320 330 340 345 350 355 361 346 332 346 360 400 439 423 407 398 389 378 368 312 228 131 89 123 186 252 289 294 299 274 249 219
5491 219 190 217 244 231 219 206 194 194 193 221 249 260 271 317 390 431 379 290 202 161 177 213 250 304 302 279 256 270 340 395 421 415 410 402 395 357 320 230
5474 230 140 70 55 65 75 94 114 161 208 205 201 198 194 255 316 354 336 311 314 350 386 393 343 298 252 234 217 228 239 240 241 213 186 158 130 154 178 214 194
5457 194 150 105 124 142 161 179 202 226 193 160 136 113 89 66 53 41 53 121 195 268 284 243 164 85 59 33 54 75 124 173 197 220 244 268 277
5442B77RRRKKKKk5k4LMK4K3l3l2l1l1K5K5L0K9K9K9M9M9M9M9m4m5m5m5RRRJ0qqqqm1m1J5J5
5424C27J1J0j7j8rj0j0j0j0j0j0j1llllk4k3k4k4JKK9K9K2K1l4l5k8k7k5k5k5K1O0O1M6M7
5407B66J8J8J2J2l5l4k8k8J9J9L2L3j5j4lkM4M4J8J8M3M4K9j8l8l8k6k5k3k3j9K7O4O4K6k0
5392D61m1m0K2K3K2K3k6k6p2j01j02n5K7P4O4km6m6k1k2k1k1N4N4K7K6LKm4m5ooK2K2L4L4
5376B51L4L4%%J%J%%JK6K6K7K6k8k7k8k7j1j0j1j0M1M1M2M1J3J2j5j6m5m5r0q9q9m3%K7K3
5359H3K3K5K4J5J5J5J5J5J4J5J5RRQRK3K4K3K3m3m3LKKk6l7J1N9N9K3k4n6n7j3j2MNk4k3J6
5342B28J6l0l1%%K8K8l1l0l0l1NMNNk0k0K7K7j7j6J1J2J5J4j3j4K5K4K5K4KKJKRJ0RRpppp
5323B56j0j1j0j0L4L4L4L4K3K3K2K3mlllKLKKl9l9l9l9QPN2N2nn2m2j3opnnPPL5L5L3L2j4
$$ plain form
5442 277 286 295 304 306 308 310 312 287 263 266 270 294 317 284 252 221 190 215 240 270 299 328 357 406 455 504 553 509 464 419 374 383 392 401 411 403 395 387 379 338 297 312 327
5424 327 338 348 331 313 304 294 284 274 264 254 244 233 230 227 224 221 197 174 150 126 127 129 158 187 209 230 196 161 133 106 81 56 31 52 112 173 219 266
5407 266 284 302 314 326 291 257 229 201 220 239 271 304 289 275 272 270 314 358 376 394 437 481 510 492 454 416 390 365 342 319 300 327 391 455 481 461
5392 461 420 380 402 425 447 470 444 418 346 245 143 88 115 189 253 251 205 159 138 116 95 74 128 182 209 235 238 240 196 151 145 139 161 183 217 251
5376 251 285 319 319 319 320 320 321 321 321 322 348 374 401 427 399 372 344 317 306 296 285 275 316 357 399 440 453 465 450 434 389 344 254 165 76 33 33 60 83
5359 83 106 131 155 170 185 200 215 230 244 259 274 283 292 300 309 332 356 379 402 359 316 319 321 323 297 260 271 330 389 412 388 332 275 262 250 254 259 235 212 228
5342 228 244 214 183 183 183 211 239 208 178 148 117 122 126 131 136 116 96 123 150 133 117 128 140 155 169 156 142 167 191 216 240 242 244 245 247 256 266 275 284 277 270 263 256
5323 256 246 235 225 215 249 283 317 351 374 397 419 442 438 435 432 429 431 434 436 438 399 360 321 282 290 297 349 401 396 344 302 289 283 276 271 266 273 280 315 350 383 415 401
5304D01j5m0m0j2j2k0k1j9K8M4M3J5J5j9o7n4k5k0RJ0j8j0j1j2j3J8J8J8J8k7k6k7k6K2K3
5289A48K2K3LKLLj9j8j9j8j6j6m5KK7j8n8k8N6J22J01P3M7J9L3L3n4n4n3n4NNNNkkjkm4m4
5272A72k5M0Q7Q6O1J4j1j1j4j4POPOj0rj0j0k0k0j9k0KLKLL3L4k2k3l0l1k8k7nM1L1Mj4j3
5255B53j5j5K5K5K5K5j5j5j4j5l4l3l4l3j6j7M1M0K9K9K9L0K4K5l2l1l2l2k8k9j6L1L1j6n0
5239A40m9J2O0O8L9LKJ2J2J3J2l6l5l6l6j6j7j6j7k7k7K9K9K5K5K4K5j0j1M6M6O1O1O1O0n5
5224D77n6n6n6p4p3m4LJ3J4J6J6O2O3P6M7Jm6p7p8j5j6M1M1M4M4j2j2J4J5J4J4j6j6j6j6k5
5208C11k5L1L2M2M3j3j3k4k3k3k3k0k0k0j9j7j6j6j7M1M1j5j5j0j1Rk0j6L1K9j7l2l2l5l5
5193H3J9J9J9J9j6j5j6j6j6j5j6j6J6J6J6J6NMMNQRQRJ9J8J9J8L2L2L1j6m1m0MLj8j8j8j8
$$ plain form
5304 401 386 346 306 294 282 262 241 222 250 294 337 352 367 348 281 227 202 182 191 201 183 173 162 150 137 155 173 191 209 182 156 129 103 125 148
5289 148 170 193 196 198 201 204 185 167 148 130 114 98 53 55 82 64 6 -22 34 156 257 330 377 396 429 462 408 354 301 247 252 257 262 267 265 263 262 260 216 172
5272 172 147 187 274 360 421 435 424 413 399 385 392 398 405 411 401 392 382 372 352 332 313 293 295 298 300 303 336 370 348 325 295 264 236 209 204 245 276 280 266 253
5255 253 238 223 248 273 298 323 308 293 279 264 230 197 163 130 114 97 138 178 207 236 265 295 319 344 312 281 249 217 189 160 144 175 206 190 140
5239 140 91 103 163 231 270 273 275 287 299 312 324 288 253 217 181 165 148 132 115 88 61 90 119 144 169 193 218 208 197 243 289 350 411 472 532 477
5224 477 421 365 309 235 162 118 121 134 148 164 180 242 305 381 428 429 383 306 228 213 197 238 279 323 367 355 343 357 372 386 400 384 368 352 336 311
5208 311 286 317 349 391 434 421 408 384 361 338 315 295 275 255 236 219 203 187 170 211 252 237 222 212 201 210 190 174 205 234 217 185 153 118 83
5193 83 102 121 140 159 143 128 112 96 80 65 49 33 49 65 81 97 102 106 110 115 123 132 140 149 168 186 205 223 255 287 318 302 261 221 225 228 210 192 174 156
5176A56mllmK1K1K1K0NMNMQQRQQQQQqqqqrqn6q3n3pL3L3N5Q3O5J9k7k7l1l0l2l2J4J4lllm
5155A84pppqk6k6k6k6j6j7M9M9J3J3K2N1M5jk0k1M7M7M7M6nnnok7k6k7k7J7J8J7J8ppppj4
5137C05j4J4J4J3J2l4l4n4n4pqmmM1P0O8J1k1k1KKKKlkkkkklkk3k3k3k3J1J0J1J1J1J0J1J1
5118B77j0rj0j0ppK1K0M7M7L1k5n8n8o1o2ooM1M1N7N7J1J0ppqpk0k0k0k0L1L1j6j6k7k6JK
5101B02K9K9K9K9kjjkm7m7l2K5P8P9M8qm4m4j9k0J7J6O3O3j2j1j2j1o3o2o2o3POOPonK2K3
5084B04K4K3k4k3rrrqnnM3M2K7K8K5K4j7o4o3j5K6N4L9pn3n4%%L5L6PPk5k6LLJ9J9M7M7K2
5066C88K3nok9l0l0l0k9k9l0k9J3J3J3J3K2K3K2K3L2L3k4k3n7n6k8k8K3K2K3K3pppoK6K6K5
5050B96K6l1l1k9l0K4N2M7j9o7l8J8M5K8j%K8Mk4opL4L4L5L4j6j6j6j6J7J6J7J7l0l0l0l0
$$ plain form
5176 156 152 149 146 142 163 184 205 225 230 234 239 243 251 259 268 276 284 292 300 308 300 292 284 276 267 259 203 120 67 60 93 126 181 264 329 348 321 294 263 233 201 169 183 197 194 191 188 184
5155 184 177 170 163 155 129 103 77 51 35 18 67 116 129 142 164 215 260 259 239 218 265 312 359 405 400 395 390 384 357 331 304 277 294 312 329 347 340 333 326 319 305
5137 305 291 305 319 332 344 310 276 222 168 161 153 149 145 186 256 324 335 314 293 295 297 299 301 298 296 294 292 290 288 285 283 260 237 214 191 202 212 223 234 245 255 266 277
5118 277 267 258 248 238 231 224 245 265 312 359 390 365 307 249 188 126 120 114 155 196 253 310 321 331 324 317 309 302 282 262 242 222 253 284 268 252 225 199 200 202
5101 202 231 260 289 318 316 315 314 312 265 218 186 211 289 368 416 408 364 320 301 281 298 314 377 440 428 417 405 394 331 269 207 144 151 157 163 170 164 159 181 204
5084 204 228 251 227 204 195 186 177 169 164 159 202 244 271 299 324 348 331 267 204 189 215 269 308 301 248 194 194 194 229 265 272 279 254 228 231 234 253 272 319 366 388
5066 388 411 406 400 371 341 311 281 252 223 193 164 177 190 203 216 238 261 283 306 338 371 347 324 267 211 183 155 178 200 223 246 239 232 225 219 245 271 296
5050 296 322 291 260 231 201 225 277 324 305 238 200 218 263 291 290 290 318 322 298 292 285 319 353 388 422 406 390 374 358 375 391 408 425 395 365 335 305
5034C05j6j7J2J1K4K5l2l2j5j4J3J4kkkkJK%jl1n9m1NO2O2L5j1l4l4k5LK7K7K6k0m6m7rJ9
5016A81ppnnL9M0L8L7J2j7jjMLMMkkK5K4L3Nl6l5m5m4n8l1lK5J1J1K6K7K7K6%jj8J0K0qm5
4998B61m5jK8L8L7J3j5%JJJJJQQQQkklkj7j6j7j6NMK1qNNLLj6j5K3N1N1K3j6j5k1k1k0j9K
4978C23K9L0Kk7k6k8k8k3k3m9m9m8k0ML3M2M2K6N5O2L5j3o0o2l5k4k5n0m9j9K7N7N6O0N9K4
4962C08K3k9l0j0L7L9qn3k5J2J2K1K1K1K1j9k0p3p3%M6M7jl9m0m0m0k8J9M9M9K5K4K5K4j4
4946B81j4j5j4ONONOONOj1j2j1j1M1M0M0M1rrrrrrrrnmnnn1n0ONK5K4K5K4MNNMj7j7j6j7K5
4926B93K5K6K5k2k2k2k2PQPPK1K1j6m5j1L6K3nj8j9j8j7l4J4M3M3j6j7j6j6ooonJ0J0J0J0
4909B80N2N2N2N3k1k0k0k1j0rj0j0j8j8L8L8OOPON0N0M9N0J1J2m5m5m0l9m0l9k0j9k0j9o2
$$ plain form
5034 305 289 272 284 295 319 344 312 280 265 251 264 278 276 274 272 270 271 273 273 272 241 182 141 146 208 270 305 294 260 226 201 204 231 258 284 264 218 171 162 181
5016 181 174 167 162 157 196 236 274 311 323 306 305 304 308 311 315 319 317 315 340 364 397 402 366 331 286 242 184 153 150 175 186 197 223 250 277 303 303 302 284 294 314 306 261
4998 261 216 215 243 281 318 331 316 316 317 318 319 320 321 329 337 345 353 351 349 346 344 327 311 294 278 283 287 308 300 305 310 313 316 300 285 308 359 410 433 417 402 381 360 340 321 323
4978 323 352 382 384 357 331 303 275 252 229 180 131 83 63 67 100 142 184 210 265 327 362 349 289 227 192 168 143 93 44 25 52 109 165 225 284 308
4962 308 331 302 272 262 299 338 330 277 252 264 276 297 318 339 360 341 321 248 175 175 221 268 267 228 188 148 108 80 99 148 197 222 246 271 295 281
4946 281 267 252 238 244 249 255 260 266 272 277 283 272 260 249 238 279 319 359 400 391 382 373 364 355 346 337 328 323 319 314 309 258 208 214 219 244 268 293 317 321 326 331 335 318 301 285 268 293
4926 293 318 344 369 347 325 303 281 288 296 303 310 331 352 336 291 280 316 339 334 316 297 279 262 228 242 285 328 312 295 279 263 257 251 245 240 250 260 270 280
4909 280 332 384 436 489 468 448 428 407 397 388 378 368 350 332 370 408 414 420 427 433 483 533 582 632 643 655 610 565 525 486 446 407 387 368 348 329 267
4893B67o2n9n9l8RM0L9L4L3L4L4J4J3J6J6k0RK2k5p6l0M2Q9P9J3m1m1J6J7J6J6l4l4l3l4k3
4877B59k3L1L1J2j6k6K0K8K8K9K8l4q1o8m0ML3J9J8l6l5l6l6m4m4J2J2j1j1j1j1K5K5K5K5
4862A01K7K8K7K7J6J7J8J8L3O2J5l1o4o4j2j2Mk3qpOONOj4j4j2j3jK7K7kj8j9l1n9q4n7J3
4845f2M1J9J8N0P9P4M6J4j4m5m4l5qj7m5o8l9RN6M7K0QQj0J9J9J9K1K2L7L7N2K3J4j3m5m5
4829B62k4ML3L3Kk7l5l6j8K8M7J8nnppPOPPnnmnqqqql5l5n1k2L8L9M1M0L7L6L5L5ll1j5j5
4810C33J3J3J3J3JJ%%l8o6o6l8QPJ0RllllPOPPj3j3J5M3Om2m0PL5L4%m7n1k4NMJ3J3J2J3M
4790B02MMMPQPPJ5J4M0L9K1k6o0l2J5M3K9K9K3K3K3K3N1N1NMk1k2m9m9m5m5KKjjK7K8QPQQ
4772D30qrn5n6l2l3l2l3QQPQqrrqL4L4L3L4J5J6l2l2k1k2M4M4P4P5Jm5m5LL8L9pql6l5l9l8
$$ plain form
4893 267 205 146 87 49 58 98 137 171 204 238 272 286 299 315 331 311 320 342 317 241 211 253 342 421 434 393 352 368 385 401 417 383 349 316 282 259
4877 259 236 267 298 310 294 268 288 316 344 373 401 367 286 218 178 182 215 234 252 216 181 145 109 65 21 33 45 34 23 12 1 26 51 76 101
4862 101 128 156 183 210 226 243 261 279 312 374 389 358 294 230 218 206 210 187 179 172 178 184 189 195 181 167 155 142 141 168 195 193 175 156 125 66 -18 -75 -62
4845 -62 -21 -2 16 66 145 219 265 279 265 220 176 141 133 116 71 3 -36 -27 29 76 96 104 112 102 121 140 159 180 202 239 276 328 351 365 352 307 262
4829 262 238 242 275 308 310 283 248 212 194 222 269 287 282 277 270 263 270 276 283 290 285 280 276 271 263 255 247 239 204 169 118 96 134 173 214 254 291 327 362 397 394 363 348 333
4810 333 346 359 372 385 386 387 387 387 349 283 217 179 187 194 204 213 210 207 204 201 208 214 221 228 215 202 217 260 266 224 184 191 226 260 260 213 162 138 143 147 160 173 185 198 202
4790 202 206 210 214 221 229 236 243 258 272 312 351 372 346 286 254 269 312 341 370 393 416 439 462 513 564 569 573 552 530 481 432 387 342 344 346 345 344 371 399 407 414 422 430
4772 430 422 413 358 302 270 237 205 172 180 188 195 203 195 186 177 169 203 237 270 304 319 335 303 271 250 228 272 316 390 465 466 421 376 379 417 456 449 441 405 370 331 293
4753B93JM7O4O4JKk2k1k2k2k2k2k2k2J8J8J9J8KKKKk9k9l1l0%k7l8RM7M6ppj3j2J6J5nono
4735B66M5M5M6M5MMLMl1l2l1l1m5m4m5m4NMNNNNNNJ6J6M4M4N0N0ooj1j0o3o4n1lK6K6JJ%J
4716B59j6j7j7j7j3j3j0j1J1N8L2L2nnnoj8j8j9j8kkkknnnnm2m3j2L4M7M7K2K1j7j8j7j7N7
4698B18N8N8N8J1J1m5m5k7k7L0K9K9K9k7k6q3q2k7k6L4L4L5L4L7L8L7L7lll1p8q0n2j5j4J3
4683A39J3O6O6O4J6j3j3K9L0JKj9j8J0J0j2j1j1j1j0ro6o5n1n1ONK9K9%JK7K7K7K8j1j1j0
4666B33j1JKJJj1j0j1j0RRm7m6RJ0J0RJ5J5J5J5nnK3K3mmN0N0Q1N4Km5n2n2n4n5o7o6j1j0
4649F1L1L1KLj8j9L7L7L5L4L4L5k1k2k1k1NMNMM4M3M4M3k4k5k4k4o5o5r2m4KJPOK7N6M0M0
4631B26JKKKppnnML1L1Ml0l0l2l1PPPPMNM3P1M7J9L4L5%k8j2j2k1k0k1k1l2l1m8j9nmkjJ2
$$ plain form
4753 293 294 341 405 469 470 472 450 429 407 385 363 341 319 297 315 333 352 370 372 374 376 378 349 320 289 259 259 232 194 203 250 296 289 282 269 257 273 288 283 277 272 266
4735 266 311 356 402 447 451 455 458 462 431 399 368 337 292 248 203 159 164 168 173 178 183 188 193 198 214 230 274 318 368 418 412 406 395 385 322 258 207 204 230 256 257 258 258 259
4716 259 243 226 209 192 179 166 156 145 156 214 246 278 273 268 263 257 239 221 202 184 182 180 178 176 171 166 161 156 114 71 59 93 140 187 209 230 213 195 178 161 218
4698 218 276 334 392 403 414 369 324 297 270 300 329 358 387 360 334 251 169 142 116 150 184 219 253 290 328 365 402 399 396 365 287 207 155 140 126 139
4683 139 152 218 284 348 364 351 338 367 397 398 400 381 363 373 383 371 360 349 338 328 319 253 188 137 86 92 97 126 155 155 156 183 210 237 265 254 243 233
4666 233 222 223 225 226 227 216 206 195 185 194 203 156 110 119 129 139 148 163 178 193 208 203 198 221 244 240 236 286 336 417 471 473 428 376 324 270 215 148 82 71 61
4649 61 92 123 125 128 110 91 128 165 200 234 268 303 282 260 239 218 223 227 232 236 280 323 367 410 386 361 337 313 248 183 91 47 49 50 57 63 90 146 186 226
4631 226 227 229 231 233 226 219 214 209 213 244 275 279 249 219 187 156 163 170 177 184 188 193 236 307 354 373 407 442 442 414 402 390 369 349 328 307 275 244 196 177 172 168 166 165 177
4612A77L9K2K2N0K2j8j8ppopj0j1qrj0J7KJj4j4j2j3J0L7P6P6K6lJ4J3rj0M5M5L3Nj8m6l2
4594D50mol4n0m9j2J7LLKLj1l9m0j1K6K6K8K8j2j2j2j2JKj4J4M2M2j2j1nK3PPj5j6j6j6j4
4577C01j4j5j4pqppM3M4M3M4k1k1p6p7k8k7k8k8opopLLN9N8K2K1K2K1O6O6%m6l0kL5L6J6J7
4559D38j1n8q9o1jK6J2J3J4J4M6M5M6M6K2K2K2K2m6m6m6m5m8m7m8m8J1J1J1J1K1K1K1K0J3
4544C34J3J2J3k1k0L5L6J1J1QQj3n9m9k1J5J4J6J6nnmnnnmnOPOPl4l3l3l3K6K6K6K6mmmmM1
4525C43M1M1M1j7j7j8j7J8J7J8J8J3J3l4l4m3m4K2K1N8N7J1J1m3m2m3m2K2K2K3K2j7j8j7j8
4510C68L7L6L3L3j2o8l7l7m7m7j9j9M4M4llJ3J2j6j5l3l4nnl1l1m3j6L4Q9Q5Q6M5J6J8l9o7
4494C66o7j9L9N8N9L4L3l5l6l5l6k1k1k1k1m1m2m1m2lmlmM8M7K0J9ppN7N7N9L1no0o4l6qr
$$ plain form
4612 177 216 238 260 310 332 314 296 289 282 276 269 259 248 240 231 221 238 240 241 227 213 201 188 198 235 311 387 413 410 424 437 428 418 463 508 541 546 528 482 450
4594 450 446 440 406 356 307 295 312 315 318 320 323 312 273 233 222 248 274 302 330 318 306 294 282 283 285 271 285 327 369 357 346 341 364 371 378 363 347 331 315 301
4577 301 287 272 258 251 243 236 229 272 316 359 403 382 361 285 208 180 153 125 97 91 84 78 71 74 77 136 194 216 237 259 280 346 412 412 366 336 334 369 405 421 438
4559 438 427 369 280 219 218 244 256 269 283 297 343 388 434 480 502 524 546 568 522 476 430 385 337 290 242 194 205 216 227 238 259 280 301 321 334
4544 334 347 359 372 351 331 366 402 413 424 432 440 427 368 319 298 313 327 343 359 354 349 345 340 335 330 326 321 327 334 340 347 313 280 247 214 240 266 292 318 314 310 306 302 343
4525 343 384 425 466 449 432 414 397 415 432 450 468 481 494 460 426 383 339 361 382 440 497 508 519 476 434 391 349 371 393 416 438 421 403 386 368
4510 368 405 441 474 507 495 427 390 353 306 259 240 221 265 309 306 303 316 328 312 297 264 230 225 220 189 158 115 99 133 222 307 393 438 454 472 433 366
4494 366 299 280 319 377 436 470 503 468 432 397 361 340 319 298 277 236 194 153 111 108 104 101 97 145 192 212 231 224 217 274 331 390 421 416 356 292 256 248 239
4477B39MLK8K8Nn1o6o6RRJ0RK3K2K3K3L4L4M6J9l5r1o1o1j4j3j3j4L4L4O6Rj7j7PPrqN3N3
4460B95K8k8m4m3rqJ9K0L5L6PPjjk9k9o5o6j9k0KKKKK2K3J9J9Kn4n0n0qqK6Q2Q8Q8K6K7k4
4442C21k4k4k4K6K6K5K6LLMLl7l7l6l7k0k0j9k0l9m0l9l8kkK5K6L8L8qrk8k8%%M2M2M1M2N8
4424B58N9J1J2l6l5qpQQn7n8k2k3k3k3l1l0J6J6O2O2L4L5k6k5n3n3llllmmR0R0P7P6K1K1K2
4407D48K2Jn5o7j1K6ln0n1n2n2k2k1L4L4K3K3K2K3k8k7k8k8K3K2K3K2NNNNm2m3j7L8M8M8N1
4391C54N2l2l2l2l2L5L6L6L6n4n4o7l8M5J00J00M4J3j5k1Pol4j7j6J0J1J1J0l0l1l0l0n1n1
4375B27NNK7K8K7K7K1K0K0K1L0L1k5k5l5l6l5l5j3j3j3j2M6M7N9L1m7j03p3p3k3k2L3L4NN
4360A66ONL3L4k3k3k0j9L7L6N1N0J0j7k5k4K8K8Nk4j0j0j0l8m9kK0K1M0J2ppqqK6K5l0l0j5
$$ plain form
4477 239 243 246 274 302 307 256 190 124 133 142 152 161 184 206 229 252 286 320 366 385 350 259 198 137 123 110 97 83 117 151 217 226 209 192 199 206 197 189 242 295
4460 295 323 295 251 208 199 191 210 230 265 301 308 315 314 313 284 255 190 124 105 85 87 89 91 93 115 138 157 176 178 124 74 24 16 8 34 116 204 292 318 345 321
4442 321 297 273 249 275 301 326 352 355 358 362 365 328 291 255 218 198 178 159 139 100 60 21 -17 -19 -21 4 30 68 106 98 89 61 33 33 33 75 117 158 200 258
4424 258 317 328 340 304 269 261 254 262 270 213 155 133 110 87 64 33 3 19 35 97 159 193 228 202 177 124 71 68 65 62 59 55 51 141 231 308 384 405 426 448
4407 448 470 471 416 349 338 364 361 311 260 208 156 134 113 147 181 204 227 249 272 244 217 189 161 184 206 229 251 256 261 266 271 229 186 169 207 255 303 354
4391 354 406 374 342 310 278 313 349 385 421 367 313 246 208 253 353 453 497 510 495 474 481 475 441 424 408 418 429 440 450 420 389 359 329 278 227
4375 227 232 237 264 292 319 346 367 387 407 428 458 489 464 439 404 368 333 298 285 272 259 247 293 340 399 430 383 280 207 134 111 89 122 156 161 166
4360 166 172 177 210 244 221 198 178 159 196 232 283 333 343 326 301 277 305 333 338 314 304 294 284 246 197 195 215 236 276 288 281 274 266 258 284 309 279 249 234
4343B34j5j5j5k2k2k0k1j3J5J5j4j1j1K7N6O5O5O6O5M9K1l9o7m3j6l1l1l1mL5L4%k8j3j2q
4327B45pppj%kkj1l9l9j1L5L4L7L6L6L6L4L5jk9k9jL1L1ql6k7k7K7K7L3L2L3L3K1K1J9J9K9
4310F00%k4n3m0m1m3m2LKn3n4m7m8m6m6lK4J1J0M4P2O8M0jo6o6jO3R0M9LLL%Jj1j0j0j1J2
4293C82J1J2J1RQL7L6K8K8k9k9m1m2j3j3N0N0N0N0L0L0k6k7k9k9l0k9L3L4L0L0K1k7k8k8l4
4277E16l4q7q8n2nK5K5L9L8J1J1n3n2n3n2j5j4j5j4RJ0J0RopopJ0J0J1J0l0l0K6K6O9O8M1
4261C54M1J1J1J2J1J3J4J3J4j7j7j7j7K0K0K0K0k0k0k0k0mmmmk2k2k3k2J8J9J8k8o2l5J5O1
4245C27M4M5rrj1j1j2j1m8m8m8m8L5L5L5L5J5J5m2m1o0o0lmM3M4J5J5k4k4k4k4K3K3K3K3j3
4229B21j2j2j2j1j0j1j0J5J5J6J5K4K4K4K4k5k5k5k5qppp%j%%N2N3N4N5K4N2O2J6k0k0k2k3
$$ plain form
4343 234 219 204 189 167 145 125 104 91 106 121 107 96 85 112 168 233 298 364 429 478 499 460 393 350 334 303 272 241 237 272 306 306 278 265 253 245
4327 245 238 231 224 223 223 221 219 208 169 130 119 154 188 225 261 297 333 367 402 401 372 343 342 373 404 396 360 333 306 333 360 393 425 458 491 512 533 552 571 600
4310 600 600 576 523 483 442 399 357 360 362 309 255 208 160 114 68 65 89 100 110 154 226 294 334 333 267 201 200 263 353 402 405 408 411 411 412 401 391 381 370 382
4293 382 393 405 416 425 433 470 506 534 562 533 504 463 421 408 395 445 495 545 595 625 655 629 602 573 544 514 485 518 552 582 612 633 606 578 550 516
4277 516 482 395 307 255 250 275 300 339 377 388 399 346 294 241 189 174 160 145 131 140 150 160 169 163 156 150 143 153 163 174 184 154 124 150 176 245 313 354
4261 354 395 406 417 429 440 453 467 480 494 477 460 443 426 446 466 486 506 486 466 446 426 422 418 414 410 388 366 343 321 339 358 376 348 286 251 266 327
4245 327 371 416 407 398 387 376 364 353 305 257 209 161 196 231 266 301 316 331 289 248 188 128 125 121 164 208 223 238 214 190 166 142 165 188 211 234 221
4229 221 209 197 185 174 164 153 143 158 173 189 204 228 252 276 300 275 250 225 200 192 185 178 171 171 170 170 170 222 275 329 384 408 460 522 538 518 498 476 453
4212D53p8p8k2k2J4J4L9L9%m7m4m5LO8J02P3K6lJ2J2k8k8J0L8Lm3l1mJ3J2m3m2j8j7j8j8J3
4196C15J4J3J3OOOOJ3J3J3J3m0m0l9m0J5J5m1m1%%K9K8L5L4L5L5K0K0J9K0K6K5K5K5l5l6l4
4179D91J3L5L5Rl7o9m0llrro6o5q5q5n5qM4M3M7M7J4J4J4J4k7k6JM8O3L5K5K6N0N1onj6j6
4162D89L7L7Nm1n7k9K4N3L9L8OOn0n0l5l5l5l5%J%%L3L3Q5Q5M3k2n7k9J7J6J9J8qqopJK9L9
4144F49qn0n0n2n3j2j2M4M4J9J8J8J8M7M6j0rl5l5l5l5j4j5M2M2K6K6N1N0N3mk8k8J9J9J9
4129G65K0L3L4k2k2opl0l1k5L2N5N6LKk6k5l8l8l8l8k5k4kN4P8N0ol3lN3R0O2J4j5mN2N9O0
4112A114M0j6l6rK7K7Qk0pM8P0P0J7J7J6J7J6J6O3O3O4O3L0K9R2J48J86J87J62J62J52J53
4098B969J55K12L11M06M59N15N76O32O64O64O82P37Q72J116J428J784K097K191K034J567P95
$$ plain form
4212 453 375 297 275 253 267 281 320 359 359 312 268 223 226 294 396 469 495 492 504 516 488 460 470 508 511 468 437 433 446 458 415 373 355 338 320 302 315
4196 315 329 342 355 361 367 373 379 392 405 418 431 391 351 312 272 287 302 261 220 220 220 249 277 312 346 381 416 436 456 475 495 521 546 571 596 561 525 491
4179 491 504 539 574 583 546 477 437 434 431 422 413 347 282 197 112 57 49 93 136 183 230 244 258 272 286 259 233 234 282 345 380 405 431 481 532 526 521 505 489
4162 489 526 563 568 527 470 441 465 518 557 595 601 607 557 507 472 437 402 367 367 368 368 368 401 434 519 604 647 625 568 539 556 572 591 609 601 593 587 580 581 610 649
4144 649 641 591 541 489 436 424 412 456 500 519 537 555 573 620 666 656 647 612 577 542 507 493 478 520 562 588 614 665 715 768 764 736 708 727 746 765
4129 765 785 818 852 830 808 802 795 765 734 709 741 796 852 855 857 831 806 768 730 692 654 629 605 603 657 735 785 779 746 743 796 886 948 962 947 943 995 1054 1114
4112 1114 1154 1138 1102 1093 1120 1147 1155 1135 1128 1176 1246 1316 1333 1350 1366 1383 1399 1415 1478 1541 1605 1668 1698 1727 1819 1967 2153 2340 2502 2664 2816 2969
4098 2969 3124 3336 3647 4053 4512 5027 5603 6235 6899 7563 8245 8982 9854 10970 12398 14182 16279 18470 20504 22071 22866
4089B2866j22r91j646k001k094j997j828j585j342j092q87p18n50l65k35j57j01o7j2K6Q2
4080E184J20J76K31K60L00L94M70N62O97Q64J077J321J496J628J735J829J962K168K579L196
4071B8249M087N115O139O795O674N572L511P99k087m501o066o722o563n945n101m259l484
4064B2213k829k233j728j331j049q51o46m49k80j50j9Q8J83K96L91N26O20P23Q54J076J356
4055A6761J649K004K368K760L085L365L668M097M781N884P522R524J1591J3181J3677J2423
4048A18340R118M085j760p165j1181j3294j3666j2749j1145r368p710o269n068m076l271k543
4041B2278j938j509j182r40p08m64k73j04L1J62K43L74N25P32R28J171J417J772K172K603
4032B7290L054L484L966M508N254O432Q105J0256J2665J4853J6106J5601J2770P588R54n836
$$ plain form
4089 22866 22744 21753 20107 18106 16012 14015 12187 10602 9260 8168 7281 6563 6013 5648 5413 5256 5155 5088 5076 5102 5184
4080 5184 5304 5480 5711 5971 6271 6665 7135 7697 8394 9258 10335 11656 13152 14780 16515 18344 20306 22474 25053 28249
4071 28249 32336 37451 43590 50385 57059 62631 66142 66941 64854 60353 54287 47565 41002 35057 29956 25697 22213
4064 22213 19384 17151 15423 14092 13043 12192 11546 11097 10817 10667 10648 10736 10919 11215 11606 12132 12752 13475 14329 15405 16761
4055 16761 18410 20414 22782 25542 28627 31992 35660 39757 44538 50422 57944 67468 79059 92240 105917 118340
4048 118340 127458 131543 129783 122618 111437 98143 84477 71728 60583 51215 43505 37236 32168 28092 24821 22278
4041 22278 20340 18831 17649 16709 16001 15537 15264 15160 15191 15353 15596 15970 16495 17227 18155 19326 20743 22515 24687 27290
4032 27290 30344 33828 37794 42302 47556 53988 62093 72349 85014 99867 115973 131574 144344 151932 152886 147050
4025A47050j1396j4894j6155j5649j4039j2037r976q124o537n209m163l322k650k071j633
4019A9195j277r66p60n97m28k58j27jJ30K61M29N65P33R41J222J553J871K196K551K984L489
4010C3706M181N098O391Q056R997J1962J3396J3640J2090Q554L365k453p751j1586j3571j3777
4003H1298j2767j1176r416p788o322n069m019l215k562k057j621j302j031q62p09n77m30k99
3995A0076k16j59p7k2P0J63K92M23N16O46Q38J044J269J549J881K349K921L688M604N596O450
3986D3901O842O484N157K911M9k806n144o526o994o706o015n128m249l436k743k215j785j438
3978A0159j159r01p33o14n20m22l29k74k18j71j42j27p1l6K0N0N0Q0J08J77K70L92M86N84
3968F659P15Q72J078J330J611J909K116K150J870J262M21n20j361j969k251k243k037j760
$$ plain form
4025 147050 135654 120760 104605 88956 74917 62880 52904 44780 38243 33034 28871 25549 22899 20828 19195
4019 19195 17918 16952 16192 15595 15167 14909 14782 14781 14911 15172 15601 16166 16899 17840 19062 20615 22486 24682 27233 30217 33706
4010 33706 37887 42985 49376 57432 67429 79391 92787 106427 118517 127071 130436 127983 120232 108646 95075 81298
4003 81298 68531 57355 47939 40151 33829 28760 24741 21526 18964 16907 15286 13984 12953 12091 11382 10805 10375 10076
3995 10076 9860 9701 9624 9602 9672 9835 10127 10550 11066 11712 12550 13594 14863 16412 18293 20642 23563 27251 31855 37451 43901
3986 43901 50743 57227 62384 65295 65344 62538 57394 50868 43874 37168 31153 26025 21776 18340 15597 13382 11597 10159
3978 10159 9000 8099 7366 6752 6232 5810 5481 5207 4989 4818 4676 4549 4478 4442 4462 4512 4562 4642 4750 4927 5197 5589 6075 6659
3968 6659 7374 8246 9324 10654 12265 14174 16290 18440 20310 21572 21993 21473 20112 18143 15892 13649 11612 9852
3960I852j479j248j005p93o62n80n24m60m05l14k22j62j34j28j01m8Rk2k1k8k9q4q4j11j11
3949A106j8j8j1j1j0j1K7K6K7K6n0n1n0n1k1k0k1k1l8l8l9l8j1j2K6N3L5k2m3m3k0PK4l3n2
3934F04n2n5n6LLLLmmN2N3O1O2Kn5q4n7j3M2O3O3J1J0l4l4l4l4l8l9l8l8J6J6j2j3n8n8kk
3917B53M1M2M2M1LKLKKLKKK8K8K8K8l9l9o4o5m3MN0K1l3l3l4l5j3j3j3j3llklj2j3M4M4J9
3899B59J9J9J9NNNNJ9J9l5l5L9Q6O8Ln1n2n6n5m6m5J0J1K8K8K9K8RRRRJKKK%%%%NNNNPPk2
3879C84k1K6K6l0l0l4l4l4l4J6J7J6J6K0J9K0K0l3l2l3l2l0l0k8J8O1O0L4j3k2k2LLO9P0M0
3864D46pl5l5J8J8qql6l6l4l4l4l4kkJJj9L7N3N2J1J0J0J1K3K3k3k4LLLLOPPPk4k4k3k4PP
3845C01POmnnn%%%%l1l1l1l1k0k1M5M5N1N2l3l3j9j9K8K8mmmlkjkjJ0J0J0J0l8l9l8l8k7k7
$$ plain form
3960 9852 8373 7125 6120 5327 4665 4085 3561 3101 2696 2382 2160 1998 1864 1736 1635 1587 1596 1574 1553 1525 1496 1412 1328 1217 1106
3949 1106 1088 1070 1059 1048 1038 1027 1054 1080 1107 1133 1083 1032 982 931 910 890 869 848 810 772 733 695 684 672 698 751 786 764 721 678 658 665 689 656 604
3934 604 552 497 441 444 447 450 453 449 445 497 550 611 673 675 620 536 479 466 508 571 634 645 655 621 587 553 519 481 442 404 366 382 398 386 373 315 257 255 253
3917 253 294 336 378 419 422 424 427 429 431 434 436 438 466 494 522 550 511 472 408 343 300 304 354 375 342 309 275 240 227 214 201 188 185 182 180 177 165 152 196 240 259
3899 259 278 297 316 321 326 331 336 355 374 339 304 343 429 497 500 449 397 341 286 240 195 205 216 244 272 301 329 338 347 356 365 366 368 370 372 372 372 372 372 377 382 387 392 399 406 384
3879 384 363 389 415 385 355 321 287 253 219 235 252 268 284 304 323 343 363 330 298 265 233 203 173 145 163 224 284 318 305 283 261 264 267 336 406 446
3864 446 439 404 369 387 405 397 389 353 317 283 249 215 181 179 177 178 179 160 197 250 302 313 323 333 344 367 390 367 343 346 349 352 355 361 368 375 382 358 334 311 287 294 301
3845 301 308 314 310 305 300 295 295 295 295 295 264 233 202 171 151 130 175 220 271 323 290 257 238 219 247 275 271 267 263 260 258 257 255 254 264 274 284 294 256 217 179 141 114 87
3826H7k7k6M7M7M8M7PQPQk6k6k6k6j9j8RR%Jm3m3K3P8P6P5M1M1J3J3k1k1MLRm8r5r4n9L4Q2
3808A99Q1J7m0qqOPn6n5m6J1O3O3Q2Q2K9k7l7l8j3j3k7k7k8k7J8J8J7J8j8j7j8j7RRRRllk8
3791A93k8j8K7M9M8PPk1k1m7m7%JJ3J4j2j1L1P9O8M0kkllJ6J7J7J7j4j4j3j4k4k3k4k3J1J2
3774C03J1J2JJJJmmmnQPL6L6rrn6q3n0kL4L5k9k8k8k9j2j1P1P0P8M9Rl8o3l4J4M2K0pl7l7
3756B60k7k7K1K0K1K1opj9j9K8K8POPPJ9J9J8J9n9n8n9n8J4J4J5J4J4J4J5J4RJ0RRL1L0k5
3739C49k6n4n4M0L9L7L8L7L7nnmnj2j2j2j2J%JJj6j6p0p0q3n4lM3M6M6M9M9N7N7J%l6l7l6
3721C06l7p6p7m7JM2M3M6M5LLLLLLLLK0K1K0K0MMMMk3k3k2k3poppJ0RJ0RRJ0RRj1j1j2j1k
3701B77jk1QJ7l0n7n8K4K5K5K4K6K5K6K5m7m7m7m7J7J6J7J7L3L3L3L3%J%%j1j2j1j2J%jjq
$$ plain form
3826 87 60 34 81 128 176 223 230 238 245 253 227 201 175 149 130 112 121 130 130 131 88 45 68 146 222 297 338 379 392 405 384 363 367 370 379 331 236 142 83 117 199
3808 199 280 297 257 249 241 247 254 198 143 97 108 171 234 316 398 427 400 363 325 312 299 272 245 217 190 208 226 243 261 243 226 208 191 200 209 218 227 224 221 193
3791 193 165 147 174 223 271 278 285 264 243 196 149 149 150 163 177 165 154 185 264 332 372 370 368 365 362 378 395 412 429 415 401 388 374 350 327 303 280 291 303
3774 303 314 326 327 328 329 330 326 322 318 313 321 328 364 400 391 382 326 243 193 191 225 260 231 203 175 146 134 123 194 264 342 391 400 362 299 265 279 321 341 334 297 260
3756 260 233 206 227 247 268 289 283 276 257 238 266 294 301 307 314 321 340 359 377 396 337 279 220 162 176 190 205 219 233 247 262 276 285 295 304 313 344 374 349
3739 349 323 269 215 255 294 331 369 406 443 438 433 429 424 412 400 388 376 377 377 378 379 363 347 277 207 124 70 67 110 156 202 251 300 357 414 415 415 379 342 306
3721 306 269 193 116 69 70 112 155 201 246 249 252 255 258 261 264 267 270 290 311 331 351 355 359 363 367 344 321 299 276 269 263 256 249 259 268 278 287 296 306 315 324 313 302 290 279 277
3701 277 276 255 263 280 250 193 135 159 184 209 233 259 284 310 335 288 241 194 147 164 180 197 214 247 280 313 346 346 347 347 347 336 324 313 301 302 302 301 300 292
3684B92l6j8j9j8RN0N0K0J9K0K0J0J1oK2M4M3Nk3nnk2NK5K4M0J2m0o7o8m0ML2J7J6j7m5k9
3668C32k9k4k4k4k4j0j0qqKL0J5J4M2M3M2M3J5J5jK7O0N9L0j7m7p5p8n0J2J3J4J4KLMMmK5
3651D27PPJk8k7JLLNNppppj2j1j2j2J7J8J4J5L7j0p6p5m5j7l3l3j5j5K3N1M1J2o0o0rM8P7
3633B34M8J4j4k8k9K8K8K8K7j8j8RJ0MMm3m3jjM6M6J9K0m6m6n2n2k5k4l8l9l9l7llM3M3M5
3616I7M4kkk3k2K5K4M2M3J4J4j9j8q1q0n9lJ1J2L9L9L9L8L5L4L5L4L3L2L3L3j0j0l6l6o6l7
3600B46J6P3O6L7j1l9k3k2LMj5j5j5j5K6K6K7K6j1j1j2j1J%J%l5l5l6l5L7L7L7L8j1j1j2j1
3584C15j1j1j1j1J5J6J5J6oonoqqqpkjQL6M5jn8n7KKKKL7L7J6l0q5q5o7k1L2L3PPrj0j0j0
3565I9j7j7M9M8LMk5k5j5j6J2J3L1L2L2L2onm9m8pM1L0Kj4j3j6j5J0J1J0J1l0k9l0k9K7K7
$$ plain form
3684 292 256 238 219 201 210 260 310 330 349 369 389 399 410 404 426 470 513 518 495 490 485 463 468 493 517 557 569 529 462 394 354 358 390 407 423 406 361 332
3668 332 303 279 255 231 207 197 187 179 171 173 203 218 232 274 317 359 402 417 432 431 458 518 577 607 590 543 468 390 340 352 365 379 393 395 398 402 406 402 427
3651 427 434 441 442 414 387 388 391 394 399 404 397 390 383 376 364 353 341 329 346 364 378 393 430 420 344 269 224 207 174 141 126 111 134 185 226 238 178 118 109 157 234
3633 234 282 296 282 254 225 253 281 309 336 318 300 309 319 323 327 284 241 240 239 285 331 350 370 324 278 226 174 149 125 87 48 9 -28 -31 -34 9 52 97
3616 97 141 139 137 114 92 117 141 183 226 240 254 235 217 136 56 -3 -6 5 17 56 95 134 172 207 241 276 310 343 375 408 441 431 421 385 349 283 246
3600 246 262 335 401 438 427 388 365 343 346 350 335 320 305 290 316 342 369 395 384 373 361 350 351 351 352 352 317 282 246 211 248 285 322 360 349 338 326 315
3584 315 304 293 282 271 286 302 317 333 327 321 316 310 302 294 286 279 277 276 284 320 365 364 306 249 251 253 255 257 294 331 347 317 232 147 80 59 91 124 131 138 129 119 109 99
3565 99 82 65 114 162 165 169 144 119 104 88 100 113 144 176 208 240 234 229 180 132 125 166 196 198 184 171 155 140 150 161 171 182 152 123 93 64 91 118
3548A18K8K7J8J7pqPN3R0Q9O3J5m2p0p0k4J4J4J1J0J0J1K5K5P2P2L0L0j6j6o0n9j3j3RRj9
3532D50j9j1j1n4n5l0J6L8L7K7K7k0j9l1l0klk1k1k0k1K0K1K0K1K3K3onp8p8n8j1J6J6J9K0
3516A90j6j6j7j6M3M2M3M2L7L7L7L7N0M9K9j8l1l2K9N8K8l7o4o4j3j3l8l8m3NK5K4k5k5LL
3501C05j1j1l8l9M5M4M5M4j3j4j4j4K9L0j8j7j2j2j3j2mnnmj2j1j2j2j1j1j2j1%%J%nonnl1
3483A43l1l1l1M5M5M5M6L1L1l4l4o2o2j5j5j0j0J8J7L3L2N8N7L3j5n3n4m2m2NMK1K1k6k5m4
3467D9m4K2K2M1M0M1M0POPON6N6jm9o0o1nM1P2P2J7l0k9k9mml6l5j8L0N1K4k4k3j3j2j3j3
3450A97OPN3N3J3J3l4l3m4m4oM0L3Nk3k3RJ0RJ0j%j%k8k7k8k8K8K8K8K8L7L7J6l0m3m3j8j7
3433A89j1j0j1j0LLLLL9L9L9L9J3J3J3J3opopK3K3onJ6J5l1l1l2l2mnJ8J8Jm6n7j0M2M2Mm3
$$ plain form
3548 118 146 173 191 208 201 193 200 253 343 432 495 510 468 398 328 304 318 332 343 353 363 374 399 424 496 568 598 628 612 596 536 477 464 451 460 469 450
3532 450 431 420 409 355 300 270 286 324 361 388 415 395 376 345 315 313 310 289 268 248 227 247 268 288 309 332 355 349 344 266 188 130 119 135 151 170 190
3516 190 174 158 141 125 168 210 253 295 332 369 406 443 493 542 571 553 522 490 519 577 605 568 504 440 427 414 376 338 295 300 325 349 324 299 302 305
3501 305 294 283 245 206 251 295 340 384 371 357 343 329 358 388 370 353 341 329 316 304 300 295 290 286 274 263 251 239 228 217 205 194 194 194 195 195 190 184 179 174 143
3483 143 112 81 50 95 140 185 231 262 293 259 225 163 101 86 71 61 51 69 86 119 151 209 266 299 284 231 177 135 93 98 102 123 144 118 93 49
3467 49 5 27 49 90 130 171 211 218 224 231 237 293 349 348 299 239 178 173 214 286 358 375 345 316 287 283 279 243 208 190 220 271 295 271 248 235 223 210 197
3450 197 203 210 263 316 329 342 308 275 231 187 181 221 254 259 236 213 222 232 241 251 250 250 249 249 221 194 166 138 166 194 222 250 287 324 340 310 267 224 206 189
3433 189 178 168 157 147 150 153 156 159 198 237 276 315 328 341 354 367 361 354 348 341 364 387 381 376 392 407 376 345 313 281 277 272 290 308 309 263 206 196 238 280 284 241
3415B41o1o1k6K0L7J0opqqj6j7L9L9J8J7J8J7L0L1k6k6k1k1L5L5L0L1L0L1JJJJj9k0k0k0k8
3398C02k9k8k8K1K0K1K1L0K9L0K9oppoo3o2oollklJ3J4J3J3m1m2m1m2NMO1O1nnnnK2K1j7m4
3379B24m0PL5L5j5j4M1M1J3J3J4J3KLLLk3k3k3k3m3m3m3m3L0K9L0K9J9J8J9J8K2K2K2K2m2
3363C52m3j5L2O1L2j4o1n9l1n0n0NONOQ2Q2K6K6L6L5M9K1j3o0q9q8n5qK2K2PQPQJ1J1J1J1
3346C38j0j0j0rJ1J1J1J1k0k0k0k0k2k1L5L5P1P1P1P1J9K0l7l7l1l1l1l1l5l4l5l4k0k0j9
3331B18k0oppoK2K3l3l3k2k1L4L5L6L7L6L7mnmmOOOOJ3J3J3J3kkkkj9j9k0j9n3n4LLJ2J1J1
3312B30J1N8N7N4N5K6k1n1n1l8l7l8l8k2k3L4L3L1L2pl4j7L1KKPPPPmnmnKLKKooook9k9lM5
3293B58Qm0k5KL7L7L6L5Lm5p1p1j3L3K5lk3MM3M3mnmnK9L0k7k7o1o1NN1M0J1L0L0J5J4m2m1
$$ plain form
3415 241 180 119 93 113 150 160 154 147 139 131 115 98 137 176 194 211 229 246 276 307 281 255 234 213 248 283 313 344 374 405 406 407 408 409 390 370 350 330 302
3398 302 273 245 217 238 258 279 300 330 359 389 418 412 405 398 392 329 267 261 255 252 249 247 244 257 271 284 297 256 214 173 131 136 140 201 262 257 252 247 242 264 285 268 224
3379 224 184 191 226 261 246 232 273 314 327 340 354 367 369 372 375 378 355 332 309 286 243 200 157 114 144 173 203 232 251 269 288 306 328 350 372 394 352
3363 352 309 294 326 387 419 405 344 285 254 204 154 159 165 170 176 258 340 366 392 428 463 512 533 520 460 371 283 228 220 242 264 271 279 286 294 305 316 327 338
3346 338 328 318 308 299 310 321 332 343 323 303 283 263 241 220 255 290 361 432 503 574 593 613 576 539 508 477 446 415 380 346 311 277 257 237 218
3331 218 198 192 185 178 172 194 217 184 151 129 108 142 177 213 250 286 323 319 314 310 306 312 318 324 330 343 356 369 382 380 378 376 374 355 336 316 297 244 190 193 196 208 219 230
3312 230 241 299 356 410 465 491 470 419 368 330 293 255 217 195 172 206 239 270 302 295 261 244 275 277 279 286 293 300 307 303 298 294 289 291 294 296 298 292 286 280 274 245 216 213 258
3293 258 266 226 201 203 240 277 313 348 351 306 235 164 151 184 209 206 183 187 230 273 269 264 260 255 284 314 287 260 199 138 143 194 234 245 275 305 320 334 292 251
3275B51l0l0K6K6O3O2O3O3KKJKm0m0j2L5K4lm2m1k5k6k6k5JJJJj9k0k0j9l3l2l3l2LMN7N7
3258A97J9k9j6J2K6N4L9M0qqpqJ5J5J5J5k0j9k0k0qqpqJ0J0RJ0k5k6q2q1k3k4L3L3K5K5K4
3241A79K5K1K2K1K1RJ0RJ0m0m0l9m0qqqpjjKKL7Q3P2M5J9J8J8J7j4j4j4j4L4L4k2k2l9m0l9
3224B98l9j7j7j7j7K9K9K9K9QPQQOOj3J5N1Mo0o1j8j8J9M8N6J1n3n2MN1M1J3mlonK9K8k7k7
3206C73l1l1l1l1l5l6l6l6K3K3K5K6L5Q2P2M3K5K5l4l3p1p1j5j5K7K7K7K7m5m5m5m4j0j0j0
3191A45j0M0M0L9M0N0M9O3L4l6q3n8n9o1o1o2o1RRRRN8N8N8N8L2L3L3L2j1j2j2j2j0j0j0j0
3175C20k3k4k2k1OL4J9k8m4j5K2K2lmlmL5L5L5L5llllm6m5J1J1K2K2l3l4MNk4k4n2n1MNJ1
3157A46J1J1J1K9K8K9K9J2J2J3J2j8j8j7j8j9k0j7j8K8N7M0om8k1J8J7m0m0J5Q0J02P3N1K4
$$ plain form
3275 251 221 191 217 243 306 368 431 494 496 498 499 501 461 421 409 444 468 465 423 382 357 331 305 280 281 282 283 284 265 245 225 206 173 141 108 76 79 83 140 197
3258 197 216 187 171 183 209 263 302 342 334 326 319 311 326 341 356 371 351 332 312 292 284 276 269 261 271 281 290 300 275 249 167 86 63 39 72 105 130 155 179
3241 179 204 225 247 268 289 298 308 317 327 287 247 208 168 160 152 144 137 136 135 137 139 176 259 331 376 395 413 431 448 434 420 406 392 426 460 438 416 377 337 298
3224 298 259 242 225 208 191 220 249 278 307 315 322 330 338 344 350 337 352 403 407 347 286 268 250 269 317 373 384 331 279 283 334 375 388 384 381 375 370 399 427 400 373
3206 373 342 311 280 249 214 178 142 106 129 152 177 203 238 320 392 435 460 485 451 418 347 276 261 246 273 300 327 354 309 264 219 175 165 155 145
3191 145 135 175 215 254 294 344 393 456 490 454 371 313 254 193 132 70 9 18 27 36 45 103 161 219 277 309 342 375 407 396 384 372 360 350 340 330 320
3175 320 297 273 251 230 236 270 289 261 217 202 224 246 243 239 236 232 267 302 337 372 369 366 363 360 314 269 280 291 313 335 302 268 272 277 253 229 177 126 130 135 146
3157 146 157 168 179 208 236 265 294 306 318 331 343 325 307 290 272 253 233 216 198 226 283 323 317 269 248 266 283 243 203 218 298 400 473 524 548
3142E48Mk5l8l8lll1l1LKL1L1J0J0j9j8k9k9jjmlK4K4ononL4L4L4L4P3P3P7K0k5k5oN0N8K9
3124H52PL5O8R7Q6Q6J14J70J96J97J91K19K90L83M98O29P57Q14P61N17J25l05o30p62p61o68
3112C966n94n00m29l34k76k21j86j87j64j08o2l3l5l4o0o1l8l8j1j0J%J%l8l9l9l8m5m5J1
3099C54J2NNONk1k2k1k2K3K3K1K1j3m2n6JM8P6R4L8k6n5m2m2rrM3M4M7rn2q0q2k6J8M6J6J6
3082C33J7J8lklkMMMMJ2J1J1J1lmllQRQRj3j3j3j3LLMLK2K1K2K1l9l8l9l9K9K9J%l0l0K6K6
3062C83L9L9j7j7j4j4n2q0p8l2L4L4qrM8M8M1M2J3J3J2J1p9p9n0mK7K6k3k3k3k3poK1K1P9
3046B93P8K2m4o6o7j5j4ppl5l5j1j0M6M6K8K8%%L0L0L0L0rro6o5l8l8J9J8j8j8J1J0N2N1K4
3030B74K4K0K0K1K0n2n1n1n2m2m3k3M2R5R4O7K1k1n0o2o3m3j5RL7O6O6N6K7noL2N9K9Kk2n0
$$ plain form
3142 548 552 527 489 451 448 445 414 383 386 388 419 450 460 470 451 433 404 375 374 373 369 366 390 414 408 403 397 392 426 460 494 528 601 674 751 771 746 721 715 765 823 852
3124 852 859 894 962 1059 1145 1231 1345 1515 1711 1908 2099 2318 2608 2991 3489 4118 4875 5689 6450 6967 7092 6787 6157 5395 4634 3966
3112 3966 3372 2872 2443 2109 1833 1612 1426 1239 1075 967 905 872 837 803 743 682 644 606 595 585 586 586 587 587 549 510 471 433 388 343 354
3099 354 366 371 376 382 387 366 344 323 301 324 347 368 389 376 334 278 279 327 403 497 535 509 454 412 370 361 352 395 439 486 477 425 345 263 237 255 301 317 333
3082 333 350 368 365 363 360 358 362 366 370 374 386 397 408 419 416 412 409 406 414 423 431 440 427 414 401 388 391 394 398 401 423 444 466 487 448 410 371 332 361 390 391 391 361 331 357 383
3062 383 422 461 444 427 413 399 347 267 189 157 191 225 217 208 256 304 345 387 400 413 425 436 357 278 228 224 251 277 254 231 208 185 178 172 193 214 293
3046 293 371 393 349 283 216 201 187 180 173 138 103 92 82 128 174 202 230 230 230 260 290 320 350 341 332 266 201 163 125 144 162 144 126 137 147 199 250 274
3030 274 298 318 338 359 379 327 276 225 173 131 88 65 107 202 296 363 384 363 313 251 188 145 130 139 176 242 308 364 391 386 380 412 471 500 502 480 430
3013D30n0n0NNj0rj0rllj9RM1M0N9L0QROPnonnmmoorl8k0k0ML2M2M2K1pm6m6n4k5J3J4jk8
2994C19m0m1j8j8ll1o6o6l8QK9L0L2L3O6O6K7jK4N2N0K2lmnnk3k3k5k4k8n6n6k8MMOOoomm
2975A56PL5L5ORQOOJ8J8J7J6j5m3m3j6K4K4K6K5K6K5K6K5PPPPrrj0rJ4J4J2J3j3m1k3k4l2
2958C32mK0M8N1N0lmk1k1j9j9k2Oj0j0j3j4j4j3L1L0L0K9k1n0l1l2J0L9K3K2K8K8j1m0l7r
2942C59J3M2L7L7N3K4m1p0n5n4k4LM4M4K2K3K0K1Ok2o3o2k1k1k1k1kjkkjk%%M0O8O6L7qn5
2924D11m5j6pK0K2nqpk5LnnmlJ2J1K7jrrj1j1pqpqKJN4N4J0m7j5j5MML6k1q6q6k8K8M7M6o
2905B87pl5l6K1K0M2M1M2M1JJ%Jn0m9n0n0nonnj7j6j7j6N1N2N1N1nnnnrj0M7M6J5J4m1m2j4
2886C24j5j5j4n5n5JJJ4J4J4J5K7K8K8K8J6J6J8J8J0L9N3ml0n7o2l3j0j1qrnnnnm7m8RRL1
$$ plain form
3013 430 380 330 335 340 330 321 311 302 299 296 277 286 327 367 426 456 464 473 479 486 481 475 470 465 461 457 451 445 436 398 378 358 362 394 436 478 499 492 446 400 346 321 334 348 347 319
2994 319 279 238 220 202 199 168 102 36 -2 6 35 65 97 130 196 262 289 288 312 364 414 436 433 429 424 419 396 373 348 324 296 240 184 156 160 164 170 176 170 164 160 156
2975 156 163 198 233 239 248 256 262 268 286 304 321 337 322 279 236 220 244 268 294 319 345 370 396 421 428 435 442 449 440 431 421 412 426 440 452 465 452 411 388 364 332
2958 332 328 348 396 447 497 494 490 469 448 429 410 388 394 384 374 361 347 333 320 351 381 411 440 419 369 338 306 316 355 378 400 428 456 445 405 368 359
2942 359 372 414 451 488 541 565 524 454 399 345 321 324 368 412 434 457 477 498 504 482 419 357 336 315 294 273 271 270 268 266 265 263 263 263 303 371 437 474 466 411
2924 411 366 350 343 363 385 380 372 365 340 343 338 333 329 326 338 349 376 375 366 357 346 335 328 320 313 305 307 308 362 416 426 379 364 349 353 357 393 372 286 200 172 200 247 293 287
2905 287 280 245 209 230 250 292 333 375 416 417 418 418 419 369 320 270 220 215 209 204 199 182 166 149 133 184 236 287 338 333 328 323 318 309 299 346 392 407 421 380 338 324
2886 324 309 294 280 225 170 171 172 186 200 214 229 256 284 312 340 356 372 390 408 418 457 510 506 476 419 357 324 314 303 295 286 281 276 271 266 219 171 180 189 220
2869B20L1L1L1J8J8J7J8j3j2j3j2j8j7j8j7L2L1L2L2RRJ0Rppqpj9k0k0j9K8K8k7k8m0m1m0
2853B01m0jkN5N4J3J2m1m1l8J0N6Q5M7j9l6l6KKL1L0J6J6J5J6M5M6j1j0K3K3on3o2o2o5o5
2837B10qpj0rl1n9o7k0K5N3M1M0K7K7l0k9l0k9kjO7O8Lm3l5J2L9L9K0K1qql8l8l9l8n1n1l2
2820b1L0M3J5L3L3K4mj4L2P5P5j3p8o6j8k1k1J4J3P0P0O9P0J3J4KLk6k6k0k0k1k0K0K1K0K0
2804C90j4j5j5j5j3j3Lk6k1k1k4k3KJJJKJJKl6l7n1k4NMRQL3O0M3M3Kk6j0j0ononK5K5K5K5
2785B95K1K2OL4O9O9nl4j0J8J7j2JJj1l9m0j1K7K7lkJ3j5m5m6qK0Jk7k4LJ6J7L4Oj8j8j9k0
2767C10j4j4j3j4J6J6M2M3K3ok8n6o7l9J9M7M2J4pl5n2k4J4J5K1K1K1K1noonl3l3l1l1J1M0
2751B17K4K3M0M0N5K7ooqpj5j5j5j5k5k5K1K2opoom4m3m3m3L7L8L7L8L7L8L8L7k6k6k7k6j
$$ plain form
2869 220 251 282 313 331 349 366 384 371 359 346 334 316 299 281 264 296 327 359 391 400 409 419 428 421 414 406 399 380 360 340 321 349 377 350 322 282 241 201
2853 201 161 160 158 213 267 280 292 251 210 172 182 238 323 370 351 315 279 281 283 314 344 360 376 391 407 452 498 487 477 500 523 517 464 402 340 275 210
2837 210 202 195 185 176 145 86 19 -1 24 77 118 158 185 212 182 153 123 94 92 91 158 226 229 186 151 163 202 241 261 282 274 266 228 190 151 113 62 11 -21
2820 -21 9 52 67 100 133 157 153 139 171 246 321 308 230 164 146 125 104 118 131 201 271 340 410 423 437 439 442 416 390 370 350 329 309 329 350 370 390
2804 390 376 361 346 331 318 305 308 282 261 240 216 193 195 196 197 198 200 201 202 204 168 131 80 56 61 65 74 82 115 175 218 261 263 237 227 217 211 206 200 195 220 245 270 295
2785 295 316 338 344 378 447 516 511 477 467 485 502 490 491 492 481 442 402 391 418 445 442 440 453 438 393 347 339 359 360 333 309 312 328 345 379 385 367 349 330 310
2767 310 296 282 269 255 271 287 329 372 395 389 361 305 238 199 218 265 307 321 314 279 227 203 217 232 253 274 295 316 311 305 299 294 261 228 197 166 177 217
2751 217 241 264 304 344 399 426 420 414 406 399 384 369 354 339 314 289 310 332 326 319 313 307 263 220 177 134 171 209 246 284 321 359 397 434 408 382 355 329 328
2734C28%k9k9m3m3LMK6K7jjL6L5On1j03m7K2N0K6kJK8M9M8N1N0POLMk1p6p7k0RRJ3J2JJ%J
2715C13J0J0J1J0K4K4O8O7K7k8o3o3o0n9j3j3l5l5l5l5M2M3M2M2J8J8k9k9NMNMl1l0l1l0l7
2699A31l6rqrqL9L8N8N9J1J2rj0J9J8RRQRj0j0n7n7o0o0NNL4L3L3L3J7J6J6J7J6J5J6J6K3
2682C72K2j7o4p3p4k9l0j1j1L6L5N2N2K3K4QRL4L5L5Qn2r9r4o5l5pj3j3J7J7L1L1L1L1J8J7
2666B51J7J7k7k7k7k7K8K9K8K9poppj1j2j1j2jkkjppM0L9L1L0j6m5k8J8L7L7K1K1k6k6k2k3
2648B86ONk5k5k5k5jkkjOPl7l7k2K5O2L3qprj0rrrrK2K1K2K1j2j1j2j1N6N6Q1L4k6n3k3K3
2630C46J3l3m9k0L1L2L3L3J0J0J0J0j1j2j1j1L1L1J3l4m6j8J0J0l4l4l3l4lklkJ5J6J4J4l1
2614B61n9m2NN6N5J2J2J2J3J3J3K0J9k7k7l0l1l1l0l9l9QQJ6J6J6J6NMMNkkm8m9PPN4N4N2
$$ plain form
2734 328 328 299 270 227 184 187 191 217 244 243 242 278 313 319 268 165 118 140 190 216 214 215 243 292 340 391 441 448 454 457 461 440 364 287 267 276 285 298 310 311 312 312 313
2715 313 323 333 344 354 378 402 470 537 564 536 473 410 350 291 278 265 230 195 160 125 167 210 252 294 312 330 301 272 277 281 286 290 259 229 198 168 131
2699 131 95 86 78 69 61 100 138 196 255 266 278 269 259 278 296 305 314 322 331 321 311 254 197 137 77 82 87 121 154 187 220 237 253 269 286 302 317 333 349 372
2682 372 394 377 313 240 166 137 107 96 85 121 156 208 260 283 307 315 324 358 393 428 436 384 285 191 126 91 84 71 58 75 92 123 154 185 216 234 251
2666 251 268 285 258 231 204 177 205 234 262 291 284 278 271 264 253 241 230 218 217 215 213 212 205 198 238 277 308 338 322 277 249 267 304 341 362 383 357 331 309 286
2648 286 292 297 272 247 222 197 196 194 192 191 197 204 167 130 108 133 195 228 220 213 204 194 185 176 167 158 180 201 223 244 232 221 209 198 254 310 391 425 399 346 323 346
2630 346 359 326 277 257 288 320 353 386 396 406 416 426 415 403 392 381 412 443 456 422 376 358 368 378 344 310 277 243 240 238 235 233 248 264 278 292 261
2614 261 202 160 165 221 276 288 300 312 325 338 351 371 390 363 336 306 275 244 214 175 136 144 152 168 184 200 216 221 225 229 234 232 230 182 133 140 147 201 255 307
2597C07N1NNnol3l4n2n1nnMNL3L3j6j5j6j6K5K6K6K5K8K7K8K7j7j6m5m5k8k7J9J9K2K3K2K2
2580C50N6N6rj0j7j7j7j7k0k0k0j9r2r2k5M0N8N9L4L5J7J7M1M1Jo4q9o0k1QK1K1J1J1J0J1
2564B89mml2l2l4l4J3J2OONOJ9J9K0J9K8K9j8j8m4m4nM2Q0Q0P8L2k9p5o8m0LMj4o0n8k9K0
2547A68M8M4M5J7J8k9k9k9k9l0l1l1l0KKKKMMLMM3M3P1P1L2L3j5j4lkklk5k5LKL7L7k8k9l6
2529C15l6qqjjj%n9n9n5n4NP1Q9Q8N0K2ll0k1k1OOj4j4j3j4J0RK6lOOLKJk8k9kJk7l6J1N3
2510B43N2k0m9m2j4mmppqpL4L4N0K1MML0L0L7L7ll1pqrrNNNNK8K9j2m1k3k3k5k4qpppL9L8
2491C24L7L7Pk2o0o0j9J0Rj8m0m0%K8L8O5P7P8L0Kk3n0n1n0k3k3lK5O5O6J6J6J6J6j2j3j3
2475D42j2l1l0k0RJ1j7n5n5k2k2k2k3QQL6L6L2L2k4k3j0j0J8J8mnmnK7K7j1l9l7RL7L7QPQ
$$ plain form
2597 307 358 363 368 363 357 324 290 238 187 182 177 181 186 219 252 236 221 205 189 214 240 266 291 319 346 374 401 384 368 323 278 250 223 242 261 283 306 328 350
2580 350 406 462 453 443 426 409 392 375 355 335 315 296 204 112 87 127 185 244 278 313 330 347 388 429 430 366 277 217 196 204 225 246 257 268 278 289
2564 289 285 281 249 217 183 149 162 174 180 186 191 197 216 235 255 274 302 331 313 295 251 207 202 244 324 404 482 514 485 410 342 302 305 309 295 235 177 148 168
2547 168 216 260 305 322 340 311 282 253 224 194 163 132 102 104 106 108 110 114 118 121 125 168 211 282 353 385 418 403 389 386 384 382 379 354 329 332 334 371 408 380 351 315
2529 315 279 271 263 262 261 260 260 201 142 87 33 38 109 198 286 336 358 355 325 304 283 289 295 281 267 254 240 250 259 285 282 288 294 297 299 300 272 243 241 242 215 179 190 243
2510 243 295 275 226 184 170 166 162 155 148 140 133 167 201 251 272 276 280 310 340 377 414 411 380 373 365 356 347 352 357 362 367 395 424 412 371 348 325 300 276 268 261 254 247 286 324
2491 324 361 398 405 383 323 263 244 254 263 245 205 165 165 193 231 296 373 451 481 483 460 410 359 309 286 263 260 285 350 416 432 448 464 480 468 455 442
2475 442 430 399 369 349 358 369 352 297 242 220 198 176 153 161 169 205 241 273 305 281 258 248 238 256 274 270 265 261 256 283 310 299 260 223 232 269 306 314 321 329
2457C29QJ1J1J1J1K5K5K5K5jjjjn0m9n0m9k9k8k9k8kjkjm1m1m1m1J4J4J4J4O8O8O8O7%%j%
2440C21k6k6k6k6MMNMK1K0K1K1qrqqk9k9l0k9j5j5j5j4PPO4O3L4L5L4L4kkkjLMMMmmnmPPO3
2419D54O3K3K2l4l4r0q9p1nM2M2P1P1R1M5l2p9n9l1OOKKk6k6k7k6K9L0NNONqpqppoooL5L5
2401D06L2L1rn7r9p1k1K7M5J8j6j5j8j7l2l2k9k9J8O4N5K6j2j2j4j3k2k1OPM6M7m7m6n8n7
2385H1jjL5L6L5L5N5N4jkL0L0L0L0j0j0j0j0k1k2k1k2j4j4j4j4L5L5L5L5K3K3K3K3k2k1k2
2369D31k1j2j3j2j3m2m3m3m3RQRQJ9J9J9J9k7k7L0K9NNNNJ9J9J9J9jjjjKKn2n1l4J4M3M3J6
2351C79J6J6J5LLJJl4o3p1k5J6M4K9j8n5n6k8J8M2M2J7J7J6J6J6J6l7l7l4J4P1J00O7Kn0n1
2335D18n3oRJ0j6j6JKKJK0J9J9K0l0l0l0k9k2k2k2k2oonoj1j2j1j2K9K8K9K8J9K0J9J9k0k1
$$ plain form
2457 329 337 348 359 370 381 406 431 456 481 480 479 478 477 427 378 328 279 250 222 193 165 163 162 160 159 118 77 36 -5 9 23 37 51 119 187 255 322 322 322 321 321
2440 321 295 269 243 217 221 225 230 234 255 275 296 317 309 300 292 284 255 226 196 167 152 137 122 108 115 122 186 249 283 318 352 386 384 382 380 379 382 386 390 394 390 386 381 377 384 391 454
2419 454 517 540 562 528 494 404 315 244 239 281 323 394 465 556 601 569 490 431 400 406 412 414 416 390 364 337 311 340 370 375 380 386 391 383 376 368 361 354 348 342 336 371 406
2401 406 438 469 460 403 304 233 212 239 284 302 286 271 253 236 204 172 143 114 132 196 251 277 265 253 239 226 204 183 189 196 242 289 242 196 138 81
2385 81 80 79 114 150 185 220 275 329 328 326 356 386 416 446 436 426 416 406 385 363 342 320 306 292 278 264 299 334 369 404 427 450 473 496 474 453 431
2369 431 410 398 385 373 360 318 275 232 189 198 206 215 223 242 261 280 299 272 245 275 304 309 314 319 324 343 362 381 400 399 398 397 396 398 400 348 297 263 277 320 363 379
2351 379 395 411 426 429 432 433 434 400 337 266 241 257 301 330 312 257 201 173 191 233 275 292 309 325 341 357 373 336 299 265 279 350 450 517 519 469 418
2335 418 365 359 368 378 362 346 347 349 351 352 372 391 410 430 400 370 340 311 289 267 245 223 217 211 206 200 189 177 166 154 183 211 240 268 287 307 326 345 325 304
2317C04k0k1l0l0l1l0J0J0j8j8J3J4O7O8P3M6L1j5m6m5k1k0mml2l2jkN5N5N7N6J%m8m8QQj4
2300C46j3o6o5o0mK1K0M3M3M3M3LLKLLLLKl1l2l1l2K7K7K7K7J1J0J1J1MLMMk7k7k7k7QQQQ
2282C37m3m4m3m3K9K9K9K9kkkkJ0J0J0Rj9k0j9k0J9J9J7J7k6n4j4M2P9Q0K2l4n0k2J5J6k1
2266C38k1k0k1j5j5j5j5k5k6L1L1J6J6J7J6L5L5j9j9QL6N2ml0l0K2K2J6J5m1m0n7n7jjJ2J1
2250B57m1m1k7K9R0R1L5L5L4L5j2j2j2j3l4l5q8q8m6%L0L0J5J5J5J5J5J5J5J5N2N3mmlmlm
2233D20m0m0J6J6K9K9K9K9J3J3J0J0j6o2n2k4m7m6m5m5p3p2pL9N5K7j0j0K5K5K5K6qqpqL2
2217B48L2L2L2jjkjj3j3j3j3J8J9J9J8ppppM0M0M1M0J8J8l8l9NNMNkklkj7j7p3p2k7k6k6k6
2199A79j1j1M4M5O1O2NNqrqqJKJKNNm1m2l6l6J0J1K0K0qqJ4J5M0M1j0l7oM9R4R3K6l1n6n6
$$ plain form
2317 304 284 263 233 203 172 142 152 162 144 126 139 153 220 288 361 407 438 423 377 332 311 291 287 283 251 219 218 216 271 326 383 439 440 440 392 344 352 360 346
2300 346 333 267 202 142 138 159 179 222 265 308 351 354 357 359 362 365 368 371 373 342 310 279 247 274 301 328 355 366 376 387 398 402 405 409 413 386 359 332 305 313 321 329 337
2282 337 294 250 207 164 193 222 251 280 278 276 274 272 282 292 302 311 292 272 253 233 252 271 288 305 279 225 211 253 332 412 434 400 350 328 343 359 338
2266 338 317 297 276 261 246 231 216 191 165 196 227 243 259 276 292 327 362 343 324 332 368 420 416 386 356 378 400 416 431 390 350 293 236 235 234 246 257
2250 257 216 175 148 177 267 358 393 428 462 497 485 473 461 448 414 379 291 203 157 157 187 217 232 247 262 277 292 307 322 337 389 442 438 434 431 427 424 420
2233 420 380 340 356 372 401 430 459 488 501 514 524 534 518 456 404 380 333 287 242 197 124 52 45 84 139 166 156 146 171 196 221 247 239 231 224 216 248
2217 248 280 312 344 343 342 340 339 326 313 300 287 305 324 343 361 354 347 340 333 373 413 454 494 512 530 492 453 458 463 467 472 470 468 465 463 446 429 356 284 257 231 205 179
2199 179 168 157 201 246 307 369 374 379 371 362 354 346 347 349 350 352 357 362 321 279 243 207 217 228 248 268 260 252 266 281 321 362 352 315 309 358 452 545 571 540 484 428
2180D28m4J1L5L5j2o8o9m2ONQQN4N5N5N4QQK4K4J1m6p6m8j8J0ONL6L5L6L6j1j1k9k9%jk4k5
2163D40k4k4m2m1NNmmlmK5K5K5K5k3k4k3k3j2j1j2j2L5L6L5L5P0P1N3lq5j13p1K3N2K5ml2
2146C91m3m2j7j6L4L4L5L4J2J1j6j6kkM5M6O3O3J0m5n5n5j1j2JKk7k6n9n9l0l1J5J5J5J5L9
2130C16L9qqKKM6M5L4k3n6n6m3m3o7o7m4J1M9P7O3O3J7J8NNONK0K1K0K1JJKJj2j2J2J3Mn3
2113D27o4o4j8L8N3N4K2K2J9J9J4m2r1r1o0nJ1J1J0J1J0J1j3j2j2j2L1L1L1L1l0k9k9k9j6
2098B39j6L0L1K4K3K4K4L1L1LMk7k7K0K1K9L0j7j7j8j8j8j8JKKJRQRRnnnmnnkjnM3M2np2p3
2078C27k0k0j5j5J2J3N0N1N1N0j7j8p4p3m6m5J1J1MMk5k4O0O0L1L2l0l0l0l1J3J2J3J2j5j5
2062B74j2j2j5L1Q0J08Q1L4POJ8J7p6p6p1p1K2K3J9J9J9J9J3J3k4n2n3oK2K2j2j1m0l9o0o1
$$ plain form
2180 428 384 395 430 465 453 385 316 274 280 285 293 301 355 410 465 519 527 535 559 583 594 548 472 424 406 416 422 427 463 498 534 570 559 548 519 490 490 489 465 440
2163 440 416 392 350 309 314 319 315 311 308 304 329 354 379 404 381 357 334 311 299 288 276 264 299 335 370 405 475 546 599 596 511 398 327 350 402 427 423 391
2146 391 348 306 289 273 307 341 376 410 422 433 417 401 399 397 442 488 551 614 624 579 524 469 458 446 447 449 422 396 337 278 248 217 232 247 262 277 316
2130 316 355 347 339 341 343 389 434 468 445 389 333 290 247 180 113 69 80 129 206 269 332 349 367 372 377 383 388 408 429 449 470 471 472 474 475 463 451 463 476 480 427
2113 427 363 299 281 319 372 426 448 470 489 508 522 480 389 298 238 233 244 255 265 276 286 297 284 272 260 248 279 310 341 372 342 313 284 255 239
2098 239 223 253 284 308 331 355 379 410 441 444 448 421 394 414 435 464 494 477 460 442 424 406 388 389 391 393 394 403 411 420 429 424 419 414 410 405 400 398 397 392 435 477 472 400 327
2078 327 307 287 272 257 269 282 332 383 434 484 467 449 375 302 256 211 222 233 237 241 216 192 252 312 343 375 345 315 285 254 267 279 292 304 289 274
2062 274 262 250 235 266 346 454 535 569 576 582 600 617 541 465 394 323 345 368 387 406 425 444 457 470 446 394 341 335 357 379 367 356 316 277 217 156
2047A56n9j1L4L5J0Rllllk0j9j9k0j7j8J1J0J2J2m0m0j5M9J06J06N5N5K7K7l3l4l3l3lmll
2030B78j2j2m0m0m5m6M8M8K9K9%JK0K1qqj5j4j2j2M0Q6Q5L8j2l9m2j4rrppj5j5j5j5j8j9L8
2013B61L8K4K3K4K4L3L4k3k3m8m9QQk5k5k5k5K8K8%%m4m4J1J2K9K9K9K9N6N6%%k5k6k5k5j0
1997C42j0J8J8j7j7o9p0k2K5N4N4L3L3NNj3j2mK5Km5o8o9j7M9N6K8RRL6L5J3J3m3m3J1J0L9
1980D03L9K7K7l0k9k5k5LLRJ0j8j9k6k7k6k7k3k4k3k3K1K1K1K1j0j0ppJ6O3Q3Q3L3L3NNk5
1964E22k5k5k4l3l2K4P1P9N0Mo2j06j07n2oJ7J8m6m5j4j3L3L3L0L0L1L0K3K4k3k3m8m7%jO
1948B93NL4L3%j%jM6M5M6M5qqrqJ5J5J5J5j5j5j6j5onoop8p8p8p8J7J7J7J7K4K4mmj1j1L6
1930B98L6k3k2k3k2KKJKKKKK%J%JN4N5N4N4J8J7J8J7j7j8j7j8K9K8K8K8RQL6j2p0p0p1p1p4
$$ plain form
2047 156 97 86 120 155 165 174 171 168 165 162 142 123 104 84 67 49 60 70 82 94 54 14 -1 48 154 260 315 370 397 424 391 357 324 291 288 284 281 278
2030 278 266 254 214 174 129 83 131 179 208 237 237 238 258 279 271 263 248 234 222 210 250 336 421 459 447 408 366 352 343 334 327 320 305 290 275 260 242 223 261
2013 261 299 323 346 370 394 427 461 438 415 367 318 326 334 309 284 259 234 262 290 290 290 246 202 213 225 254 283 312 341 397 453 453 453 428 402 377 352 342
1997 342 332 350 368 351 334 265 195 173 198 252 306 339 372 377 382 369 357 353 378 380 335 267 198 181 230 286 314 323 332 368 403 416 429 386 343 354 364 403
1980 403 442 469 496 466 437 412 387 390 393 402 412 394 375 349 322 296 269 246 222 199 176 197 218 239 260 250 240 233 226 242 305 388 471 504 537 542 547 522
1964 522 497 472 448 415 383 407 478 557 607 611 549 443 336 284 278 295 313 267 222 208 195 228 261 291 321 352 382 405 429 406 383 335 288 288 287 293
1948 293 298 332 365 365 364 364 363 409 454 500 545 537 529 520 512 527 542 557 572 557 542 526 511 505 500 494 488 410 332 254 176 193 210 227 244 268 292 288 284 273 262 298
1930 298 334 311 289 266 244 246 248 249 251 253 255 257 259 259 260 260 261 315 370 424 478 496 513 531 548 531 513 496 478 507 535 563 591 600 608 644 632 562 492 421 350 276
1912B76m7LMOOOOjkjkJ6J6J6J6L7L7L4L4nn1k6k5MMMMKKK8K9M2J5k0m7l7l6l7l6qK1N2N2N8
1893D49N7M5J8l6l6rK0J9qPQQk0mnk0k1k1k0k1k1k0k1POPPN3N2L3j5q1q2p3m4o1o0m7j9J7
1876D8J8L1N9Q8Q7P8M9K5K6K1K1qn5k9k8k6k6k5k6j9j8j9j9rrrrkkjkJ4J5jK7O7O8J9rm0m1
1858C29m2m3k5k5KLO8O8K1K1LLL1L1K9K9K9K9L8L7L8L8m1m1m1m1l1l0l1l1LMk5k4j6j6L1L1
1841D13N7N7L0K9k7k6k6k7m8m9p6p7j1j2N4N3N8N8k6k6m0m0j2j1N7N6N7N7j1j1n8n8l0l0k9
1826B75l0k4k4l4o1n0lN5Q3P4M6Ql9m2j5L2L2j7j6j7j7jjM6M6O6O5K6k1m8m9n2n2ppl5l5l0
1810A27l0J6J6O1O1O1O1KJKKKJKKJ5J5J6J5l2l2l2l2ooK1K2M1M1oom7m8j9k0L5L4L1L2j8o4
1792C37n2k4OL3K0J9K3K3k4n2k3K5O1O2J0J0J1J0n8n8j1j2nnl3l3m6m6J%KJKM8O0L2j7m5j6
$$ plain form
1912 276 229 232 236 242 248 254 260 259 257 256 254 270 286 302 318 355 392 426 460 455 404 378 353 357 361 365 369 371 373 401 430 472 487 467 420 383 347 310 274 266 287 339 391 449
1893 449 506 551 569 533 497 488 508 527 519 526 534 542 522 518 513 493 472 451 431 410 389 369 348 355 361 368 375 428 480 513 498 417 335 262 218 157 97 50 31 48
1876 48 66 97 156 244 331 409 458 483 509 530 551 543 488 459 431 405 379 354 328 309 291 272 253 244 235 226 217 215 213 212 210 224 239 238 265 332 400 419 410 370 329
1858 329 287 244 219 194 196 199 267 335 356 377 380 383 414 445 474 503 532 561 599 636 674 712 671 630 589 548 517 487 456 425 428 432 407 383 367 351 382 413
1841 413 470 527 557 586 559 533 507 480 432 383 307 230 219 207 261 314 372 430 404 378 338 298 286 275 332 388 445 502 491 480 422 364 334 304 275
1826 275 245 221 197 163 102 52 49 104 187 261 307 315 276 234 219 251 283 266 250 233 216 215 214 260 306 372 437 463 442 394 345 293 241 234 227 192 157 127
1810 127 97 113 129 190 251 312 373 375 376 378 380 382 383 385 387 402 417 433 448 416 384 352 320 314 308 329 351 392 433 427 421 374 326 307 287 322 356 387 419 401 337
1792 337 285 261 267 300 320 339 362 385 361 309 286 311 372 434 444 454 465 475 417 359 348 336 331 326 293 260 214 168 169 169 171 172 174 222 282 314 297 252 236
1775B36j6J0J0JJLLN3Q1R1M5mml6l5q3q4l7l7J5J4j2j1J6O2N2K4j3j4j4j5ppopJ6J6J6J7k9
1758C11k8j%J3J3l4l3m5m4KLN6N7N7N7L8L9J9k9m3m3J9K0j%%jJ1J0J1J1nmnnm2m3m2m3k0k0
1740B16RQl8l7k2L3P0P0P0P0J5m0p5p5l5l6J1J1QPL6L5NNk4k3J7J7J7J7J5J4l2l2l2l3J5J5
1723B72J0J0J0J1k2k2k2k2PPPOnnmnM3M3M3M4K3K4k4k3m7m7l2K5K5K6JJK7K7k0j9k6k5k6k6
1706B70K7K6K7K6m3m2p4j8K8K9L2L3m1m0m0m0J0J1J1J0j0j0j1j0L3L3L3L3K9K9K9K9ppp2p2
1690B51j5j4j5j4j4j4j4j4j5j4j1j1L6Q3P9L3k7p5p6k9K4N3L9L9LLLLL6L6O1O1L6j0n0n0n0
1674C47m9m8m8K0M8Mo0q4n5pK1M2M2M3M4K1K1K1K1K7K6jjpon0n1j8K8J7j0j4j4j6j6k9k8L7
1658B18L6K7K6jkk1k2k1k1KLLLK1K1j8o5q4q3k6J9O6R4Q0L2J2J1j9k0l3l4L2L2K0K0M8M8O
$$ plain form
1775 236 220 230 240 241 242 245 248 301 382 473 518 514 510 474 439 356 272 235 198 213 227 215 204 220 282 334 358 345 331 317 302 295 288 282 275 291 307 323 340 311
1758 311 283 282 282 295 308 274 241 196 152 154 157 213 270 327 384 422 461 480 451 408 365 384 404 403 403 403 402 413 423 434 445 440 436 431 426 384 341 299 256 236 216
1740 216 225 233 195 158 136 169 239 309 379 449 464 424 349 274 239 203 214 225 233 240 276 311 316 321 297 274 291 308 325 342 357 371 339 307 275 242 257 272
1723 272 282 292 302 313 291 269 247 225 232 239 246 252 247 242 238 233 276 319 362 406 429 453 429 406 359 312 280 305 330 356 357 358 385 412 392 373 347 322 296 270
1706 270 297 323 350 376 333 291 217 199 227 256 288 321 280 240 200 160 170 181 192 202 192 182 171 161 194 227 260 293 322 351 380 409 402 395 323 251
1690 251 236 222 207 193 179 165 151 137 122 108 97 86 122 205 284 317 290 215 139 110 134 187 226 265 268 271 274 277 313 349 410 471 507 497 447 397 347
1674 347 298 250 202 222 270 274 214 130 75 68 89 131 173 216 260 281 302 323 344 371 397 396 395 388 382 332 281 263 291 308 298 284 270 254 238 209 181 218
1658 218 254 281 307 306 304 283 261 240 219 221 224 227 230 251 272 254 189 105 22 -4 15 81 175 255 287 299 310 291 271 238 204 236 268 288 308 356 404 410
1641D10OOOj7j7j7j8n0n0m9m9LL1M1M2L4Ol3l3l4nL3L3J6j3ML%%%jJ4J3J3J3rj0KL1L0L1k4
1623C92k4k0j9k0k0J5J5J5J5L2L2K0rn4n5l7K8Q3Q3K0k7n0n0j3J5K2K2j5m3n3k4m2m2j9j9
1608A54j9j9NONOk3k3J7M5L3L3L5L4J9J8J7J7ll0j5j5J3J3J3J3OOOOk7k8k7k8k6k5J3M0M0
1591C05J2k5k5m1j3K6K6J3j5k6k6qK0N8N9K3mj7j7J3J2J3J2RJ0QPk5n3n1k3KL0P0O9O7K1j0
1575E06rqqk5LK9%l7l8j2j3l8l9k4NM3M3K4mm4m4l8l9j0j1RQQQl0k9k7k7QN5M5J6MLN5N5L
1557C76m4l3n%JMMK3N2N1K4j8j8OPRk0m2p0o5l6k4k5l0kJ0J0j5j4Jk7m7m7J6O3O1L4L4O3N9
1539C26L2qpJKJKmlmlj1j0j1j0j5j5j7j7k1n0m7k0QL6O0Q8R3M6J8J8l4l3l4l4NMK3nk9J7M5
1521C83M6JJKJL1L1k6k5k0j9k0j9j7j7j7j7J8J8J9J8mmmnMNMMQQm7m6p3m4PN5Q8Q8P2Pn9n8
$$ plain form
1641 410 416 422 428 411 394 377 359 309 259 210 161 164 195 236 278 312 318 285 252 218 213 246 279 295 282 286 289 289 289 289 288 302 315 328 341 332 322 324 355 385 416 392
1623 392 368 348 329 309 289 304 319 334 349 381 413 433 424 370 315 278 306 389 472 492 465 415 365 352 367 389 411 396 353 300 276 234 192 173 154
1608 154 135 116 121 127 132 138 115 92 109 154 187 220 255 289 308 326 343 360 357 327 312 297 310 323 336 349 355 361 367 373 346 318 291 263 237 212 225 265 305
1591 305 317 292 267 226 213 239 265 278 263 237 211 203 223 281 340 363 359 342 325 338 350 363 375 384 394 402 409 384 331 280 257 259 289 359 428 495 516 506
1575 506 497 489 481 456 459 488 488 451 413 401 388 350 311 287 292 335 378 402 398 354 310 272 233 223 212 221 229 237 245 215 186 159 132 140 195 240 256 260 263 318 373 376
1557 376 332 299 294 294 295 299 303 326 378 429 453 435 417 423 430 439 419 377 307 242 206 182 157 127 125 135 145 130 116 117 90 43 -4 12 75 136 170 204 267 326
1539 326 358 350 343 344 346 347 349 345 342 338 335 324 314 303 293 278 263 246 229 208 158 111 91 99 135 195 283 376 422 440 458 424 391 357 323 328 332 355 350 321 338 383
1521 383 429 430 431 433 434 465 496 470 445 425 406 386 367 350 333 316 299 317 335 354 372 368 364 360 355 359 364 368 372 380 388 341 295 222 178 185 240 328 416 488 495 436 378
1502C78o3o2j1j0M6M5kkklNNNNJ4J3J3J3J7J7m0l9j2j1j2j1M8M8pqk4k4L2L2L3L3L3L3o4o4
1485C97o4o4k6k6k6k6ONO2O1K7K6K7K7l3l4l3l3k1k1k2k1K3K3K3K3JJJJQRQQj0rj0rL0L0L0
1467C69L1K5K6K6K6L3L3o1o1n4n4JKnnonJ2J3J2J2J8J9l7l6j4J5L0k6o2o3j0j0M1M1M1M1k8
1451C30k8k8k8l0l1l0l1OOO2O2j3j2j1j0k4MM8J05J16Q8M4j2l6o5n3n2nmmnmnmnm1m1m1m1
1434A77K4K3K3K3%%n6n7q1q0j9L6K9K9L3L2K3K3K3K3J0J1m6m5j1j1M6M5JJ%JL4L5L4L5KJK
1417C73JK3K2K3K2j4j4j4j5n7n8jjK5K5K5K5k5k4k4k4m8m7K7N5L3j4m2m2j7j7j5j6M0O8P8
1401C36L1j8j9k1k2NOO0N9J3j5k5K1N5N6N5N5j6o2n2k4m2m3l8l8JM7L6Rl6l6l8l8j1j1j1j1
1385B18mmmmJJJJN8N8KLk6k5k5k5k0k1L6L6j4j5j4j5J5J5J5J5J7J7J7J8j8j8L8L8N5N4kkl9
$$ plain form
1502 378 315 253 242 232 278 323 321 319 317 314 319 324 329 334 348 361 374 387 404 421 381 342 330 319 307 296 344 392 385 377 353 329 361 393 426 459 492 525 461 397
1485 397 333 269 243 217 191 165 171 176 238 299 326 352 379 406 373 339 306 273 252 231 209 188 211 234 257 280 281 282 283 284 292 301 309 317 307 298 288 279 309 339 369
1467 369 400 425 451 477 503 536 569 508 447 393 339 340 342 337 332 326 321 333 346 358 370 388 407 370 334 320 335 365 339 277 214 204 194 235 276 317 358 330
1451 330 302 274 246 216 185 155 124 130 136 198 260 247 235 224 214 190 194 242 347 463 551 595 583 547 482 429 377 372 368 364 359 355 350 346 341 300 259 218 177
1434 177 201 224 247 270 270 270 214 157 76 -4 -23 13 42 71 104 136 159 182 205 228 238 249 203 158 147 136 182 227 228 229 229 230 264 299 333 368 370 371 373
1417 373 374 397 419 442 464 450 436 422 407 350 292 291 290 315 340 365 390 365 341 317 293 245 198 225 280 313 299 257 215 198 181 166 150 190 258 336
1401 336 367 349 330 309 287 292 298 358 417 430 415 390 411 466 522 577 632 616 554 502 478 436 393 355 317 318 365 401 410 374 338 300 262 251 240 229 218
1385 218 214 210 206 202 203 204 205 206 264 322 324 327 301 276 251 226 206 185 221 257 243 228 214 199 214 229 244 259 276 293 310 328 310 292 330 368 423 477 475 473 434
1368D34m0l9l9k3k3k0k0JM7L7J0J9K0J8J8rrrrrrM6M7J2J2m4m4l2l2l1l2K0J9K0K0L3L2k3
1351C69k4j2j3j3j3kjkjK4K4K5K4J0J1J0J0o3o2l3J4L0K9L3L3M2M2j3j4k0k0j9k0jjj%K3K3
1334D28l3l3J5J4J5J5lmmmJJn5n5m9n0POM4M4M4M4OOL3j4q4q5n7j1K4K3K7K7K6K7K6K7MLl3
1316C63o2n7j1N3N2L7rl6l6J4O2M9K1j3m2k7k8m2m2m2m2lkN3N4K9K9o5o4m0m0J6J7M1M0j5
1301B12j5QQQQM4M3J8l7n7n7nmL3L3Q5Q6M8qo7o6o1mK0K0mmmmj7j7j7j7J3J4J4J3ooN0N0n
1283C46mmnN4N3K4K4n4q2m1J4L8L8j4j5l0l0l0l1j5j5L8L8K3l3n4n4rM6L1Lk9k9lkO9P0M5
1266C71j1m6m7k2k2K0J9P6P5J3J3m3m3m7m6RJ0K9K8K6K5Mn3q0k5M8M8K7k9m8m8k3k4k9k9K7
1250A53K7M7M8M7M7rro6o5m9m9PPPPPPk0k0M5R1O7K0LL2N3K5j4j3l7l6rqK7K8%%l5l4l5l4
$$ plain form
1368 434 394 355 316 293 270 250 230 231 278 315 325 344 364 382 400 391 382 373 364 355 346 392 439 451 463 419 375 343 311 280 248 268 287 307 327 360 392 369
1351 369 345 333 320 307 294 292 291 289 288 312 336 361 385 395 406 416 426 363 301 268 282 312 341 374 407 449 491 478 464 444 424 405 385 384 383 382 382 405 428
1334 428 395 362 377 391 406 421 418 414 410 406 407 408 353 298 249 199 206 212 256 300 344 388 394 400 433 419 335 250 193 182 206 229 256 283 309 336 362 389 393 396 363
1316 363 301 244 233 286 338 375 366 330 294 308 370 419 440 427 385 358 330 288 246 204 162 159 157 210 264 293 322 257 193 153 113 129 146 187 227 212
1301 212 197 205 213 221 229 273 316 334 297 240 183 178 174 207 240 325 411 459 451 384 318 257 253 273 293 289 285 281 277 260 243 226 209 222 236 250 263 257 251 301 351 346
1283 346 342 338 333 387 440 464 488 434 352 311 325 363 401 387 372 342 312 282 251 236 221 259 297 320 287 233 179 170 216 247 250 221 192 189 187 256 326 371
1266 371 360 314 267 245 223 243 262 338 413 426 439 396 353 306 260 269 279 308 336 362 387 391 338 258 233 281 329 356 327 279 231 208 184 155 126 153
1250 153 180 227 275 322 369 360 351 285 220 171 122 129 136 143 150 157 164 144 124 169 260 327 347 350 382 435 460 446 433 396 360 351 343 370 398 398 398 363 329 294 260
1233B60llllO1O2L3L3l0l0kM5N3K6l3o0l9j1J2M0N7N7LLk2k2p5p5l1J5Nk3l9l9J5J5mmmmP9
1215C15P9N0Kl2l3pqrrl7l7onK2K3M8M7O0L1l0r5r6l0L6O4O6L8J3j4j6J2OOQPj0j1j0j1k2
1198D05k2k3k2k1k0j8j8J2O0M8K1k9l0l1l2MMLMJ6J7J6J7OOM9N0M1j6o4o4n1OL8O7N6%n1n1
1181C83m0m1oM9P3P3K5l1l1lNOk2k1OPK9K9KJm9m9m9m9j3j2j3j3J1J0N7N7J04J04O8J3m3p2
1164E55p1m3LN8M3J5m4p2n8n7n2n1k3k3j9j8K8K8K9K9K9K9LKo2r0o4qM6P4N6N6J1J2k0j9J1
1148C23J0O0Q7N6%l8l8ONK6K6n9n8o9o9lmJ4J3l3l3l6l6M9M9L5L5PPk2k2n0OM8J04J06N1m8
1132E05p6r5l8J7J7K0K1K4K5m1o8m9OK0K1k9k9k9k9k1k1k1k1N6N7N2N3J1m6l0k%jKKn4n3n4
1115A02n3J9J9J8J9NNNNL6L5L5L6L5L4L5L5k8k8k8k9k5k6k5k6rrL7L8M0M1M4j2m5m5nnk3p8
$$ plain form
1233 260 257 254 251 248 309 371 404 437 407 377 375 420 473 499 466 406 367 356 368 408 465 522 525 528 506 484 409 334 303 318 323 300 261 222 237 252 248 244 240 236 315
1215 315 394 444 446 414 381 374 366 357 348 311 274 268 263 285 308 356 403 463 494 464 369 273 243 279 343 409 447 460 446 430 442 448 454 462 469 459 448 438 427 405
1198 405 383 360 338 317 297 279 261 273 333 381 402 373 343 312 280 284 288 291 295 311 328 344 361 367 373 422 472 513 497 433 369 318 324 362 429 485 485 434 383
1181 383 343 302 296 345 418 491 516 485 454 451 456 462 440 419 425 432 461 490 492 493 444 395 346 297 284 272 259 246 257 267 324 381 485 589 657 670 627 555
1164 555 484 441 444 502 545 560 516 444 386 329 277 226 203 180 161 143 171 199 228 257 286 315 318 320 258 168 104 96 142 216 272 328 339 351 331 312 323
1148 323 333 393 480 536 536 498 460 466 471 497 523 464 406 337 268 265 261 275 288 255 222 186 150 199 248 283 318 325 332 310 288 238 244 292 396 502 553 505
1132 505 429 334 296 313 330 350 371 395 420 379 311 262 268 288 309 280 251 222 193 172 151 130 109 165 222 274 327 338 292 262 260 260 259 261 263 209 156 102
1115 102 49 68 87 105 124 129 134 139 144 180 215 250 286 321 355 390 425 397 369 341 312 287 261 236 210 201 192 229 267 307 348 392 380 335 290 285 280 257 179
1098A79n1NN9N9k2k2MMNMK8K7K8K8J7J6K0l6q2q2n2MK8K8MLlkK5K6K5K5N3N3L8L7k7k8l5l6
1081C54pqJ3J2l4l4nmK4K4ONNOOPOPj3j3j3j3m3m3j5j5k7k8J9M7K3k4l9j1L0L1K9K9mn0r0
1063A50q9l3l2J3J4O9O9O9O9RQRRPPPPJ3J4J4J4k6k7k6k6JJJJJJm5m6m2m3K3K3M7M7J%k2k3
1045B38k3k3k8k9k8k8K3K3k4k3k0k0M6M5N4N3l1l1m7m7m3m2k4M2Q5N6Kk6j2j2L0L0L0L0J5
1029B41J5J5J5k5k5k5k5JJJJK1K1ppk4k4M2M1N3N2j3m0k3K4O2O1L7L6QRopl4l4k1k2M5M4L0
1012E14L1l5l4l3l2L3L3J6J6j2j2m4m5m2m3m2j4M3R0O0mm9m9j3j3j3j3k5k6KL1J4l3o7o7j4
996A09L3O7L9Rj9l0l0j0L7P2P3N6QPPLLLLLMMMqqqqj3j2j2j2KKo4o4l6l6J1J0K2K2opN4N4
977C38N3N4K2K1K2K1j4j4j5j4n5n6n2n2m3ML4L4KKn4n4j4j4j3j4%JN6N7J0J1J0J1k1k1k1k1
$$ plain form
1098 179 128 133 192 251 229 207 211 215 220 224 252 279 307 335 352 368 388 352 270 188 136 140 168 196 200 203 200 198 223 249 274 299 352 405 443 480 453 425 390 354
1081 354 347 339 352 364 330 296 291 287 311 335 341 346 351 357 363 370 376 383 370 357 344 331 288 245 230 215 188 160 179 226 249 225 186 175 205 236 265 294 290 240 150
1063 150 61 28 -4 9 23 92 161 230 299 308 316 325 334 341 348 355 362 375 389 403 417 391 364 338 312 313 314 315 316 317 318 273 227 185 142 165 188 235 282 283 283 261 238
1045 238 215 192 164 135 107 79 102 125 101 78 58 38 84 129 183 236 205 174 127 80 37 -5 -29 13 98 154 156 130 118 106 136 166 196 226 241
1029 241 256 271 286 261 236 211 186 187 188 189 190 211 232 225 218 194 170 212 253 306 358 345 305 282 306 368 429 466 502 510 519 513 506 472 438 417 395 440 484 514
1012 514 545 510 476 443 411 444 477 493 509 497 485 441 396 354 311 269 255 298 388 448 444 395 346 333 320 307 294 269 243 245 276 290 257 190 123 109
996 109 142 209 248 257 238 208 178 168 205 277 350 406 414 421 428 431 434 437 440 443 447 451 455 447 439 431 423 410 398 386 374 376 378 314 250 214 178 189 199 221 243 237 230 284 338
977 338 391 445 467 488 510 531 517 503 488 474 419 363 311 259 216 220 254 288 290 292 238 184 170 156 143 129 129 130 186 243 253 264 274 285 264 243 222 201
960B01L9L8L9L8j0j1j0j1J1J2J1J1k8k7K9K8J0RRRl3l3l3l3l0l0K6K7M0M0M0M1nmo0o1k9k9
944B31k8k9RJ0RJ0J6J7J6J6J0RJ0Rl0l0l0l1j1j0j1j1m6m6J1J0J5J5m0m1K0K0K0K0OOOOM5
927A78M6M6M5J1J0QQLm4m6JM3J4k3k3M8M8M7M8J3J3m1m0j2L6O5O4O9O9M4j2o1o1o5o4m1m1
911D03J5J6L2L3L3L3k1k2k1k1n6n6l3K3K0pJ2J2K5K6K5K6KKKKm9m8m8m9opM6M7K0l6r4r4k9
894A58K8O6L9j6m5m4j6J6M4L0L0J0J0m7m6j0j1j0j0J5J4O7O7N0pl1l1PQm9m9m3m3N1N0N2N2
878C56nmpopoKJKKJ1J1J0R%k9m6J0K7%l8l8l1l1K5K5P3P3J8J7M3M4N5K8ln8o0nL2L2k2k2m8
859D40p5q9l4P6J03O7J0k5k4k8k8k0k0k0k0J0J0J0J1JKk0p7o4l5JJQQQQj%jjpqpqj3j3j3j2
841A11M1M0M1M1ooopL4L3Q6Q6M9qp0o9m8m7m8m7N2N2N3N2O1O0Jn6o4l6JJK5K5K5K4K9L0k8
$$ plain form
960 201 240 278 317 355 345 334 324 313 324 336 347 358 330 303 332 360 370 379 388 397 364 331 298 265 235 205 231 258 298 338 378 419 414 410 350 289 260 231
944 231 203 174 183 193 202 212 228 245 261 277 287 296 306 315 285 255 225 194 183 173 162 151 105 59 70 80 95 110 70 29 49 69 89 109 115 121 127 133 178
927 178 224 270 315 326 336 344 352 355 311 265 266 309 323 300 277 325 373 420 468 481 494 453 413 401 437 502 566 635 704 748 736 675 614 549 485 444 403
911 403 418 434 466 499 532 565 544 522 501 480 424 368 335 358 378 371 383 395 420 446 471 497 499 501 503 505 456 408 360 311 305 298 344 391 411 375 281 187 158
894 158 186 252 291 275 230 186 170 186 230 260 290 300 310 263 217 207 196 186 176 191 205 272 339 389 382 351 320 327 335 286 237 194 151 202 252 304 356
878 356 351 347 340 334 327 321 323 324 326 328 339 350 360 369 369 340 294 304 331 331 293 255 224 193 218 243 316 389 407 424 467 511 566 594 591 533 473 468 500 532 510 488 440
859 440 365 276 242 318 421 488 498 473 449 421 393 373 353 333 313 323 333 343 354 355 357 337 260 196 161 162 163 171 179 187 195 194 194 193 192 185 177 170 162 149 136 123 111
841 111 152 192 233 274 268 262 256 249 283 316 402 488 537 529 459 390 342 295 247 200 252 304 357 409 470 530 531 475 411 375 376 377 402 427 452 476 505 535 507
824E07k7k7k8o5r2q7l2J4M1K7K6K9K8k5k6k6k5L3L3L2L3PPPPJKl5o4l1K5Pk0l0k9K5K4lmm
807B35lqpppJ1J1J1J1L0L0k6k7l0k9K6K6QQRRK0M9N8J2norqm6m5J0J1J3J4J4J4l4l4l4l4k1
788B20k1L5L4M4M4M3M4kkkkK1K0K0K1rrrrJJn5n6ooooL3L2k3k4RQQQk8k8k9k8o7o6j1j1L0
769A61K9L0K9P9P8P9P8K2K2l4l4n4n4KKK4K5mn0m8k0J8J7MLLMPOPPJ5J6J2J3l0p5n0n0k7k8
752B34k7k8L0L0L0K9m1m1J5J5L2L3k3k3m5m5j7j7J0J0J0J0K2K1M9N0Q6Q6pqk0k1k1k0n3n3
736B92LMK5K5mlmmk9k9m1J5M0M0j2j3m0m0j%K7K8L5L6L6L5J9J9J9J9K1K2l4l5k3k3NOK4K4
719D84l1l2k2k1L4L5L2L1ML%%%%m7m6m6m7j6j6j2j3k6K9N5N4L8L8L4L4k0p6o0l3nonmLLKL
700C32QRQQj7j8j7j8m1m1m1m2QPL6L5N1N1J4j4jM6P1P1K9j7l1o0p2p3m7m6o8o7j2j1K2K1K2
$$ plain form
824 507 480 453 425 360 268 181 149 163 204 231 257 286 314 289 263 237 212 245 278 310 343 350 357 364 371 372 374 339 275 244 269 276 256 226 197 222 246 243 239 235
807 235 232 224 217 210 203 214 225 236 247 277 307 281 254 224 195 221 247 255 263 272 281 301 350 408 420 415 409 400 392 346 301 311 322 335 349 363 377 343 309 275 241 220
788 220 199 234 268 312 356 399 443 441 439 437 435 456 476 496 517 508 499 490 481 482 483 428 372 366 360 354 348 381 413 390 366 375 383 391 399 371 343 314 286 219 153 142 131 161
769 161 190 220 249 328 406 485 563 585 607 573 539 485 431 433 435 459 484 480 430 382 362 380 397 401 404 407 411 418 424 431 438 453 469 481 494 464 389 339 289 262 234
752 234 207 179 209 239 269 298 257 216 231 246 278 311 288 265 220 175 158 141 151 161 171 181 203 224 273 323 409 495 488 480 460 439 418 398 345 292
736 292 295 299 324 349 345 342 338 334 305 276 235 250 290 330 318 305 265 225 224 224 251 279 314 350 386 421 440 459 478 497 518 540 506 471 448 425 430 436 460 484
719 484 453 421 399 378 412 447 479 510 514 517 517 517 517 517 470 424 378 331 315 299 287 274 248 277 332 386 424 462 496 530 510 434 374 341 336 330 325 321 324 327 329 332
700 332 340 349 357 365 348 330 313 295 254 213 172 130 138 145 181 216 267 318 332 318 317 363 434 505 534 517 486 426 354 281 234 188 120 53 41 30 52 73 95
683I5K2OPOOL2L1O0N9L5L6k1k1poN0N0O9P0J3J4m1m2j3j4j9k0m7m8l9l9j1j1M8M9M5M5J3l5
667D27o4o4j8j8L8L7K5K4l1l2k5k5LLJ9J9J9J8n1n1n1n0J2J2J2J2L2L2L2L2J3J3J2J3j8j7
651C44J0J0M0L9j6j7n2n2k4k3L8L9L9L8k5k6k5k6rrooRN5M3J4j6o2o4j7L0L0k2o8n3nL4O1
634B50N0N0K3K4j4j4j4j4l4l4l5l4j0j0l7J0N3N3N6N6k2k1k1k2k8k8k8k9klklmmnmK1K1K2
618B13K1RRRRRRRRQQQQj6j6j6j6N0M9O0Q7O4J8k3n1l5l5l6l7NONNrql7l7ppL9M0J7J7m9m9
598C16k4k4M2M1P0P0NMl2l2m2o9n2mL2L3j9k0K8K7L4L4POppK2K1M3M2k2k3l8l8l8l8l8l8l8
581B34l8lkK3K3K2ol6l5m3j4L5L5L8L9K6kk7k8KL0K9K8KLj0rrj0pqqqJ5J5jK8P4P5R0O2Lk6
563F01j1j1l6l6l6l5j5j5m1m1m8k0L1N8N4K5nl3j1J7j%ONOOk0j9qK1M2M3k2k1kkjkl6l6l5
$$ plain form
683 95 117 123 130 136 142 174 205 265 324 359 395 374 353 346 340 390 440 509 579 592 606 565 523 510 496 477 457 410 362 323 284 273 262 310 359 404 449 462 427
667 427 363 299 281 263 301 338 363 387 356 324 299 274 277 280 299 318 337 355 304 253 202 152 164 176 188 200 232 264 296 328 341 354 366 379 361 344
651 344 354 364 404 443 427 410 358 306 282 259 297 336 375 413 388 362 337 311 302 293 287 281 290 345 388 402 386 324 260 243 273 303 281 213 160 155 189 250
634 250 300 350 373 397 383 369 355 341 307 273 238 204 194 184 147 157 210 263 319 375 353 332 311 289 261 233 205 176 174 171 169 166 162 158 153 149 170 191 213
618 213 234 243 252 261 270 279 288 297 306 314 322 330 338 322 306 290 274 324 373 433 520 584 602 579 528 493 458 422 385 390 396 401 406 397 389 352 315 308 301 340 380 397 414 365 316
598 316 292 268 310 351 421 491 496 500 468 436 394 325 273 269 301 334 315 295 323 350 384 418 425 431 424 417 439 460 503 545 523 500 462 424 386 348 310 272 234
581 234 196 193 191 214 237 259 253 217 182 139 125 160 195 233 272 298 296 269 241 243 273 302 330 332 335 325 316 307 297 290 282 274 266 281 296 295 323 397 472 562 624 627 601
563 601 590 579 543 507 471 436 421 406 365 324 276 256 287 345 399 424 419 386 375 392 391 391 397 402 408 414 394 375 367 388 430 473 451 430 428 426 425 423 387 351 316
545C16l4pK1K3nLL2J4J4mnJ3j4n3k5L2Q0O1L4Kk5m5m6l4pK0J9K0J9pl5k0j9j9j9j9j9rqrq
527B28JJN7N7K3K3llM8P6N8J0k8n6m3m2k3k2k2k2%%j%KJn4n5m3m2j1j2J0N7Q4Q3K7k0k3k2
510B99noooJ5J5J5J4M9N0ppJ2J2j4o2n9j3J5J4QQQQk1k0k1k1m0m0j2j1j3j3J6O2O9M1j6m4
492B73m4j5K3K3OPk1k2m1m1J5J5J2J2J0J0M0J1JM7Q5Q5onl8l8r2r1p4k8KKrj0j0rK1K1K1K2
475A70J2J2M0M1M9M9ppmmmml5l6K1K1L5L4k1k1llklL0K9L0L0J3J4J3J4m5m4m4m4n6n6%Jk1
457A94k0J0N6M3M3M5M6N7N6J%LLLLL0L0Jm7n8n9noK5K5mn2p3p3J8J7J9J9J9J8%%n4n4rL7L9
439C46L9LL%jLm4p0p1l5J2J3J3j5j5j6j5j4j3j4j3PPPPj9j8j6j6K8P4O4L6JJjjO2O3O2O2j
421E05%jjLKKLl0l0k9l0rrL8L8KJk6k6J3J4J4J4j2j1N1N1K5k2m3m2j5j5j5j5j6j6j5j6lmm
$$ plain form
545 316 282 275 296 319 314 317 349 363 377 373 368 381 367 314 289 321 401 462 496 498 473 428 382 348 341 361 380 400 419 412 377 357 338 319 300 281 262 253 245 236 228
527 228 229 230 287 344 367 390 387 384 432 508 566 576 548 492 449 407 384 362 340 318 318 318 317 317 319 320 266 211 168 126 115 103 113 170 254 337 364 344 321 299
510 299 294 288 282 276 291 306 321 335 384 434 427 420 432 444 430 368 309 296 311 325 333 341 349 357 336 316 295 274 234 194 182 171 158 145 161 223 292 333 317 273
492 273 229 214 237 260 266 273 252 230 189 148 163 178 190 202 212 222 262 273 274 321 406 491 485 480 442 404 312 221 147 119 121 123 114 104 94 85 106 127 148 170
475 170 182 194 234 275 324 373 366 359 355 351 347 343 308 272 293 314 349 383 362 341 338 335 333 330 360 389 419 449 462 476 489 503 458 414 370 326 270 214 214 215 194
457 194 174 184 240 283 326 371 417 474 530 531 531 534 537 540 543 573 603 604 557 499 440 435 429 454 479 475 423 350 277 295 312 331 350 369 387 387 387 333 279 270 307 346
439 346 385 388 391 391 390 393 349 279 208 173 185 198 211 196 181 165 150 136 123 109 96 103 110 117 124 105 87 71 55 83 157 221 257 258 259 258 257 319 382 444 506 505
421 505 505 504 503 506 508 510 513 483 453 424 394 385 376 414 452 454 455 429 403 416 430 444 458 446 435 486 537 562 540 497 455 440 425 410 395 379 363 348 332 329 325 321
403C21mm7m7m4m4kM4J8J8jjjjOOOOK3K3K2K3KKJKonooj3j3j2j3K7K8K7K8L0L0L0L1LLM6M6
383E86np1q1q1o1o1j5j4mmmmL5L5L5L6MNNNj1j2j1j1J%J%j8j7j8j8jjjkKJJJK7K6K7K7k0k1
363B93k0k0L6L7L6L7%%k9k8l9l9K6K6J0J0j7j8rj0rrO9O9L0j7m3m3JJM0M1L7L8J1l6n6n6J8
346C68J7J7J7ppl2l2pM0N8N7Nm2o3o2k7k6JKJJM8M9J5J6m9n0ppppllM4M4J0J1J0J1k3k2k3
328C36k2J7J7J8J7m8m7m8m7J5J6J5J6L0L1L0L1MNNMopporrl7l7l0l0J7J7NONNKKKKM2M2M1
309D05M2RROOk0o7o7k0J2J2Lk6k8k8jK7M1J2j7j6jjjjK2K2K2K2K0K0L6Qj9k0k1k1j0j1J7J8
291C95K3K3k7n5m8m8l6pPL6M9N0O1O0L9rm7p6p7m9KK9J6J5K6K5M2J3m3m4m5m5l9l8l9l8J9
275A20K0K0K0L4L4L5L4MLONK8N6N4K7j8m6m8j9J6J6Ok3l1l2J5M3O4L6kn0p1m4OL5N5N6M3J6
$$ plain form
403 321 317 270 223 179 135 133 177 195 213 212 211 210 209 215 221 227 233 256 279 301 324 326 328 329 331 325 320 314 308 295 282 270 257 284 312 339 367 397 427 457 488 491 494 540 586
383 586 581 510 429 348 287 226 211 197 193 189 185 181 216 251 286 322 326 331 336 341 330 318 307 296 297 297 298 298 280 263 245 227 226 225 224 222 224 225 226 227 254 280 307 334 314 293
363 293 273 253 289 326 362 399 399 399 370 342 303 264 290 316 326 336 319 301 292 282 273 264 333 402 432 415 372 329 330 331 371 412 449 487 498 462 406 350 368
346 368 385 402 419 412 405 373 341 334 374 432 489 494 452 389 327 300 274 275 277 278 279 327 376 391 407 358 308 301 294 287 280 277 274 318 362 372 383 393 404 381 359 336
328 336 314 331 348 366 383 335 288 240 193 208 224 239 255 285 316 346 377 381 386 391 395 389 382 375 369 360 351 314 277 247 217 234 251 256 262 267 272 274 276 278 280 322 364 405
309 405 447 456 465 471 477 457 390 323 303 315 327 330 304 276 248 247 274 315 327 310 294 293 292 291 290 312 334 356 378 398 418 454 462 443 423 402 381 371 360 377 395
291 395 418 441 414 359 311 263 227 220 227 263 312 362 423 483 522 513 466 390 313 264 266 295 311 326 352 377 419 432 389 345 300 255 216 178 139 101 120
275 120 140 160 180 214 248 283 317 321 324 330 335 363 419 473 500 482 436 388 369 385 401 407 384 353 321 336 379 443 479 477 427 356 312 318 353 408 464 507 523
258E23j7m5m6j9PPJ0J1OL4J7J7k3n1n0k3J4J3J6J5l0l1l0l1l3l2m5j7K6Q2R6R6P7K1l3o1o5
242D06l7pqmmK5K4N0M9LLk3k3k3k3K0K1K0K0j0rj0j0J1J1J2J1qqqql7l7rrmlL9M0J6l9n2k4
224C44POQQL7L8L7L8j7j6k0j9k2p9o0l3nK4RJ0rqqrJ1J0P6P6L0K9j7j7qqpqMNMNk4k4k4k5
204C49j4j5J3J3j5j5L1L1O3O2J6J6k1k2k1k1k7k7p1p1o0lL2O1P0O9O8K1n8q7m6%Lm5o7o8o
188A38N8R3O4K8Jj4j4qpqqooonj5j5j4j5ool3l4n0m9OPNNNNL5L5L6L5RQm7m8k1k2L4L5nmn
168A71mK0K0K0K0j0j0j0j0OOPOK6K7K6K7LLn0n0j1L5O3O2N0Lo5o4m8m8RQJ7J6J7J6K6K7l0
151C27l0j1j0J7J7%%l7o6o1j4J4J4J2J1M0M0K9K9N8N7L2L1k4k5noK3K3j3j3J5J6j9j8j9j8
135D16%%n6n6n5n6L7L8J5J5J4J5N7N7l7l6p0p1p0p0J4J4J4J4L4L5Q7Q8M1oqpL4L4k2k2k5k5
$$ plain form
258 523 506 461 415 396 403 410 420 431 437 471 488 505 482 431 381 358 372 385 401 416 386 355 325 294 261 229 184 167 193 275 371 467 544 565 532 471 406
242 406 369 362 354 350 346 371 395 445 494 497 500 477 454 431 408 428 449 469 489 479 470 460 450 461 472 484 495 487 479 471 463 426 389 380 371 367 364 403 443 459 420 368 344
224 344 351 357 365 373 410 448 485 523 506 490 470 451 429 350 290 257 252 276 285 295 286 278 270 261 272 282 358 434 464 493 476 459 451 443 436 428 432 437 441 446 422 398 374 349
204 349 335 320 333 346 331 316 347 378 441 503 519 535 514 492 471 450 423 396 325 254 194 191 223 284 354 423 491 512 454 367 321 321 324 279 212 144 138
188 138 196 289 353 381 382 368 354 346 339 331 323 317 311 305 300 285 270 256 241 235 229 196 162 112 63 69 76 81 86 91 96 131 166 202 237 246 254 207 159 138 116 150 185 180 176 171
168 171 167 187 207 227 247 237 227 217 207 213 219 226 232 258 285 311 338 341 344 294 244 233 268 331 393 443 446 381 317 269 221 230 238 255 271 288 304 330 357 327
151 327 297 286 276 293 310 310 310 273 207 146 132 146 160 172 183 223 263 292 321 379 436 468 499 475 450 445 439 462 485 472 459 474 490 471 453 434 416
135 416 416 416 360 304 249 193 230 268 283 298 312 327 384 441 404 368 298 227 157 87 101 115 129 143 177 212 299 387 428 422 414 407 441 475 453 431 406 381
119C81K8K8jm7o3l4%K8M3M2M1M1J3J2M3M3J4J5j9j8p5p5k7k8k7k8n2n3M0M1K3K3l3l3l3l3
103B20K2K3M0M1j6j6OPOPk5k5L1L1M2M2j4j4m7m6m7m7j7j8j8j8m1m1j1L5N8N8L3L3LLLLk0
86B66k0k0k0mmlmL5L5L5L5K3K4K3K3qqrqrqqrKJKJk4k5k4k4P1P2P1P1KKl5o4q1l5L1L1l0k9
67C43k9l0NNMNj8j7j8j8mmN3N2N4N4K5K6K5K4l1l2j7j8J1J0j1j1j1j1%J%JNOk3k3k5k6L0L1
48C93K8K8k8k8llllMML2L2N6N7%%l0l1lkL7L7j9j9k1k2OOJ1J1L5L5m3j08r8n1KLNNopopNN
28B96L2L3L7L6ml1rrJ7J7K1K1j7m6m4j6K3K3K3K3K4K3K3K4J1j7m5m5QQK5km2m1m2j4K5K4J2
12C85j5j6J2M0L9j5j5l7l8l5l6j6J2mmk1k2ml2l8j1K8K8M0L9K8jk4k5J%m9p6m2K3O6O6K9J
-5B61k6k5K7K7Mk4l4l5k4MJ5J6J5J4j1j1K1O8Q4N5Qk0opj1j2k7JL4L5L4L5K1qm6m6m5j7nm
$$ plain form
119 381 409 437 436 389 326 292 292 320 363 405 446 487 500 512 555 598 612 627 608 590 515 440 413 385 358 330 278 225 265 306 329 352 319 286 253 220
103 220 242 265 305 346 330 314 320 327 333 340 315 290 321 352 394 436 422 408 361 315 268 221 204 186 168 150 109 68 57 92 150 208 241 274 277 280 283 286 266
86 266 246 226 206 202 198 195 191 226 261 296 331 354 378 401 424 416 408 399 391 382 374 366 357 359 360 362 363 339 314 290 266 337 409 480 551 553 555 520 456 375 340 371 402 372 343
67 343 314 284 289 294 298 303 285 268 250 232 228 224 277 329 383 437 462 488 513 537 506 474 457 439 450 460 449 438 427 416 416 417 417 418 423 429 406 383 358 332 362 393
48 393 421 449 421 393 390 387 384 381 385 389 421 453 509 566 566 566 536 505 502 500 537 574 555 536 515 493 499 505 516 527 562 597 554 446 348 297 299 302 307 312 306 299 293 286 291 296
28 296 328 361 398 434 430 399 390 381 398 415 436 457 440 394 350 334 357 380 403 426 450 473 496 520 531 514 469 424 432 440 465 463 421 380 338 324 349 373 385
12 385 370 354 366 406 445 430 415 378 340 305 269 253 265 261 257 236 214 210 178 140 129 157 185 225 264 292 291 267 242 243 243 194 118 76 99 165 231 260 261
-5 261 235 210 237 264 268 244 210 175 151 155 170 186 201 215 204 193 214 282 366 421 429 409 403 396 385 373 346 347 381 416 450 485 506 498 452 406 361 344 339 335
-23C35ooooK1K0K0K1J8J9L4Ok8k7l0k9J4J5J5J5JJK8j9l8l7m0m0mmmmRJ0J0R%%K9K8K5K5k1
-41C79k2j0j0L6L6K6K6m0l9l2l2J4J5L2L2j5j6J%%JRRRR%%%%m2m1m2m1QQN1N2M2nk3OM4M4
-60D79J7J8MMm0m0j3L4K3nk4k4n1n1k2K5M6M6J1J1l6l5k2k1M4M4J0Rl7l7l7l7l7l7MNNML1
-77B68L2L1L1K9K9J%m3m3MMj7j8J1J1M4M4klk8k8k9k8j1j1j1j1MML3L2K6K5oo3q7n9RL7J2
-94B23J3M1P0N3lKKM4M4O8O9J9l8p1p1OOOOl4l4l3l4k4k4M2M2K5K5k2k2k9l0p2p3jN6N2N1
-111C50M9M9M9M8m5m6p3p4k8k8J9J8M0L9J2J2j7j7m5m5p1p2k5k5N2N1Q0Q0M7M8M7M8llm9n0
-127D22n3n4L1L0L2L1l4l4l5l4J2J2M1M2M1M1M5M5kjk9k8k9k8j8j8K9K9L2L3L3L2j3j3o9o9
-142D52n8n8l0l0l6l6L9O7K6k1m9m9j1j1M2M3Jm5l7qMk4popqppJ0RRJ0J1J2J1J2M3M4J4l3
$$ plain form
-23 335 329 323 317 311 332 352 372 393 411 430 464 470 442 415 385 356 370 385 400 415 416 417 445 426 388 351 311 271 267 263 259 255 264 274 284 293 293 293 322 350 375 400 379
-41 379 357 347 337 373 409 435 461 421 382 350 318 332 347 379 411 396 380 381 381 381 382 391 400 409 418 418 418 418 418 376 335 293 252 260 268 319 371 413 408 385 391 435 479
-60 479 496 514 518 522 482 442 429 463 486 481 457 433 382 331 309 334 380 426 437 448 412 377 355 334 378 422 432 441 404 367 330 293 256 219 223 228 233 237 268
-77 268 300 331 362 391 420 421 421 378 335 339 343 326 308 319 330 374 418 416 413 385 357 328 300 289 278 267 256 260 264 297 329 355 380 374 311 224 165 174 211 223
-94 223 236 277 347 400 397 399 401 445 489 557 626 645 607 536 465 471 477 483 489 455 421 388 354 330 306 348 390 415 440 418 396 367 337 265 192 191 247 299 350
-111 350 399 448 497 545 500 454 381 307 279 251 270 288 328 367 379 391 374 357 312 267 196 124 99 74 126 177 257 337 384 432 479 527 524 521 472 422
-127 422 369 315 346 376 408 439 405 371 336 302 314 326 367 409 450 491 536 581 579 578 549 521 492 464 446 428 457 486 518 551 584 616 603 590 521 452
-142 452 394 336 306 276 240 204 243 310 336 315 266 217 206 195 237 280 281 236 199 191 195 171 164 158 151 143 136 129 139 148 157 167 178 190 201 213 256 300 314 281
-160B81o0o0l1J5N8Q6Q6N9ml1j8K9L8J0k8k8J7J6j2j2l4l4o3o2k6k6L0L0mlllmlllL2L1N7
-177C20N6K5k2m9m9l1J5M4M5M5M6M2M3j2o0m8k1jkJ%L6L5L6L5l3l3l4l3j2j3j2j2k6k5k6k5
-193B45K3K4K4K3mmlml1l0J0L8L1L1ql6l1l1QL5M2M2M0M0K5m1n9o0j7j8j8j7l3l3l1l1K2N0
-209B13L4L5K4K4K4K5J4J4J5J4JJl8o5n3k4L7O4N2N3J4j4ool6l5k5k4LLJ9J9Pk1j9j9k0k0
-226B84j9j9ml1m5m4j7L1N5N6P4M6KKJ%m0m0l9m0j6j6K5N2K5K4K7K6M0M0%k8k9k8lkjj%jl2
-243C15l1m6j8M2P0N4N5K1oJ1J1LL1L2Lm7m8m9n0l5l5K1K0L0K9k7k7m7m6m3m4J3O9R0R0O2
-259D73Nn6n7j7j7J1J1LMk5k5J3J3j5j5JJK9K8L0L1k6k6n0m9n0m9K5K6N4N3L0K9Nn1m3m4R
-275B69Rj5j4j5j4K4K5K4K5ppppjjN2N1L2k5n0m9n1n1n5KM3M3M7M6K6K6l0l1j2j3J5J5llK5
$$ plain form
-160 281 221 161 130 145 203 289 375 434 430 399 381 410 448 458 430 402 419 435 423 411 377 343 280 218 192 166 196 226 222 219 216 213 209 206 203 200 232 263 320
-177 320 376 401 379 330 281 250 265 309 354 399 445 487 530 518 458 410 389 388 386 387 387 423 458 494 529 496 463 429 396 384 371 359 347 321 296 270 245
-193 245 268 292 316 339 335 331 328 324 293 263 273 311 342 373 365 329 298 267 275 310 352 394 434 474 499 458 399 339 322 304 286 269 236 203 172 141 163 213
-209 213 247 282 306 330 354 379 393 407 422 436 437 438 400 335 282 258 295 359 411 464 478 464 458 452 416 381 356 332 335 338 357 376 383 362 343 324 304 284
-226 284 265 246 242 211 166 122 105 136 191 247 321 367 369 371 372 372 332 292 253 213 197 181 206 258 283 307 334 360 400 440 440 412 383 355 352 350 349 348 348 347 315
-243 315 284 238 220 262 332 386 441 462 456 467 478 481 512 544 547 500 452 403 353 318 283 304 324 354 383 356 329 282 236 193 149 162 231 321 411 473
-259 473 478 422 365 348 331 342 353 356 360 335 310 323 336 321 306 307 308 337 365 395 426 400 374 324 275 225 176 201 227 281 334 364 393 398 347 304 260 269
-275 269 278 263 249 234 220 244 269 293 318 311 304 297 290 289 288 340 391 423 398 348 299 248 197 142 144 187 230 277 323 349 375 345 314 302 289 304 319 316 313 338
-293C38K5K7K7jkL0L0L0L0j7j6j6j7MMMMLMMMlllloopoJ%n3n4o5l7QO4N5K7rj0J5J5m2m1m0
-313B96m0j2j2nml3l3%%N6N7P8P8J6m0o8o7K3K2J7J7j2j1L3L2O0O0K4K4nnl2l3l3l3o2o3l8
-329B52J8L6L6M0M0J2J3J3J3rqqqqrqqm9m8m8m9mmmmM1M1M0M1K9K9K9K9kkkjL4L5L4L5K2K2
-348F51l4l4n1n0k7K8M2J5k3k2k9k9k9k9K1K1K1K1l1l1l2l1J9J9j8m6l9J7M0M0RRl5l6k6K
-363B93J2l5o0o1nM1P0P0J6l0l4oK4N1N3K6J4J5QPl8o7m3LK3K2jkkkJ3J3J3J2k5k5k5k5j6
-380B97j5j5j5n2n1mnj3j3J5J5M2M2J4J4k4k4L1P7O7J9j6j7QPk1k0k6k5M0M0K5K5m1m0l7l6
-396B68J0J1N1N1K3K4k4k4MMJ0J0l3l4lM4Q3Q3M6M5k0k1MLL2L1k1k1o8o8o2o2LLJ7J7m8m9
-413C19j5j5j5j5MLM9M9jk8j3j3mnmnl7l8l6l5j0J9J8rj2j3L6O4N2N2K3ol7l7l7l7l6qM0M0
$$ plain form
-293 338 363 390 417 416 414 444 474 504 534 517 501 485 468 472 476 480 484 487 491 495 499 496 493 490 487 481 475 468 462 463 463 410 356 291 254 262 326 381 408 399 389 404 419 377 336 296
-313 296 256 244 232 227 223 190 157 157 157 213 270 348 426 442 402 334 267 290 312 329 346 334 323 356 388 448 508 532 556 551 546 514 481 448 415 353 290 252
-329 252 270 306 342 382 422 434 447 460 473 464 456 448 440 432 423 415 407 358 310 262 213 209 205 201 197 238 279 319 360 389 418 447 476 474 472 470 469 503 538 572 607 629 651
-348 651 617 583 532 482 455 483 525 540 517 495 466 437 408 379 400 421 442 463 432 401 369 338 357 376 358 312 273 290 330 370 379 388 353 317 291 293
-363 293 305 270 210 149 144 185 255 325 341 311 277 271 295 346 399 425 439 454 462 469 431 364 321 324 347 369 368 366 364 362 375 388 401 413 388 363 338 313 297
-380 297 282 267 252 200 149 145 140 127 114 129 144 186 228 242 256 232 208 239 316 383 402 386 369 377 384 363 343 317 292 332 372 397 422 381 341 304 268
-396 268 278 289 340 391 414 438 414 390 394 398 408 418 385 351 348 392 475 558 604 649 629 608 612 615 647 678 657 636 568 500 438 376 379 382 399 416 368 319
-413 319 304 289 274 259 263 266 315 364 363 335 322 309 305 300 296 291 254 216 180 145 135 154 172 163 151 138 174 238 290 342 365 359 322 285 248 211 175 167 207 247
-430B47L0KqqJ0L8O6O7L6j1j3j2k1k1k0k1k7k6j6J1J9rl9o8n2k3QL7K6K6K7K8j0rj0rqpl2
-447A98l3rL8N6N7J4j5KJk4k5j2J6K2K2k3k3k2k2k1k0qK0O9O8N6K8pl4m7m7l6r%jJJK9K8K9
-464C17K8J3J4J3J3J3J4J3J3RJ0PQMk4k4Ml2l1k9l0mlmml1l1l1l1K3K3K3K3%%J%K6K7K6K6
-482C82%J%JK6K6K6K6j4j5j4j4pooo%%n6n6m2m2j4j4L3L4NOk0k0RQL1L1Q3Q3Jn6m0j2j9j9
-500C20j6j7K1K1K1K1k4k5n2n2rqM8M7M2M2j4j4j4j4j5j4j8j8j9j8lmk8k9k5L2P3J02Q1K4
-516D45JJL6L5L9j7qqj2j2m5m5m5m5l0k9k7k6k0L6P6M8qrj0j0OPOPk7k7k7k7K6K7N4N4j8j9
-533C53OO2R9J00M7M7j6j7p2p2n9n8lkk7k7k7k7kjJ9P6Q7L2k7k6k7k6n5n4j1j1j1j0qqM8M8
-550C40N9N9l5l4RJ0L7L8KKn5n4qqM8M9M5M5J8J7k2k1k1k2nonoJ3J2m3m4l3l3K3K4O7O8Qm9
$$ plain form
-430 247 277 279 271 263 273 311 377 444 480 469 456 444 423 402 382 361 334 308 292 303 322 313 274 206 154 131 139 176 202 228 255 283 273 264 254 245 237 230 198
-447 198 165 156 194 250 307 321 306 308 309 285 260 248 264 286 308 285 262 240 218 197 177 169 189 258 326 382 410 403 369 322 275 239 230 230 229 230 231 260 288 317
-464 317 345 358 372 385 398 411 425 438 451 460 470 477 485 489 465 441 445 413 382 353 323 319 316 312 308 277 246 215 184 207 230 253 276 276 276 277 277 303 330 356 382
-482 382 382 383 383 384 410 436 462 488 474 459 445 431 424 418 412 406 406 406 350 294 252 210 196 182 215 249 254 260 240 220 229 237 268 299 382 465 466 410 370 358 339 320
-500 320 304 287 308 329 350 371 347 322 270 218 209 201 249 296 338 380 366 352 338 324 309 295 277 259 240 222 219 215 187 158 133 165 238 340 421 445
-516 445 446 447 483 518 557 540 532 524 512 500 455 410 365 320 290 261 234 208 188 224 300 348 340 331 321 311 317 324 330 337 310 283 256 229 255 282 336 390 372 353
-533 353 359 421 520 620 667 714 698 681 609 537 478 420 417 415 388 361 334 307 305 304 323 399 486 518 491 465 438 412 357 303 292 281 270 260 252 244 292 340
-550 340 399 458 423 389 398 408 445 483 485 487 432 378 370 362 410 459 504 549 567 584 562 541 520 498 493 487 482 476 489 501 458 414 381 348 371 395 462 530 538 489
-567D89p3m6oM9N3lo4j21q7l1L1Q7P7M9M3j3o4o4m3J3L4L5QQk6n5m2J4L1L1k2k2L3L2L3L3
-583D01j4j4j4j3pppoK0K0L4Om4p2n7n6qK1JKj3n9m9k1QQJ0J0M5M6M3M3J8j0NOLMMML0L0r
-601C42l6k3OJ6J6J4J3j4j5J3J3L1KnK3ONnmnnRQRQJ1J0K6kj7j8j9j9KKKKNNMNj2j1j0j0J8
-621C96M6M6J8n8n7k1Qk5n4n1k3ppnoJ3J4J3J3J6J7J7J6qppoQL6M8M9N2N3K3k4k3k2k6k6k3
-639D16k3k3k4m4m4M9M9O1O1NNk7k6k7k6m1m0J5J6J6J5m0m0qpppj0j1j1j0k8k7k8k7L1L1L1
-655A95L1j1j2j1j1j8j9j8j8L8L9L8L8J8J7J7J8m2m2l8l9lM4P4P5L9L9J2J1l8l9l8l8j3j2
-670B83M1M1jm8o3l5J1L9M0J3j8j7L6L7K0K0M5M6J2l5l6l7n0n1n0n0KJKKL7L8L7L7L4L4L4
-686D51L4%%%%rqqqq3q3n2ojjKKLLLLj4j4J6O2M5M4M7M7kkkkj3j3o9o8KLKKL0L0K7K6k7p4
$$ plain form
-567 489 416 370 364 413 466 463 399 278 191 160 191 278 355 404 447 434 370 306 263 276 310 345 353 361 335 280 238 252 283 314 292 270 303 335 368 401
-583 401 387 373 359 346 339 332 325 319 339 359 393 399 355 283 226 170 162 183 184 186 173 114 65 44 52 60 70 80 125 171 214 257 275 265 270 276 279 283 287 291 321 351 342
-601 342 306 283 289 305 321 335 348 334 319 332 345 376 378 373 396 402 407 402 398 393 388 397 405 414 422 433 443 469 467 450 432 413 394 396 398 400 402 407 412 416 421 409 398 388 378 396
-621 396 442 488 506 448 391 370 378 353 299 248 225 218 211 206 200 213 227 240 253 269 286 303 319 311 304 297 291 299 335 383 432 484 537 560 536 513 491 465 439 416
-639 416 393 370 346 302 258 307 356 417 478 483 488 461 435 408 382 341 301 316 332 348 363 323 283 275 268 261 254 244 233 222 212 184 157 129 102 133 164 195
-655 195 226 215 203 192 181 163 144 126 108 146 185 223 261 279 296 313 331 289 247 209 170 167 211 285 360 399 438 450 461 423 384 346 308 295 283
-670 283 324 365 364 316 253 218 229 268 308 321 303 286 322 359 379 399 444 490 502 467 431 394 344 293 243 193 195 196 198 200 237 275 312 349 383 417 451
-686 451 485 485 485 485 485 476 468 460 452 369 286 234 228 227 226 228 230 233 236 239 242 228 214 230 292 337 381 428 475 473 471 469 467 454 441 372 304 306 309 311 313 343 373 400 426 399 325
-707C25o3l5%%KKK7K8K8K7J8J7J8J8J7J8J7J8L4L3k2k2j3j4o6o6jM5L5POOMML3L3L4L3RRR
-724F12Qj6j6p2p2l4l4l3l4m0m0J7J6L9L8L6L5rn6m6j7M0L9j4j5JKJKJ4J4J6J6QL6M7%m4m4
-741D01j7L0M7M7nol0k9k9l0LKKKj4j4j4j4j0j0j0j1k7k8k8k8k3k3L4L3N1N1j6o2o5o5k5L
-758G3N1R7Q7N9J9rMNk2k1k2k1J5J5m1m2k2k3nl2j5L1J9rj5j4L9M0L9M0M0M0j1j0j1j0m6m6
-774B66m6m6J8J9J8J8L2L2k5k4%%%%K1K2l5l5lllmL9L9L8L9MLMMmllmn2n2n3n2QQQQL1L0L0
-794B92L0M0M0j7j6kjjjQRRQk1k2k2k1KKKJM1M1j6j6j0j0j0j0L5L6L5L6j1j0j0j1m5m5m6m5
-812B48J7J7J7J7J7J7J7J7k6k6k6k6K4K3K3K3NNNNl7l8l5J1L1L2k2k2%JN7N7K3K4K3K4JKn4
-829D71n4l0l0jkjkl0k9MNN8N8P0K4m4m4j1j1J8J7J2J2J0l6o8o9j4j5j2j2M4M4M8M8M8M8K9
$$ plain form
-707 325 262 227 227 227 229 231 258 286 314 341 359 376 394 412 429 447 464 482 516 549 527 505 492 478 412 346 345 390 425 432 438 444 448 452 485 518 552 585 594 603 612
-724 612 620 604 588 516 444 410 376 343 309 269 229 246 262 301 339 375 410 401 345 299 282 322 361 347 332 333 335 336 338 352 366 382 398 406 442 489 489 445 401
-741 401 384 414 461 508 503 497 467 438 409 379 382 384 386 388 374 360 346 332 322 312 302 291 264 236 208 180 157 134 168 201 252 303 287 225 160 95 70 73
-758 73 124 221 308 367 386 377 381 386 364 343 321 300 315 330 289 247 225 202 197 165 150 181 200 191 176 162 201 241 280 320 360 400 389 379 368 358 312 266
-774 266 220 174 192 211 229 247 279 311 286 262 262 262 262 262 283 305 270 235 232 229 226 222 261 300 338 377 381 384 388 392 388 385 382 378 326 274 221 169 177 185 193 201 232 262 292
-794 292 322 362 402 385 369 367 366 365 364 372 381 390 398 377 355 333 312 314 316 318 319 360 401 385 369 359 349 339 329 364 400 435 471 460 450 440 429 384 339 293 248
-812 248 265 282 299 316 333 350 367 384 358 332 306 280 304 327 350 373 378 383 388 393 356 318 283 294 325 357 335 313 313 314 371 428 451 475 498 522 523 525 471
-829 471 417 387 357 356 354 353 351 321 292 296 301 359 417 487 511 467 423 412 401 419 436 448 460 470 434 366 297 283 268 256 244 288 332 380 428 476 524 553
-845E53L0k7k7n3n2n3n3j2j1j2j2K0J9K0J9j5j5m3m3ppN0M9j5j4j5j4J3J3J3J3K5K5llj9j9
-861C18L7L7J9K0rqK2K2K0J9K7k1n0n0MMMNM5M6J6l1l5l6l8l8m2m2m2m2j2j2j3j2N1N0N1N1
-878C35J7J7J7J7OPOPM5M5j1j2l2l2l2l3l8l8N3N3P3M6nn1o0l3ONJ4J4J4J4OOPOk9k9k9k9
-895C43J6J5J6J5k4k4k5k4K8K9K8K8N4N3j2n9p2m4L1L1lll1l1M0M0M0M1m3m3j6L1K4k2n0m9
-910C28j1j0j1j0l5l5nM1N5N5KKJ2J3J1J1m6p5q3l6L0N8O1L3llnmOPOPK3K3K3K3j1j1j0j1
-928D15K4K4K5K4rrrrrrrrpprrJ0j8k8J8M1M2M5M4jkjkm3m2p1p1l6l7J0J0J1J1J1J1L7L7J
-946C95m6m2NM1O9N6Rm8p6n8l0KL0M7M6K1K1jkjjk8k9k8k9M3M3M3M3j6j5j6j6ONNOj1j2j1
-964D20j1J8J7J8J7J8J7J7J8rj0rrPPPPm4m4m1m1k0K6J8j0OL3L0Kk6n4n6k8k5k4k3k3K2K1
$$ plain form
-845 553 583 556 529 476 424 371 318 306 295 283 271 291 310 330 349 334 319 276 233 226 219 269 318 303 289 274 260 273 286 299 312 337 362 359 356 337 318
-861 318 355 392 411 431 422 414 436 458 478 497 524 503 453 403 407 411 415 420 465 511 527 496 461 425 387 349 307 265 223 181 169 157 144 132 183 233 284 335
-878 335 352 369 386 403 409 416 422 429 474 519 508 496 464 432 400 367 329 291 344 397 470 516 511 460 400 367 373 378 392 406 420 434 440 446 453 459 430 401 372 343
-895 343 359 374 390 405 381 357 332 308 336 365 393 421 475 528 516 457 385 341 372 403 400 397 366 335 375 415 455 496 453 410 394 425 449 427 377 328
-910 328 317 307 296 286 251 216 211 252 307 362 364 366 378 391 402 413 367 292 209 173 203 261 322 355 352 349 344 340 346 353 359 366 389 412 435 458 447 436 426 415
-928 415 439 463 488 512 503 494 485 476 467 458 449 440 433 426 417 408 418 400 372 390 431 473 518 562 561 559 558 556 513 471 400 329 293 256 266 276 287 298 309 320 357 394 395
-946 395 349 307 312 353 422 478 487 439 363 305 275 277 307 354 400 421 442 441 439 438 437 409 380 352 323 366 409 452 495 479 464 448 432 438 443 448 454 443 431 420
-964 420 409 427 444 462 479 497 514 531 549 540 530 521 512 519 526 533 540 496 452 411 370 350 376 394 384 390 423 453 455 429 375 319 291 266 242 219 196 218 239
-981B39K2K1JJ%JL1L1L1L1OPPOrj0j0rJ3J3J3J4J3J3J3J4l8l7l8l8L7L7L7L6k0k1PQJ0J0p1
-998D22p1m7jJJK3K3O9P0llK5N4L9pm5m5n4n4k6k6M3M2M0L9J0l7n7n7lml1l2k9k9J8J8K6K7
-1015C29K6K7mnn1n0n5n4J1J1L3L4L3L4J6J7J6J7L0L0L0L1j4j4j3j4K0K0m5m6n6n6rj0J8J8
-1031C05J8J8J9J9J9J9k8k9J7Q3Q9O1K3k4l9l9m3m2k2k2k3k2l6l5L0L0L9M0L6L6rn6p5p5o0
-1046B22l2K8P4R0O3J1j8l9o7n2nO6O7M1M1lkl1l1lmmmn4n4KM9P4M6J5j3poqqj7j7j7j7J3
-1063C89J4J3J3J6J5J6J5MLMMQRQRm5m6m5m5j0j1j0j0L0K9L0K9j9j9k0j9RJ0RJ0J6J7j1j2
-1080D07k6k6J9J9L2Mm6m6l4l4lK5K8K8KKJJM6M6M5J7l4o2o1l3onk1n0m7k0kK6N8N7N9L2J6
-1097D14j2l8l7n4k5J9M7N9N8M0qm6m6j8j8j7j8QRRQj0j1k6KL0L1L2L2kkkkk8k7k8k8llkl
$$ plain form
-981 239 261 282 283 284 284 285 316 347 378 409 415 422 429 435 426 416 406 397 410 423 436 450 463 476 489 503 465 428 390 352 389 426 463 499 479 458 465 473 483 493 422
-998 422 351 304 303 304 305 328 351 420 490 487 484 509 563 602 595 550 505 451 397 371 345 388 430 470 509 519 482 425 368 365 361 330 298 269 240 258 276 302 329
-1015 329 355 382 378 373 322 272 217 163 174 185 218 252 285 319 335 352 368 385 415 445 475 506 492 478 465 451 471 491 446 400 344 288 279 269 287 305
-1031 305 323 341 360 379 398 417 389 360 377 460 549 610 633 609 570 531 488 446 424 402 379 357 321 286 316 346 385 425 461 497 488 432 357 282 222
-1046 222 190 218 292 382 445 456 438 399 332 280 275 341 408 449 490 487 485 454 423 420 416 412 408 354 300 302 351 425 471 486 473 466 460 452 444 427 410 393 376 389
-1063 389 403 416 429 445 460 476 491 495 498 502 506 514 523 531 540 495 449 404 359 349 338 328 318 348 377 407 436 417 398 378 359 368 378 387 397 413 430 419 407
-1080 407 381 355 374 393 425 429 383 337 303 269 266 291 319 347 349 351 352 353 399 445 490 507 473 411 350 317 311 306 285 235 188 168 166 192 250 307 366 398 414
-1097 414 402 364 327 273 248 267 314 373 431 471 463 417 371 353 335 318 300 308 317 326 334 324 313 287 289 319 350 382 414 412 410 408 406 378 351 323 295 292 289 287 284
-1115B84RRRQppJ0j7j8J0ppkjkjkjkjQRRRQRRRK7K8K8K8KKKKNOLMJk6n6n6l2lj9j9l9l8J0
-1137A94L9L4L4L5L6K7K6l5l5k5L1M4J5j8j7k0j9K6K7K7K7ooooqqqqK2K1K2K2PPm0m0j8j8
-1154C82K9K8J2J2j6j6l4l3l3l3K1K1k5k6m5m4K0K1M2M3J4J4K7K7K8K7k2k2k1k2L6L6L7L6
-1169E21J5J4Jn4p9n0m1m2o2o2l4l4j0j0j0j1KJQ5Q6O4O5jk8k1L6O8O8mlmll7l7l7l7LKN0
-1186C70M9M4M3k2k3k4k4n1q0m4J1M3M4%%O6O6O7O8K0K1l8l8l8l8l6l7l6l6l5l5J2M0N6Qm7
-1201C46m8m0l9PQNOOOK4K5K3K3ll1j5L2M4J6j2j2J4J4J4J4j2j3j2j2K3K4K4K4l7l8l7l7j7
-1218C07j8j7j8M4M3M3M4J4J5J5J4l3l4l4l4j9k0K7K8J5J5J5J5O3O4O3O4onl4l3l3l3L3L2
-1233F02%jjjk9k9n8n7m8m7J7J8N3N3K5K5k5k6k5k5k1k1k1k1l3l2nmN0N1L2j5m9k1L7Q4N3
$$ plain form
-1115 284 293 302 311 319 312 305 315 298 280 290 283 276 274 273 271 270 268 267 265 264 272 281 290 299 307 316 325 334 361 389 417 445 447 449 451 453 458 464 467 471 472 446 390 334 302 299 280 261 222 184 194
-1137 194 233 267 301 336 372 399 425 390 355 330 361 405 420 402 385 365 346 372 399 426 453 447 441 435 429 421 413 405 397 419 440 462 484 491 498 458 418 400 382
-1154 382 411 439 451 463 447 431 397 364 331 298 319 340 315 289 244 200 220 241 283 326 340 354 381 408 436 463 441 419 398 376 412 448 485 521
-1169 521 536 550 551 497 418 368 327 285 223 161 127 93 83 73 63 52 54 55 140 226 290 355 354 326 305 341 409 477 473 470 466 463 426 389 352 315 318 320 370
-1186 370 419 463 506 484 461 437 413 362 282 238 249 292 336 336 336 402 468 535 603 623 644 606 568 530 492 456 419 383 347 312 277 289 329 385 393 346
-1201 346 298 258 219 226 234 239 245 251 257 281 306 329 352 349 318 303 335 379 395 383 371 385 399 413 427 415 402 390 378 401 425 449 473 436 398 361 324 307
-1218 307 289 272 254 298 341 384 428 442 457 472 486 453 419 385 351 332 312 339 367 382 397 412 427 490 554 617 681 675 670 636 603 570 537 570 602
-1233 602 602 601 600 599 570 541 483 426 378 331 348 366 419 472 497 522 497 471 446 421 400 379 358 337 304 272 267 263 313 364 396 381 332 311 348 432 485
-1249D85N4%%ppl5l5l6l6l3l3K6P3O2L4K1K0J9J9mnmnp3p2p3p2m6m6M8M8M0M0M1M0M2M1n2
-1265D79n2p6p5m6JPPJ0J1J4J4J4J4L4L5L4L4M7M7J8l0n8n8nmK5K6l1l1o0n9mmj7j7j7j7j3
-1282A97j3j4j3J9K0K0J9L9L9J1J1LMN9O0P8P8K1K2L8L8j8j8o6o6o6o7p3p3j8j7M1M0J3J3
-1297C61LMN7N7J4l2n0k2J5J5j2j1l1l0K5K5O1O1L2L3MMn3n2j9k0j9k0j6j5M0M0N6N6K6k1
-1313E66n8n8l3l3LLl5o2m1PL4L5lll2l1K1K0K1K1OPOPooooOOL3L4kjN1N0k3q9r4o6l6qL3
-1331B38L4J1J0j8j8k9k8%jN3N2N2N3poppqrqrj6j5j6j5K4K4K4K4L8L8L8L8k3k4k3k3LMLM
-1349D55k2k2ON2P3K6l8l8m5m5m3m2LM9O6L7J7j0n3n2k3k3NNrrrrRRRRm3m3m4m3k5k6k4k4
-1366F6n3k5K3P1P6M8J1J0L1L1L1L1JKJKrj0rrPPPQl6l5l5l5MNMNM2M2M3M2M3M4j3j2m8m8
$$ plain form
-1249 485 539 539 539 532 525 490 455 419 383 350 317 343 416 478 512 533 553 572 591 587 582 578 573 500 428 355 283 237 191 239 287 327 367 408 448 490 531 479
-1265 479 427 351 276 230 231 238 245 255 266 280 294 308 322 356 391 425 459 506 553 571 541 483 425 420 416 441 467 436 405 345 286 282 278 261 244 227 210 197
-1282 197 184 170 157 176 196 216 235 274 313 324 335 338 342 401 461 539 617 638 660 698 736 718 700 634 568 502 435 362 289 271 254 295 335 348 361
-1297 361 364 368 425 482 496 464 414 392 407 422 410 399 368 338 363 388 449 510 542 575 579 583 530 478 459 439 420 400 384 369 409 449 505 561 587 566
-1313 566 508 450 417 384 387 390 355 293 252 259 293 328 325 322 290 259 280 300 321 342 348 355 361 368 362 356 350 344 350 356 389 423 421 420 471 521 498 409 315 249 213 205 238
-1331 238 272 283 293 275 257 228 200 200 199 252 304 356 409 402 396 389 382 374 365 357 348 332 317 301 286 310 334 358 382 420 458 496 534 511 487 464 441 444 448 451 455
-1349 455 433 411 417 469 542 568 530 492 447 402 359 317 320 369 435 472 489 479 426 374 351 328 333 338 329 320 311 302 311 320 329 338 295 252 208 165 140 114 90 66
-1366 66 13 -12 11 82 158 206 217 227 258 289 320 351 352 354 355 357 348 338 329 320 327 334 341 349 313 278 243 208 212 217 221 226 268 310 353 395 438 482 469 457 409 361
-1385C61m8m8ppppK2K2K3K2k5k6L1L0M8M8M7M8J3J3J2J3K2K2l4l4j4j4j4j4j6j7j6j6m5m4
$$ plain form
-1385 361 313 265 258 251 244 237 259 281 304 326 301 275 306 336 384 432 479 527 540 553 565 578 600 622 588 554 540 526 512 498 482 465 449 433 388 344
$$ [...]
-3135C53
##END=	
##END=	
