##TITLE=	Sep10-2019.30.fid
KB - Propyl-PSP

##JCAMP-DX=	6.0	$$ MestReNova 14.1.1-24571
##DATA TYPE=	LINK
##BLOCK_ID=	1
##BLOCKS=	1    
##ORIGIN=	Mestrelab Research S.L.
##OWNER=	hrzepa
##$MNOVA/LINK_BLOCK_TYPE=	ITEM	$$ NMR Spectrum
##$MNOVA/ITEM/POLYGON=	(XY..XY)
5321,5835
8722,5835
8722,8208
5321,8208
5321,5835
##$MNOVA/ITEM/Z=	0
##$MNOVA/ITEM/ANGLE=	0
##TITLE=	Sep10-2019.30.fid
##JCAMP-DX=	6.0	$$ MestReNova 14.1.1-24571
##BLOCK_ID=	2
##DATA TYPE=	NMR SPECTRUM
##DATA CLASS=	XYDATA
##NUMDIM=	1
##ORIGIN=	Bruker BioSpin GmbH
##OWNER=	nmr
##.OBSERVE FREQUENCY=	400.20240119999999706
##.OBSERVE NUCLEUS=	^1H
##.SOLVENT NAME=	MeOD
##.PULSE SEQUENCE=	zg30
##LONGDATE=	2019/09/10 15:29:00.000
##.ACQUISITIONMODE=	SIMULTANEOUS (DQD)
##$ORIGINAL FORMAT=	Bruker XWIN-NMR
##$MNOVA/SCALES_VERSION=	9
##$PARAMETER FILE=	(acqus, ASCII, /Users/hrzepa/Downloads/Polysiphenol%20SI%20NMR%20Original%20Data/1/1d%20-%201H%20-%20400C.19.09.10.030/30/acqus, 0)
$$ ##TITLE= Parameter file, TOPSPIN		Version 3.2
$$ ##JCAMPDX= 5.0
$$ ##DATATYPE= Parameter Values
$$ ##NPOINTS= 11	$$ modification sequence number
$$ ##ORIGIN= Bruker BioSpin GmbH
$$ ##OWNER= nmr
$$ $$ 2019-09-10 15:29:15.712 +0100  nmr@CZC2439F63
$$ $$ /opt/topspin/data/brad/nmr/Sep10-2019/30/acqus
$$ $$ process /opt/topspin3.2/prog/mod/shimcntl
$$ ##$ACQT0= -2.36344537815126
$$ ##$AMP= (0..31)
$$ 100 100 100 100 100 100 100 100 100 100 100 100 100 100 100 100 100 100
$$ 100 100 100 100 100 100 100 100 100 100 100 100 100 100
$$ ##$AMPCOIL= (0..19)
$$ 0 0 0 0 0 0 0 0 0 0 0 0 0 0 0 0 0 0 0 0
$$ ##$ANAVPT= -1
$$ ##$AQSEQ= 0
$$ ##$AQ_mod= 3
$$ ##$AUNM= <au_zg>
$$ ##$AUTOPOS= <52 >
$$ ##$BF1= 400.2
$$ ##$BF2= 400.2
$$ ##$BF3= 400.2
$$ ##$BF4= 400.2
$$ ##$BF5= 400.2
$$ ##$BF6= 400.2
$$ ##$BF7= 400.2
$$ ##$BF8= 400.2
$$ ##$BYTORDA= 0
$$ ##$CAGPARS= (0..11)
$$ 0 0 0 0 0 0 0 0 0 0 0 0
$$ ##$CFDGTYP= 0
$$ ##$CFRGTYP= 9
$$ ##$CHEMSTR= <none>
$$ ##$CNST= (0..63)
$$ 1 1 145 1 1 1 1 1 1 1 1 1 1 1 1 1 1 1 1 1 1 1 1 1 1 1 1 1 1 1 1 1 1 1 1
$$ 1 1 1 1 1 1 1 1 1 1 1 1 1 1 1 1 1 1 1 1 1 1 1 1 1 1 1 1 1
$$ ##$CPDPRG= (0..8)
$$ <> <> <> <> <mlev> <mlev> <mlev> <mlev> <mlev>
$$ ##$D= (0..63)
$$ 0 1 0 0 0 0 0 0 0 0.06 0 0 0 0 0 0 0.0002 0 0 0 0 0 0 0 0 0 0 0 0 0 0 0
$$ 0 0 0 0 0 0 0 0 0 0 0 0 0 0 0 0 0 0 0 0 0 0 0 0 0 0 0 0 0 0 0 0
$$ ##$DATE= 1568125754
$$ ##$DE= 6.5
$$ ##$DECBNUC= <off>
$$ ##$DECIM= 2496
$$ ##$DECNUC= <off>
$$ ##$DECSTAT= 4
$$ ##$DIGMOD= 1
$$ ##$DIGTYP= 12
$$ ##$DQDMODE= 0
$$ ##$DR= 22
$$ ##$DS= 2
$$ ##$DSPFIRM= 0
$$ ##$DSPFVS= 20
$$ ##$DTYPA= 0
$$ ##$EXP= <proton>
$$ ##$F1LIST= <111111111111111>
$$ ##$F2LIST= <222222222222222>
$$ ##$F3LIST= <333333333333333>
$$ ##$FCUCHAN= (0..9)
$$ 0 2 0 0 0 0 0 0 0 0
$$ ##$FL1= 90
$$ ##$FL2= 90
$$ ##$FL3= 90
$$ ##$FL4= 90
$$ ##$FOV= 20
$$ ##$FQ1LIST= <freqlist>
$$ ##$FQ2LIST= <freqlist>
$$ ##$FQ3LIST= <freqlist>
$$ ##$FQ4LIST= <freqlist>
$$ ##$FQ5LIST= <freqlist>
$$ ##$FQ6LIST= <freqlist>
$$ ##$FQ7LIST= <freqlist>
$$ ##$FQ8LIST= <freqlist>
$$ ##$FRQLO3= 12442.5500000119
$$ [...]
$$ ##$Sgu3PowerLevels= (0..7)
$$ 0 0 0 0 0 0 0 0
$$ ##$Sgu4PowerLevels= (0..7)
$$ 0 0 0 0 0 0 0 0
$$ ##$Sgu5PowerLevels= (0..7)
$$ 0 0 0 0 0 0 0 0
$$ ##$Sgu6PowerLevels= (0..7)
$$ 0 0 0 0 0 0 0 0
$$ ##$Sgu7PowerLevels= (0..7)
$$ 0 0 0 0 0 0 0 0
$$ ##$Sgu8PowerLevels= (0..7)
$$ 0 0 0 0 0 0 0 0
$$ ##$SguType= 3
$$ ##$ShimPowMaxUA= (0..63)
$$ 130000 130000 130000 130000 130000 130000 130000 130000 130000 130000 130000
$$ 130000 130000 130000 130000 130000 130000 130000 130000 130000 0 0 0 0
$$ 0 0 0 0 0 0 0 0 0 0 0 0 0 0 0 0 0 0 0 0 0 0 0 0 0 0 0 0 0 0 0 0 0 0 0 0
$$ 0 0 0 0
$$ ##$ShimPowMaxUC= (0..63)
$$ 130000 130000 130000 130000 130000 130000 130000 130000 130000 130000 130000
$$ 130000 130000 130000 130000 130000 130000 130000 130000 130000 0 0 0 0
$$ 0 0 0 0 0 0 0 0 0 0 0 0 0 0 0 0 0 0 0 0 0 0 0 0 0 0 0 0 0 0 0 0 0 0 0 0
$$ 0 0 0 0
$$ ##$ShimPowMaxUG= (0..63)
$$ 524287 524287 524287 524287 524287 524287 524287 524287 524287 524287 524287
$$ 524287 524287 524287 524287 524287 524287 524287 524287 524287 0 0 0 0
$$ 0 0 0 0 0 0 0 0 0 0 0 0 0 0 0 0 0 0 0 0 0 0 0 0 0 0 0 0 0 0 0 0 0 0 0 0
$$ 0 0 0 0
$$ ##$ShimPowRcbType= 3
$$ ##$ShimPowRes= (0..63)
$$ 1e-20 1e-20 1e-20 1e-20 1e-20 1e-20 1e-20 1e-20 1e-20 1e-20 1e-20 1e-20
$$ 1e-20 1e-20 1e-20 1e-20 1e-20 1e-20 1e-20 1e-20 0 0 0 0 0 0 0 0 0 0 0 0
$$ 0 0 0 0 0 0 0 0 0 0 0 0 0 0 0 0 0 0 0 0 0 0 0 0 0 0 0 0 0 0 0 0
$$ ##$ShimPowRng0= (0..63)
$$ 1 1 1 1 1 1 1 1 1 1 1 1 1 1 1 1 1 1 1 1 0 0 0 0 0 0 0 0 0 0 0 0 0 0 0 0
$$ 0 0 0 0 0 0 0 0 0 0 0 0 0 0 0 0 0 0 0 0 0 0 0 0 0 0 0 0
$$ ##$ShimPowRng1= (0..63)
$$ 1 1 1 1 1 1 1 1 1 1 1 1 1 1 1 1 1 1 1 1 0 0 0 0 0 0 0 0 0 0 0 0 0 0 0 0
$$ 0 0 0 0 0 0 0 0 0 0 0 0 0 0 0 0 0 0 0 0 0 0 0 0 0 0 0 0
$$ ##$ShimPowRng2= (0..63)
$$ 1 1 1 1 1 1 1 1 1 1 1 1 1 1 1 1 1 1 1 1 0 0 0 0 0 0 0 0 0 0 0 0 0 0 0 0
$$ 0 0 0 0 0 0 0 0 0 0 0 0 0 0 0 0 0 0 0 0 0 0 0 0 0 0 0 0
$$ ##$ShimPowRng3= (0..63)
$$ 1 1 1 1 1 1 1 1 1 1 1 1 1 1 1 1 1 1 1 1 0 0 0 0 0 0 0 0 0 0 0 0 0 0 0 0
$$ 0 0 0 0 0 0 0 0 0 0 0 0 0 0 0 0 0 0 0 0 0 0 0 0 0 0 0 0
$$ ##$ShimSysFunc= (0..63)
$$ 1 2 3 4 5 7 9 11 15 16 8 10 12 14 6 17 13 18 19 20 0 0 0 0 0 0 0 0 0 0
$$ 0 0 0 0 0 0 0 0 0 0 0 0 0 0 0 0 0 0 0 0 0 0 0 0 0 0 0 0 0 0 0 0 0 0
$$ ##$ShimSysMatrix= 0
$$ ##$ShimSysType= 1
$$ ##$TFXNUM= 0
$$ ##$TRIPLO2= 0
$$ ##$VTU= 2
$$ ##$VTUETH= <149.236.99.20>
$$ ##$VTUTY= <no>
$$ ##$WBREFAM= (0..15)
$$ 135.5 97.7 100 100 100 100 100 100 100 100 100 100 100 100 100 100
$$ ##$WBREFLM= (0..15)
$$ 0 0 0 0 0 0 0 0 0 0 0 0 0 0 0 0
$$ ##$WBREFPH= (0..15)
$$ 72.26 -67.22 0 0 0 0 0 0 0 0 0 0 0 0 0 0
$$ ##$WBSGU= (0..15)
$$ 0 0 0 0 0 0 0 0 0 0 0 0 0 0 0 0
$$ ##$XFAC= 2
$$ ##END=
$$ 
##$DECIM=	2496
##$DSPFVS=	20
##XUNITS=	HZ
##YUNITS=	ARBITRARY UNITS
##FIRSTX=	6407.6102564186803647
##LASTX=	-1605.0879904638193238
##DELTAX=	-0.12226593800080109986
##XFACTOR=	1
##YFACTOR=	0.0053756881289554617545
##FIRSTY=	5.9401378631591796875
##MINY=	-13.496795654296875
##MAXY=	10631.4794921875
##NPOINTS=	65536
##XYDATA=	(X++(Y..Y))
$$ [...]
3464E81N4Rj8o4o7k1K9L0L2L3k1k0k0k1J4J3J4J4j0rrrL2L3L2L3lllll7l7l7l7N1N2N1N2j3
3459F97j2j3j3qpqql9l8L6L7OOPOJ1J1J1J1k4k4k5k4m8m7K7K8K5K5K6K5L1L0m4m5j0j0rj0
3454E90m9m8m3m3j2P8N6J0jM5M1mm8m8K4K5k2k2K4K3j2j3L0L0j8o4m3M7N2N3j7j7m3m4L2L2
3450E81l8l9L7L7KKk9J7J5o0m1MJ6J6J9J8RRRQj0j0j0j0k3k4k3k3M3M4L9L9rq5n9M7J21P5
3445G14n6n7pL9j6r1j14l8N0N1JJJJM4M3M4M4MNNNJ6J6J6J7k2k2k1k2m0m1L5L5L4L3j1j2k8
3440F56k8k8k7M2M3l3l3J3J3N9N9o1o1j5j5j2j1j2j1J4J4J5J4J4J4J4J5jjjjk3k2k3k2K6K7
3436F11j9j9O9O9l7l7j5j5L0L0O6O5n2j27r8oN6J1m3JO2O1k3o8n1L9M8Lj1j2L6L5j0rk4k4
3431E92K1K1k9k8k9k9K2K2o9o8N1N1NOO2O3J7J7oooom8m9m8m8J3J3p2p2L3J24Q1j0o5j9M0
$$ plain form
3464 581 635 644 626 562 495 474 503 533 565 598 577 557 537 516 530 543 557 571 561 552 543 534 566 599 631 664 661 658 655 652 615 578 541 504 555 607 658 710 697
3459 697 685 672 659 651 644 636 628 589 551 587 624 630 636 643 649 660 671 682 693 669 645 620 596 548 501 528 556 581 606 632 657 688 718 674 629 619 609 600 590
3454 590 541 493 450 407 395 473 529 539 538 583 624 620 572 524 548 573 551 529 553 576 564 551 581 611 593 529 486 533 585 638 621 604 561 517 549 581
3450 581 543 504 541 578 580 582 553 570 585 525 484 488 504 520 539 557 566 575 584 592 582 572 562 552 529 505 482 459 502 546 585 624 615 530 471 518 639 714
3445 714 658 601 594 633 617 526 412 374 424 475 476 477 478 479 523 566 610 654 658 663 668 673 689 705 721 738 716 694 673 651 611 570 605 640 674 707 696 684 656
3440 656 628 600 573 615 658 625 592 605 618 677 736 675 614 599 584 572 561 549 538 552 566 581 595 609 623 637 652 651 650 649 648 625 603 580 558 584 611
3436 611 592 573 642 711 674 637 622 607 637 667 733 798 746 619 521 515 571 582 539 540 602 663 640 572 521 560 608 611 600 588 624 659 649 640 616 592
3431 592 613 634 605 577 548 519 541 563 494 426 477 528 533 539 601 664 681 698 692 686 680 674 626 577 529 481 494 507 435 363 396 520 601 591 526 507 547
3427E47M0O2O1J7J6m8m9J1N6M8m3j05o0L0L1L3L3j3j4j4j4j2j2j2j2L9L9m6m6RR9P5K8KJN0
3422H27m1r1r2K3O8K9o2n3n4rqP6P6O3k7o7o8k8k9J6J7P3P3j8j7o1o0j5j6L3L3j2j2J3J3l2
3418E61l2MLN0M9M2M3llonn1n1j3j2j2j2kkkjN4N5l6l6J5J5J5J5j8j7j8j8RRRRm2m1m2m1P0
3413E11P0O9P0L5L5n6n6j7j6j6j7LLMLk1k1k0k1KJM7M6N9N9J4o2o3j7K7j9n7j1N1N0k9k9k9
3408E82k9nnmnK9K9K8K9nnnnPPPPl2l3N8N9JKKKJKKJL4L3n8n7qpn3n3MNNMPQR2R2K1p0j8j9
3402F84N4N5n1n1m6m5j%JKJJK9K9K9K9n5n6n5n5k0j9K6K5K6K6k0j9klM9m2n0n0J9K0k5k5N0
3398D65N1K4K4K4K4NNNNL6L6l9m0j8j8j8j8N6N7N6N7J2J3J2J3j9j8j9j9K5K5n1n1k0k0k0k0
3393F22QPQPLLLKL4L3m3m2k6k7k6k6jjjkJ8J8J8J8L1L2L1L2l0l0l0l0l6l6RRpqL7L8QQPQ%
$$ plain form
3427 547 587 649 710 727 743 695 646 657 713 761 718 613 553 583 614 647 680 667 653 639 625 613 601 589 577 616 655 609 563 572 671 746 774 776 777 827
3422 827 786 695 603 626 694 723 661 608 554 545 537 613 689 752 725 658 590 562 533 549 566 639 712 694 677 616 556 541 525 558 591 579 567 580 593 561
3418 561 529 533 536 586 635 677 720 717 714 708 703 652 601 588 576 564 552 550 548 546 545 599 654 618 582 597 612 627 642 624 607 589 571 580 589 598 607 565 524 482 441 511
3413 511 581 650 720 755 790 734 678 661 645 629 612 615 618 622 625 604 583 563 542 544 545 592 638 697 756 770 708 645 628 655 636 579 568 619 669 640 611 582
3408 582 553 548 543 539 534 563 592 620 649 644 639 634 629 636 643 650 657 625 592 650 709 710 712 714 716 717 719 721 722 756 789 731 674 666 659 606 553 557 562 567 571 578 586 678 770 791 721 703 684
3402 684 738 793 742 691 645 600 599 599 600 602 603 604 633 662 691 720 665 609 554 499 479 460 486 511 537 563 543 524 522 519 568 526 476 426 445 465 440 415 465
3398 465 516 540 564 588 612 617 622 627 632 668 704 665 625 607 589 571 553 609 666 722 779 791 804 816 829 810 792 773 754 779 804 753 702 682 662 642 622
3393 622 630 637 645 652 655 658 661 663 697 730 687 645 619 592 566 540 539 538 537 535 553 571 589 607 638 670 701 733 703 673 643 613 577 541 550 559 552 544 581 619 627 635 642 650 650
3388F50jKKJM7M6Jp3p4MM9L8L8rn5n1n1K4O9M3km4%MMl9l9j4j3j3j4K3K2K3K2J8J7km8l1l0
3383E44l1l1MM9M9Mn5n5l7PL3L2L5L5k1k2k1k2K4K4Pl9J1N6N3QJ7J7J4J4MNM7M7pn3o9p0m3
3378E64LK2K2LMM6M6J8k8m8m7pqppJ3J4J3J4K7K6J2l3o2J4J00N4k2k1N1R6qq4o5j8j6j5j2
3373F54j2k4k4m9mN3N3J1J1m4m3o9k3L6L7poooL9M0L3L4L3L4KLKKj1j1j1j0j6j6j5j6J4J4
3368F82o1o1NNNNM6M7JKonK6j9m3M7R5N0o2o2j9k0j3j2n9n8k6k6J9J9L6L5rn5k2O8O9k3l1
3364E70J5Q9Q9k7k7k7k7o9o9PPk9k8rQ1P7j4l4l3J4J3J3J3l6l6M0M0M6M6k9k9q6q5K1K0NM
3359E16NMPPJ08J07j0j01j00j0Q8Q8J8J8l4l5l5l5n6n5M9N0RJ0RRK6K6K1K1J3p8p2p2L0L0
3355E76P0O9J4p7p6J4M5M6k4k5k4k4k5k4m0m0O6O6J8J7J8J8j4j3j3j4L9L8L3L3or7n6L3P7
$$ plain form
3388 650 649 651 653 654 701 747 748 675 601 605 654 692 730 721 666 615 564 588 657 700 698 654 654 658 662 623 584 570 557 544 530 553 575 598 620 638 655 653 605 574 544
3383 544 513 482 486 535 584 588 533 478 441 448 481 513 548 583 562 540 519 497 521 545 552 513 524 580 633 641 658 675 689 703 707 712 759 806 799 746 677 607 564
3378 564 567 589 611 614 618 664 710 728 700 652 605 598 590 583 576 589 603 616 630 657 683 695 662 600 614 714 768 746 725 776 872 864 780 715 697 681 666 654
3373 654 642 618 594 545 541 594 647 658 669 625 582 513 490 526 563 556 550 544 538 577 617 650 684 717 751 753 756 758 760 749 738 727 717 701 685 670 654 668 682
3368 682 621 560 565 570 575 580 626 673 674 676 670 665 691 672 629 676 771 821 759 697 678 658 645 633 574 516 490 464 483 502 538 573 564 509 487 555 624 601 570
3364 570 585 674 763 736 709 682 655 586 517 524 531 502 474 465 546 623 609 575 542 556 569 582 595 559 523 563 603 649 695 666 637 551 466 487 507 512 516
3359 516 521 525 532 539 647 754 744 643 543 533 621 709 727 745 711 676 641 606 550 495 544 594 603 613 622 631 657 683 704 725 738 660 588 516 546 576
3355 576 646 715 729 652 576 590 635 681 657 632 608 584 559 535 495 455 521 587 605 622 640 658 644 631 618 604 643 681 714 747 741 644 588 621 698
3350F98j5n4L7P7P8k3k2m9m8j23j24J2J2J1J2N7N6N6N6o2o3o2o2K7K7j8j7K6K7K7K7N1N0N1
3346G33N0JKJKNNm0m0l4l3L6L7N0m1r6r5j5j6O1O0NNMNN9N9m6m7K7K8j9j8j3j4j4j3K0K0k5
3341F56k5J7J8J7J7k8k7k7k8RQQRj6j5j5j5N5N5L1o0l3l2L7L8L0L1m5m4m0m0L5L6K0K1K0K1
3337F99n1n1n1n1k8k7J8J8j4j4L2L1K5K5K5K5J2J2l3l3kkkkj3j3j3j4l8l8PPK6K6K6K6J0J1
3332E71N5N6KJm3m4j4j4L1L1j4j3j4j3k1k0K4K5rj0rrj4j5L2L1J4J4J5J4KLm3m3k9k9k9k8
3327D44K0K1K1K1OPN2N2rrj0rO4O4J8J8l6l7RRL7L7qqn5n4m4O2J03K8o0n9j7j7j7j7llm8m8
3323E25M0L9ooJ1J0J0J0M4M5l3p8o2j6L1L2llllj2j2j2j2L8L8J8k7k8k8J4J5L8L8L5L5j7o3
3318F42o3j8M3M2l0l0k2k1j9j9K5P1M5M5M3M3M4M3K9L0k0o6p4p4jkm0m0m1m0J7J6J6J7P1P0
$$ plain form
3350 698 683 629 666 743 821 798 776 727 679 556 432 444 456 467 479 536 592 648 704 642 579 517 455 482 509 491 474 500 527 554 581 632 682 733
3346 733 783 784 786 787 789 794 799 759 719 685 652 688 725 775 734 638 543 528 512 573 633 638 643 647 652 711 770 724 677 704 732 713 695 682 668 654 641 661 681 656
3341 656 631 648 666 683 700 672 645 618 590 599 607 615 624 608 593 578 563 618 673 704 644 611 579 616 654 684 715 670 626 586 546 581 617 637 658 678 699
3337 699 648 597 546 495 467 440 458 476 462 448 480 511 536 561 586 611 623 635 602 569 567 565 563 561 548 535 522 508 470 432 439 446 472 498 524 550 560 571
3332 571 626 682 684 685 642 598 584 570 601 632 618 605 591 578 557 537 561 586 577 567 558 549 535 520 552 583 597 611 626 640 642 645 602 559 530 501 472 444
3327 444 464 485 506 527 533 540 592 644 635 626 616 607 671 735 753 771 735 698 707 716 753 790 782 774 719 665 621 683 786 814 754 695 678 661 644 627 624 621 573 525
3323 525 565 604 598 592 603 613 623 633 677 722 689 611 549 533 564 596 593 590 587 584 572 560 548 536 574 612 630 603 575 547 561 576 614 652 687 722 705 642
3318 642 579 561 604 646 616 586 564 543 524 505 530 601 646 691 734 777 821 864 893 923 903 837 763 689 688 686 646 606 565 525 542 558 574 591 662 732
3314G32K4k2k9J7J7k8o3j7K5k1p1p1JKJ9J8J9J9m0m0L6Q1Q7J1m6m6kM4J5o0q1q0J7J7k6p1
3309C87m3L2R2R1K0K1ooooPQPPM8M7k6k6k9J5Jq9j13k2Q7Q7J9J9k7k6RRJ0RJ9J9J9J9l0l0
3304F23l0l0J3J2J3J2QQQQkjp1p1l3N7P7L2n9o0j7j7K0K0K0K0l5l4J0J1m8m9K7K7KLm0l9Q4
3299D79J29P9j1m2m3klm9m9K7K6L2L2L2L2k8k8k8k7J4J4J4J4nnnnNNNNJ3J2l2l3L4L3j5j06
3295E20p4J7J26J26M1M1nnklkll2l2l2l1RJ0J0J0j1j1j0j1m4m5m4m5L9M0L9L9J3J3J2J3mn
3290F67mml5l5J1J1O1O2j2j1j6L0M6k9o8o7L4L4MLMML3L4m2m2m1m1l8l8K4P0Q7J2p3p3jkL2
3285E91L2L2L2m3m3m2m3J3J2J3J2j3j4j4j4K4K3K4K3l3l3l3l3OOOOJJJJM5M5l1l0J7J8O3O3
3281F91QPl7l7j6j6L0K9J%%%R7R6rrk0k1k0k0m1m0l8l8M9R4O9oq3l8PQk1k1k1k2K1K0K0K1
$$ plain form
3314 732 756 734 705 722 739 711 648 631 656 635 564 493 494 496 515 533 552 571 531 491 527 608 695 706 660 614 612 656 671 611 530 450 467 484 458 387
3309 387 344 376 468 559 579 600 594 588 582 576 583 591 598 605 653 700 674 648 619 634 635 546 433 411 498 585 604 623 596 570 579 588 598 607 626 645 664 683 653 623
3304 623 593 563 576 588 601 613 621 629 637 645 643 642 571 500 467 524 601 633 574 514 497 480 500 520 540 560 525 491 501 512 464 415 442 469 471 474 434 395 479
3299 479 608 687 676 634 591 589 586 537 488 515 541 573 605 637 669 641 613 585 558 572 586 600 614 609 604 599 594 599 604 609 614 627 639 607 574 608 641 626 520
3295 520 446 463 589 715 756 797 792 787 785 782 780 777 745 713 681 650 659 669 679 689 678 667 657 646 602 557 513 468 507 547 586 625 638 651 663 676 672 667
3290 667 663 659 624 589 600 611 672 734 722 711 695 725 771 742 674 607 641 675 679 682 686 690 723 757 715 673 632 591 553 515 539 609 696 708 635 562 561 559 591
3285 591 623 655 687 644 601 559 516 529 541 554 566 553 539 525 511 535 558 582 605 572 539 506 473 479 485 491 497 498 499 500 501 546 591 560 530 547 565 628 691
3281 691 699 706 669 632 616 600 630 659 660 660 660 660 757 853 844 835 815 794 774 754 713 673 635 597 646 740 809 803 720 682 689 697 676 655 634 612 633 653 673 694
3276F94k4k4K1K2j6j5o1o0PPQ3Q3M3M3o3o2poL8L9o7o7RRK1K2n4n3K4K5K5K4m5m5%M5K8m7
3271E96p8p7N7N6N7N6j2j2j2j3kllkM4M3o2j07r5k0M1M1J0J1K6P1R5J9p1p1N0N1NOk6k6J9
3266F62K0M3M3kkj8j8j8j8o1o0j5j5ooP0P0rqrqk8k7J8J8j9j9j9j9lmllM8M9M9M8jkp7p7M
3261E68MM9M9rj0j0rk8k7J7J8M3M3o3o3L8L8L8L8J9K0k6k5m3m3m3m2o1o2M5M5J2J3J2J3Q1
3257F39Q1k4k4o0n9n9n9J5J4J5J5MMLMl6l5l6l5O6O7O6O6jkjjK2K2K2K2JKm5m4j8j9j9j9R
3252E63QRQL7L7l9l9qqO7O7J9K0k7k6mnmnL4L5rqJM6J8n7p4p4klJ2J3J2J3O1O2L1m4p6l1M5
3247F75M5j6j7j6j7popp%%%jo5o5M0M1M5M5l0l1n7n8j2j2O9O9K3K4n4n4N1N2nnnnN9N8N9N9
3242H62N9N9N9N9K5K5K5K6l9l9l9l9%%%%j04j05j05j04m2m1L4L4j7j7K9P4L6l9o5j9K2K2k0
$$ plain form
3276 694 670 646 667 689 673 658 597 537 544 551 634 717 760 803 740 678 671 665 703 742 675 608 617 626 647 669 615 562 586 611 636 660 615 570 570 615 643 596
3271 596 518 441 498 554 611 667 655 643 631 618 616 613 610 608 652 695 633 526 431 411 452 493 503 514 540 611 706 725 654 583 633 684 689 695 669 643 662
3266 662 682 725 768 766 764 746 728 710 692 631 571 556 541 535 529 599 669 660 652 643 635 607 580 598 616 597 578 559 540 537 533 530 527 575 624 673 721 720 718 641 564 568
3261 568 572 621 670 661 651 641 632 604 577 594 612 655 698 635 572 610 648 686 724 743 763 737 712 669 626 583 541 480 418 463 508 520 533 545 558 639
3257 639 720 696 672 612 553 494 435 450 464 479 494 498 502 505 509 473 438 402 367 433 500 566 632 631 629 628 627 649 671 693 715 716 718 673 629 611 592 573 554 563
3252 563 571 580 588 625 662 623 584 576 568 635 702 721 741 714 688 684 679 675 670 704 739 730 722 723 769 787 730 656 582 580 577 589 602 614 627 688 750 781 737 661 630 675
3247 675 720 704 687 671 654 647 641 634 627 627 627 627 626 561 496 536 577 622 667 637 606 549 491 479 467 536 605 628 652 598 544 595 647 642 637 632 627 686 744 803 862
3242 862 921 980 1039 1098 1123 1148 1173 1199 1160 1121 1082 1043 1043 1043 1043 1043 939 834 729 625 583 542 576 610 593 576 605 679 715 676 611 592 614 636 616
3238F16k0O4O3J9J8k3k3k3k3k6k5k6k6L2L1L1L1llllk8k8J8J8K4K4m7m7O1J36J37O0lmrqL3
3233A015L3L3L3k6k6k5k6pppoo2o2o1o2p2p2L4L4kkjkk9k9k9k9J9J9J9J9%J%%k8k8k8k9N2
3228E54N1M5M6J2p9q1R%m6m0OJ9J9K2K3m7m7o6k2O5J55J56O4j10j55o0R1J13K1q4q4L3L3L3
3224F49L3k4k4k5k4J7J8J7J7ONONJ1J0J0J1n9n8J7J8mlmlL0L0m6m5k3k3K3K3j4j4j4j4k2k3
3219D90k2k3KJKJN1N0M5M5L6n5l2J3L1j5n6j2N6N7j7j6j9j8j8j9L1L0L0L0j8j7j8j8L8L7j4
3215F69j05o5k0K4K5QPl7l8n4n3N1R6R8Pm5m6KJJJO6O6j0rl6l6l6l7j5j5L0L0K6K6K6K7J6
3210F46J6n9n9j25j24m2M8J00N4M0M0J14J14k3k2ppqpj6j6j5j6J7J6J7J7J2J2l2p8o3K7P5
3206F46L0onqrpoppj2j2j1j2L6L6J7p4p1J9O8O8k0k1k0k0j4j4j1j1J1N5Q1j0k3k3J7J7k3k3
$$ plain form
3238 616 596 660 723 742 760 737 714 691 668 642 617 591 565 597 628 659 690 687 684 681 678 650 622 640 658 682 706 659 612 673 809 946 1006 1003 999 990 982 1015
3233 1015 1048 1081 1114 1088 1062 1037 1011 1004 997 990 984 922 860 799 737 665 593 627 661 659 657 656 654 625 596 567 538 557 576 595 614 614 615 615 615 587 559 531 502 554
3228 554 605 650 696 708 629 548 557 557 511 471 477 496 515 537 560 513 466 400 378 443 598 754 818 708 553 493 584 697 718 634 550 583 616 649
3224 649 682 658 634 609 585 602 620 637 654 660 665 671 676 687 697 707 718 659 601 618 636 632 629 625 622 652 682 636 591 568 545 568 591 577 563 549 535 513 490
3219 490 468 445 447 448 450 451 502 552 597 642 678 623 591 604 635 620 564 552 608 665 648 632 613 595 577 558 589 619 649 679 661 644 626 608 646 683 669
3215 669 564 499 479 503 528 536 543 506 468 414 361 412 508 606 613 568 522 524 525 526 527 593 659 649 640 604 568 532 495 480 465 495 525 551 577 603 630 646
3210 646 662 603 544 419 295 253 301 401 455 495 535 649 763 740 718 711 704 696 689 673 657 642 626 643 659 676 693 705 717 685 607 544 571 646
3206 646 676 670 665 657 648 641 635 628 621 609 597 586 574 610 646 663 589 518 537 605 673 653 632 612 592 578 564 553 542 553 608 689 679 656 633 650 667 644 621
3201F21k3k3m4m3L2L1L2L3L2L2o8o8k3k3L3L2L2L2pqO4O3j4q9r2j7Ql7n3K3P3K7j8j8N7N7
3197F46mp9o4j9N7N8K5K5n1n0J4J4J4J5j7j7j7j7l2l1l2l2Q7Q6lp8l5M0O8O8J8J7J8J7K5K5
3192G59n0n1p4p4KJJ1J1N7N6L2L1j3j4n8n8J8J7J1J1J1J1NNm0m0j1j1O4O5K1K1k4k4qqqpJ
3187F48Km3m4m3m4KKMMMNKKLKO5O4j0j1%Jm5m5J0J0J0J0j8j9K7K7L6L5L5L5m4m4m4m4k4k4
3182D99N1N2klkkNOOOj4j3j3j3J%J%j8j9j8j8J4J4J4J4LLP3P2q0j70r5mN3N3j6j7lmlmJ6J6
3177D41Q7Q6P0k1m5m5K3K3K3K2%jjjl8l8l8l8k6k6N0M9J0J0J0J0k0k0K5K5O4O4m2m1n3n2K4
3173E70K3M4M4jjl6l6J0RK1K1k5k4o4o5j8j9K4K5K5K4J4J4J3J4nnonj4j5j5j4K7K6K7K7kk
3168F30onOl9n9J7J8k7LMj9j8j9j8N8N7N8N7k2k1k2k2j0j0j0j0M2M2M2M2nnq0q1k1k1Q0Q0
$$ plain form
3201 621 598 575 531 488 520 551 583 616 648 680 612 544 521 498 531 563 595 627 620 612 676 739 725 636 544 527 535 498 445 468 541 568 550 532 589 646
3197 646 642 563 499 480 537 595 620 645 594 544 558 572 586 601 584 567 550 533 501 470 438 406 493 579 576 498 463 503 571 639 657 674 692 709 734 759
3192 759 709 658 584 510 512 513 524 535 592 648 680 711 698 684 626 568 586 603 614 625 636 647 652 657 617 577 566 555 619 684 705 726 702 678 670 662 654 647 648
3187 648 650 607 563 520 476 478 480 484 488 492 497 499 501 504 506 571 635 625 614 614 615 570 525 535 545 555 565 547 528 555 582 618 653 688 723 679 635 591 547 523 499
3182 499 550 602 600 597 595 593 598 604 610 616 602 589 576 563 564 564 565 565 547 528 510 492 506 520 534 548 551 554 627 699 619 449 354 350 403 456 440 423 420 416 413 409 425 441
3177 441 528 614 684 663 618 573 596 619 642 664 664 663 662 661 623 585 547 509 483 457 507 556 566 576 586 596 576 556 581 606 670 734 692 651 598 546 570
3173 570 593 637 681 680 679 643 607 617 626 647 668 643 619 555 490 472 453 477 502 527 551 565 579 592 606 601 596 590 585 571 556 541 527 554 580 607 634 632 630
3168 630 624 619 625 586 527 544 562 535 538 542 523 505 486 468 526 583 641 698 676 655 633 611 601 591 581 571 613 655 697 739 734 729 649 568 547 526 606 686
3163F86M4l1l5l4J5J5J5J5n5n5rj0O9O9opo0o0J5J5P0P0P0P0L4L5L4L5QPQQNMMMm2m2m2m2
3158H94M3M3l3l2q2q2j02n7NQ0O6K1l1l1l4l4l4l4nO9P3ko2o1J9K0k7k6O2O2j4j4QQPQLLL
3154G00LJKKKj0rj0rL8L8L9L8K8K8J29J29N2k3k6N0O9K4q1q2j6j6j5j6l4l4J2J1n4n4r9j00
3149G07J1J1J1J1j1j1L4L4m4m3m4m3klm7m8j3j3L3L3R9R9opj3j3n9n8k9k9k5k4QQ3Q3Qp7p7
3144E26l7l6L3L2L3L2L6L6L6L6m1m0m1m1l1l1J4J4j8j9K8K7ppppn2n1K4K4O7O6L8l7p9kQ6
3140F04Q6j3j3j3j4o5o5k0j9l7l6L9Q4K3n3n2K3M3jLM8O2O3j1j0k6k7k6k7%%M5M6j7j6j6j7
3135E75nnnnK5K5k1k1L5L5J1q0o7o7LLL2L2P8P7klqqnr6r6nKKQPN1N0k6k5k3k3k4k3L0L1m5
3130D24m5M7M7N3l7qpL2L2l3l3J3J3J6J6J7J6KKLKj7j7j6j7ONOOJ4J4J4J5j1j1n6n6M4M4M4
$$ plain form
3163 686 730 699 664 630 645 660 675 690 635 580 571 561 630 699 693 686 626 566 581 596 666 736 806 876 910 945 979 1014 1022 1029 1037 1045 1050 1054 1058 1062 1020 978 936 894
3158 894 937 980 947 915 833 751 649 592 597 677 743 764 733 702 668 634 600 566 561 630 703 701 639 578 597 617 590 564 626 688 674 660 668 676 683 691 694 697 700
3154 700 703 704 706 708 710 700 691 681 672 710 748 787 825 853 881 1010 1139 1191 1168 1142 1192 1261 1285 1204 1122 1106 1090 1075 1059 1025 991 1003 1014 960 906 807 707
3149 707 718 729 740 751 740 729 763 797 753 710 666 623 621 618 571 523 510 497 530 563 662 761 755 748 735 722 663 605 576 547 522 498 506 589 672 680 603 526
3144 526 489 453 486 518 551 583 619 655 691 727 686 646 605 564 533 502 516 530 512 493 521 548 541 534 527 520 468 417 441 465 532 598 636 599 520 518 604
3140 604 690 677 664 651 637 572 507 487 468 431 395 434 518 541 488 436 459 502 501 504 552 614 677 666 656 630 603 577 550 550 550 595 641 624 608 592 575
3135 575 570 565 560 555 580 605 584 563 598 633 644 564 497 430 433 436 468 500 578 655 653 650 642 634 629 533 437 432 434 436 444 451 502 552 526 501 478 455 431 408 438 469 424
3130 424 379 426 473 526 489 481 474 506 538 505 472 485 498 514 530 547 563 565 567 570 572 555 538 522 505 511 516 522 528 542 556 570 585 574 563 507 451 495 539 583
3125E83M4p5p4k9k9L5L5j0j0P5P5P4P5m0m0m1m0L5L4j0j1n7n7n7n7M0L9M0L9o8o8j9P1J07
3121F09J7klM7M7n3n3l0O2N6N5l9m0l9m0K0K0m9n0n9L1N6N6j8j8j8j8m9m9j01rM8M9N4N4N
3117E49NMNj6j7j7j7L5L4onn2L9R3R3k7k8k7k8L1L1L1L1m0m1m1m0m0m0m0m0M7M6M7M7J1J1
3112F28J0J1QQQQJ4J3l2l1l3l3M3M3K7K7j8j8k4k4o9p0l8l9POl1l1J4J4O8O8K2K3O0O0J5J5
3107G29m3m4KJL0L0p5p6J6J6k9l0j7j6K8K8qrrqM6M6J8n8n9J6M0nn6n6M6M7L4L4j1j1l4l4
3103E19J1J2q9q8j3j3N0M9N0M9K2K3K2K3K2K2K3K2m6m5m2m1j2O2R1M6mnO8O9m4m3m3m3k9k9
3098F26k8k9ONNORRJ0RJ6J6J6J5j0j0q5q6K9K8K9K8m6m6m7m6N0M9Nm1k3N3N0k6n4n4M7M7K1
3094E53K2K1K1k0k1k0k1P7P7k6k6jM5rq4n2K4M7Kj6j7k0j9n2n1n2n1QQQQMMM9M9K4K4K3K4
$$ plain form
3125 583 627 552 478 449 420 455 490 480 470 545 620 694 769 729 689 648 608 643 677 667 656 599 542 485 428 468 507 547 586 518 450 431 502 609
3121 609 626 624 621 668 715 662 609 579 641 697 752 713 673 634 594 614 634 585 535 476 507 563 619 601 583 565 547 498 449 348 339 387 436 490 544 549
3117 549 554 558 563 547 530 513 496 531 565 559 554 502 541 634 727 700 672 645 617 648 679 710 741 701 660 619 579 539 499 459 419 466 512 559 606 617 628
3112 628 638 649 657 665 673 681 695 708 676 645 612 579 622 665 692 719 701 683 659 635 566 496 458 419 426 432 401 370 384 398 466 534 556 579 639 699 714 729
3107 729 686 642 644 645 675 705 630 554 570 586 557 527 510 494 522 550 542 533 524 516 562 608 626 568 509 525 565 560 504 448 494 541 575 609 598 587 553 519
3103 519 530 542 453 365 352 339 389 438 488 537 559 582 604 627 649 671 694 716 670 625 583 542 530 592 683 729 725 720 788 857 813 770 727 684 655 626
3098 626 598 569 575 580 585 591 600 609 619 628 644 660 676 691 681 671 586 500 529 557 586 614 568 522 475 429 479 528 533 492 469 522 572 546 492 438 485 532 553
3094 553 575 596 617 597 576 556 535 612 689 663 637 636 681 672 588 536 560 607 609 593 576 556 537 485 434 382 331 339 347 355 363 367 371 420 469 493 517 540 564
3089E64J6J6J6J6m3m3O2O2k5k6k5k6LLLLn6n5j0j1N6N6N6N6o5o6J0J0J2J2J1J2M6M6k9l0k3
3084F14k4K1K2j5j5j6j5pqqpl8l7L7L8m7m7K9K8MLLLj7j8K8K7mmmmK1K2k4k4L7L8qqo2o2J4
3079D66J4K7K7K7K6L1L1j5j5K8K9K8K8K3K4q2q3k0k1K4K5O0N9O0N9m1m1MNk4k5k4k4llm9m9
3075E86j4j5L1L0opopo3o3M2M3L5L5L6L5QQl8l7rqn4n4j4j4R1R2J6J6k9l0N7N7J01J02l8l8
3070H77l8l8p1p1j1O5Q1L6O2O1K1n4q8q8n5n6j0j1J6J7J6J6LL%%o0j05p9lL2j3j0L4M7Jm1
3065D86NM8M9k4k4mnmmJ06J06J3o3l0l1l6l5J0J0J0J0RRQ4Q5M3M3M3M3J4J4o2o2q5q5q3pO3
3061F59O3O3O3Kp4j06j07L0L1L0L0j7j6o2o2j1j0j0j0J3J2J3J2J0J0J0Rlmm9m9m4m3M7M8L5
3056E13L5j0j0MNMMk5k4J21J20J4p8r7n2ppnmJ9K0J9J9j2j3j2j3j2j3j2j3j5j6j0j0rQ0Q1
$$ plain form
3089 564 580 596 612 628 585 542 604 666 641 615 590 564 567 570 573 576 520 465 455 444 500 556 612 668 603 537 547 557 569 581 592 604 650 696 667 637 614
3084 614 590 611 633 618 603 587 572 565 557 549 542 504 467 504 542 495 448 477 505 509 512 515 518 501 483 511 538 534 530 526 522 543 565 541 517 554 592 584 576 514 452 466
3079 466 480 507 534 561 587 618 649 634 619 647 676 704 732 755 779 697 614 594 573 597 622 682 741 801 860 819 778 782 787 763 738 714 690 687 684 635 586
3075 586 572 557 588 618 612 605 599 592 529 466 508 551 586 621 657 692 700 708 670 633 624 616 562 508 494 480 571 663 679 695 666 636 693 750 851 953 915 877
3070 877 839 801 730 659 648 713 794 830 892 953 974 920 832 744 689 633 623 612 628 645 661 677 680 683 683 683 623 518 439 436 468 455 445 479 526 527 486
3065 486 491 539 588 564 540 536 531 527 523 629 735 748 685 655 624 588 553 563 573 583 593 602 611 695 780 823 866 909 952 966 980 918 856 771 686 603 596 659
3061 659 722 785 848 850 776 670 563 593 624 654 684 667 651 589 527 516 506 496 486 499 511 524 536 546 556 566 575 572 568 519 470 426 383 430 478 513
3056 513 548 538 528 532 537 541 545 520 496 617 737 751 673 576 524 517 510 505 501 520 540 559 578 566 553 541 528 516 503 491 478 463 447 437 427 418 498 579
3052E79j0l1l1l7l7K7K7K8K7J1J1J1J1j6j5j5j6rj0j0j0n3n3M1J32J09J9j5j5j9k0j9j9l8
3048E35l8N3N3OPq4q5ppL8L8j3j3L2L3L9M0n1n1LLLLJ2J3J3J3K4K5K4K4n0m9n0n0K8K8K8K7
3043E97o7o7K4K4lllkR2R3j3q9r9n4j9K7J9K0K2K3JKJKn9n9n8n9M3M3M3M3j8j8j8j8M5M5Q6
3038E69Q6O2j3q6m2j8j7j5j5J3J3J4J3M6M6m6m5J6J6J6J6l0k9l0k9P3P4L0m5j14l8P8J54J09
3034H32L4j2j2nn0o8RL9M0jjN1N0j00j00r1r1jjKJJKQ0Q1p1p0k9k8J8J7O5O6k5k6l3l4l4l4
3029D71J7J6p0o9J6R2N1k4m0L5L5m0j0O5M4kK1K1Nm1m1N1J00N6j1L5Q2Q2L9L9L8L9o6o7k1
3025I48k0j6j5N9J05L4n8j08j09p2p1k6k6j7j6K8K9J9J9n1n1n2L9O3O3qpqqn7n7J8J8N5N5
3021F99k0k1j8j7K7K8L0K9m6m6p7p8N8N9N1N2OPKJjjOm0o9K3P0K4J1J0MMp2p1L0L0L0L1m7
$$ plain form
3052 579 569 538 507 470 433 460 487 515 542 553 564 575 586 570 555 540 524 515 505 495 485 432 379 420 552 661 680 665 650 631 611 592 573 535
3048 535 497 550 603 609 616 532 447 440 433 471 509 496 483 515 548 587 627 576 525 528 531 534 537 549 562 575 588 612 637 661 685 635 586 536 486 514 542 570 597
3043 597 530 463 487 511 508 505 502 500 592 685 672 583 484 430 411 438 457 477 499 522 523 525 526 528 469 410 352 293 336 379 422 465 447 429 411 393 438 483 569
3038 569 655 717 704 618 576 558 541 526 511 524 537 551 564 610 656 610 565 581 597 613 629 599 570 540 511 584 658 688 643 529 491 569 723 832
3034 832 866 854 842 837 787 719 728 767 807 806 805 856 906 806 706 615 524 523 522 524 525 526 528 608 689 618 548 519 491 509 526 591 657 632 606 573 539 505 471
3029 471 488 504 434 365 381 473 524 500 460 495 530 490 480 545 589 587 608 629 634 593 552 603 703 759 748 783 865 947 986 1025 1063 1102 1036 969 948
3025 948 928 912 897 956 1061 1095 1037 929 820 748 677 651 625 608 592 620 649 668 687 636 585 533 572 635 698 690 683 675 667 610 553 571 589 644 699
3021 699 679 658 640 623 650 678 708 737 691 645 568 490 548 607 658 710 716 723 725 726 725 724 730 690 621 644 714 738 749 759 763 767 695 624 654 684 714 745 698
3016F98m6m6m6J0J1J1J0J3J3l3l3L9M0l7l6LMLLj8j8j9j8ppppK0K0K0K0L2L1L2L1%%J%l9l8
3011F10l9l8M0M0Q0Q0P8j3o7o7n9n9n9n9RRRRM4M4l1l2L3L3L3L3L6L5l9m0k7k8J8J8k6k7r7
3006D84r6n8L3N7N8J2J3J2J3m7m7m7m6N0N1N1N1k1k1k1k0k4k4k4k3KLLKk4k5k5k5K5K4K5K4
3002C75J4J3J9K0J9J10J10J9q2q1q7q7K0J9n6n5n3n4n3n3J1J2J6J7M1J32K07J16K9K8K3K3
2998G32m3m4m3m3o1o2M5M4l9m0l9m0L9L9L9L9PPPPK6K5K6K6ONONj3j3j4j3K8K8K8K8l3l3L6
2993G05L7l1j22p0p1M9M8M8M9P2P3M8m3j01j01l2l1lklkj1j0J21J20Lq7q8MMMJ0J0j9j8j9
2989E41j9P1P0K6K6o4o3o4o3L5L6Q1Q1J9K0n7n6%%M6M6k4k4r3r4m6M4R9R9M1M2l5l4n7n6j2
2984E62j1M6M6k9l0l3l3k7k8RR9R9Qj8j8P7P6k2j13o8K3J6J6K2K2L3L3j3j2J0J0J1J0j6j5
$$ plain form
3016 698 652 606 560 570 581 592 602 615 628 595 562 601 641 604 568 571 575 578 581 563 545 526 508 501 494 487 480 500 520 540 560 592 623 655 686 686 686 687 687 648 610
3011 610 571 533 573 613 693 773 851 838 771 704 645 586 527 468 477 486 495 504 548 592 561 529 562 595 628 661 697 732 693 653 626 598 616 634 608 581 484
3006 484 388 330 363 420 478 490 503 515 528 481 434 387 341 391 442 493 544 523 502 481 461 437 413 389 366 368 371 374 376 352 327 302 277 302 326 351 375
3002 375 389 402 421 441 460 570 680 699 617 536 449 362 382 401 345 290 237 183 130 77 88 100 116 133 174 306 513 629 658 686 709 732
2998 732 689 645 602 559 498 436 481 525 486 446 407 367 406 445 484 523 530 537 544 551 577 602 628 654 660 665 671 676 663 650 636 623 651 679 707 735 702 669 705
2993 705 742 711 589 519 448 497 545 593 642 714 787 835 792 691 590 558 527 524 522 519 517 506 496 617 737 740 653 565 569 573 577 587 597 578 560 541
2989 541 522 593 663 689 715 651 588 524 461 496 532 613 694 713 733 676 620 620 620 666 712 688 664 571 477 431 475 574 673 714 756 721 687 630 574 562
2984 562 551 597 643 614 584 551 518 491 463 472 571 670 678 660 642 719 795 773 660 592 615 631 647 669 691 724 757 744 732 742 752 763 773 757 742
2980G42o1o1o4o4J2J2O4O5j1j1l0l0P5P6L8L8o7o8q2q2PQ3R0J6p4p4m4m4L1L1K4K3j08j09
2976C43m1L5O3J7j4j5j4j5LM8O5j1j41j41m2O4P6L1O3O3L5L6NN0N1k4n0mK9K9j3j3RRJ0RN
2971F10NNNK6K6j9k0L2L3m3m4j2j2j2j2l2l3J3J3J6J6k9l0ppL8L8j9j9k0j9o5o4J1J1O3O3
2967E06J8J7llm8m8M4M4jjj2j3L3L3J9J8k6k7j0j0K0k5j0O6O3j3p2p2J4J4k8k9J7J7ononN
2962D75ONOL0L0j6j6l2l3N8N8J9J8k7k7L5L6L5L5J3J3l3l3o9p0K2K1QPQQk6k7k6k6M8M9m2
2957E40m3l0l0l0l0QQN3N3N0N0m1m0k3k3O8O8J1J1J2J1JJJJK9K8o2o2n6n5j0j0M6M5M6M6n3
2953E89n2n3n2mlmlK9K9K9K9J9J9k7k6k9k8O2O2L0L0K7K8o2j07r8PO8K3l6l6J2J3J3J3J9J8
2948E48J9J8j5j6j2j3L6Q2O5k6q1l5K3K4J2J1l3l4K4K4l6q1n7L3P0P0k9k9J6J6J6J5j6K9K4
$$ plain form
2980 742 681 620 556 492 504 516 580 645 634 623 593 563 638 714 752 790 723 655 573 491 498 581 671 687 613 539 495 451 482 513 537 560 452 343
2976 343 302 337 400 417 403 388 374 359 362 410 475 464 323 182 140 204 280 311 374 437 472 508 513 563 614 590 540 536 565 594 581 568 577 586 596 605 610
2971 610 615 620 625 651 677 658 638 670 703 660 616 604 592 580 568 536 503 516 529 545 561 532 502 495 488 526 564 545 526 506 487 422 358 369 380 443 506
2967 506 524 541 538 535 487 439 483 527 526 525 513 500 533 566 585 603 577 550 540 530 550 525 515 581 644 631 559 487 501 515 487 458 475 492 486 481 475 470 475
2962 475 481 486 492 522 552 536 520 488 455 513 571 590 608 581 554 589 625 660 695 708 721 688 655 586 516 538 559 567 574 582 590 564 537 511 485 533 582 540
2957 540 497 467 437 407 377 385 393 446 499 549 599 558 518 495 472 540 608 619 630 642 653 654 655 656 657 686 714 652 590 534 479 469 459 505 550 596 642 589
2953 589 537 484 432 428 425 421 418 447 476 505 534 553 572 545 519 490 462 524 586 616 646 673 701 639 532 434 441 509 532 496 460 472 485 498 511 530 548
2948 548 567 585 570 554 542 529 565 647 712 686 605 570 593 617 629 640 607 573 597 621 585 504 447 480 550 620 591 562 578 594 610 625 609 638 662
2944F62o8q4l9M8M7qn5k5O5Q2L7l1l0J2J3K9K9K9K9K4K3o7o7k4k4l7q4q7MJ01J01L1L0L1L1
2940G28K2K2K1K2n3n3n2n3O6O5k5k5m2m2MMN4N5RRMMMMJ2J3J2J2POOOj5j6j5j5J2J3l3l3q8
2935F36q7LLN9N9J4J3K0J9O5O4l1l1l1l1J3J4J3J3j7j7j8j7o8o9k9O2M7M6l8l8j9j9K7K7k2
2930F35k1k2k1O3O4k7k7K7K8j8j8K5K4L1o1l2l2PQK0K1K0K1k0k0k0k0K2K2K1K2L8L7L8L8L4
2926I07L5j0j1j26j25q7NR2R2R8R8k5k5k5k5KJKKl3l2l3l2%jn1L9M8M7N3N3K0K0k5k6j02j03
2921G17o2K8M7M8l7l7o0o0Q5Q6R7Or4r4k4k3k4k4J6J6J6J6j2j1j1j1K3K3K3K3j0j1j0j1K3
2917F67K4K3K4j7j7j7j7n1n1n1n1ppppmmmnj3j4L2L1RJ0O8J14O4k6q8m4k3k4k0k1P2P1j9j9
2912E81J%M6M6O2O1k9l0l4l5J0J0j0j0j0j0j9j9j8j9j1j1j0j1L8L9L8L9j4j3j3j3k4k5k4k4
$$ plain form
2944 662 594 510 471 519 566 558 503 478 543 625 662 631 601 613 626 655 684 713 742 766 789 722 655 631 607 570 486 399 403 504 605 636 666 697 728
2940 728 750 772 793 815 762 709 657 604 670 735 710 685 643 601 605 609 663 718 727 736 740 744 748 752 764 777 789 801 808 814 820 826 811 795 780 765 777 790 757 724 636
2935 636 549 552 555 614 673 687 700 720 739 804 868 837 806 775 744 757 771 784 797 780 763 745 728 660 591 562 624 671 717 679 641 622 603 630 657 635
2930 635 614 592 571 634 698 671 644 671 699 681 663 688 712 743 682 650 618 625 633 653 674 694 715 695 675 655 635 657 679 700 722 760 797 835 873 907
2926 907 942 932 921 795 670 583 588 680 772 870 968 943 918 893 868 870 871 873 875 842 810 777 745 745 744 693 732 780 827 880 933 953 973 948 922 820 717
2921 717 655 683 730 778 741 704 644 584 669 755 852 858 764 670 646 623 599 575 591 607 623 639 627 616 605 594 617 640 663 686 676 665 655 644 667
2917 667 691 714 738 721 704 687 670 619 568 517 466 459 452 445 438 434 430 426 421 408 394 426 457 466 476 544 658 722 696 608 564 541 517 497 476 548 619 600 581
2912 581 582 582 628 674 736 797 768 738 704 669 679 689 679 669 659 649 630 611 593 574 563 552 542 531 569 608 646 685 671 658 645 632 608 583 559 535
2908E35m3m2m3m2L8L9L9L9O8O9k2k2n0n1n0n0J9J8J9J9j2j3L3L3N7N6l4l5K6K7k0j9K9L0K9
2904F74K9l0l0l0l0N7N6N7N7o8o8o3o4j2O2M6Jj9j8K4K4l9l8OPK5K6k0k0nmm6m5J2Q8Q8J2
2899G02l9m0JJKKJKk3k3k3k3L1L2j4j4l8l8PPJ2J3J3J2j2j3j2j3KJKKN0N0k5k6L2L1j4j4k1
2894E83k1k1k1j0j1L5L5PPl8l7k4k4k4k4N9N9J4J3K0K0K0K1j2j1j1j2opopLLP9P8RJ0RJ0K7
2889G94K6K2K2nq1j09j09m4L2O5O5J5J4l2l1j8j9j8j9k9k8J6J7m8m7N9N8K2K2K2K1j7j8j23
2885D97j23l6l7P0O9L3L3L3L4K8K8j7j7m8m8K7K7j5j6j5j5m7m7jkL8L7l8l8j8j7K8K8L6L6
2881D87L7L6L9L9ppk3k4N2N2l6l6l6l6J8J7J8J8L6L7L7L6k3k3k3k3qqn4n3JJJJL5L5m0m0j7
2876E16j7j7j7j1j1j2j1M3M2l3l3J8J8J8J8J3J4J3J3LLKLk3k3K3K2JJJ%L6L6j0ro5o4M1M2
$$ plain form
2908 535 492 450 407 365 403 442 481 520 588 657 635 613 563 512 462 412 431 449 468 487 475 462 495 528 585 641 607 572 598 625 605 586 615 645 674
2904 674 703 673 643 613 583 640 696 753 810 742 674 611 547 535 597 643 644 625 607 631 655 616 578 584 591 616 642 622 602 597 593 547 502 514 602 690 702
2899 702 663 623 624 625 627 629 630 632 609 586 563 540 571 603 589 575 537 499 506 513 525 538 551 563 551 538 526 513 515 516 518 520 570 620 595 569 601 632 618 604 583
2894 583 562 541 520 510 499 534 569 576 583 545 508 484 460 436 412 471 530 544 557 577 597 617 638 626 615 604 592 586 579 573 566 569 572 651 729 738 748 757 767 794
2889 794 820 842 864 859 778 669 560 516 548 613 678 693 707 675 644 626 607 589 570 541 513 529 546 498 451 510 568 590 612 634 655 638 620 497
2885 497 374 338 301 371 440 473 506 539 573 601 629 612 595 547 499 526 553 538 522 507 492 445 398 397 395 433 470 432 394 376 359 387 415 451 487
2881 487 524 560 599 638 631 624 601 577 629 681 645 609 573 537 555 572 590 608 644 681 718 754 731 708 685 662 654 646 592 539 540 541 542 543 578 613 573 533 516
2876 516 499 482 465 454 443 431 420 463 505 472 439 457 475 493 511 524 538 551 564 567 570 572 575 552 529 552 574 575 576 577 577 613 649 639 630 565 501 542 584
2871E84O4O5m0m1j8j7j8j7l1l1l1l0l5l5M1M1Q3Q3POk0k1k0k1opopM1M1M1M0l0l1l1l1j5j5
2867E32j5j5J4J5Q9R0j3j4j3j4k7k8k8k7l7l7l7l7qpO8O8L3L3JM8L8n2n2L9L9om9mQ9M2r4
2862F24j39o8K3J4J4L9L9l6q1j5P6P5j5j5L1J0q0n3L8Q2L7QRNOq7q7j1j2Q3Q2O0l0j4L0P6
2858G18P5qqn4n3j5j6j6j5l2l1M3M4n2n1ppk8k8M7M7K5K5K5K5L9L9opN9N8j7j7l7l7QRjjj
2853G41jO0N9J5l0n1M1R2R2P4P4J30J75K22L13M54N44L99J27j81l94m44m00l20k29j75j29
2849A258p4p3q5q6l9m0l4l4l4l4l2l2l2l2P6P7N5l6l7Pk3k3k6k5k5k5k0k0j9k0L4L4L5L4J6
2845F66J6k9k9m6m7L0K9RQRQK5K5K4K5j9j8j9j8j6j6j6j5k6k5K0K0l7l7L9L9k5k5k4k5K5K4
2841E29K5K4mmJ1N5O2l0n1n1J6J7l0k9L3L3L3L4kjkjL6L5j0j0m0m0m1m0j9k0K6K6j8j8j7j8
$$ plain form
2871 584 648 713 673 632 614 597 579 562 531 500 469 439 404 369 410 451 534 617 624 630 610 589 569 548 542 535 529 522 563 604 645 685 655 624 593 562 547 532
2867 532 517 502 516 531 620 710 697 683 670 656 629 601 573 546 509 472 435 398 390 383 451 519 552 585 586 634 672 620 568 607 646 640 591 587 676 718 624
2862 624 485 417 440 454 468 507 546 510 429 414 490 565 550 535 566 576 496 443 481 563 600 608 617 622 628 541 454 443 431 514 596 656 626 612 642 718
2858 718 793 785 777 723 670 655 639 623 608 576 545 588 632 580 529 522 515 487 459 506 553 578 603 628 653 692 731 725 718 777 835 818 801 764 727 735 744 743 742 741
2853 741 740 800 859 874 844 793 834 926 1018 1092 1166 1296 1471 1693 2006 2460 3004 3403 3530 3349 2955 2511 2111 1791 1562 1387 1258
2849 1258 1184 1111 1026 940 901 861 827 793 759 725 693 661 629 597 673 750 805 769 732 739 716 693 667 642 617 592 572 552 533 513 547 581 616 650 666
2845 666 682 653 624 578 531 561 590 599 607 616 624 649 674 698 723 704 686 667 649 633 617 601 586 560 535 555 575 538 501 540 579 554 529 505 480 505 529
2841 529 554 578 574 570 581 636 698 668 617 566 582 599 569 540 573 606 639 673 671 670 668 667 703 738 728 718 678 638 597 557 538 518 544 570 552 534 517 499
2836D99k8k8P2P2K6o4n9n9M0L9M0L9J7J6J6J7k5k6k5k5L1L2L1L2kjkkL4L4j6j06j22l2J8J7
2832E00nmM0M1K2K1K2K2k7k7k7k6M7M7JKm8m8K6P2M4m7o9o9rqrrm1m2MLN4N3QRJ7J8J8J7j6
2827E77j7j7j6J7J8J7J8L6L6L6L6m8m8r3r3K8K7K8K7J7J6J6J7n5n4rrK0J9J9K0L4L4j1j2m2
2822E89m3LLKJM7M7ppppK7K7m2m2p7J4O9O9l8l8l8l8M4M4M9m1p8p7K2K2l9l9OOj3j4j3j4N1
2817D30N0R6R7j7j6j7j6k0k0K5K5K9K9K8K9j5j5o0o0j0j0j1j0j0j1j0j0l5l5m0N1M1M0M7M7
2813F16K3K3n2n3k5k6k6k6J7J6O2O2j%%jJ1J1l4l5qqL8L7M7M8M7M7mlj0rK4o6r1r2K7K7m8
2808E65m9l6l7j2P9R7R7o3o3K6K7L2n9p8p8K3K2O1O1m5m4qqqqk0k0N5N6O2O2j3j3k7k7P4P3
2804G56Lq9q8LO1O0l9m0j6j7j7j7k8k9M7M7QPQPm6m5j%K8K8K8K8o8o7m3M8K3K3K3K4M9m1q7
$$ plain form
2836 499 471 443 515 587 613 549 490 431 471 510 550 589 606 622 638 655 630 604 579 554 585 617 648 680 678 677 675 673 707 741 725 619 497 465 483 500
2832 500 495 491 531 572 594 615 637 659 632 605 578 552 599 646 647 649 601 553 579 651 695 648 579 510 501 493 484 475 434 392 396 399 453 506 514 523 540 558 576 593 577
2827 577 560 543 527 544 562 579 597 633 669 705 741 693 645 552 459 487 514 542 569 586 602 618 635 580 526 517 508 528 547 566 586 620 654 643 631 589
2822 589 546 549 552 554 555 602 649 642 635 628 621 648 675 633 591 514 528 597 666 628 590 552 514 558 602 651 610 532 455 477 499 460 421 427 433 420 406 393 379 430
2817 430 480 576 673 656 640 623 607 587 567 592 617 646 675 703 732 717 702 642 582 572 562 551 541 531 520 510 500 465 430 390 441 482 522 569 616
2813 616 639 662 610 557 532 506 480 454 471 487 549 611 610 610 610 609 620 631 597 562 554 546 584 621 668 716 763 810 806 803 793 784 808 742 651 559 586 613 565
2808 565 516 480 443 431 510 607 704 641 578 604 631 663 604 526 448 471 493 554 615 570 526 518 510 502 494 474 454 509 565 627 689 676 663 636 609 683 756
2804 756 759 670 582 585 646 706 667 627 611 594 577 560 532 503 550 597 605 612 620 627 581 536 535 535 563 591 619 647 579 512 469 517 540 563 586 610 659 618 531
2799E31MN9O0p1j61q7O4J09J10m2m2MMO8O7pqp6p5l1l0l6l7O9P0L9L9L3L3J4p8k7k6J2J2l3
2795E34l3L1L2L2L2k1k0K0J9N6l5n9o0N1N1n4n5ONOOj5j5L0L1MMNMJ8J9J8J9j3j3j3j3k4k5
2790E65k4k5j4j5j5j5N7N7N6N7%j%jN9N9J3J4M2M2M2M1M6M6%Jo2o2o2o1m1m1MMn1n1n2n1j9
2785E42j9N6N6k6k6k6k6J4J5o2o1NNQ0Q1J1J1o4o4NNNN%%J%K4K5K5K4L1L1j4j4l4l5l4l5q
2780E09qO7O8k2k2k2k2M5M5o1o0j8j8K7K7J4J4J4J5mmlmJ5J6J5J5m5m4m5m4l9l9N2N2%%%J
2775D87M0M0M0M0m2m2l9l9P0J16M5l1p8l2N8J04P0nn0n1o7o8K3K3j3j3j3j3K0J9p1p1jjkj
2771D52M3M2M3M2j6j7M3Q9Q5Rl6l6l3l4l3l3M5M6M5M5lmlml2l2l2l2KKKKK1K2K1K2k0k0k0
2766F83k0J6J7J7J7n5n5n5n5m4m4m4m4K1K0K1K0LMLLpqqqL5L6L6L6l7l6l6l6K0K0J9K0j4j5
$$ plain form
2799 531 535 594 654 583 422 335 399 508 618 576 534 538 542 610 677 670 662 586 511 480 450 414 377 446 516 555 594 627 660 674 596 569 543 555 567 534
2795 534 501 532 564 596 628 607 587 607 626 682 647 588 528 579 630 576 521 527 532 538 544 529 514 544 575 579 583 588 592 610 629 647 666 653 640 627 614 590 565
2790 565 541 516 502 487 472 457 514 571 627 684 684 683 683 682 741 800 813 827 869 911 953 994 1040 1086 1086 1087 1025 963 901 840 799 758 762 766 715 664 612 561 542
2785 542 523 579 635 609 583 557 531 545 560 498 437 442 447 527 608 619 630 566 502 507 512 517 522 522 522 523 523 547 572 597 621 652 683 669 655 621 586 552 517 509
2780 509 501 568 636 614 592 570 548 593 638 577 517 499 481 508 535 549 563 577 592 588 584 581 577 592 608 623 638 593 549 504 460 421 382 434 486 486 486 486 487
2775 487 527 567 607 647 605 563 524 485 555 671 716 685 607 575 633 737 807 802 752 701 634 566 589 612 599 586 573 560 580 599 528 457 456 455 453 452
2771 452 495 537 580 622 606 589 632 721 806 815 779 743 710 676 643 610 655 701 746 791 788 784 781 777 745 713 681 649 651 653 655 657 678 700 721 743 723 703 683
2766 683 663 679 696 713 730 675 620 565 510 466 422 378 334 355 375 396 416 419 423 426 429 422 414 406 398 433 469 505 541 504 468 432 396 416 436 455 475 461 446
2761D46j4j4M5M5M5M5mmnmK6K6K5K6L1L1L1L1q1q1q1q1J4J3J4J3J%%%nnono7o7k8O3P7P6q
2756E64rl3l3l4l3J1J0J0J0J3J3J3J3j9j9P2P1l9m0l9m0J4J3J4J3k2k2O8O9l9l9m0l9k4k4
2752D04k4k4M0M0M1M0J5J5J4J5mmmmj4j5o6K5N5N5N5N5J9p1j11j11M5M6M6M5M0M0Jr1ppj3
2748E81j3j6j6j7j6J0J1J0J0M1M2M1M2m6m5m6m5K7K8K8K8k1k1K4K4l6l7RRNONNkjkkj6j6r1
2743D81r2J8J9J8J8RRRQM0M0l5l6l3l2J2J3K5K5k0k0N9N9m7m6k2k2K4K3L6L6L6L6J6J6O1O2
2738H03J4J4J5J4OOl9m0nnonl8l7QPP9P8J9n8l5J0Rl5n9J6M5jo2j7O0O1qqL8L8k4k3k4k4m
2733G83nM1M0m1m2m1m1J8J8J8J8PPNNk8p3m4L1M4M3MLl6l5J0RL0L0L0L0N0N0k5k6L3L4m2q6
2728H26m2N0M9m1p5k9P5J20L4n7p3k9ppn5L6Q5Q6j5j4J6J6n6n7m0Nrj00j15k4onPPQ2Q3m4
$$ plain form
2761 446 432 418 463 508 553 598 594 590 585 581 607 633 658 684 715 746 777 808 727 646 565 484 498 511 525 538 539 539 539 539 534 529 523 518 451 384 356 419 496 572 564
2756 564 555 522 489 455 422 433 443 453 463 476 489 502 515 496 477 549 620 581 541 502 462 476 489 503 516 494 472 540 609 570 531 491 452 428 404
2752 404 380 356 396 436 477 517 532 547 561 576 572 568 564 560 546 531 465 490 545 600 655 710 729 658 547 436 481 527 573 618 658 698 699 608 601 594 581
2748 581 568 552 536 519 503 513 524 534 544 585 627 668 710 664 619 573 528 555 583 611 639 618 597 621 645 609 572 581 590 595 601 606 611 609 608 606 604 588 572 481
2743 481 389 407 426 444 462 471 480 489 497 537 577 542 506 473 441 453 466 491 516 496 476 535 594 547 501 479 457 481 504 540 576 612 648 664 680 741 803
2738 803 817 831 846 860 866 872 833 793 788 783 777 772 734 697 705 712 791 869 888 830 795 805 814 779 720 736 781 780 718 701 761 822 814 806 844 882 858 835 811 787 783
2733 783 778 819 859 818 776 735 694 712 730 748 766 773 780 785 790 762 689 645 676 720 763 767 770 734 699 709 718 748 778 808 838 888 938 913 887 920 954 912 826
2728 826 784 834 883 842 767 738 813 933 967 910 837 808 801 794 739 775 860 946 931 917 933 949 893 836 796 801 792 692 577 553 547 542 549 556 638 721 677
2724F77m4m4m4L1L2j3n8m9M1Q6M0k9p5l2J3K4K4K7K7m5m5m4m5N2N2PPK1K0Ol9o5K5P7P7l9
2719F56l9l9l9llm8m9mmM1M2Q1Q1N7l4o7o7KLN7N7N7N7J2J3J2J3k2k1k2k1k2k1j9j8K4P0R8
2715H71Ql5J0Q5Q5J2J2l8N1J17J17J23J23J15J16O5J56L48L49L54L54L92L93K87J97J15K5
2712D807j17k68l12l12l21l21l38l38l33l32k06j15j65j66KLKKo9o9o9p0k3k4p5J6P6P6p0
2708H71o9MMMNrrM7m3p7J4m3m3J9J8J9J9L0L0L0L0k6k7k7k6qqpqJ2J1J2J2%J%%M5M6M5M5m2
2703I01m1m2m2K2K2K2K2k7k7k7k7K7K7K7K8l0k9l0k9J3J4J3J4nonnOPOPk0k0k0k0NMNNL8L9
2698H22L8L9kkkkn1n1n1n1J%JJj8j9j8j8J7J7J7J7K9K9K8K9p9p8p8p9JJJKM4M5M5M4j2j2j2
2693F33j1L2L2L2L2L3L2L2L2j3j3j3j3N9N8N9N9N2N3N3N2N3N3N2N3r3r2r3r2p4p3p4p4m8m9
$$ plain form
2724 677 633 589 545 576 608 595 537 488 529 615 655 626 551 519 532 556 580 607 634 589 544 500 455 507 559 566 573 594 614 620 581 516 541 618 695 656
2719 656 617 578 539 536 533 485 436 432 428 469 511 592 673 730 696 629 562 564 567 624 681 738 795 807 820 832 845 823 802 780 759 737 716 697 679 703 773 871
2715 871 879 844 854 939 1024 1036 1048 1010 1061 1178 1295 1418 1541 1656 1772 1837 1993 2341 2690 3044 3398 3790 4183 4470 4667 4782 4807
2712 4807 4690 4422 4110 3798 3477 3156 2818 2480 2147 1815 1609 1494 1329 1163 1165 1168 1170 1172 1103 1034 965 895 872 848 773 789 865 941 871
2708 871 802 806 810 814 819 810 801 848 805 728 742 699 656 675 693 712 731 761 791 821 851 825 798 771 745 737 729 722 714 726 737 749 761 761 762 762 762 807 853 898 943 901
2703 901 860 818 776 798 820 842 864 837 810 783 756 783 810 837 865 835 806 776 747 760 774 787 801 796 790 785 780 786 793 799 806 786 766 746 726 731 735 740 745 783 822
2698 822 860 899 897 895 893 891 840 789 738 687 688 688 689 690 672 653 635 617 634 651 668 685 714 743 771 800 721 643 565 486 487 488 489 491 535 580 625 669 657 645 633
2693 633 622 654 686 718 750 783 815 847 879 866 853 840 827 886 944 1003 1062 1114 1167 1220 1272 1325 1378 1430 1483 1390 1298 1205 1113 1039 966 892 818 770 721
2689G21m9m9k2k3k2k3poppO5O5O5O5J08J08J08J08K8K9K9K8o0o0o0o0l3l4l4l3j1j0j1j0k9
2684H67l0k9k9%JJJK2K3J8J8K6m9j04o0M4Q9Po8r1j5J3J2L8L7L8L7m9m8K7K6L3L3K9L0m8r3
2680G57k6Q0R1J6p2p1l2l2J1J0mn0o7RN3N3N8N8l5l6l5l6M3M2o3o3K8K8j7j7l3l3P3P3non1
2675F99n1J1J0J0J0LLKLn7n8M9M8O1O1O0O1l2l2l2l3K0K0L5Q0N2k4p9l4J8J8k5k5%%j%MMm1
2670H18m1q0q0J0Q6J21P6K5j9l8l7NNK9L0K9L0l2l2l2l2K9K8j9N6R3Mp7p7K8K7K8K8j4j3j4
2666I48j4K0K1K0K0m5m5m5m5k7k6k6k7QQQPN7N7N7N6k5k6k6k5ppppk8k9k8k9ONONJ11J11O5
2661A052J56L15M05L83L37L01K56J67J6m5m5p5j67j94j50p3k7l8q3q1l5MLj00r9p9p9p5p6
2657A874J8O3K0p2j23l3M9R3R0M4qn3n6n5J8J7P3P3K7K8JJkkm7r2j18k8O4O3poK1K1K2K1L3
$$ plain form
2689 721 672 623 601 578 556 533 526 520 513 506 571 636 701 766 874 982 1090 1198 1226 1255 1284 1312 1252 1192 1132 1072 1039 1005 971 938 927 917 906 896 867
2684 867 837 808 779 779 780 781 782 804 827 845 863 889 840 736 676 720 809 816 748 657 642 655 667 705 742 780 817 768 720 747 773 806 839 868 898 850 757
2680 757 731 811 902 918 846 775 743 711 722 732 728 678 611 620 673 726 784 842 807 771 736 700 743 785 722 659 687 715 698 681 648 615 688 761 756 750 699
2675 699 648 659 669 679 689 692 695 697 700 643 585 634 682 743 804 864 925 893 861 829 796 816 836 871 951 1003 979 900 866 884 902 877 852 852 852 851 851 855 859 818
2670 818 777 697 617 627 713 834 910 935 916 878 841 846 851 880 910 939 969 937 905 873 841 870 898 879 935 1028 1032 955 878 906 933 961 989 975 962 948
2666 948 934 954 975 995 1015 970 925 880 835 808 782 756 729 737 745 753 760 817 874 931 987 962 936 910 885 878 871 864 857 829 800 772 743 749 754 760 765 876 987 1052
2661 1052 1208 1523 1928 2311 2648 2949 3205 3372 3388 3343 3298 3223 3056 2862 2712 2639 2612 2574 2491 2410 2375 2379 2382 2282 2183 2104 2025 1950 1874
2657 1874 1892 1955 1975 1903 1780 1747 1796 1889 1979 2023 2015 1962 1906 1851 1869 1886 1959 2032 2059 2087 2088 2089 2087 2085 2038 1946 1828 1800 1864 1927 1920 1914 1935 1956 1978 1999 2032
2653B032L2m0m0jM4O9k1n6n6J4J3P8P8P8P8J5J4r1r1K9K8M0n1m8M2O1O2O1O1O1O1M7M7M7M7
2649B744K4K4K3K4K6K6J01J01j5j5L0L1K8K9K8K8R5R5J46N6k6k6l2l1N5N5N5N5J04J04J05
2645D047J04J33J34J34J33J11J11K17K17K07K07J32J31J34J33K04K03K27J36J12J11J63J62
2642G603K38K39K97K97K28K27K75L65M26M26M75N66O51O51O96O97P71P72Q26Q25Q56R46J118
2639B0471J209J349J499J771J982K139K229K245K245K108J958J908J907J921K012K253K706
2637E3912L292L866M558N433O529P767R256J1159J3686J6980K1237K6707L3810M2845N3850
2635C14887O6328P9000Q9485R4523R0988P7342N4227K4408q437m0328o7311q6218r5372r5324
2634D98198q8102p6609o3585n1119m0270l1379k4339j8904j4885j1909r582p766o345n190
$$ plain form
2653 2032 2064 2024 1984 1983 2027 2096 2075 2019 1963 1977 1990 2068 2146 2224 2302 2317 2331 2240 2149 2178 2206 2246 2195 2147 2189 2250 2312 2373 2434 2495 2556 2603 2650 2697 2744
2649 2744 2768 2792 2815 2839 2865 2891 2992 3093 3078 3063 3093 3124 3152 3181 3209 3237 3332 3427 3573 3629 3603 3577 3545 3514 3569 3624 3679 3734 3838 3942 4047
2645 4047 4151 4284 4418 4552 4685 4796 4907 5124 5341 5548 5755 5887 6018 6152 6285 6489 6692 6919 7055 7167 7278 7441 7603
2642 7603 7841 8080 8377 8674 8902 9129 9404 9769 10195 10621 11096 11662 12313 12964 13660 14357 15128 15900 16726 17551 18407 19353 20471
2639 20471 21680 23029 24528 26299 28281 30420 32649 34894 37139 39247 41205 43113 45020 46941 48953 51206 53912
2637 53912 57204 61070 65628 71061 77590 85357 94613 105772 119458 136438 157675 184382 218192 261037 314887
2635 314887 381215 460215 549700 644223 735211 812553 866780 891188 882751 842423 775112 688894 593522 498198
2634 498198 410096 333487 269902 218783 178513 147134 122795 103891 89006 77097 67515 59749 53404 48214
2632D8214m193l384k690k159j766j505j355j336j426j599j749j792j792j792j792j651j500
2630A4733j336j245j034q23o10n19m29m30l79l78l81l80k75k75k90k91k45k46k10k11j65j65
2627D416j59j59j59j58j96j96j50j51j67j67r1r2n4n5n4n5m2m3L3L4NMm0m0m2m2m1m2p1p1
2623A955p1p0l3l3l3l3k8k8k9k8j05j06l0l0o7o8L8L8j4j5j4j4K6K6K6K7qqqrqqqqj8j8j8
2619A168j9k2k2N1N1k2o8k0P0P5K8p0p0l5N7Q1Q0l0l1p6p6p3p3k7k8p2p2p2p2j1j2L4L4k6
2615F30k6K0J9m4m4JJL8L8qpk7k6k6k7j7j8K7K8j9j8K1K1Rq2q1RL6L6l3l4p8p8l3l2K8K8m7
2610A85m7q0p8j55j55j56j56k02k02k69k70j79q8PR8J38K28L09L09L08L09L05K15R4KL0P6
2607E76P0K4rqj2j2k8k7M8M7J%%%m2m3PR8P5j5l4l3K0K1J6J5j5j05j05j4M6M6N1N2k0j9k0
$$ plain form
2632 48214 44021 40637 37947 35788 34022 32517 31162 29826 28400 26801 25052 23260 21468 19676 17884 16233 14733
2630 14733 13397 12152 11118 10295 9685 9166 8737 8307 7928 7550 7169 6789 6514 6239 5949 5658 5413 5167 4957 4746 4581 4416
2627 4416 4257 4098 3939 3781 3585 3389 3239 3088 2921 2754 2663 2571 2517 2462 2408 2353 2311 2268 2301 2335 2340 2344 2304 2264 2222 2180 2139 2097 2026 1955
2623 1955 1884 1814 1781 1748 1715 1682 1654 1626 1597 1569 1464 1358 1328 1298 1231 1163 1201 1239 1225 1210 1196 1182 1208 1234 1260 1287 1279 1271 1263 1254 1246 1238 1230 1222 1204 1186 1168
2619 1168 1149 1127 1105 1156 1207 1185 1117 1097 1167 1242 1270 1200 1130 1095 1152 1233 1313 1283 1252 1176 1100 1027 954 927 899 827 755 683 611 600 588 622 656 630
2615 630 604 624 643 599 555 556 557 595 633 625 618 591 565 539 512 495 477 504 532 513 495 516 537 546 464 383 392 428 464 431 397 319 241 208 176 204 232 185
2610 185 138 58 -20 -175 -330 -486 -642 -844 -1046 -1315 -1585 -1764 -1852 -1845 -1747 -1609 -1381 -1072 -763 -455 -146 159 374 468 470 500 576
2607 576 646 670 661 653 641 629 601 574 622 669 670 670 670 670 628 585 592 690 765 750 716 683 703 724 740 755 740 635 530 516 562 608 659 711 691 672 652
2602F52j9L7L7rqRRl7l6M5M6LLj9K6N2l9p7p7poPPN3N2K4K3k2k2rrrj0j6j5K9L0k9k9J7J7
2597F74j7j8j7j7LMLML7L8L7L8k1k1k1k1m6m6RJ00J47J47P7P8j1j1j1j0j0j0q5q5l2l1l2l1
2593G92O4O4O6O7J04J50J00Rp2p2p8p8p8p9l4l3k4k5K1K1J0J0RJ0J9J8J8J9M8M9LMj8j7N9
2589A126N8L2L2L2L1L0L0L0L0J36J36O0O0O8O9J73J74J18J19J18J18J78J78K63L53M06M05
2585D563M79O30P92J064J403J918K446K960L209K997K234R34m82j539k008j917j347n92J81
2583A7925Q15J191J342J401J400J577J666J562R26k37j656k851l545l647l376k863k290j674
2581G666j221q88o77n05l54k74k74k10j19o8o8j03j02KR2J17J17J49J49K39L30L66M57M57
2578E278M57M89M88M85L34P1j41k82k83k40j51k0P1J61K52M12N02M77M76M36K86Ll90o28p79
$$ plain form
2602 652 633 670 707 698 690 699 708 671 635 680 726 729 732 713 739 791 752 675 598 591 585 592 599 652 704 728 751 729 707 698 689 680 670 654 639 668 698 669 640 657 674
2597 674 657 639 622 605 608 612 615 619 656 694 731 769 748 727 706 685 639 593 602 702 849 996 1073 1151 1140 1129 1118 1108 1098 1088 1003 918 886 855 823 792
2593 792 856 920 986 1053 1157 1307 1407 1416 1344 1272 1194 1116 1038 959 925 892 868 843 864 885 895 905 914 924 943 961 979 998 1046 1095 1098 1102 1084 1067 1126
2589 1126 1184 1216 1248 1280 1311 1341 1371 1401 1431 1567 1703 1763 1823 1891 1960 2133 2307 2425 2544 2662 2780 2958 3136 3399 3752 4158 4563
2585 4563 5042 5672 6464 7528 8931 10849 13295 16255 19464 22461 24695 25629 25147 23608 21600 19683 18336 17744 17925
2583 17925 18740 19931 21273 22674 24074 25651 27317 28879 29805 29568 27912 25061 21516 17869 14493 11630 9340 7666
2581 7666 6445 5557 4880 4375 4021 3747 3473 3263 3144 3076 3008 2905 2803 2805 2897 3014 3131 3280 3429 3668 3998 4364 4821 5278
2578 5278 5735 6224 6712 7197 7531 7602 7461 7179 6896 6656 6505 6485 6556 6717 6969 7381 7883 8360 8836 9272 9558 9561 9171 8543 7764
2575G764q83r74r36p85n88m97m79l88k88j97j67j67o7o6k1k2n0n1n1n0J8J9j12j12m0N1K5
2572H86k0rrj1j2llM2M2rj0rj0popp%%%%k6k7k6k6K1K1K1K1ononRRQRJ0RN5N5kkkkj1j0j1
2566I19j0L6L7L6L7R6R6N0N1R1R1R6R7J02J92K56L00L30L76M38N28N53N53N53N53M91M01K17
2562G566Ok28l18l55l56l31l32k10j20k3O7J35K25K34J89J03m8j92k83l55m00m25m70m71m25
2559C183l60l14k54k09j78j33p5l0n8n8j0j0L2L3J17K08K56K57K16K17L26L26L21L20K44J53
2556D520K3o7j20k10l01l01l01l01k55k56k72k72k26k27j46j47m0m1LLMLRJ0J0J0m3m3m3m3
2552I40rrrqllklN1N1k4k4J9J9K0J9J4J5J5J4K4K3K4K4L5L5L5L5L7L8L7L8J01J02J02J02Q2
2548A957Q3Q3Q2J36J35J81J81J62J62K22L13L87M77N57P68R96J268J517J788K080K292K310
$$ plain form
2575 7764 6881 5907 4971 4186 3598 3101 2622 2234 1946 1749 1582 1415 1348 1282 1261 1239 1189 1138 1087 1037 1055 1074 962 850 810 861 886
2572 886 866 857 848 837 825 822 819 861 903 894 884 875 865 858 852 845 838 838 838 838 838 812 785 759 733 754 775 796 817 811 806 800 795 804 813 821 830 840 849 904 959 957 955 953 951 940 930 919
2566 919 909 945 982 1018 1055 1151 1247 1297 1348 1439 1530 1626 1723 1825 2017 2273 2573 2903 3279 3717 4245 4798 5351 5904 6457 6948 7349 7566
2562 7566 7572 7344 7026 6671 6315 5984 5652 5442 5322 5299 5366 5501 5726 5960 6149 6252 6204 6012 5729 5374 4974 4549 4079 3608 3183
2559 3183 2823 2509 2255 2046 1868 1735 1660 1630 1572 1514 1504 1494 1526 1559 1676 1884 2140 2397 2613 2830 3156 3482 3803 4123 4367 4520
2556 4520 4543 4476 4356 4146 3845 3544 3243 2942 2687 2431 2159 1887 1661 1434 1288 1141 1101 1060 1063 1066 1070 1073 1082 1092 1102 1112 1069 1026 983 940
2552 940 931 922 913 905 902 899 897 894 945 996 972 948 967 986 1006 1025 1039 1054 1069 1083 1107 1130 1154 1178 1213 1248 1283 1318 1355 1393 1430 1468 1569 1671 1773 1875 1957
2548 1957 2040 2123 2205 2341 2476 2657 2838 3000 3162 3384 3697 4084 4561 5118 5886 6882 8150 9667 11455 13535 15827 18137
2545A8137K159J768J134K77n99j193j525j611j522j184p32k85J07M46Q40J161J312J198R26
2543B0814M50j84r40j634k084k175k102j950j735j524j204r33p40n89m82l31k01j10j46j46
2540B054j40j41q7q8q7q8l1l1l1l1k9k9k9k9m8m7m8m8l6l5l6l6K7K7n3j43p2J9O1k9o4j8K6
2536F30K7ppopN5N4k1k1l5l6J0J0oon2n2k0k1k0k1LLMLononk0j9k0j9jjm6m6n2n1K3K4J6J6
2531B43J5J6k1k1k1k1Q7Q7Q7Q6M1M1M0M1kkp2p2j4P7P6j4k4k4l0k9K7K7K7K7m9n0m4m5l7N3
2527E06N3l8n8n7M2M2rrL6L7J8J9J8J9l5l6l5l5L0L1L0L1j9j9j8j9j4j4j4j4M6M5M6M5klp2
2522E74p3k4O7J16P1j3j3j7j6o5o5J0J0j8j9j8j9NONNJ2J3J2J3k4k5k4k5k7k8M8M7j7j7K5
2518D92K5l4p9o2K9K4k0m3M7M6JJM6J02J1m1m1J3J3J2J3onnoJ4J4J5J4ppn2n2K9K8j6o2k1
$$ plain form
2545 18137 20296 22064 23198 23475 22876 21683 20158 18547 17025 15841 15109 14824 14931 15377 16217 17378 18690 19888 20814
2543 20814 21264 21080 20140 18506 16422 14247 12145 10195 8460 6936 5732 4799 4059 3470 2988 2657 2456 2346 2200 2054
2540 2054 1914 1773 1686 1598 1511 1423 1392 1361 1330 1299 1270 1241 1212 1183 1135 1088 1040 992 956 921 885 849 876 903 850 707 635 654 715 686 622 604 630
2536 630 657 650 643 637 630 685 739 718 697 662 626 636 646 640 634 582 530 510 489 469 448 451 454 458 461 455 450 444 439 419 400 380 361 360 359 313 267 215 164 187 211 227 243
2531 243 258 274 253 232 211 190 277 364 451 537 578 619 659 700 698 696 624 552 538 615 691 677 653 629 599 570 597 624 651 678 629 579 535 490 453 506
2527 506 559 521 463 406 448 490 481 472 508 545 563 582 600 619 584 548 513 478 508 539 569 600 581 562 544 525 511 497 483 469 515 560 606 651 649 646 574
2522 574 501 477 544 660 731 718 705 688 672 607 542 552 562 544 525 507 488 493 499 504 509 521 534 546 559 535 510 486 461 434 406 454 501 484 467 492
2518 492 517 483 404 342 371 395 375 332 379 425 426 427 473 575 586 545 504 517 530 542 555 549 544 539 533 547 561 576 590 583 576 524 472 501 529 513 451 430
2513D30O8P2j9p4J7O3J9mM1O4k7j00j00L0L0j9k0K5K6M2M3l3l3o9o9L4L4l9q5l0M7N3Ppqk6
2509C83k6k4N2Q8Q8Kp4q3l8L9Q5N0Mm2m3ppO6O6rn5%P7Q9M3kkn9n9l0M7M9NON2Q4L8l9l9l6
2504G39l5p7p6l1M5K7j8m7m6n0n0qqqqN2N3N2N2j2j1j2j2j8j7j8j7poooJ2J3J2J3m8m8K7K8
2499D25M9M9n7n7QQPQM2M2M2M3n3n2n2n2J0J1PQmm9k4N2O2J6k9k9j2j2L3L3k2k2k2k2l8l8
2494C09l8l8J7J7J7J7n5n4L6L5R3R3j0q7j26n0Q3J29Q7J1J1J1j9j9k0j9QPQPJ0J1k0K5J9n7
2490D49n7J9O5K1NON5N6l4l5K8K8j8j8j5j4j5j5O1O0J6o0o9k3L8L7k9l0k9l0n8n8L3L3klk
2485C96kM1M2mmm1m1N0N0k5k4k5k5O9O9K3K3o0o1L0K9LKLKj3j4j4j3lkkkppopk6k6J9J9N4
2480D70N4l6l6o3o3K8K8K0K0k5k5K6K7K7K6L6L5n6n5N2N2N2N2l6l6l6l6K8K8K8K8k9k9k9k9
$$ plain form
2513 430 498 570 551 477 494 557 576 572 613 677 650 550 450 480 510 491 471 496 522 564 607 574 541 472 403 437 471 432 347 317 364 417 424 417 409 383
2509 383 357 333 385 473 561 563 489 406 368 407 492 542 546 504 461 454 447 513 579 570 515 515 592 681 724 722 720 661 602 572 619 668 673 679 731 815 853 814 775 739
2504 739 704 627 551 520 565 592 574 527 481 431 381 373 365 357 349 401 454 506 558 546 535 523 511 493 476 458 441 434 428 422 416 428 441 453 466 418 370 397 425
2499 425 474 523 466 409 417 425 432 440 482 524 566 609 556 504 452 400 410 421 428 436 432 383 359 411 473 489 460 431 419 407 440 473 451 429 407 385 347 309
2494 309 271 233 250 267 284 301 246 192 228 263 356 449 439 352 226 176 259 388 475 486 497 508 489 470 450 431 439 446 454 461 471 482 462 487 506 449
2490 449 392 411 476 497 502 508 563 619 585 550 578 606 588 570 555 541 526 511 572 632 648 588 519 496 534 571 542 512 483 453 395 337 370 403 401 398 396
2485 396 394 435 477 473 469 428 387 437 487 462 438 413 388 457 526 549 572 512 451 481 510 513 515 518 520 507 493 479 466 463 461 459 457 450 443 437 430 404 378 397 416 470
2480 470 524 488 452 389 326 354 382 402 422 397 372 398 425 452 478 514 549 493 438 490 542 594 646 610 574 538 502 530 558 586 614 585 556 527 498
2476D98lkllnoooO3O2k8k9r4r4lmL5L4L5L4qqpqn7n7n7n6K0K0K0K0L1L2L1L2K1K1K1K0j3j3
2471D80j3j3m5m4m5m5N8N7N7N7k3k3k3k3mmmmK1K2K1K2J0J0J0J0nnmnK2K2K1K2m6m6m7m6J2
2466D17J3J2J2M9M9m1m2n4n5n5n5J9J9J8J9J4J4J4J4N0N0k5k6MMP4P5L8l7r4m7M5R1M9LJ9
2462F54J9J6J6n6n5n6n6K8K7m3m4jP3P4kn3n3J8J7N0N0MNllllj3j2q8q8K1K2K2K2k4k4k2k1
2457D15jM5O1j4o5o5L7L6M0M0nnn6n5j0j0J3J3J3J3J2J1J1J1L9M0l6l6q7q6m1m0Q1Q1L6L6
2453D72qpqpK1K2K2K2k5k6K0K0m9n0K6K6P6P6L1L1p1p1p0p1J3J3J3J4j3j2j2j2L1L0m5m5o
2448C71oopK6K6K6K6K3K2k3o8l4M1O7K2p0p0k7k7K9K9L0K9k2k2k0j9J1N7P4jm9m8K2K2k1k0
2444C93k1k0j4j5j4j5lllmL0L0L0L0m1m2m2m2RRRRRRRRl0k9l0l0J9K0J9J9m3m3m4m3J3J2J2
$$ plain form
2476 498 495 493 490 487 482 476 470 464 527 589 561 532 438 344 341 337 372 406 441 475 467 459 452 444 387 330 273 217 237 257 277 297 328 360 391 423 444 465 486 506 493 480
2471 480 467 454 409 365 320 275 333 390 447 504 481 458 435 412 408 404 400 396 417 439 460 482 492 502 512 522 517 512 508 503 525 547 568 590 544 498 451 405 417
2466 417 430 442 454 503 552 511 469 415 360 305 250 269 288 306 325 339 353 367 381 431 481 456 430 434 438 512 587 625 588 494 447 492 583 632 635 654
2462 654 673 689 705 649 594 538 482 510 537 494 450 449 522 596 594 541 488 506 523 573 623 627 632 629 626 623 620 607 595 507 419 440 462 484 506 482 458 436 415
2457 415 414 459 520 506 441 376 413 449 489 529 524 519 463 408 398 388 401 414 427 440 452 463 474 485 524 564 528 492 405 319 278 238 319 400 436 472
2453 472 464 457 449 442 463 485 507 529 504 478 498 518 469 419 445 471 547 623 654 685 614 543 473 402 415 428 441 455 442 430 418 406 437 467 422 377 371
2448 371 365 359 352 378 404 430 456 479 501 478 410 376 417 484 506 436 366 339 312 341 370 400 429 407 385 365 346 357 414 488 487 438 390 412 434 413 393
2444 393 372 352 338 323 309 294 291 288 285 281 311 341 371 401 360 318 276 234 243 252 261 270 279 288 297 306 276 247 217 187 206 226 245 264 221 178 134 91 104 116 128
2438A28J3k7k7P9P9RJ0N5N6N7N7J1J2KJJKL9M0l1l2nP0R8N2J4J3l4l5m8m8lll0l1J5J5qqq
2434E50qL1L1L0L1o1o1J4J5j8j8k1k1L4j2l1M4P2K7m9m8mlmlk0j9j9k0k1k1K4K4k2k1N3N4
2429E09K1K1k5k4j5j4j4j4K2K3p9p8l1M5J08J08P2P2l3l4k5k5k4k5l5l6M1M0L6L5rj0rqq0
2425E06p9l3M3M6k9k1K4ool9l9OPl6l5M0M1JKKKL3L2m2m3%jp5p6j4j4L2L2M6M6n9o0kjkkM4
2420B71M5l1l1LLj2n7o4J2J1J2J1J2J1J2n2n1K3K4m5m5m5m4RJ0QJ0n4n4n5n5J2J3J2J2J8J7
2415a24jr1r3jj3j3n4n5rrq5q6%R0P5P5N7l5j06j06l2N8J12K0k8k9m9m8mlL3L3m2m2l5l5l5
2411g10l4J7J7J7J7N2N2N2N3K0K0O5O6J02J03llJ02J04N8N9K0K1K1K1N2N1N2N2J7J6J6J7K3
2406F05K3K3K3M6M7k9k9l6l5J0RnnM1M0n4n4rqK9K9O8O9K3o7o2o1k2k1K3K4P9P8N4l7l7l8
$$ plain form
2438 128 141 114 87 166 245 254 264 319 375 432 489 500 512 514 515 516 518 557 597 566 534 529 599 697 749 763 776 742 707 659 611 608 605 575 544 559 574 566 558 550
2434 550 542 573 604 634 665 604 543 557 572 554 536 515 494 528 516 485 529 601 628 579 531 527 524 520 517 497 478 459 439 418 397 421 445 423 402 455 509
2429 509 530 551 526 502 487 473 459 445 467 490 411 333 302 347 455 563 635 707 674 640 615 590 566 541 506 470 511 551 587 622 613 603 594 586 506
2425 506 427 394 437 483 454 433 457 451 445 406 367 373 380 344 309 349 390 391 393 395 397 430 462 420 377 377 376 301 225 211 197 229 261 307 353 294 234 232 231 229 227 271
2420 271 316 285 254 257 260 248 191 127 139 150 162 173 185 196 208 156 105 128 152 107 62 17 -27 -18 -8 0 10 -44 -98 -153 -208 -196 -183 -171 -159 -141 -124
2415 -124 -125 -216 -309 -310 -323 -336 -390 -445 -454 -463 -548 -634 -634 -544 -469 -394 -337 -372 -478 -584 -616 -558 -446 -426 -454 -483 -532 -580 -584 -587 -554 -521 -563 -605 -640 -675 -710
2411 -710 -744 -727 -710 -693 -676 -624 -572 -520 -467 -447 -427 -362 -296 -194 -91 -94 -97 5 109 167 226 246 267 288 309 361 412 464 516 533 549 565 582 605
2406 605 628 651 674 720 767 738 709 673 638 648 657 652 647 688 728 674 620 611 603 632 661 729 798 821 754 692 631 609 588 611 635 714 792 846 809 772 734
2402G34L2L2j5j6j5j5k0k0k1k0N6N7j9k0k5k6k6k5K6K6K7K6l1l0l1l0k0j9j9j9L0L1L1L1J1
2398F68J2J2J2k1k2k1k2L6L5L5L5%%%jk6k7k2k2pO7O8pr7r6NMm3m4KKM1M2Q2Q2M3l2l6l5L
2393G05Km2m3j3j3j3j3L1L0L0L1k6k5N0N0opL9L9kjkkl3l3l6l5J2l3n3K2M8Lr9r8o0J5J9J8
2388D56JJKJk7k6j28j27m2L4J9k5l5J0j8j8j0rL5L6l5l6M1M0R2R2J7J6QQQPl9l9L6L6j5j5
2383C52j5j4K3K4K4K4j1j2j1j1l7l7O9O9K4K5K4K5j5j5j5j6j04j04NR6J04J4l1J5L8L9L6L5
2379F17O5k5n1n0K5K4k0k1%%%%KJKJJ3J3J3J3m5m4m5m4N0N0N0N0LLMLl8l8PPKJp5p4%%P6P5
2374F00oooorrn4n4l3l4P2J16R6Om7m6k9k8k9k8K6K6K6K7l7l7L8L9j5j6j5j5j9j8o9K1M7M8
2369E23QQM2M2l3l3k0j9K6K7LLMLl5l6l5l5J6J7J6J6NNNOJ0J1J1J1j5j6j5j6OONOk1k0k1k1
$$ plain form
2402 734 766 798 783 767 752 737 717 697 676 656 712 769 750 730 705 679 653 628 654 680 707 733 702 672 641 611 591 572 553 534 564 595 626 657 668
2398 668 680 692 704 683 661 640 618 654 689 724 759 759 759 759 758 732 705 683 661 654 721 789 782 685 589 594 598 555 511 513 515 556 598 680 762 805 773 737 702 705
2393 705 707 665 622 609 596 583 570 601 631 661 692 666 641 691 741 735 728 767 806 804 803 801 799 766 733 697 662 674 641 588 610 658 661 562 464 404 419 438 456
2388 456 457 458 460 461 434 408 280 153 111 145 164 139 104 114 96 78 68 59 94 130 95 59 100 140 232 324 341 357 365 373 381 388 349 310 346 382 367 352
2383 352 337 323 346 370 394 418 407 395 384 373 336 299 368 437 461 486 510 535 520 505 490 474 370 266 271 367 471 485 454 469 507 546 582 617
2379 617 682 657 606 556 581 605 585 564 564 564 564 564 566 567 569 570 583 596 609 622 577 533 488 444 494 544 594 644 647 650 654 657 619 581 588 595 597 598 523 449 449 449 525 600
2374 600 594 588 582 576 567 558 504 450 417 383 455 571 667 673 626 580 551 523 494 466 492 518 544 571 534 497 535 574 559 543 528 513 494 476 407 428 475 523
2369 523 531 539 581 623 590 557 537 518 544 571 574 577 581 584 549 513 478 443 459 476 492 508 513 518 523 529 539 550 561 572 557 541 526 510 516 522 527 533 512 492 471 450
2364D50J5J4J5J4K6K6K6K6j8j8j8j8p6p7q2QR1R1K0K1l0l0J5J5L5L5o5o5l9N1P6P6j1j1j2
2360E76j1oopoK8K9K9K8L3L4L3L3m8m7K7K8o4o4j8j9MMM9N0qpqpl5l5q5ML8L8M4M4J1J1l5
2355F59l4o0n9P3P3J1l4L7J27P4p7q8m3j7j7j4j5QPQPj9k0j9k0J4J5J4J5K5K6K6K6POPPLM
2350G43LLk4k3k3k3MMMMk3k2k2k3K6K7K6K6PPPQj5j6j5j5k2k2k1k2P4P4l1l2rqrrQRl4l4L9
2345F06Q5L8n3n1oRQQPQPl9m0m0l9N7N8N8N7K8K7m8m8l2l2k6k6rQ1Q1rm4m4K5K6j2j2j2j2
2340F40J1J2QRK2k3n2M0O7K2n2n3K0K0k5k5q3q3qpK9L0L0K9NMm1m2N6N6k0o5n8J7P8P7J8J9
2335F82J8J8M3M4l2l2K6K6m9n0M0M0nnm2m2m2m2J5J5J4J5o7o7k1k2M9M8M8M9L9L9o1o2j1O5
2331F81M8Lj7j6K6K6J5J6l0k9p8p9K8P2J9n8n7J8O4K0q2q2j2O4M7JJ6J5J3J3l2l2l1l2KKm3
$$ plain form
2364 450 465 479 494 508 534 560 586 612 594 576 558 540 464 387 305 313 404 495 515 536 506 476 491 506 541 576 511 446 407 458 534 610 599 588 576
2360 576 565 559 553 546 540 568 597 626 654 687 721 754 787 739 692 719 747 683 619 601 582 586 590 639 689 681 674 666 659 624 589 504 508 546 584 628 672 683 694 659
2355 659 625 565 506 579 652 663 629 666 793 867 790 702 659 642 625 611 596 604 611 619 626 607 587 568 548 562 577 591 606 631 657 683 709 716 722 729 736 739 743
2350 743 746 749 725 702 679 656 660 664 668 672 649 627 605 582 608 635 661 687 694 701 708 716 701 685 670 655 633 611 590 568 642 716 685 653 644 636 627 618 626 635 601 567 606
2345 606 691 729 676 625 619 628 636 644 651 659 666 627 587 547 508 565 623 681 738 766 793 745 697 665 633 607 581 572 653 734 725 681 637 662 688 676 664 652 640
2340 640 651 663 671 680 702 679 627 667 734 756 704 651 671 691 666 641 558 475 467 460 489 519 549 578 583 587 546 504 560 616 596 531 473 490 568 645 663 682
2335 682 700 718 761 805 773 741 767 793 744 694 734 774 769 764 722 680 638 596 611 626 640 655 588 521 500 478 527 575 623 672 711 750 689 627 616 681
2331 681 729 732 715 699 725 751 766 782 752 723 645 566 594 666 685 627 570 588 652 672 590 508 496 560 607 608 624 639 652 665 633 601 570 538 540 542 499
2326D99m3K1K2K1K1mlP2P2L9L9ooKLp3p3%JLMk0K5M5l0n0nM0M1k3k3K3K2k4k4K1O6N3l8n9
2322F51o0oppoM2M3M2M3mmmmL0K9m6m7k7k7k8k7L1L2J2p8n9L1J06O1n2n3K0K0MMMNP2P2K1
2317H29p0p2k7J8J8J2J3l3l3l1l1M5M4k7k7J8J8M1M1o5o5l0l1J6J5J7J7J7J8k6k5k5k5oop
2312E35oK2K2K3K2J5J6J5J6%%P5P6l9l9l9l8jjjjN8N9J3J3j9j8j9j9n5n6j0j0m2m2MLP6P5
2308F83L0L0j8j8o4o3kkM3M3nmnnL9M0oop6p5j%N9O0J3J4k9l0k9l0J7J7J6J7RQQRM5M5%%l2
2302G45l3p4JR0R1Mp1r8n3K2K3K2K1n4n4l3l3J1J2P0O9J0o7n7j2O3O4O2O3m4m3j7j6K8K9m
2298G37mlmk7k7k8k7l6l5L9M0J0J1J0J0k0k0k0k0LKJ04J04N5k0k3k2J9J9J8J9mnL8L8n5r9
2293G77m1L4L9L9jkm2m2m3m2J2J1J2J1o4o4o4o4k3k4PQ3J19P4J4o2n6j1MNQRRRM2M2JJJ7R3
$$ plain form
2326 499 456 477 499 520 541 537 534 606 678 717 756 750 744 746 749 676 603 603 604 607 611 591 616 661 631 581 576 616 657 634 611 634 656 632 608 629 695 748 710 651
2322 651 591 585 578 571 565 607 650 692 735 731 727 723 719 749 778 732 685 658 631 603 576 607 639 651 573 514 545 651 712 660 607 627 647 651 655 659 664 736 808 829
2317 829 759 687 660 678 696 708 721 688 655 624 593 638 682 655 628 646 664 705 746 681 616 586 555 571 586 603 620 637 655 629 604 579 554 548 542 535
2312 535 529 551 573 596 618 633 649 664 680 680 680 755 831 792 753 714 676 675 674 673 672 730 789 802 815 796 778 759 740 685 629 619 609 567 525 529 532 608 683
2308 683 713 743 725 707 643 580 578 576 619 662 657 653 648 643 682 722 716 710 634 559 558 558 617 677 690 704 675 645 616 586 603 620 636 653 662 670 678 687 732 777 777 777 745
2302 745 712 638 639 729 820 824 753 655 602 624 647 669 690 636 582 549 516 527 539 609 678 688 621 564 552 615 679 741 804 760 717 700 684 712 741 737
2298 737 733 730 726 699 672 644 617 581 546 585 625 635 646 656 666 646 626 606 586 589 591 695 799 854 834 811 789 808 827 845 864 860 855 893 931 876 777
2293 777 736 770 809 848 847 845 803 761 718 676 688 699 711 722 658 594 530 466 443 419 426 509 628 702 716 654 598 587 591 596 604 613 622 631 673 715 716 717 734 827
2288H27J47J01k9j05j10l5l0p5p0k5K1K2k2k1PPOPK6K5K6K5n2n3pqRRQRj0j1j1j0J1J1J1J1
2284F42j6j6L0L0M6M5o0o0o9o9O7O7O0O1j6j5mnnmj7j7N8N9L8L9o7o7K1K1K1K0L0L0j6j6m6
2279H00m7m7m7J2J1J2J1n0m9n0n0J0RN5N5L0K9L0K9j1j1j1j2o0o1o0o0K5K6K6K5qqrqK3K3
2275E82K3K2j8j9K7K6M6M5K1p0l1l0J0Rk9k9J7J6j2j3L2L3K1K1K1K1J0J0J0J0n5n4K1K1mn
2270G06K0J11J04J04O4O3pqL2L2n3j43r8qj4j5n5n4o2o1l7N4O0N9O5O5J3J3J3J2k1k1k1k1
2266H91k5k4k4k5N7N7O3k9m5m5K4K5k1k1k1k0j8j8j8j8J3J4J3J3K6K6L1n9q8q9J2J2K4K5O5
2262G83O5Qq3q3QK9K8L4L4qqpqQPPQPPQPmmmmk3k2k3k3NNNNL7L7rql5l5P1P1j5j5j5j5j9j9
2256G95K7K6N1N0n6n5m4m3R3R3j0rrrNMNNj4j4j4j4LLLLj6j5j6j6K1K1K1K1o6o6o5o6L5L4
$$ plain form
2288 827 974 1075 1046 941 831 796 766 691 621 596 617 639 617 596 603 610 616 623 649 674 700 725 673 620 613 605 614 623 631 640 630 619 608 598 609 620 631 642
2284 642 626 610 640 670 716 761 701 641 572 503 570 637 697 758 742 727 723 718 713 709 692 675 733 792 830 869 802 735 756 777 798 818 848 878 862 846 800
2279 800 753 706 659 671 682 694 705 655 606 556 506 516 525 580 635 665 694 724 753 742 731 720 708 648 587 527 467 492 518 544 569 561 553 544 536 559 582
2275 582 605 627 609 590 617 643 689 734 755 685 654 624 634 643 614 585 602 618 606 593 625 658 679 700 721 742 752 762 772 782 727 673 694 715 711 706
2270 706 726 837 941 1045 1109 1172 1165 1157 1189 1221 1168 1025 927 919 905 890 835 781 719 658 621 675 735 794 859 924 937 950 963 975 954 933 912 891
2266 891 866 842 818 793 850 907 970 941 896 851 875 900 879 858 837 817 799 781 763 745 758 772 785 798 824 850 881 822 734 645 657 669 693 718 783
2262 783 848 856 773 690 698 727 755 789 823 815 807 800 792 800 807 814 822 829 836 844 851 847 843 839 835 812 790 767 744 749 754 759 764 801 838 829 821 786 751 822 893 878 863 848 833 814 795
2256 795 822 848 899 949 893 838 794 751 844 937 927 918 909 900 905 909 914 919 905 891 877 863 866 869 872 875 859 844 828 812 833 854 875 896 830 764 699 633 668 702
2251G02L5L5J%JJmmmlj6j5j5j5J5J6J6J5L4L5L4L5k6k6k7k6ONNNo8o8PQN4N5RJ0k7k7k7k8
2246G13llmlL2L3L2L2jkjkm3m3m3m2J3J4J4J4J5J5J5J6mmmlK2K3K3K3rqrqKLM8M8K2K3K2K3
2241A001k0j9n0n%r1r1%Km3o3K8R8R7kkJ3J3J3J2o2o3o2o3N9N9L4n7q3q2J6O1N6l5n6n7K6
2236E82K5K6K5p7p8L2J23O5k6o8K2J4l2J8J09O0l1j01j0K1K1K7K7M7M8jjJ2l5o2K8O8K3k1
2232H80k1K5K5n1n0J3J4J4J3j2j3j3j2M8M9k7k7j6j7j7j7N8N7j8j8m0m0ONL9L9ooK6K5j9k0
2228H76n5n6oQ4P3j9o5k1L2j4n5n5L8J28J25L5m0q5p4J7K5k0j7K8P2K6n1n1k3k4K2K2J7J6
2223I05J6J7l0k9k9l0L2L2K6K7L4n7p7l1MNPQk8k8k7k8K6K6n0m9J6J5J6J6P5P5%jK0J9n7n6
2219H10L0L0L1L0jkkkL6L5K9L0L5n4j05n9NOo7o7K0K0K0K1P3P4jkllm9m9L2L2p4p5L0L0L0
$$ plain form
2251 702 737 772 773 773 774 775 771 767 763 760 744 729 714 699 714 730 746 761 795 830 864 899 873 847 820 794 800 805 810 815 747 679 686 694 748 803 812 822 795 768 741 713
2246 713 710 707 703 700 732 765 797 829 828 826 825 823 780 737 694 652 665 679 693 707 722 737 752 768 764 760 756 753 775 798 821 844 835 827 818 810 812 815 863 911 933 956 978 1001
2241 1001 981 962 912 907 907 816 725 725 727 684 621 649 747 844 842 840 853 866 879 891 829 766 704 641 700 759 793 736 653 571 587 648 704 669 613 556 582
2236 582 607 633 658 581 503 535 658 723 697 629 651 665 633 651 760 820 789 688 678 699 720 747 774 821 869 868 867 879 844 782 810 878 901 880
2232 880 859 884 909 858 808 821 835 849 862 850 837 824 812 860 909 882 855 839 822 805 788 846 903 885 867 827 787 793 798 837 876 870 864 890 915 896 876
2228 876 821 765 759 843 916 897 832 811 843 829 774 719 757 885 1010 1045 1005 920 846 863 888 868 851 879 951 977 926 875 852 828 850 872 889 905
2223 905 921 938 908 879 850 820 852 884 910 937 971 914 837 806 810 815 822 830 802 774 747 719 745 771 721 672 688 703 719 735 810 885 885 884 904 923 866 810
2219 810 840 870 901 931 930 928 926 924 960 995 1024 1054 1089 1035 930 871 876 882 815 748 768 788 808 829 902 976 975 973 970 967 918 869 901 933 859 784 814 844 874
2214H74K9J17J17n0n0j3j3j3j4nmnnk9k9k9l0K2K2k3k4J01J00l6l5j1j0j0j0N7N7m8m8JKm4
2210I11m4J25J25j2j1j5j5o1o0J28J29o8j59JJ52P3p7n3pm2m3M1M1l5l4J18J19n1j42pQ4j8
2206A093o2O4J54J9p2Q4J29j2j02L0J22j5j05Q4J75j4j64j9J32O4J8J76J77q3j74J37K87L8
2202B161j13K03M14J60n0K99N11J97M6N93R26N05N05J731K727K775M800J1244J7681J5592
2200F2907L052j0914j6443j3124p896n169l870k189q90q14r65n11n8k34n05k30M1j24k76m9
2197A739J62j1k23k2J28k2k33j24Q8j0j01k2O9j03k53o1R0L1j19j4J37L5j17m1J10M6j05n7
2194I97R5M5m5LR5M7m4j8K7k7j18m5M5M8m2j7K9mr4NR6J7j33j29K3L6L5M2M2l9q3l7N4L8q
2190I36L7Q3J8p2p2J9N1PON1O1k9pL8K3o7k5O6P0k0l9l9j2j2L3P8M7m3k0K5qr9r8qQ5M0mm
$$ plain form
2214 874 903 1020 1137 1087 1037 1024 1011 998 984 979 975 970 965 936 907 878 848 870 892 869 845 946 1046 1010 975 964 954 944 934 991 1048 1000 952 953 955 911
2210 911 867 992 1117 1105 1094 1079 1064 1003 943 1071 1200 1132 973 974 1126 1199 1122 1069 1062 1020 977 1018 1059 1024 990 1108 1227 1176 1034 1027 1111 1093
2206 1093 1031 1095 1249 1268 1196 1280 1409 1397 1295 1325 1447 1432 1327 1411 1586 1572 1408 1389 1521 1585 1603 1779 1956 1873 1699 1836 2123 2161
2202 2161 2048 2251 2665 2825 2775 3074 3585 3782 3828 4421 5347 5852 6357 8088 10815 13590 18390 29634 47315 62907
2200 62907 65959 55045 38602 25478 17582 12413 8543 6354 5464 4650 3685 3174 3116 2882 2377 2147 2188 2064 1788 1739
2197 1739 1901 1890 1667 1645 1773 1751 1518 1394 1482 1472 1371 1349 1418 1315 1062 1001 1091 1122 1003 989 1126 1161 1044 1003 1113 1159 1054 997
2194 997 1092 1137 1092 1095 1190 1237 1193 1175 1202 1175 1057 1012 1057 1105 1063 1046 1075 1071 977 982 1078 1095 962 833 856 892 927 969 1011 972 889 852 906 944 936
2190 936 973 1056 1074 1002 930 949 1000 1007 1013 1064 1125 1096 1089 1127 1150 1083 1058 1124 1194 1174 1135 1096 1084 1072 1105 1183 1230 1187 1167 1192 1184 1085 987 979 1064 1104 1100 1096
2185A096MMJ9O4M6m5o1j7PORJ0OPOPMMMMkjkkl2l2l2l3qrL7L7K1K1K2K1kknnj8o3r1jRl7j1
2179I64Q0J21J22K1K1llllk4k4k4k5l8l8l8l9j7j7o3o3n9o0j5j4m9m9mlqpON3mr5r4mM9Lm3
2174E10m4m3q9m2M9J26Q0L5L6P4P3M3Q7P6j5j20p5K0O5lkL6L6L6L6RJ0RJ0J8J8N8N7K2o9m6
2170A081kJ1l5n2n2OPOPkkkkj0j1j1j1L3L4j2j2K1K1K1K1K2K2k3k3L4L4j1j1m6m5l0J5Oo9
2165I28o7QQ9Q9M8M9j9j8o4o3N0N1N0N1QRl7l7J2J3J2J2k2k2o7o7J0J0J0J1k1k2k1N5N0MN
2161A087N0P3jo3o2K8K7K8K7K3K4n3r7n0K6N2Ok1k2k5k4M5M5M3M2m6r1q1K6J19J19L2m4m6
2157A196m7n1n2K7K7K8K7J2J3QRK1n4q7q8K0J9J9K0k5k5K0K0PPl8l8%J%%L7L7r4r4k2N4L7
2152I51qj5j4j7j8J7J7J6J7rrpoQ1J26J43O7J0J1NOM7M7R2R3Q7Q8J2J1P2P1P2P1O1O0L1m6
$$ plain form
2185 1096 1100 1104 1123 1187 1233 1188 1127 1110 1117 1123 1132 1142 1148 1155 1161 1168 1172 1176 1180 1184 1182 1181 1179 1177 1145 1113 1081 1048 1040 1031 1068 1105 1126 1147 1169 1190 1188 1186 1181 1176 1158 1095 1004 1003 1012 975 964
2179 964 1044 1165 1287 1308 1329 1326 1323 1320 1317 1293 1269 1245 1220 1182 1144 1106 1067 1050 1033 970 907 848 788 773 759 710 661 657 654 646 639 645 698 694 599 505 501 550 553 510
2174 510 466 423 334 292 341 467 547 582 618 692 765 808 895 971 956 836 761 781 846 843 841 877 913 949 985 994 1004 1013 1023 1041 1059 1117 1174 1196 1127 1081
2170 1081 1079 1090 1055 1003 951 957 964 970 977 975 973 971 969 959 948 937 926 959 993 981 969 990 1011 1032 1053 1075 1097 1074 1051 1085 1119 1108 1097 1051 1006 976 991 997 928
2165 928 861 869 958 1047 1095 1144 1125 1107 1043 980 1030 1081 1131 1182 1190 1199 1162 1125 1137 1150 1162 1174 1152 1130 1063 996 1006 1016 1026 1037 1016 994 973 1028 1078 1082 1087
2161 1087 1137 1210 1209 1146 1084 1112 1139 1167 1194 1217 1241 1188 1091 1041 1067 1119 1125 1104 1082 1057 1033 1078 1123 1166 1208 1162 1071 990 1016 1135 1254 1286 1242 1196
2157 1196 1149 1098 1046 1073 1100 1128 1155 1167 1180 1188 1197 1218 1164 1077 989 1009 1028 1047 1067 1042 1017 1037 1057 1064 1071 1033 995 995 996 996 996 1033 1070 976 882 860 914 951
2152 951 943 928 914 897 879 896 913 929 946 937 928 921 915 996 1122 1265 1332 1342 1353 1358 1364 1411 1458 1550 1643 1730 1818 1830 1841 1913 1984 2056 2127 2188 2248 2279 2233
2147B233n1nL5j0k1k0N2N2OOp0o9m6m6m5m6M6M6J%o3o3mP1Q0Mq0q0KP7O1J5L1L2K8K9K7K7
2143B242K8K7J13J14N0k6m9m9r9j00k6k7J9J9K0K1K0K1l6l6l7l6L6L6j0j0o4o5l4M2R2M7l0
2139B213p6k6J9J6k9kjmnL3L3L2L3KKm3q8o8QL7rn5rL8L8NMm0m0m1m1L4L5qqpqqpL8L8M4M5
2133B124jjj03j04n1L9N9J4l1l1P6P7K7o4r9rM0M0k1k2K4K3ONp0o9K8K8K8K9nnm4m5l6N4P4
2129A984K9NOKKK1K2K1K1K5K5k0k1NMm1m1m0m0l5l4k1P0J20P5J4J4J2J1J8J9J8J8j1j1qqL4
2124B264P9O0l1m3m3m3m3l7N3J63J64R2Km4M7R5R6J9p1o2j7m5m5l0J7Jq8p4J7R2M6KKkjn4
2120B538n4N2N2popprrL5L6j3j3n9n8k8k7k3k2K2R7J40O5n1r6n5j0K6K7K9K9m7m7kkk0k0K6
2115B482K5j7j8j7j7l3l3K6J01J01K5mlMNm1m1K6K6K6K7M6M7KKj8j7K8K8PPOPkkkkk7k8k8
$$ plain form
2147 2233 2182 2177 2212 2202 2181 2161 2213 2265 2271 2277 2207 2138 2092 2046 2001 1955 2001 2047 2048 2048 1985 1922 1918 1989 2069 2073 1993 1913 1915 1992 2053 2068 2099 2131 2159 2188 2215 2242
2143 2242 2270 2297 2410 2524 2574 2548 2499 2450 2351 2251 2225 2198 2217 2236 2256 2277 2297 2318 2282 2246 2209 2173 2209 2245 2235 2225 2161 2096 2062 2104 2196 2243 2213
2139 2213 2137 2111 2130 2146 2117 2115 2114 2110 2105 2138 2171 2203 2236 2238 2240 2197 2109 2041 2049 2086 2077 2022 2013 2051 2089 2094 2098 2058 2018 1977 1936 1970 2005 1997 1989 1982 1974 1966 1959 1997 2035 2079 2124
2133 2124 2123 2122 2019 1915 1864 1903 1962 1976 1945 1914 1990 2067 2094 2030 1931 1922 1962 2002 1981 1959 1983 2006 2012 2017 1947 1878 1906 1934 1962 1991 1986 1981 1937 1892 1856 1910 1984
2129 1984 2013 2018 2024 2026 2028 2049 2071 2092 2113 2138 2163 2143 2122 2127 2131 2090 2049 2009 1969 1934 1900 1879 1949 2069 2144 2158 2172 2184 2195 2213 2232 2250 2268 2257 2246 2238 2230 2264
2124 2264 2343 2403 2372 2329 2286 2243 2200 2163 2216 2379 2543 2635 2637 2593 2640 2735 2831 2850 2779 2717 2700 2655 2610 2580 2597 2598 2510 2436 2453 2545 2591 2593 2595 2593 2592 2538
2120 2538 2484 2536 2588 2581 2575 2568 2561 2552 2543 2578 2614 2601 2588 2529 2471 2443 2416 2393 2371 2393 2490 2630 2695 2644 2548 2493 2483 2509 2536 2565 2594 2547 2500 2498 2496 2476 2456 2482
2115 2482 2507 2490 2472 2455 2438 2405 2372 2398 2499 2600 2625 2621 2618 2622 2627 2586 2545 2571 2597 2623 2650 2696 2743 2745 2747 2729 2712 2740 2768 2775 2782 2788 2795 2793 2791 2789 2787 2760 2732 2704
2110B704k8P1P2P1P1kkK8J04J53J07k4j31j15l9J7J8l6l5l6l5P0P0O8qp7p7q2q2J7J7O2O3
2106B974J3J3J3J3J0RK5P0N3k3m8lL5L6qpL0L0j6j5jjj%K7K8K8K7n4n4K2K1M9M9LMM1M1Qo8
2101C373q2q3LP9P9L4l7l7rO6R4M9k2k2L4J10R8K2l6l6Q8Q8M2M3L0L0J06J06R9R9J00R9J30
2097D737J30Q4Q4N0N0N0M9LLM8M8JKKKJ1J1J1J2o5o4L8L9l6q1k6N0O0J4jjpqpqJ6J5J6J5N3
2092E400N2k3k4L1L0L1L0J6J7O1O2N9N9J4J4m4m5JJP2P3lkL9M0M0L9J7J7k8k9j0rL6L5O3O2
2088F194O3O3o4o4l4M2Q1L6opN9J04P6%j8j7Q3Q3N7N8J2J3K9K9K8K9l5l5M0M0K3K2K3K3P9
2084G109Q0P9Q0L2L3P7P8K5K5K5K5PQO5J42J35N9J%J23J22O2j4MN0O4O5L7L6L7L7J7J8J8J8
2079H779J01J01N5N6L5L5L5L5M5M4R0R0R0R1M7M8N9J04J22M5jjL9L9N4N4N3N4K5K4J30J76
$$ plain form
2110 2704 2676 2747 2819 2890 2961 2959 2957 2985 3089 3242 3349 3325 3194 3079 3040 3057 3075 3039 3004 2968 2933 3003 3073 3141 3133 3056 2979 2897 2815 2832 2849 2911 2974
2106 2974 2987 3000 3013 3026 3036 3045 3070 3140 3193 3170 3122 3119 3154 3190 3182 3175 3205 3235 3219 3204 3203 3202 3201 3201 3228 3256 3284 3311 3257 3203 3225 3246 3295 3344 3347 3351 3392 3433 3441 3373
2101 3373 3291 3208 3211 3290 3369 3403 3366 3329 3320 3386 3480 3529 3507 3485 3519 3629 3727 3749 3713 3677 3765 3853 3895 3938 3968 3998 4104 4210 4309 4408 4508 4607 4737
2097 4737 4867 4951 5035 5085 5135 5185 5234 5237 5240 5288 5336 5337 5339 5341 5343 5354 5365 5376 5388 5323 5259 5297 5336 5300 5219 5193 5243 5303 5317 5316 5315 5308 5300 5293 5285 5301 5316 5332 5347 5400
2092 5400 5452 5429 5405 5436 5466 5497 5527 5543 5560 5621 5683 5742 5801 5815 5829 5785 5740 5741 5742 5814 5887 5884 5882 5921 5961 6001 6040 6057 6074 6046 6017 6007 5998 6034 6069 6132 6194
2088 6194 6257 6320 6256 6192 6158 6200 6281 6317 6311 6304 6363 6467 6543 6543 6525 6508 6591 6674 6731 6789 6801 6814 6843 6872 6900 6929 6894 6859 6899 6939 6962 6984 7007 7030 7109
2084 7109 7189 7268 7348 7380 7413 7490 7568 7593 7618 7643 7668 7675 7683 7748 7890 8025 8084 8085 8085 8208 8330 8392 8378 8382 8432 8496 8561 8598 8634 8671 8708 8725 8743 8761 8779
2079 8779 8880 8981 9036 9092 9127 9162 9197 9232 9277 9321 9411 9501 9591 9682 9729 9777 9836 9940 10062 10107 10106 10105 10144 10183 10237 10291 10344 10398 10423 10447 10577 10753
2075A0753J28N3P0J15J13O8K8P3J26J72J48J49J58J58K33K34K51K50K96K96K94K94L39L40
2073A5139M00M01M46M46L62L62M32M32L98L07L27L72L06K14J35J80K07J61Q4Q4J28J27N2N2
2070B1554N3N3N3N3P5P4P5P5J01J01J06J07Q9J79K26J82P0K5R9J91K24J79J34J35J80J79K26
2066B4798K25K62K62K16K17K75K76K75K76K64K64K64K64K77K76L23L22K96K97K97K96L95L94
2064C1311L95L94M08M08M19L29L23M15N25N71N49N03M86M86N15N15N60N60N42N41O17O17O52
2061D2641O51O98O97P04P05P80P80P93P92Q45R35R59R15R20R65J041J041J046J047J087J133
2058F1175J192J282J314J313J279J280J358J448J508J553J616J616J679J770J906J996K036
2056H7321K037K099K250K340K341K405K556K682K773K817K907L040L191L243L334L444L595
$$ plain form
2075 10753 10881 10934 11004 11119 11232 11300 11328 11401 11527 11699 11847 11996 12154 12312 12545 12779 13030 13280 13576 13872 14166 14460 14799 15139
2073 15139 15539 15940 16386 16832 17194 17556 17988 18420 18818 19125 19452 19824 20130 20344 20479 20659 20866 21027 21111 21195 21323 21450 21502 21554
2070 21554 21607 21660 21713 21766 21841 21915 21990 22065 22166 22267 22373 22480 22569 22748 22974 23156 23226 23251 23350 23541 23765 23944 24078 24213 24393 24572 24798
2066 24798 25023 25285 25547 25763 25980 26255 26531 26806 27082 27346 27610 27874 28138 28415 28691 29014 29336 29632 29929 30226 30522 30917 31311
2064 31311 31706 32100 32508 32916 33335 33664 33987 34402 34927 35498 36047 36550 37036 37522 38037 38552 39112 39672 40214 40755 41372 41989 42641
2061 42641 43292 43990 44687 45391 46096 46876 47656 48449 49241 50086 51021 51980 52895 53815 54780 55821 56862 57908 58955 60042 61175
2058 61175 62367 63649 64963 66276 67555 68835 70193 71641 73149 74702 76318 77934 79613 81383 83289 85285 87321
2056 87321 89358 91457 93707 96047 98388 100793 103349 106031 108804 111621 114528 117568 120759 124002 127336 130780 134375
2054A34375L733L886M108M319M469M619M850N062N286N498N755O026O280O551O926P318P702
2052B26763Q034Q385Q839R363R817J0315J0890J1526J2100J2761J3456J4291J5167J6029J6904
2050D04640J7908J8965K0072K1311K2610K4091K5646K7309K9087L0991L3000L5206L7538L9986
2048G88360M2600M5348M8173N1165N4262N7373O0496O3366O5979O8246O9988P1046P1118P0000
2047A627520O7601O3764N8393N1414M2923L3104K2275J0702j297j3232k4805l5652m5501n4052
2045A803157o1130o6660p0672p3302p4562p4654p3747p2025o9646o6775o3588o0233n6812
2043I19351n3397m9985m6692m3579m0648l7892l5322l2917l0651k8528k6565k4766k3104k1600
2042D23705k0239j8914j7736j6621j5564j4619j3683j2863j2168j1481j0786j0177r602r127
$$ plain form
2054 134375 138108 141994 146102 150421 154890 159509 164359 169421 174707 180205 185960 191986 198266 204817 211743 219061 226763
2052 226763 234797 243182 252021 261384 271201 281516 292406 303932 316032 328793 342249 356540 371707 387736 404640
2050 404640 422548 441513 461585 482896 505506 529597 555243 582552 611639 642630 675630 710836 748374 788360
2048 788360 830960 876308 924481 975646 1029908 1087281 1147777 1211143 1277122 1345368 1415356 1486402 1557520 1627520
2047 1627520 1695121 1758885 1817278 1868692 1911615 1944719 1966994 1977696 1976399 1963167 1938362 1902710 1857209 1803157
2045 1803157 1742027 1675367 1604695 1531393 1456831 1382177 1308430 1236405 1166759 1099984 1036396 976163 919351
2043 919351 865954 815969 769277 725698 685050 647158 611836 578919 548268 519740 493175 468409 445305 423705
2042 423705 403466 384552 366816 350195 334631 320012 306329 293466 281298 269817 259031 248854 239252 230125
2040B30125q674q178p726p348p015o678o345o031n760n483n273n068m857m627m356m166l956
2038A28584l817l666l526l376l250l099k993k902k772k682k579k429k344k254k205k114k028
2036H0548j938j839j794j760j715j682j592j512j512j461j460j361j361j315j315j252j253
2034E4426j194j104j006r60r80r80r49r49r69r24q13p22p71p70p49p49p49p49p12p12o36o37
2031C5642o10o10n65n64n22n21n21n21n18n18n13n13m88l97m48m49m08m09m09m09l72l73l72
2028B4612l73l46l46l46l47l01l02l01l02l20l20l21l20k87k87k87k88k87k87k87k87k85k85
2025A7500k85k85k85k85j94j95k18k18l09l09k53k52k53k52k25k25k25k25k88k87k01k02k66
2023A1763l41l45k68k60l06l66l66l02l01l02l02k73k73k74k73k63k63k56k57k21j16k4k4
$$ plain form
2040 230125 221451 213273 205547 198199 191184 184506 178161 172130 166370 160887 155614 150546 145689 141062 136706 132540 128584
2038 128584 124767 121101 117575 114199 110949 107850 104857 101955 99183 96501 93922 91493 89149 86895 84690 82576 80548
2036 80548 78610 76771 74977 73217 71502 69820 68228 66716 65204 63743 62283 60922 59561 58246 56931 55679 54426
2034 54426 53232 52128 51122 50162 49182 48202 47253 46304 45335 44411 43598 42876 42105 41335 40586 39837 39088 38339 37627 36915 36279 35642
2031 35642 35032 34422 33857 33293 32771 32250 31729 31208 30690 30172 29659 29146 28658 28261 27813 27364 26956 26547 26138 25729 25357 24984 24612
2028 24612 24239 23893 23547 23201 22854 22553 22251 21950 21648 21328 21008 20687 20367 20080 19793 19506 19218 18931 18644 18357 18070 17785 17500
2025 17500 17215 16930 16645 16360 16166 15971 15753 15535 15226 14917 14664 14412 14159 13907 13682 13457 13232 13007 12719 12432 12231 12029 11763
2023 11763 11422 11077 10809 10549 10243 9877 9511 9209 8908 8606 8304 8031 7758 7484 7211 6948 6685 6429 6172 5951 5835 5811 5787
2020E787q3q3K6J01J23J23J28J28J50J51J51J51J17J17J17J16P3P4P3P3N2N2l8l8J3J3J4J3
2016G694QQPQn0n0n0n1jjjjk7k7k7k8o1o1o1o2j03j03j46p0K7K7n9n9%jr1r1l4l4l5l4o8o9
2012F223o8o9l4l5l4l5o2o3o3o3RRRRn9o0n9o0m0m1m0m1j8j9j9j8p0o9K1K1q0q1q0q0rrqr
2007D806JKr0q9n6n6L6L5l7l7l8l7n7n8n8n8m4m4m5m4j8j7j8j8nonoL5L4n7n6m2m2m2m2m8
2002C679m8m7m8onooo4o4o4o4j3j3P8P7l7l7l8l7n9n9n8n9QPQPM4M4m7m7q2q3q3q2j7j7j7
1998B645j7l6l5l6l6l8l8l8l8j2j1j2j2l3l4l3l3kjr2r2k6k6k6k6KLKKN0N0N0N0QQQ3Q3Q3
1993B336Q3Q4Q3O2O1O2O1k3k4k3k4M1M1M1M0K4K3K3K3L2L2m4m4m2m1m2m2m9m8lln4n4K1K2
1989B635kkkkPPl8l9o9p0L7L6j2j2L3L3kjm7m8n5n5n5n5K9K9K9K9j6j7j6j6j6j6j7j6l2l3
$$ plain form
2020 5787 5704 5621 5647 5748 5871 5994 6122 6250 6400 6551 6702 6853 6970 7087 7204 7320 7393 7467 7540 7613 7665 7717 7679 7641 7654 7667 7681 7694
2016 7694 7702 7710 7717 7725 7675 7625 7575 7524 7523 7522 7521 7520 7493 7466 7439 7411 7350 7289 7228 7166 7063 6960 6814 6744 6771 6798 6739 6680 6680 6679 6588 6497 6463 6429 6394 6360 6292 6223
2012 6223 6155 6086 6052 6017 5983 5948 5886 5823 5760 5697 5706 5715 5724 5733 5674 5614 5555 5495 5455 5414 5374 5333 5315 5296 5277 5259 5189 5120 5141 5162 5082 5001 4921 4841 4832 4823 4815 4806
2007 4806 4807 4809 4719 4630 4574 4518 4554 4589 4552 4515 4477 4440 4383 4325 4267 4209 4165 4121 4076 4032 4014 3997 3979 3961 3956 3950 3945 3939 3974 4008 3951 3895 3853 3811 3769 3727 3679
2002 3679 3631 3584 3536 3530 3525 3519 3513 3449 3385 3321 3257 3244 3231 3309 3386 3349 3312 3274 3237 3178 3119 3061 3002 3010 3017 3025 3032 3076 3120 3073 3026 2944 2861 2778 2696 2679 2662 2645
1998 2645 2628 2592 2557 2521 2485 2447 2409 2371 2333 2321 2310 2298 2286 2253 2219 2186 2153 2151 2150 2058 1966 1940 1914 1888 1862 1864 1867 1869 1871 1921 1971 2021 2071 2079 2087 2170 2253 2336
1993 2336 2419 2503 2586 2648 2709 2771 2832 2809 2785 2762 2738 2779 2820 2861 2901 2925 2948 2971 2994 3026 3058 3014 2970 2928 2887 2845 2803 2754 2706 2703 2700 2646 2592 2613 2635
1989 2635 2633 2631 2629 2627 2634 2641 2603 2564 2495 2425 2462 2498 2486 2474 2507 2540 2538 2537 2490 2442 2387 2332 2277 2222 2251 2280 2309 2338 2322 2305 2289 2273 2257 2241 2224 2208 2176 2143
1984B143l3l2K3K4K4K4llklooooK1K0k5k4J6J7n9n9j9k0k0k0N3N2k4k3k2k1k2k1o9o8OPK3
1980A837K4K3K3k9k9k8k9j7j7j6j7k8k8J7J7M0L9l6l6k7k6o7o8k3N2Q1L5OOm2m3j9j9j9j9
1975A518RRj9r4r4j9M0nk9M5J07J06nnnnj7j8j7j7j7j6j7j7j3j4j4j4l9l9OOr3r4l2M3L4j1
1971A144pL9J7J7K0K0l7l8l8l8m3m4K9L0m8r2o7QKm3j3j3j%j%M1M1M1M2K9L0L0K9ppppm4m3
1966I71L3L2K7K7j8j9J0J1J0J0j4j4j5j4J%P1P1Np2p1MPQJ2J2j5j4j5j4J1J1J1J1K3K2K3K2
1961A161l2l1l2l2K8K8K7K8n4n4qrm4m3M7M7K1K1K2K1j5j5j4j5JJjkj1n8q2QK6K7L2L2jjm6
1956I78m7pqN2R8J20K9m0q5n9j5LLm7m6J3N9M2m9o6k0J6J6J7J6k2o7n3L8O8k3j12j11j1P9
1952G59K9K8K5K4K5K5j5j6j5j5J9J9J3J3k2j12q6m2JJMMJ52J53or6p7l1j7j7j2j3L0L0Q3L8
$$ plain form
1984 2143 2110 2078 2101 2125 2149 2173 2170 2167 2165 2162 2156 2150 2144 2138 2159 2179 2154 2130 2146 2163 2104 2045 2026 2006 1986 1966 2019 2071 2047 2024 2002 1981 1959 1938 1869 1801 1807 1814 1837
1980 1837 1861 1884 1907 1878 1849 1821 1792 1775 1758 1742 1725 1697 1669 1686 1703 1743 1782 1746 1710 1683 1657 1590 1522 1499 1551 1632 1667 1673 1679 1637 1594 1575 1556 1537 1518
1975 1518 1527 1536 1517 1423 1329 1310 1350 1345 1316 1361 1468 1574 1569 1564 1559 1554 1537 1519 1502 1485 1468 1452 1435 1418 1405 1391 1377 1363 1324 1285 1291 1297 1204 1110 1078 1121 1155 1144
1971 1144 1137 1176 1193 1210 1230 1250 1213 1175 1137 1099 1056 1012 1041 1071 1023 931 864 872 874 831 818 805 804 804 803 803 844 885 926 968 997 1027 1057 1086 1079 1072 1065 1058 1014 971
1966 971 1004 1036 1063 1090 1072 1053 1063 1074 1084 1094 1080 1066 1051 1037 1038 1038 1109 1180 1185 1113 1042 1046 1053 1061 1073 1085 1070 1056 1041 1027 1038 1049 1060 1071 1094 1116 1139 1161
1961 1161 1129 1098 1066 1034 1062 1090 1117 1145 1091 1037 1029 1020 976 933 980 1027 1048 1069 1091 1112 1097 1082 1068 1053 1054 1055 1054 1052 1041 983 901 909 935 962 994 1026 1025 1024 978
1956 978 931 924 916 968 1066 1186 1215 1175 1090 1031 1016 1019 1022 975 929 942 1001 1043 994 928 908 924 940 957 973 951 884 831 869 937 914 802 691 680 759
1952 759 788 816 841 865 890 915 900 884 869 854 873 892 905 918 896 784 698 656 657 658 662 666 818 971 965 869 792 761 744 727 715 702 732 762 845 883
1948H83r1j81j20l0O5O5K2K2K1K2l5l5l5l5j6j6j7j6j2j3j3j3l9l9l9l9J4J3J4J4nonnk2k3
1943B55k2k2j1j1j1j1K3K3K3K3N4N5N4N4O2O1J9J9Q6J32P2j9k5O5Q0L4J6J5J3J3j%j%j%j%
1939A115%j%%K6K6K6K7m8m7m7m7M7M7M7M7pqpql3l3p3p2p2J8N9N8K1K2K1K2qqqpJ1J1p7p7
1934I63K9P3J4p6m3M7M7m3j08j6P8P8l4l3N1N2L3n7l5J1Km3m0NLLONk1k0k1k1L9L8L9L8on
1929A032ooo7o8RQQRQQO0O0m7m6mlM1M2j6j5o1o1OPOOp7p7JJO9J15R5Mj00r9kkl9q4m0N1J10
1924H36J9%%M9N0n7n6p8p8n3L7M1M0M6M6N3N4n3n2m2m2MLl7l8m2M7J03J02LKK0J9k6k5ooL9
1919I22L9K2K1K1K2klm7m8k0k0N5N5KJM6R1O5k7m3KM6M6LLrrj0rJ7J6k9k9J0RN5N5m5m6no
1914A217L1o0q4q5l3l3l4l3l1l1l2l1K9K8j7j7j0j1j0j1k4k5k5k5OOONK9K8j7j6K9K9j5j6
$$ plain form
1948 883 792 611 491 461 526 591 613 635 656 678 643 608 573 538 522 506 489 473 461 448 435 422 383 344 305 266 280 293 307 321 316 310 305 300 278 255
1943 255 233 211 200 189 178 167 190 213 236 259 313 368 422 476 538 599 618 637 723 855 927 908 883 948 1028 1062 1078 1093 1106 1119 1118 1118 1117 1117 1116 1116 1115 1115
1939 1115 1115 1114 1114 1114 1140 1166 1192 1219 1171 1124 1077 1030 1077 1124 1171 1218 1211 1203 1196 1188 1155 1122 1049 977 905 923 982 1040 1061 1083 1104 1126 1118 1110 1102 1095 1106 1117 1040 963
1934 963 992 1065 1079 1003 960 1007 1054 1011 903 887 965 1043 1009 976 1027 1079 1112 1055 1020 1031 1033 990 950 955 958 961 967 972 951 931 910 889 928 966 1005 1043 1037 1032
1929 1032 1026 1020 953 885 894 902 910 919 927 935 995 1055 1008 962 958 955 996 1038 1022 1007 946 885 891 898 904 910 833 756 757 758 827 942 1037 1041 941 842 840 838 799 715 675 726 836
1924 836 855 855 855 904 954 897 841 763 685 632 669 710 750 796 842 895 949 896 844 802 760 764 767 730 692 650 697 800 902 905 907 927 946 920 895 889 883 922
1919 922 961 983 1004 1025 1047 1045 1042 995 947 927 907 962 1017 1019 1020 1066 1157 1222 1195 1152 1154 1200 1246 1249 1252 1243 1234 1224 1215 1232 1248 1219 1190 1200 1209 1264 1319 1274 1228 1223 1217
1914 1217 1248 1188 1104 1019 986 953 919 886 855 824 792 761 790 818 801 784 774 763 753 742 718 693 668 643 649 655 661 666 695 723 706 690 719 748 733 717
1910G17n2n2K4K4P0P0ool5l5M1M0l8l8l8l9nnp5p5n0M2O5O6k1k1N5N4MMm1m1K8K7K8K8n6n5
1905F03J9K0l2l2J4J3M7M7JKJ6J6J5J6j1j1n7n6K8K9K8K9o4o5j9j9J3J2l3l3M7M8KKj8j8K8
1901F27K8M3M3m8m8MLOPQN3K8m7q8m2P5P4%p6n9j4ONQRl8l8N3N3N6N6l5l4o4o3j8j8P3P4j8
1896F44j7m3m3m0m0Q0J25N2k4m9m9qqj1j1rqL5Q1J0o6p0k4L6L7KKM8M7k6k6J9J9l0l1O0O0
1891G24K1K1k4k5m0m1NN%%M6M5KKKJNMNNK1K2rL7J5o1m1NLMOOl5l5l6l5k0k0k1k0J4J4J4J4
1886F05k2k2k1k2O4O5J6n9k7k7N9N9m8m7lkN0N0m0m1j1j1j2j1P0P0k0k1k6k6k6k7jjjkjjj
1881E28jOOOOJ1J2J2J1n2n3L8L8K0J9J9J9l5l5N5N5j4j5j4j5j5j6j6j5j6j6j5j6NNMNJ6J6
1876E53J7J6nonnnnnnj%%jk9l0O1O1j5j5L0L0non1n1PPPPL6L6n4n5K1K0K0K0K6K6K6K5k0k0
$$ plain form
1910 717 665 613 637 661 731 801 795 789 754 719 760 800 762 724 686 647 642 637 562 487 437 479 544 610 589 568 623 677 681 685 644 603 631 658 686 714 658 603
1905 603 622 642 610 578 592 605 652 699 700 702 718 734 749 765 754 743 686 630 658 687 715 744 680 615 596 577 590 602 569 536 583 631 633 635 617 599 627
1901 627 655 698 741 693 645 649 652 658 665 673 726 754 707 619 577 652 726 726 650 591 577 583 588 596 605 567 529 582 635 691 747 712 678 614 551 533 515 588 662 644
1896 644 627 584 541 501 461 541 666 718 694 645 596 588 580 569 558 549 541 576 657 667 601 531 507 543 580 582 584 632 679 653 627 646 665 635 604 664 724
1891 724 745 766 742 717 677 636 641 646 646 646 692 737 739 741 743 744 749 753 758 763 784 806 797 834 849 788 747 752 755 759 765 771 736 701 665 630 610 590 569 549 563 577 591 605
1886 605 583 561 540 518 582 647 663 604 577 550 609 668 620 573 570 568 618 668 628 587 576 565 553 542 612 682 662 641 615 589 563 536 535 534 533 531 530 529 528
1881 528 527 533 539 545 551 562 574 586 597 545 492 530 568 588 607 626 645 610 575 630 685 671 656 642 627 612 596 580 565 549 533 518 502 507 512 516 521 537 553
1876 553 570 586 581 575 570 565 560 555 550 545 544 544 544 543 514 484 545 606 591 576 606 636 631 625 574 523 530 537 544 551 587 623 569 514 535 555 575 595 621 647 673 698 678 658
1871F58k0k0J4J3J4J4n0n0n0n0K5K5K4K5l3l3J3J3J0J1J1J0J3J2l2l3k8k8J7J7Q3Q2K7o3n6
1867E85n7J3J3K0J9K0J9L8L9ppm8m9m8m8rj0L6L6RJ0o6o6L6L5L6L6NMNMk2k2k2k2klklk2k1
1862D62k2k1J9J9J8J9k6k5K0J9J4J4J4J4N1N1k4k5n6n5j0j0K6K7K7K6J0J0N5N6OOl9m0j7j8
1857E95j7j8KKm3m3KJl8l8L7J28J28L8n3n2n9n8m2m2LLJ4J4J4J3k6k5M5M4J4o3o5J1R0M4j
1853E59jpqn3n3L0L0P5P5K6K6p6p5m2L4O3O2J5o0m3K%jm3m3J8J9k7k7L0K9j5j6J3J2l2l3J
1848D64JJKnnK6k0m1L4O0J4k5k6M8M7JJp4p5J9J9J8J9k6k6K0J9N0N0NNn5n6N0N0K6K5k0k0
1843F00k5k5K1K1j7j7j7j6K1K1K1K1L2L3o9o8K5J01N5k0o7o6L5L5N6N6n0n0p8p7kkMMm1m2
1839D13M9M8K0n6n5K0M3kj4j5j7j7MNMNmlllL8L9L8L9n6n6n1n1l6M0M6k9n0N5J05N9o2j08
$$ plain form
1871 658 638 618 632 645 659 673 623 573 523 473 498 523 547 572 539 506 519 532 542 553 564 574 587 599 567 534 506 478 495 512 595 677 704 641 585
1867 585 528 541 554 574 593 613 632 670 709 702 695 647 598 550 502 493 483 519 555 564 574 508 442 478 513 549 585 590 594 599 603 581 559 537 515 513 510 508 505 483 462
1862 462 440 419 438 457 475 494 468 443 463 482 496 510 524 538 589 640 616 591 535 480 470 460 486 513 540 566 576 586 641 697 703 709 670 630 613 595
1857 595 578 560 562 564 521 478 480 481 443 405 442 570 698 736 683 631 572 514 472 430 433 436 450 464 478 491 465 440 485 529 543 480 415 426 516 560 559
1853 559 558 551 543 490 437 467 497 572 647 673 699 623 548 506 540 603 665 680 620 577 579 579 578 535 492 510 529 502 475 505 534 519 503 516 528 496 463 464
1848 464 465 466 468 463 458 484 464 423 457 517 531 506 480 528 575 576 577 503 428 447 466 484 503 477 451 471 490 540 590 595 600 545 489 539 589 615 640 620 600
1843 600 575 550 571 592 575 558 541 525 546 567 588 609 641 674 605 537 562 663 718 698 631 565 600 635 691 747 697 647 569 492 490 488 492 496 455 413
1839 413 462 510 530 474 419 439 482 480 466 451 434 417 421 426 430 435 431 428 425 422 460 499 537 576 520 464 413 362 326 366 412 383 333 388 493 552 490 382
1834C82l7L9N2N2J1J2jjjjm0m0N1N0L1L1P6P6m0m1m0m0m9m9m9m9L1L0L0L0n4n4rrk6k6O4O4
1829D56K9K8j7j7m6m5M5M5L2L3j3j2oon1n1J4J3J3J3POOOk8k8k7k8K3K3K3K2m9n0M1M0L2L1
1825E07j4j4O3O3k9k8o7o7K3K4N7N8l4l3n8n8L2L2K5K5K5K5RJ0RRl7l7l6l7J0J1N6N6K5K5
1820F30o6o5rrrrl7l8N4N3N0M9m1m1M3M3m7m8poL9L8l2l2J4J3j4j3n9n9J1J1J1J0POOPK5K5
1816E04K5K5m6m7m6m7J0J0J1J0OPPOK7K6j9j9r7r8ppK9K9P4P4P8P9p3p2m7m7M3M4m5m5m4m5
1811B73M8M8M7M8llllk9k9l0k9J8J8J9J8PPPPk7k7k7k7n9n9L1L2P3P4P4P3k2k3k3k2k6k5k8
1806C98k8J2l4qO7J08O2j4j3%%j%KJp5p4n5n6K0K1J1J1J1J1L0L0j5j5poooJ7J7J8J7LKLLO4
1801E26O4j2j1l6l7l6l6L7L8qn3m3L3Q8M3m8m9ooj9k0k0k0L5L5j0j0K7K8K8K8n0n0mnklkl
$$ plain form
1834 382 345 384 436 488 499 511 510 509 508 507 467 427 478 528 559 590 666 742 702 661 621 581 532 483 434 385 416 446 476 506 452 398 389 380 354 328 392 456
1829 456 485 513 496 479 433 388 433 478 510 543 530 518 512 506 455 404 418 431 444 457 464 470 476 482 454 426 399 371 394 417 440 462 413 363 404 444 476 507
1825 507 493 479 542 605 576 548 481 414 437 461 518 576 542 509 451 393 425 457 482 507 532 557 566 576 585 594 557 520 484 447 457 468 524 580 605 630
1820 630 564 499 490 481 472 463 426 388 442 495 545 594 553 512 555 598 551 503 496 490 529 567 535 503 517 530 516 503 444 385 396 407 418 428 435 441 447 454 479 504
1816 504 529 554 508 461 415 368 378 388 399 409 415 422 429 435 462 488 469 450 353 255 248 241 270 299 373 447 525 604 531 459 412 365 408 452 407 362 318 273
1811 273 321 369 416 464 461 458 455 452 423 394 364 335 353 371 390 408 415 422 429 436 409 382 355 328 269 210 241 273 346 420 494 567 545 522 499 477 451 426 398
1806 398 370 382 348 340 407 515 577 563 550 550 550 549 549 551 552 477 403 348 292 312 333 344 355 366 377 407 437 422 407 400 394 388 382 399 416 434 451 454 456 459 462 526
1801 526 590 578 567 531 494 458 422 459 497 489 436 393 426 514 557 509 460 454 448 429 409 389 369 404 439 429 419 446 474 502 530 480 430 426 421 419 416 414 411
1796D11O0O0m6m6%%%jL4L4L4L4o5o5nP1N4Qo7o7J0J0J1J0llllr0r1j4j5LKJP6J09L3k6k5O
1791D36NOOJ7J7J7J8n0n0n0n0j4j3O2O2O3O3m3m3j4j4L2L1j2j2j2j2J3J2J2J3QRl7l6L6L6
1787E12j0rk1k0K4K5J3J2l3l2l6l6M0M0RQRRL0L1j5j5m7m8kkK4K3q2q2K4K4K4K4L1L2L1L2
1782E41l4l4J2J1L8L8ppl8l8l9l8P4P3klk2k3k3k3LLm3m3k4k4N1N1k4k3k4k3N7N7J2J2N3N4
1777E81k2k2m0l9m0l9m5m4m4m4R4R4R5R4m4m3m4m3N5N5l6l6K5K5k1k0j2j2L4L4j4j3j4j3o
1773D36nooK7K7K6K7m8m8M2M3k0k0j9k0K9K9L0K9k8k9J7J7N3N3l7l8j2j2L3L4qqn2n3j6j7
1769D50L0K9kjkkj0j0j0j1k4k5k5k5KJKKJ4J4J5J4j9k0k0j9pqppMNMML2L2L2L2jkkkn2n2n1
1763C02n2N8N8N8N8K2K2K1K2j2j2j2j2K2K2K2K2nmnmk5k4k5k4J0RJ0Rn1n1n1n1K0K1K0K1L1
$$ plain form
1796 411 471 531 485 439 439 439 439 438 472 506 540 574 509 444 439 510 564 572 505 438 448 458 469 479 476 473 470 467 377 286 272 257 260 262 263 339 448 481 455 430 436
1791 436 441 447 453 470 487 504 522 472 422 372 322 308 295 357 419 482 545 502 459 445 431 463 494 482 470 458 446 459 471 483 496 504 513 476 440 476 512
1787 512 502 493 472 452 476 501 514 526 493 461 425 389 429 469 478 486 495 504 534 565 550 535 488 440 438 436 460 483 401 319 343 367 391 415 446 478 509 541
1782 541 507 473 485 496 534 572 565 558 520 482 443 405 479 552 550 547 525 502 479 456 459 462 419 376 352 328 379 430 406 383 359 336 393 450 462 474 527 581
1777 581 559 537 497 458 418 379 334 290 246 202 296 390 485 579 535 492 448 405 460 515 479 443 468 493 472 452 440 428 462 496 482 469 455 442 436
1773 436 431 425 419 446 473 499 526 478 430 472 515 495 475 456 436 465 494 524 553 525 496 513 530 583 636 599 561 549 537 570 604 596 588 536 483 467 450
1769 450 480 509 507 506 504 502 492 482 472 461 437 412 387 362 364 365 367 369 383 397 412 426 407 387 367 348 341 333 326 319 323 328 332 336 368 400 432 464 463 461 459 457 405 353 302
1763 302 250 308 366 424 482 504 526 547 569 557 545 533 521 543 565 587 609 604 600 595 591 566 542 517 493 503 512 522 531 480 429 378 327 347 368 388 409 440
1758D40L2L2L1k5k5O6O6K6K5o5o4m3m2LLk0j9K5K6k9k8J7J7n6n7j1O5L3j2J9J8rj0rrJ7J8
1754D46J7J7OPk5K2K8m6r0j4N2N1l4l5nnonJJ%JK7K8K7K7m4m5m4m5J3J2J2J3J4J5J5J5J5J4
1749D53J5J5l8l8l3l3JP6O0J4m6m5m8m9MMM9M9l9l9N2N2MMMMJ1J1J2J1m4m3m4m3N0N0Po9q4
1744B77qR5R6k4k4k3k4NMNNj4j4j3j4q3q2pqN2N1N1N2k4k3k3k3j9k0j9j9J3J2J2J2N0N0NN
1739C44p1p2MML3L3j2j2n3n3k3N3Q2L8l9l8lkM3M2K6K6K5K6k1k1k0k1%j%%J9J8K2K1L0P5R3
1735E95J6l2l2l8l7j6j6j6j6o2o2P5P4K8K8j8j7M2M3M3M3nmnnl8l9l9l8J7J7J7J7L1L1JM7
1730F30oq1o2j6mnkjK6K7K6K6J%%%l3l3l2l3M7M6M7M6l2l3l3l2k9k9M4M3m8r4m0L6P3kk8J6
1725D26P5K9m8m8NOONqqqqMLMLpqppK8K7K8K8N0N0n5n6l2l3l3l3k1k1N4N5J2J1RRKm4o1J5
$$ plain form
1758 440 472 504 535 510 485 551 617 643 668 603 539 496 454 457 460 440 421 446 472 443 415 432 449 393 336 325 390 423 411 430 448 439 429 420 411 428 446
1754 446 463 480 486 493 468 490 518 472 382 368 420 471 437 402 397 392 386 381 382 383 383 384 411 439 466 493 449 404 360 315 328 340 352 365 379 394 409 424 439 453
1749 453 468 483 445 407 374 341 342 418 478 492 446 401 353 304 308 312 361 410 371 332 384 436 440 444 448 452 463 474 486 497 453 410 366 323 373 423 430 361 277
1744 277 269 364 460 436 412 389 365 370 374 379 384 370 356 343 329 246 164 157 149 201 252 303 355 331 308 285 262 243 223 204 185 198 210 222 234 284 334 339 344
1739 344 273 201 205 209 242 275 263 251 198 145 122 175 257 295 256 218 215 213 256 298 324 350 375 401 380 359 339 318 318 317 317 317 336 354 376 397 427 502 595
1735 595 611 579 547 509 472 456 440 424 408 346 284 359 433 461 489 471 454 496 539 582 625 620 616 611 606 568 529 490 452 469 486 503 520 551 582 583 630
1730 630 624 543 481 465 461 456 454 453 479 506 532 558 559 559 559 559 526 493 461 428 475 521 568 614 582 549 516 484 455 426 470 513 465 371 331 367 440 438 410 426
1725 426 501 530 482 434 439 445 451 456 448 440 432 424 428 431 435 438 431 423 416 409 437 464 492 520 570 620 565 509 477 444 411 378 357 336 390 445 457 468 477 486 488 444 383 398
1720C98K6K6L1L1j0j0rj0RJ0RRl4l4l4l4J7J8J8J8MMp2p1J3J2J3J2j8j9j9j9qpqqj9k0k0k0
1715A75jjjjj6j7j7j6l1l1l0l0L2L3j2j3L0K9m6m6L7L7L8L7j6j6j7j6o4o2o4o3ppppN7N6N7
1710c7N5J27J26L6L6KKJKN3N3N3N3k7k6k7k6Q8Q9kkM8M8M8M8JJPOJ1J02N0N0kklko3o3K8K8
1705I70m0m1m0m0P3P3j8j8j6j6j5j6NNN7l4r3r3qqJ7J7R7R8K5j27j84r3j9j9j3j4K2K3K2K3
1701E62n3n3n3n2j7j7j7j7L3L3n7n8J5J4P1k0k0P1J4J4l4l5l0k9j04j3Q8Q7N8N9l2l2k7k7
1697C22k2k2j4P6P7j4p8p8QPkklkM4M4M5M4l5l6l5l5J8J9J8J8q9q9JKJ3J3J3J4l2l2N8N9M7
1692C40M7L7L8O0r1j47n7J5J5K1K1j2j1j1j1M2M2L6L6O9k2o2o2j%r2r1p1p0K0K0J6J7J6J7
1688A14k7k7k7k7%%%%N6N7l4l4n9o0L1L1J5J6J6J5k6k7k5k7N9O1O0O0M5M4M5M4L9L9L8L9M7
$$ plain form
1720 398 424 450 481 512 502 492 483 473 482 492 501 510 476 442 408 374 391 409 427 445 449 453 381 310 323 335 348 360 342 323 304 285 277 270 262 254 235 215 195 175
1715 175 174 173 172 171 155 138 121 105 74 43 13 -17 15 48 36 23 53 82 36 -10 27 64 102 139 123 107 90 74 10 -52 -116 -179 -186 -193 -200 -207 -150 -94 -37
1710 -37 18 145 271 307 343 345 347 348 350 403 456 509 562 535 509 482 456 544 633 631 629 677 725 773 821 822 823 830 836 847 949 999 1049 1047 1045 1042 1040 977 914 942 970
1705 970 930 889 849 809 882 955 937 919 903 887 872 856 861 866 923 889 796 703 695 687 704 721 818 916 941 814 630 537 518 499 486 472 494 517 539 562
1701 562 509 456 403 351 334 317 300 283 316 349 292 234 249 263 334 314 294 365 379 393 359 324 294 265 161 148 236 323 381 440 408 376 349 322
1697 322 300 278 264 340 417 403 325 247 255 262 260 258 255 253 297 341 386 430 395 359 324 289 307 326 344 362 273 184 185 187 200 213 226 240 208 176 234 293 340
1692 340 387 424 462 522 431 284 227 242 257 278 299 287 276 265 254 296 338 374 410 479 457 395 333 332 332 240 149 78 8 28 48 64 81 97 114
1688 114 87 60 33 6 6 6 6 6 62 119 85 51 -8 -68 -37 -6 9 25 41 56 30 3 -22 -49 10 71 131 191 236 280 325 369 408 447 485 524 571
1683E71M6l9l8M0J32Q0Q0L9L8L8L9L8L8L9L8N8N7N8N8L9L8l6l7m1m2MML2L2j2n8l6N4N5l7
1679A369q6m1O4O4MMMMj4j4j4j4LLLLJ4J5J4J4k5k4k5k5L2L1L2L2n0n1n0n1j1j2k6p1l3N8
1674A130J03N7j5o1o4j8l6l6l3l3J3J3J3J3K2K2K7o3q3q4j3j3j9j9K7K6l8l9l6l6L8Q2O3k8
1670H82q0q1M9R4K5o5o2K9L9L8l1l1j6j6K9K8m8m8mlM3M3lkk9k9J6J6o6o6m8M3N6l5n0mM9
1666F62M8OOKKKKn3n3n2n3L4L4L4L5j3j3j2j3K2K1K1K2J0J0J0J0l2l1l2l1N3N3N3N3n1n1j02
1661F13j1K7K8L3L3o4o5o4o4L9L9opmnP1P1PQPPppppJJJJl3l2O8O8k0j10j10j9k0k0j5j5p
1656D04pppL9L8l7l8J%M6M5P0O9poM4M4M3M4M3M3l3l2p0o9k5k4M0M0nnM9M9LM%%%%L1L1L1
1651H79L1k1k1r6r7J3J2J3J2rrL6L6Q7Q7m8r5j5N9J5o1q9m4JKpppoooooNONNJ2J1J2J1J0R
$$ plain form
1683 571 617 578 540 580 712 792 872 911 949 987 1026 1064 1102 1141 1179 1237 1294 1352 1410 1449 1487 1451 1414 1373 1331 1335 1339 1371 1403 1391 1333 1297 1351 1406 1369
1679 1369 1283 1242 1306 1370 1374 1378 1382 1386 1372 1358 1344 1330 1333 1336 1339 1342 1356 1371 1385 1399 1374 1350 1325 1300 1332 1363 1395 1427 1377 1326 1276 1225 1214 1202 1176 1105 1072 1130
1674 1130 1233 1290 1275 1214 1150 1132 1096 1060 1027 994 1007 1020 1033 1046 1068 1090 1117 1054 971 887 874 861 842 823 850 876 838 799 763 727 765 847 910 882
1670 882 802 721 770 864 889 824 762 791 830 868 837 806 790 774 803 831 783 735 731 728 771 814 811 809 780 751 767 783 717 651 603 646 702 667 617 613 662
1666 662 710 716 722 724 726 728 730 677 624 572 519 553 587 621 656 643 630 618 605 627 648 669 691 701 711 721 731 699 668 636 605 658 711 764 817 766 715 613
1661 613 602 629 657 690 723 659 594 530 466 505 544 538 531 527 522 593 664 671 679 686 693 686 679 672 665 666 667 668 669 636 604 672 740 720 610 500 481 461 441 426 411 404
1656 404 397 390 383 422 460 423 385 386 386 432 477 547 616 609 603 647 691 734 778 821 864 831 799 729 660 635 611 651 691 686 681 730 779 782 786 786 786 786 786 817 848 879
1651 879 910 889 868 772 675 688 700 713 725 716 707 743 779 866 953 905 810 795 854 869 808 719 675 676 678 671 664 657 651 645 639 633 627 632 638 643 648 660 671 683 694 704 713
1645G13o1o1JP6L4m1o1j5K6k0n9n9M4R0M9k6k6k6k5k5K1K0M9M8M9M9J1J0J1J1j5j6j5j6rr
1641G27rrooooOPN1N2j3j3L2P7J0o6m9lj2n8n4rK2K1K0K0Ro7n0nJ5J6J8J8J2J2l3l2J0J0o0
1636E99o1OQ1L8L9LLm2m3noP0P0J3J3l3l3klklk9k9l0k9J3J2J2J3j6j6j6j5J8J8J8J8j3j4
1631F17j4j4K0K0K0K0k1k2k1k1J2J3J2J3%%%%%J%%J2J2J3J2JJJJRQRQRQRRRRJ0RK8K9K8K8
1626I07L6L5L6L5o6o6o7o6M8M7M8M8l8l9l8l8N7N6m9m9k3k4K2K2l6l5J0J0RRRRJ8J8n8n8j7
1621G22j7K8K8K8K7j8j7J0J0J1J0l6l6l6l6Q3Q3QPmlMq5p8l2M3M2M7M6k9k8k1k0k1k0o7o6
1616E67O9P0L5L6m0m0j8j8J4l2p8J4O5O5k8k9J7J7m2m2L1L1J4l1j6P4R2Lj7j7l8l7l8l8O3
1612F78O2J7J7noooL0L1L0L0j8j8o4o3j2j1L4L4k1k0K5K5M2M2mlm3m4KKK7K6j04j03k4O7J13
$$ plain form
1645 713 652 591 592 668 702 661 600 585 611 591 532 473 517 607 656 630 604 578 553 528 549 569 618 666 715 764 775 785 796 807 792 776 761 745 736 727
1641 727 718 709 703 697 691 685 691 698 749 801 788 775 807 884 894 828 779 776 764 706 652 643 665 686 706 726 735 668 618 613 628 644 662 680 692 704 671 639 649 659 599
1636 599 538 544 625 663 702 705 708 666 623 618 612 682 752 765 778 745 712 710 707 705 702 673 644 614 585 598 610 622 635 619 603 587 572 590 608 626 644 631 617
1631 617 603 589 609 629 649 669 648 626 605 584 596 609 621 634 634 634 634 634 634 635 635 635 647 659 672 684 685 686 687 688 697 705 714 722 731 739 748 757 766 775 785 794 822 851 879 907
1626 907 943 978 1014 1049 983 917 850 784 832 879 927 975 937 898 860 822 879 935 886 837 814 790 812 834 798 763 773 783 792 801 810 819 837 855 797 739 722
1621 722 705 733 761 789 816 798 781 791 801 812 822 786 750 714 678 761 844 852 859 855 852 856 771 693 661 704 746 793 839 810 782 761 741 720 700 633 567
1616 567 636 706 741 777 737 697 679 661 675 643 565 579 644 709 681 652 669 686 644 602 633 664 678 647 631 705 797 800 783 766 728 691 653 615 678
1612 678 740 757 774 769 763 757 751 781 812 842 872 854 836 772 709 697 686 720 754 733 713 738 763 805 847 843 840 797 753 755 757 784 810 706 603 579 646 759
1608G59K1o5o5k2k3M5R1M3m7o7k1N3N2j3j4j4j4m4m4m5m4k5k6N0M9M0L9oop7p7K8K9J5J6J5
1603E86J5QQQQl8l7j9P2Q0j0r0q9jjM5M4J9J8k7k6K8K8K8K8k5k4k5k5MMm2m1k1k1K4K4O5O5
1598F47O5O5N3N2PQK6K6n0m9J1J1J1J1qpL7L8N3N3N3N4P1P1m4j35j34j34l4l5J1J0o5o5j0
1594F74j0j0j0l3l3P3P3mmnmN8N9N9N9j1j0j1j1J3J2Q2Q2J03J2l7l6J6J07J31J31J67J68L11
1590B161N22P54Q46N54k0n21p93p40n29l62k12j38m7p6p6j15j16p2p2K8K7Q1j0o4o5M2M2M2
1587A071M2K5K6k0k0k2k3Q3Q3N9N9J4J3P8P8J89J89J62K52M17O28Q06J078J618K071J815N77
1583A1348j048k045k050j477r89p17n54l42k12k12j52o2j04j03j06M6J17K7m1m0jjM6M5l3
1580A340j25r7oJ03J03O0N9O0O0Q6Q6R2R1J56K46K84K84M53O64Q78J210J910K726K858J559
$$ plain form
1608 759 780 715 650 628 605 650 741 784 737 670 649 702 754 741 727 713 699 655 611 566 522 497 471 521 570 610 649 643 637 560 483 511 540 555 571 586
1603 586 601 609 617 625 633 595 558 539 611 691 681 591 502 501 500 545 589 608 626 599 573 601 629 657 685 660 636 611 586 590 594 552 511 490 469 493 517 582 647
1598 647 712 777 830 882 889 897 923 949 899 850 861 872 883 894 886 879 916 954 1007 1060 1113 1167 1238 1309 1265 1130 996 862 828 793 804 814 749 684 674
1594 674 664 654 644 611 578 651 724 720 716 711 707 765 824 883 942 931 921 910 899 912 924 1006 1088 1191 1203 1166 1130 1146 1253 1384 1515 1682 1850 2161
1590 2161 2683 3437 4283 4837 4817 4296 3503 2763 2234 1872 1660 1522 1475 1399 1323 1208 1092 1020 948 976 1003 1084 1074 1010 945 987 1029 1071
1587 1071 1113 1138 1164 1144 1124 1102 1079 1162 1245 1304 1363 1377 1390 1468 1546 1735 1924 2086 2338 2755 3383 4189 5267 6885 8956 10771 11348
1583 11348 10300 8255 6205 4728 3739 3022 2468 2126 1914 1702 1550 1488 1384 1281 1175 1221 1338 1365 1324 1284 1283 1282 1328 1373 1340
1580 1340 1215 1118 1112 1215 1318 1378 1437 1497 1557 1643 1729 1821 1912 2068 2314 2598 2882 3335 3999 4877 6087 7997 10723 13581 15140
1577A5140o48k492k987k413j674j101p09m38l19l19k26p5j1j01j17j17k0k1k0k0m2m2m2m3
1574A143K7K7K7K7nmO6O5P1j9o5K6O0O0J4J05K03K02K69M80O57Q70J228J862K229J595J5j525
1571I710k189j978j449r95o84m12j89j90j49j49p3p4o9o8o3o4q3QO2O2RQQRj6j5j6j5J0J1
1567I57J1J1NMNMN2N2R7R7R7R8J96K86M07O19Q40Q40K79m16q74q73o19m07k91k00j12j12j06
1564I47j07o7o6QRJ1J1J2J1k6k6k5k6J2J2J2J2N0N0n6n6j3j4O3O2L0L0j5j6n9n8o5K6J21J20
1559I14Q1Q1J48J48R3Kj42j42j24l2L6L5M2M2M6M6M6M7O3O4O9O9K06K97K36K37J14l6k12l03
1556B171l01k10j26q1p1p1k3k3L6L6Q1Q1J18J18Kq8j59j59j64j65o7o8RQP8P8L3L2o1o1o1
1552I22o2M3M2M3M3KLm3m2j5j4j4j5n9o0j5j5J7J7k9k9q4q5qrN3N2k2k3j%j%QQN3N3j2j2n8
$$ plain form
1577 15140 14492 12000 9013 6600 4926 3825 3116 2678 2359 2040 1814 1739 1728 1627 1510 1393 1373 1352 1332 1312 1270 1228 1186 1143
1574 1143 1170 1197 1224 1251 1246 1242 1308 1373 1444 1425 1360 1386 1446 1506 1520 1625 1828 2030 2299 2779 3436 4306 5534 7396 9625 11220 11235 9710
1571 9710 7521 5543 4094 3099 2415 2003 1814 1624 1475 1326 1253 1179 1110 1042 979 915 832 840 902 964 973 981 989 998 982 967 951 936 946 957
1567 957 968 979 984 988 993 997 1049 1101 1198 1295 1392 1490 1686 1972 2379 2998 3838 4678 4957 4541 3667 2794 2175 1768 1477 1277 1165 1053 947
1564 947 840 773 707 715 724 735 746 758 769 743 717 692 666 678 690 702 714 764 814 758 702 689 675 738 800 830 860 845 829 770 712 647 673 794 914
1559 914 995 1076 1224 1372 1465 1467 1325 1183 1059 1027 1063 1098 1140 1182 1228 1274 1320 1367 1430 1494 1563 1632 1838 2135 2371 2608 2722 2686 2474 2171
1556 2171 1870 1660 1534 1453 1382 1311 1288 1265 1301 1337 1418 1499 1617 1735 1737 1649 1490 1331 1167 1002 935 867 876 884 962 1040 1073 1105 1044 983 922
1552 922 860 903 945 988 1031 1033 1036 993 951 936 922 908 893 834 774 759 744 761 778 749 720 636 551 543 534 587 639 617 594 593 593 592 592 600 608 661 714 702 690 632
1547F32n8L0K9j5o1j7P3P1k1l2l3QPM1M1l4l5k8k9Km2n7L4N6N6kllkJ1J1Q7Q6j8j8o4o3o3
1542E77o3M3M3k4k4N1R5M7m5r1m6M5M5k7k8l3l4M2M2j9k0K6K6j8j8j7j8j8j8o9K2J05J06L1
1538G16n9q3PN6N6klklo1o2J3J4j9k0k5O6N6N6m4m4K4K3O9O9N1N2p9p8r1%onJ1J1J18J17J12
1533A011J12K66K65K20Rj90j90j90j89j14j14jjm6m6n3n3ppj3j3L2L2mmN0J41J54J53J54J53
1530A517K9o2q6q7o8o9j13j14l1l2L9L9K4o6j15j15l3N8N8l2q5q4j1P9N8l4n2n2k1k2k1k1
1526D75O8O8K3K3RJ0l6l5L0L0L0L1QRRQk2k1k2k1ll%%k0K5M2l4j13j14M6J21O0j7LM8M7Jj6
1521G47j6o2o1j3O3R7R8mp9j19p4J7O2J7n9l9OL8L7M0M0l1l1J5R0J00N5nnj1j1j1j1J0J0l5
1517H65l5m6m7jP5Q8M3m7r3m8K8K8K8m5m4m5m5M5M5M4M5RRQRm6m6m3m3O3J09L5m1p1p2l1l1
$$ plain form
1547 632 574 604 633 618 557 540 613 684 663 631 598 606 613 654 695 661 626 598 569 571 529 472 506 562 618 616 613 610 608 619 630 717 803 785 767 703 640 577
1542 577 514 557 600 576 552 603 698 745 700 609 563 608 653 626 598 565 531 573 615 596 576 602 628 610 592 575 557 539 521 452 474 579 685 716
1538 716 657 574 581 637 693 691 688 686 683 622 560 573 587 568 548 523 589 645 701 657 613 637 660 729 798 849 901 822 744 653 653 647 642 653 664 782 899 1011
1533 1011 1123 1389 1654 1874 1883 1693 1503 1313 1124 1010 896 895 894 848 802 749 696 689 682 669 656 688 720 716 712 762 903 1057 1210 1364 1517
1530 1517 1546 1484 1398 1311 1243 1174 1061 947 916 884 923 962 986 920 805 690 657 715 773 741 656 572 561 640 698 664 612 560 539 517 496 475
1526 475 543 611 634 657 666 676 640 605 635 665 695 726 734 743 752 760 738 717 695 674 671 668 668 668 648 673 715 681 568 454 500 621 681 664 667 715 762 763 747
1521 747 731 669 608 595 658 755 853 849 770 651 577 594 656 673 614 575 581 619 656 696 736 705 674 689 779 879 934 929 924 913 902 891 880 890 900 865
1517 865 830 784 737 736 811 899 942 895 802 754 782 810 838 793 749 704 659 704 749 793 838 847 856 864 873 827 781 738 695 758 867 902 861 790 718 687 656
1512F56K5K5K5K5J2J2J2J2%%M6M5N0M9m1m2j6j6o1o1L8L8L8L8L2L1L2L2j0j0j0j0m8m9m9m9
1508H01o8o9K2K2K2K3k3k3RQQQj8j9j9j9j6j6L0K9N6N6l5l5pppqllllK4K3K3K4m2m3m2m2m3
1503E75m3KKKKQ7Q7P0k2o1o1MLMLk0k1k1k1N2N2N3N2L6L6n4n5rrn5n5M8M7KKmmlmJ2J3J2J3
1497G49K0K1P1j9m4m5nnk0k1P0P0M7M6m4m4k9k9k9k9k3k4k3k3L0L0L0L0J1J1J1J1j2j2j2j2
1493G54L0K9L0K9j9j9j9j9j%%%kjkjj8j8j7j8j1j1L5L4ppn3n2K8K9K9K9k0k0k0k1l3l3J3J2
1488F39K4K3J00R9JKjkm8r4o8PJ2l3l2J4N7J1l6l6K3K3K4K3PPPQPPQPj6j6j6j7m2m1LLK0J9
1483F87K0J9LKKLklkkj4j4R2R2J5J6o0o0p6p5m5L1N6J0mmK3K4K3K4K7K8j8j8j3j3j3j2OOO
1478G67Ok2k1K4K3m3m3JKqrq4q4o5o4j9j9kkkklkM2M3M4M5l1l1RQQ4Q5OON1N1k6k6k6k6j7
$$ plain form
1512 656 681 706 731 756 768 780 792 804 804 804 850 895 945 994 953 911 895 879 818 757 795 833 871 909 941 972 1004 1036 1026 1016 1006 996 948 899 850 801
1508 801 733 664 686 708 730 753 730 707 716 724 732 740 722 703 684 665 649 633 663 692 748 804 769 734 727 720 713 705 702 699 696 693 717 740 763 787 745 702 660 618 575
1503 575 532 534 536 538 540 627 714 784 762 701 640 644 647 651 654 634 613 592 571 623 675 728 780 816 852 798 743 734 725 670 615 663 710 712 714 710 706 703 699 711 724 736 749
1497 749 769 790 861 842 798 753 748 743 723 702 772 842 889 935 891 847 818 789 760 731 708 684 661 638 668 698 728 758 769 780 791 802 790 778 766 754
1493 754 784 813 843 872 853 834 815 796 795 795 795 795 793 792 790 789 771 753 736 718 707 696 731 765 758 751 698 646 674 703 732 761 741 721 701 680 647 614 627 639
1488 639 663 686 786 885 886 888 887 885 837 743 675 682 694 661 629 643 700 711 675 639 662 685 709 732 739 746 753 761 768 775 783 790 774 758 742 725 683 642 645 648 668 687
1483 687 707 726 729 731 733 736 734 731 729 727 713 699 791 883 898 914 854 794 718 643 598 629 685 695 691 687 710 734 757 781 808 836 818 800 787 774 761 749 755 761 767
1478 767 773 751 730 754 777 734 691 692 694 686 677 593 509 444 380 361 342 340 338 336 334 331 329 371 414 458 503 472 441 450 458 542 627 633 639 690 741 715 689 663 637 620
1473F20j7j8j7J4J4J4J4L5L5j0j1k1k2k2k2M6M6JJK3K3K4K3J4J3l1l2l7l8q2q3M5M4M5M4N1
1468G26N0N0N0J2J1l5l4k8k7k8k8j1j2j1j2PQPPL3L3L2L3MLMLJ1J1l4l4j5j5j5j6J14J14Q
1464I76QN5N6n1n0k5k5k5k5J3J2J13J13R9Qj21j66r7pL5n4q5q5%%K3K4k2k1L1L1j3j4j1j0
1460F90j0j0L2L2L3L2ONRRj6K9N5l5q5q5%%M1M0kkK3O9M8m1k6k5l1l1l4l4l3l4K8K9K9K9k1
1455G13k0k0k1K9L0K9K9K9K9L0K9J2J2J2J2n2n3n2n2l0l0k9l0mllmmlmmPQPQO5O6O6O5Q5Q4
1450A038Q4Q5M3M3M3M3J4J5J4J5LLR3R4J12J13K1K2L8L8L8L7O2O1J07J07N2N3R2J83K81K82
1446C329K97K97L71N23P18Q09R08R07Q68P77O82N91M40K89J64J4k72n44o76o75p53r04r59
1443G201q68p63o72o47n57m37l45k89j99r2r3o6o6o6o6j24j24q4Prrm9m8l5l6j20j20l9N2
$$ plain form
1473 620 603 585 568 582 596 610 624 659 694 684 673 652 630 608 586 632 678 679 680 703 726 750 773 787 800 769 737 700 662 580 497 542 586 631 675 726
1468 726 776 826 876 888 899 864 830 802 775 747 719 708 696 685 673 680 688 695 702 735 768 800 833 837 840 844 847 858 869 835 801 786 771 756 740 854 968 976
1464 976 984 1039 1095 1044 994 969 944 919 894 907 919 1032 1145 1244 1252 1131 965 868 861 896 842 757 672 672 672 695 719 697 676 707 738 725 711 700 690
1460 690 680 670 702 734 767 799 805 810 819 828 812 841 896 861 776 691 691 691 732 772 770 768 791 860 908 867 841 816 785 754 720 686 653 619 647 676 705 734 713
1455 713 693 673 652 681 711 740 769 798 827 857 886 898 910 922 934 882 829 777 725 695 665 636 606 602 599 596 592 588 585 581 577 584 592 599 607 672 738 804 869 954 1038
1450 1038 1122 1207 1250 1293 1336 1379 1393 1408 1422 1437 1440 1443 1536 1630 1742 1855 1876 1898 1936 1974 2012 2049 2111 2172 2279 2386 2438 2491 2583 2766 3047 3329
1446 3329 3626 3923 4294 4817 5535 6344 7252 8159 9027 9804 10486 11077 11517 11806 11970 11984 11712 11168 10492 9817 9064 8160 7201
1443 7201 6333 5570 4898 4251 3694 3257 2912 2623 2424 2332 2239 2173 2107 2041 1975 1851 1727 1643 1650 1641 1632 1583 1535 1500 1464 1344 1224 1185 1237
1439A237M6M7m4m3KKq2q3l7l7m9m9M1M2K7K7j8j8q2q1m2M9L0L0k1O9N6l4o8o9L7L6n4n5K1
1435H33K0O6O6N9N9q6q6m1N0M4M4k9k9k9k9k1k0k1k0O3O3k1k2rQ2Q3rkkpqj9j9j8j9l0k9l0
1431H77k9Q3Q2Q3Q3opq2q1l9l8OPPPPPN1N2N1N1rj0rj0J2J3J2J2n1n0nnk9k9M7M7o9o8k4k3
1426I24K3K3K3K3N2N2k4k3poL8L9L3L3L3L3J6J7J7J7M8M8M7M8O9O8pojjm6m6j4j4j4j4L1L1
1421A563L2L1%%%%M9M9k7k7rj0L5L6L4L5L4L4L7L8L7L7J07J08J07J08J41J42J41J42J69J69
1417C342J68J69K98K97L42L43L85L85M85M86N09M20L15J64j7k29l25m16m63m63m68m69l16
1414D942l15l16l16k46k47k41k41k16j25j01j01j39j40l4J1l2j22r3m9l7l7l4l4o7o8o7o7
1411A468J2J2J2J1l7l7l8l7K2K2K2K2K1K1n5n5j2j3j2j2k9k9k8k9M6M6M6M6p5p4k9k9M3M4
$$ plain form
1439 1237 1283 1330 1286 1243 1245 1247 1165 1082 1045 1008 959 910 951 993 1020 1047 1029 1011 929 848 806 855 885 915 894 963 1019 985 917 848 885 921 867 812 833
1435 833 853 919 985 1044 1103 1017 931 890 940 984 1028 999 970 941 912 891 871 850 830 893 956 935 913 904 986 1069 1060 1058 1056 1049 1041 1022 1003 985 966 936 907 877
1431 877 848 931 1013 1096 1179 1173 1166 1084 1003 964 926 932 939 946 953 960 967 1018 1070 1121 1172 1163 1153 1144 1134 1146 1159 1171 1183 1132 1082 1077 1072 1043 1014 1061 1108 1039 971 947 924
1426 924 947 970 993 1016 1068 1120 1096 1073 1066 1060 1098 1137 1170 1203 1236 1269 1285 1302 1319 1336 1384 1432 1479 1527 1596 1664 1657 1651 1650 1649 1603 1557 1543 1529 1515 1501 1532 1563
1421 1563 1595 1626 1626 1626 1626 1626 1675 1724 1697 1670 1661 1651 1686 1722 1756 1791 1825 1859 1896 1934 1971 2008 2115 2223 2330 2438 2579 2721 2862 3004 3173 3342
1417 3342 3510 3679 3977 4274 4616 4959 5344 5729 6214 6700 7209 7629 7944 8108 8091 7862 7537 7121 6658 6195 5727 5258 4942
1414 4942 4627 4311 3995 3749 3502 3261 3020 2804 2679 2578 2477 2338 2198 2164 2175 2143 2021 1928 1879 1842 1805 1771 1737 1670 1602 1535 1468
1411 1468 1480 1492 1504 1515 1478 1441 1403 1366 1388 1410 1432 1454 1475 1496 1441 1386 1374 1361 1349 1337 1308 1279 1251 1222 1268 1314 1360 1406 1331 1257 1228 1199 1242 1286
1407A286l2l2n1n1N4N5N1N2R1R2kr3r5nQ2L6rql2l2l1l2M0M0l5l5O4O4O5O4nnmnK8K7K7K8
1402A652O9O9O9O9l0l0k9l0j1j1j0j1M0M0M0M0jjkjj3j2j3j3KJKJM6M6R1R2J19J20J19J20
1398B629L0K9j8j9n8j04q3PL3L4o6o6n6n6n6n6jjm1m0j4P8L5n6j20p4%Jk8k8J7J7k6k6k6k6
1393A765M3M4M4M3M7M7k8k9o1o0j6j5KKKKK2K2n4n4o8o8L7Q2N8l3n5n4j4j4j4j5O9O8J6p5
1389A688q2l7L7L7L9L8L8L9LLLLj6j6j6j6nnnnnon2n1K7K7K7K7L5L6L5L6J6J7J6J7lkklQP
1384A932QPK2K2K7K7J9J08J24P7J3p8q1J0Q3Q3M3M4K4K4K5K4p7p7jkJ3J3N2N3J6p4l4N7R1
1379B617Jp4k9L1L0m2m2L6L7rn3l3N7P5K9k5k4o8o7l2N8J14J13j1j0L5L4J8J7J7J7J7J7J7
1375B868J8K6K7j9j9k1k2K4K4O3O4J9J8K9K9L5L4N4J45K04K50K51K50K53K54L57L57M22L77
$$ plain form
1407 1286 1254 1222 1171 1120 1174 1229 1280 1332 1423 1515 1513 1420 1325 1320 1402 1438 1429 1421 1389 1357 1326 1294 1334 1374 1339 1304 1368 1432 1497 1561 1556 1551 1547 1542 1570 1597 1624 1652
1402 1652 1721 1790 1859 1928 1898 1868 1839 1809 1798 1787 1777 1766 1806 1846 1886 1926 1925 1924 1922 1921 1908 1896 1883 1870 1872 1873 1875 1876 1922 1968 2059 2151 2270 2390 2509 2629
1398 2629 2659 2688 2670 2651 2593 2489 2406 2413 2446 2480 2414 2348 2292 2236 2180 2124 2123 2122 2081 2041 2027 2105 2140 2084 1964 1890 1890 1891 1863 1835 1852 1869 1843 1817 1791 1765
1393 1765 1808 1852 1896 1939 1986 2033 2005 1976 1915 1855 1839 1824 1826 1828 1830 1832 1854 1876 1822 1768 1700 1632 1669 1751 1809 1776 1721 1667 1653 1639 1625 1610 1679 1747 1763 1688
1389 1688 1606 1569 1606 1643 1682 1720 1758 1797 1800 1803 1806 1809 1793 1777 1761 1745 1740 1735 1730 1725 1720 1714 1662 1611 1638 1665 1692 1719 1754 1790 1825 1861 1877 1894 1910 1927 1924 1922 1920 1917 1925 1932
1384 1932 1940 1947 1969 1991 2018 2045 2064 2172 2296 2373 2386 2308 2227 2237 2320 2403 2446 2490 2514 2538 2563 2587 2510 2433 2432 2430 2443 2456 2508 2561 2577 2503 2469 2526 2617
1379 2617 2618 2544 2515 2546 2576 2534 2492 2528 2565 2556 2503 2470 2527 2602 2631 2606 2582 2514 2447 2415 2473 2587 2700 2689 2679 2714 2748 2766 2783 2800 2817 2834 2851 2868
1375 2868 2886 2912 2939 2920 2901 2880 2858 2882 2906 2969 3033 3052 3070 3099 3128 3163 3197 3251 3396 3600 3850 4101 4351 4604 4858 5215 5572 5994 6371
1372F371K70J80J10J9k2o7p5l0m0q5q2l6j7j6q9q9q3q3qpl7l6l7l6K4K5K5K5PPOPJ05J05Q0
1367F391j0l7l7L3L3k7k8lQ8P5P4L5L5O5O5O5O5J7J6J7J7N8N8N8N9L6L6L6L6Q8Q7Q8Q8N3N3
1363G783R9R8J41J41O5O5R9R9J99K00J56O6M2M1J63J62J62J63J08J09J08J09J69J69J69J70
1360A1055J67J67K13K12J74J74K50K49K67K66K67K66K44K43K44K44L15L16L15L16L42L42L42
1357A6990L42L02L02L57M48M89M88M19M19N17N17N63N62O34O35O79O80P00P00P46P45P42P43
1354B9719Q17Q18Q95Q95J001J001J077J077J183J182J204J203J345J496J626J626J696J787
1352E1648J936K026K102K254K468K619K733K884L092L363L560L711L924M196M480M811N135
1350A06942N528N912O366O894P529Q121Q816R570J0507J1522J2640J3930J5350J6981J8824
$$ plain form
1372 6371 6641 6821 6931 6950 6928 6861 6786 6756 6716 6631 6549 6513 6496 6480 6391 6302 6219 6136 6128 6121 6084 6048 6011 5975 5999 6024 6049 6074 6081 6088 6094 6101 6206 6311 6391
1367 6391 6381 6344 6307 6340 6373 6346 6318 6315 6403 6478 6552 6587 6622 6687 6752 6817 6882 6899 6915 6932 6949 7007 7065 7123 7182 7218 7254 7290 7326 7414 7501 7589 7677 7730 7783
1363 7783 7882 7980 8121 8262 8327 8392 8491 8590 8789 8989 9145 9211 9253 9294 9457 9619 9781 9944 10052 10161 10269 10378 10547 10716 10885 11055
1360 11055 11222 11389 11602 11814 11988 12162 12412 12661 12928 13194 13461 13727 13971 14214 14458 14702 15017 15333 15648 15964 16306 16648 16990
1357 16990 17332 17634 17936 18293 18741 19230 19718 20137 20556 21073 21590 22153 22715 23349 23984 24663 25343 26043 26743 27489 28234 28976 29719
1354 29719 30536 31354 32249 33144 34145 35146 36223 37300 38483 39665 40869 42072 43417 44913 46539 48165 49861 51648
1352 51648 53584 55610 57712 59966 62434 65053 67786 70670 73762 77125 80685 84396 88320 92516 96996 101807 106942
1350 106942 112470 118382 124748 131642 139171 147292 156108 165678 176185 187707 200347 214277 229627 246608 265432
1348B65432K0913K3300K6035K9147L2789L6929M1668M7078N3124N9741O6778P3879Q0463Q5569
1347I42845Q7839Q5634P7283O1782L9291J1824j7359m4523o6565q1764q9776r1620q8892q3303
1345G42696p6174o8470o0783n3683m7240m1468l6392l2011k8192k4899k2017j9509j7420j5578
1343A98860j3911j2492j1271j0214r254q379p651p016o424n849n393m999m619m225l804l533
1341G9826l272k999k788k577k410k199k046j894j816j725j591j501j398j308j210j165j151
1339D6776j060r62q11p19o74o31o30n72n27m68l77k77j86r1m6k8O3K42M54N16N16M97O48Q04
1336D2457R56J046J197J370J521J707J978K258K530K826L099L468L801M140M353M437M437
1334H7581M295M084L739L345L015K925L057L328L767M281M847N240N357N146M704L948L037
$$ plain form
1348 265432 286345 309645 335680 364827 397616 434545 476213 523291 576415 636156 702934 776813 857276 942845
1347 942845 1030684 1116318 1193601 1255383 1294674 1306498 1289139 1244616 1178051 1096287 1006511 914891 825999 742696
1345 742696 666522 598052 537269 483586 436346 394878 358486 326475 298283 273384 251367 231858 214438 198860
1343 198860 184949 172457 161186 150972 141718 133339 125688 118672 112248 106399 101006 96007 91388 87163 83359 79826
1341 79826 76554 73555 70767 68190 65780 63581 61535 59641 57825 56100 54509 53008 51610 50302 49092 47927 46776
1339 46776 45716 44754 43943 43224 42550 41919 41289 40717 40190 39722 39345 39068 38882 38791 38745 38717 38780 39022 39476 39992 40508 41005 41653 42457
1336 42457 43413 44459 45656 47026 48547 50254 52232 54490 57020 59846 62945 66413 70214 74354 78707 83144 87581
1334 87581 91876 95960 99699 103044 106059 108984 112041 115369 119136 123417 128264 133504 138861 144007 148711 152659 155696
1332A55696K100J508J235J351J804K442L138L696L968L802L167K031M90j195k736l869m504
1330A74124m670m337l712k957k235j783j662k056k731l608m453n149n625n775n543n150m641
1328A08037m126l656l385l305l456l689m022m337m670m799m800m598m386m097l705l315k983
1326D0708k749k538k284k012j819j729j588j377j153j063j070r79q64p74q13q14p12o21n37
1323A5212n36m98m98m52m52m58m58m58m58l73l72l73l72l62l61l61l61l76l76l75l76l91l90
1321E725l60m05m13l23k32q1K2O7J04J50K12K58J81R0M8M8M3M3k6k5K0K0L6L6j6j06j11o5
1317D940POj01j46j00qM9Lm5r1j21j22p8p9MNp2p1j04j04JJn1n2n2n2l4l4l4l4l8l8l8l8m
1313C275mmmm7m7m7m6m2m1m1m1j5j5j5j5j5j5j6j5j0j0j1j0k2k2k2k1k5k5k5k5l7l6l6l6k6
$$ plain form
1332 155696 157796 159304 160539 161890 163694 166136 169274 172970 176938 180740 183907 185938 186428 185233 182497 178628 174124
1330 174124 169454 165117 161405 158448 156213 154430 152768 150712 147981 144373 139920 134771 129146 123371 117828 112678 108037
1328 108037 103911 100255 96870 93565 90109 86420 82398 78061 73391 68592 63792 59194 54808 50711 47006 43691 40708
1326 40708 37959 35421 33137 31125 29306 27577 25989 24612 23459 22396 21326 20347 19483 18709 17896 17082 16370 15749 15212
1323 15212 14676 14178 13680 13228 12776 12318 11860 11402 10944 10571 10199 9826 9454 9092 8731 8370 8009 7633 7257 6882 6506 6115 5725
1321 5725 5365 4960 4547 4224 3992 3911 3933 4000 4104 4254 4466 4724 4905 4995 5043 5091 5134 5177 5151 5126 5146 5166 5202 5238 5222 5116 5005 4940
1317 4940 4947 4953 4852 4706 4606 4598 4647 4650 4605 4514 4393 4271 4193 4114 4118 4123 4051 3980 3876 3772 3773 3774 3723 3671 3619 3567 3533 3499 3465 3431 3393 3355 3317 3279 3275
1313 3275 3271 3267 3263 3216 3169 3122 3076 3034 2993 2952 2911 2896 2881 2866 2851 2836 2821 2805 2790 2780 2770 2759 2749 2727 2705 2683 2662 2637 2612 2587 2562 2525 2489 2453 2417 2391
1309B391k6k6k6k3k3k3k2j40j40n7L3M0mK6K7k0j9k0j9qqqqm4m4m4m4K4K3K0K0l1p6m8K7M7
1304A727M6M6M7K4n0j10o3J0J1o2o2l9l8O5J11R1j5q8q9J3J3J2J3M3M3M3M2POl9l9l3l2p8
1300A576p8L0K9j5j6L3L2j0j0j9K6M6l0n2pL3j1l1l0l4l3j5j4L0L1J3J3J3J3j6j6K9K9k4k4
1296A491r9j45q9j3J2l4r6r6k3k3l7l6L9L9P5P5J45J46J03K8onk0j9N6N6L8L8L8L8P8P8KL
1292A837L3L2p3p3k3k3k3k3p8p8K8K7j3j3j4j3kklkp4p4KJP8P8KLn2n1K4K4QQRQJ4J5l1l1
1287A462qqrqkkm7m7KKJKJ2J2l3l3l9l9POj0j0j0j1L7L8L7L7poL9L9J7J6J7J6p3p3k7k8k9
1282A240l0k9l0L7L7qrkkjkK7K8K7K8m2m1L4L4P6P7P6P7K4K5K5K4J12J13J12J12%%M5M5R1
1277B330R2R1R1J59J58J59J58K80K81K80K81L55L55L55L55M49M49M83M83L52J72l8k20l75
$$ plain form
1309 2391 2365 2339 2313 2290 2267 2244 2222 2082 1942 1885 1918 1958 1954 1980 2007 1987 1968 1948 1929 1921 1913 1905 1897 1853 1809 1765 1721 1745 1768 1788 1808 1777 1701 1653 1680 1727
1304 1727 1773 1819 1866 1890 1840 1730 1667 1677 1688 1626 1564 1525 1487 1552 1663 1754 1739 1651 1562 1575 1588 1600 1613 1656 1699 1742 1784 1791 1797 1758 1719 1686 1654 1576
1300 1576 1498 1528 1557 1542 1526 1559 1591 1581 1571 1552 1578 1624 1594 1542 1535 1568 1557 1526 1496 1462 1429 1414 1400 1430 1461 1474 1487 1500 1513 1497 1481 1510 1539 1515 1491
1296 1491 1392 1247 1158 1145 1157 1123 1027 931 908 885 848 812 851 890 965 1040 1185 1331 1434 1462 1456 1451 1431 1412 1468 1524 1562 1600 1638 1676 1754 1832 1834 1837
1292 1837 1870 1902 1829 1756 1733 1710 1687 1664 1586 1508 1536 1563 1550 1537 1523 1510 1508 1506 1503 1501 1427 1353 1355 1356 1434 1512 1514 1517 1465 1414 1438 1462 1470 1478 1487 1495 1509 1524 1493 1462
1287 1462 1454 1446 1437 1429 1427 1425 1378 1331 1333 1335 1336 1338 1350 1362 1329 1296 1257 1218 1225 1231 1221 1211 1201 1190 1227 1265 1302 1339 1332 1326 1365 1404 1421 1437 1454 1470 1397 1324 1297 1269 1240
1282 1240 1210 1181 1151 1188 1225 1217 1208 1206 1204 1203 1201 1228 1256 1283 1311 1269 1228 1262 1296 1372 1449 1525 1602 1626 1651 1676 1700 1812 1925 2037 2149 2149 2149 2194 2239 2330
1277 2330 2422 2513 2604 2763 2921 3080 3238 3518 3799 4079 4360 4715 5070 5425 5780 6229 6678 7161 7644 7996 8168 8130 7910 7535
1274G535m66n17n16m67m67l73l73l90l44k69j79j84j85j79j78j22j21j64j63n3po6j57j38
1271A457m7J6O2N1m0l1l1j8j9o3o4l2l3l2l3J8J8l1l0r9j44p8J1R1R1n5n5l9l9POM4M4M4M5
1267I92Q3Q4ppJ3J4l2l3j7j8j8j8J3J3p7p7PQPQK0K0K0K0J4J4J4J5O0O0Jm4l3N7M9M9L5L4
1262A343L5L4J%J%L2L1j4j4l1l1N9O0J7J7k9k8j8j8j8j8k2k3O8O8mmm4m4PQ3J25N0m7r3p2
1258A459p2n4n5L6L6l3l4l4l4j8j9j8j9LKKL%%q7q8mM1J6o0p8l3j4j5J5O0P7Kr8r7j2j2M7
1253H11M7M7M7l5l4l5l4J4J5J4J5j7j7j7j6J4J4l1l1l6l5N5N5OPPPK6K6o0o0rO6O7rn8n8K8
1249G96K8rj0L6L5K6K5k0k0K0J9K0K0k1k0k1k1P1P0K2n4q0p9l9l9rrL7L6J5J5J5J4l6l6l7
1244G60l6llM3M2O3O3k7k8K3K2m7m7l2O0L6qm0ON8J03Q5Q5Q8Q8klkkM6M6n4n4LR4O9K3l1l2
$$ plain form
1274 7535 7069 6552 6036 5569 5102 4729 4356 3966 3622 3353 3174 2990 2805 2626 2448 2326 2205 2041 1878 1825 1818 1752 1595 1457
1271 1457 1410 1426 1488 1539 1499 1468 1437 1419 1400 1337 1273 1241 1208 1176 1143 1161 1179 1148 1118 1019 875 797 808 899 990 935 880 841 802 809 815 859 903 947 992
1267 992 1075 1159 1152 1145 1158 1172 1140 1107 1090 1072 1054 1036 1049 1062 985 908 915 923 930 938 958 978 998 1018 1032 1046 1060 1075 1135 1195 1196 1152 1119 1176 1225 1274 1309 1343
1262 1343 1378 1412 1413 1413 1414 1414 1446 1477 1463 1449 1418 1387 1446 1506 1523 1540 1511 1483 1465 1447 1429 1411 1389 1366 1434 1502 1498 1494 1450 1406 1413 1496 1621 1671 1624 1531 1459
1258 1459 1387 1333 1278 1314 1350 1317 1283 1249 1215 1197 1178 1160 1141 1144 1146 1148 1151 1151 1151 1064 976 972 1013 1029 969 891 858 844 829 844 904 981 983 885 788 776 764 811
1253 811 858 905 952 917 883 848 814 828 843 857 872 855 838 821 805 819 833 802 771 735 700 755 810 816 823 830 837 863 889 829 769 760 826 893 884 826 768 796
1249 796 824 815 805 841 876 902 927 907 887 907 926 946 966 945 925 904 883 954 1024 1046 992 912 833 794 755 746 737 774 810 825 840 855 869 833 797 760
1244 760 724 721 718 761 803 866 929 902 874 897 919 872 825 793 853 889 881 841 847 905 1008 1093 1178 1266 1354 1352 1349 1347 1345 1391 1437 1383 1329 1332 1426 1495 1518 1487 1455
1239A455J1J1Q3Q2PPpoO9O9j4j4L2L1J03J03M9m3j44j44p5p5k4k5K1K1k6k6k6k6J9J8J9J8
1235A553M2M2M2M2j4j5j5j4mmlmr1r0r1r1K7K6K6K6M0L9l6l6L0K9j6j6j3j4rqK2J12J15K4
1231A653k4K2O6O6L7L8J07J08N6l4n9n9k4k4K2K1l5l6l5l6m3m3m3m3m3m4m3m3NONNN5N4RR
1226A633m9m9K6K6M1M0M1M0P7P7M4l2p2p1jjK5K6k0k0l9l9l9l9j3j3j2j3j4j3O2O2m1m1o2
1222A527j7N7J33J16P0j1n7l4l4J2J3J2J2o6o5o6o6k4k4k4k4mnmmJ5J5J4J5NNNNK3K4K4K3
1218A596j5j5j5j5M9M9M9M9k3k3k4k3k3k4k3k4o8o8o8o9J1J1QRl1p7r3j8J9J9K4K4k0k0K6
1213A164K6m3m2LM8K8m8p3k8OORRl3l2l3l2M7M7k9k9k4k4K1K2L8L8ppJ9J9N8N9l3j24j24l3
1209H69K8K8j2j2N6N7k0j9j5j5j5j4l3l3M3M2RRN4N5j3j3j3j2K7K7P3P2J11J12n5n5m2m2L3
$$ plain form
1239 1455 1466 1477 1560 1642 1649 1656 1649 1643 1712 1781 1767 1753 1785 1816 1919 2022 2071 2028 1884 1740 1665 1590 1566 1541 1562 1583 1557 1531 1505 1479 1498 1516 1535 1553
1235 1553 1595 1637 1679 1721 1707 1692 1677 1663 1659 1655 1652 1648 1557 1467 1376 1285 1312 1338 1364 1390 1430 1469 1433 1397 1427 1456 1440 1424 1411 1397 1388 1380 1402 1514 1629 1653
1231 1653 1629 1651 1717 1783 1820 1858 1965 2073 2129 2095 2036 1977 1953 1929 1951 1972 1937 1901 1866 1830 1787 1744 1701 1658 1615 1571 1528 1485 1490 1496 1501 1506 1561 1615 1624 1633
1226 1633 1584 1535 1561 1587 1628 1668 1709 1749 1826 1903 1947 1915 1843 1772 1771 1770 1795 1821 1801 1781 1742 1703 1664 1625 1612 1599 1587 1574 1560 1547 1609 1671 1630 1589 1527
1222 1527 1510 1567 1700 1816 1886 1875 1818 1784 1750 1762 1775 1787 1799 1733 1668 1602 1536 1512 1488 1464 1440 1436 1431 1427 1423 1438 1453 1467 1482 1487 1492 1497 1502 1525 1549 1573 1596
1218 1596 1581 1566 1551 1536 1585 1634 1683 1732 1709 1686 1662 1639 1616 1592 1569 1545 1477 1409 1341 1272 1283 1294 1302 1311 1280 1203 1110 1092 1111 1130 1154 1178 1158 1138 1164
1213 1164 1190 1147 1105 1108 1156 1184 1136 1063 1035 1041 1047 1056 1065 1032 1000 967 935 982 1029 1000 971 947 923 944 966 1004 1042 1035 1028 1047 1066 1124 1183 1150 1026 902 869
1209 869 897 925 913 901 957 1014 994 975 960 945 930 916 883 850 893 935 944 953 1007 1062 1049 1036 1023 1011 1038 1065 1138 1210 1321 1433 1378 1323 1281 1239 1272
1205A272L3PPPPk1k1k0k1M8M8M8M8P1P0R5J85K45K45L79O51R37Q46K39n17r02q58n79l06k12
1201B031j21p9q0r6r6r7r6K2K3K2K3mmmmjkjjrqL6L7P7P7k8p2m4M7J23J24M4m6p1p1%%m5m5
1196A561qqqqJ3J3J3J3q2q1onK3K4K3K4O6O6O7O6J0RJ0J0Q8Q9Q9Q8J7J7J6J7kllkj4j4j4j4
1191B160L5L5L5L5k1k2K4K4J5J6o0o0L7L7J13J13L7L8L7L8M2M2M2M2R1R1R0R1R4R5J8J9m7
1187C376m7jkN5N5N5N5P5P5P5P5J10J09J09J09J36J35J36J35K12K13K12K12K40K40J95J95
1184F544K36K36M02M01L30L30M35M35N06N07N81N82O41O41O50O50P79R31J031J181J354J564
1181B0947J799K131K520L032L619M313N011N827O560P073P036O342M974L010P24j603l729
1179G9586n331o229o441o158n523m761m004l272k577j973j519j149q17n80l69j20R2K70M81
$$ plain form
1205 1272 1305 1312 1319 1326 1333 1312 1291 1271 1250 1298 1346 1394 1442 1513 1583 1678 1863 2108 2353 2732 3383 4320 5166 5405 4888 3986 3128 2549 2243 2031
1201 2031 1910 1831 1751 1655 1559 1462 1366 1388 1411 1433 1456 1452 1448 1444 1440 1439 1437 1436 1435 1426 1418 1454 1491 1568 1645 1617 1545 1501 1548 1671 1795 1839 1793 1722 1651 1651 1651 1606 1561
1196 1561 1553 1545 1537 1529 1542 1555 1568 1581 1499 1418 1412 1407 1430 1454 1477 1501 1567 1633 1700 1766 1776 1785 1795 1805 1893 1982 2071 2159 2176 2193 2209 2226 2224 2221 2218 2216 2202 2188 2174 2160
1191 2160 2195 2230 2265 2300 2279 2257 2281 2305 2320 2336 2276 2216 2253 2290 2403 2516 2553 2591 2628 2666 2708 2750 2792 2834 2925 3016 3106 3197 3291 3386 3404 3423 3376
1187 3376 3329 3328 3326 3381 3436 3491 3546 3621 3696 3771 3846 3956 4065 4174 4283 4419 4554 4690 4825 5037 5250 5462 5674 5914 6154 6349 6544
1184 6544 6780 7016 7418 7819 8149 8479 8914 9349 9855 10362 10943 11525 12166 12807 13457 14107 14886 15817 16848 18029 19383 20947
1181 20947 22746 24877 27397 30429 34048 38361 43372 49199 55759 62832 69868 76210 81184 84194 84918 83315 79586
1179 79586 74255 68026 61585 55427 49904 45143 41139 37867 35290 33317 31798 30649 29832 29252 28883 28763 28855 29125 29606
1177B9606P26R38J167J438J813K326K953L709M607N605O724P841Q646Q737P902N998L287J14
1175A04137l013n641p398q093p884p130n996m697l461k404j512o36K25J102J962K960M110
1173E6631N349O561P619Q321Q231P146N002K133j101m288o796q325q779q378p442o207n029
1170E0648l911k974k147j452r27n34j45J88N16P88J023J173J457J789K149K542L013L709M642
1168F1547N699O824Q306J0126J2090J3983J5342J5874J5120J2732Q835L790j739p087j1590
1166A69852j4622j5921j5771j4652j3011j1108r227p504o085m906l958l082k402j889j363
1164D4351r11n48k76j10J02M05O77J017J471K025K660L416M352N474O592P706Q583Q975Q522
1162A04483P068M741J869j365m447o833q224q616q235p298o068m769l560k443j434m36O09
$$ plain form
1177 29606 30332 31270 32437 33875 35688 38014 40967 44676 49283 54888 61612 69453 78099 86836 94738 100736 104023 104137
1175 104137 101124 95483 88085 79992 72108 64978 58982 54285 50824 48420 46908 46272 46497 47599 49561 52521 56631
1173 56631 61980 68541 76160 84481 92712 99858 104860 106993 105892 101604 94808 86483 77704 69326 61884 55677 50648
1170 50648 46737 43763 41616 40164 39237 38703 38558 38746 39262 40050 41073 42246 43703 45492 47641 50183 53196 56905 61547
1168 61547 67246 74070 82376 92502 104592 118575 133917 149791 164911 177643 186478 190268 188529 181442 169852
1166 169852 155230 139309 123538 108886 95875 84767 75540 68036 61951 57045 53087 50005 47603 45714 44351
1164 44351 43440 42892 42616 42506 42608 43013 43690 44707 46178 48203 50863 54279 58631 64105 70697 78403 86986 95961 104483
1162 104483 111551 116292 118161 116796 112349 105516 97292 88676 80441 73143 67075 62306 58746 56303 54869 54433 55042
1160E5042J607K678L858N209O629P989Q987R326Q691O853L982M21l236o537q984j0279j0371
1158H1865r640q463p167n867m656l597k839k204j682j228q02m69j97J4K30N01P53R64J221
1156C6737J553J958K471L018L654M414N291O098O794P130O979O068M346K084n46l151n478
1154H9420p215q153q273p880p195o379n541m664l853l157k640k248j923j651j435j225j007
1152A4981q56q37q37p26p26o35o36o64o63n13n13l82l83l82l82k89k89j99j98k21k20j76j75
1149D079j15j15p1k5n6j46j93j48p8p9j50j51p4p4p3p4o0n9o0n9l9l9l8l9p0p0o4o4m3M8M2
1145A843M3J5J6J6J6n0n1K5K5j3j4n9n9j8j8o3o3p5p4l0k9L8L7r8r9l8l8l8l8q9r0q4q4l6
1141G26N3P9P8P8P8Km2j8P3M5jl2l1mm8q7LN5N5K7K6j8j9J5J5l0l0n8n8j0j0l5J1L9n1j37
$$ plain form
1160 55042 56649 59327 63185 68394 75023 83012 91999 101325 110016 116869 120851 121272 118036 111499 102515 92236 81865
1158 81865 72225 63762 56595 50728 46072 42475 39636 37432 35750 34522 33720 33251 33054 33068 33298 33799 34552 35516 36737
1156 36737 38290 40248 42719 45737 49391 53805 59096 65194 71988 79118 86097 92165 96511 98595 98049 94898 89420
1154 89420 82205 74052 65779 57899 50704 44325 38784 34120 30267 27110 24470 22222 20299 18648 17213 15988 14981
1152 14981 14125 13288 12451 11725 10999 10364 9728 9064 8401 7888 7375 6993 6610 6228 5846 5557 5268 5069 4871 4650 4430 4254 4079
1149 4079 3964 3849 3778 3753 3697 3551 3358 3210 3132 3053 2903 2752 2678 2604 2531 2457 2397 2338 2278 2219 2180 2141 2103 2064 1994 1924 1860 1796 1753 1801 1843
1145 1843 1886 1901 1917 1933 1949 1899 1848 1873 1898 1885 1871 1812 1753 1735 1717 1654 1591 1516 1442 1412 1383 1421 1458 1360 1261 1223 1185 1147 1109 1020 930 846 762 726
1141 726 779 858 936 1014 1092 1094 1052 1034 1107 1152 1151 1119 1088 1084 1036 949 952 1007 1062 1089 1115 1097 1078 1093 1108 1078 1048 990 932 922 912 877 888 927 876 739
1136G39r1J1J0l1p7%R1J03N8J4J3l0k9J5J5K6K6K6K6J7J7r0q9j2j3j2j2o2o1J4J4K2K3K2K3
1132G16JJ%JK2K2K2K2K5K5K4K5n7n8n5K1P8P9K0n6r0r0J1J1M3M2lll4l3l4l3l8l9QPM4M5j
1127F91%K4K5K5K5K9K9j6j6KKP3P3N4k2q5q5JJJJK0K0J9K0j4j4N7N6K2n4n7n7j8j7j7j8kk
1123G76M3M3N5N4RRj0j0j0j1jkkkj3j3j3j3L1L2L1L1n0n1nnJ9K0J9K0M3M3l2p7q3qN3N3L1
1118A004L1L1L1j5j4j5j4k3k3M8M8jp5l6M1O9or5r5J1J1J1J1K6K5j5j5k0N6J14J15L0m5kl
1113A201l4l5l4l5j8j8j8j8K4K3K4K3%%j%L6L7L7L6l4l5J1J1L4L4L5L4k9l0k9k9mmn0m9M5
1109A141M4M5M4L5L5m0m1k9k9k9k9Q0Q1K0n6n3qPQJ2J2J2J2n6n6n6n5j0rj0rl9l8L7L8j1j1
1104I89L4L5J08J08M5l0onppM4Q9J06L0m7m7N3N4K5K5q1q1j43j42k2N4L1j4n9o0noP0P0rr
$$ plain form
1136 739 648 659 669 638 561 561 652 755 813 827 840 810 781 796 811 837 863 889 915 932 949 859 770 758 745 733 721 659 598 612 626 648 671 693 716
1132 716 717 718 718 719 741 763 785 807 832 857 881 906 849 791 736 757 835 914 934 878 788 698 709 720 763 805 802 799 765 732 698 665 627 588 596 603 647 692 691
1127 691 691 715 740 765 790 819 848 832 816 818 820 893 966 1020 998 913 828 829 830 831 832 852 872 891 911 897 883 940 996 1018 964 907 850 832 815 798 780 778 776
1123 776 819 862 917 971 980 989 979 969 959 948 947 945 943 941 928 915 902 889 920 952 983 1014 964 913 908 903 922 942 961 981 1024 1067 1035 958 875 867 920 973 1004
1118 1004 1035 1066 1097 1082 1068 1053 1039 1016 993 1041 1089 1088 1013 977 1018 1087 1081 986 891 902 913 924 935 961 986 971 956 936 992 1106 1221 1251 1206 1204 1201
1113 1201 1167 1132 1098 1063 1045 1027 1009 991 1015 1038 1062 1085 1085 1085 1084 1084 1120 1157 1194 1230 1196 1161 1172 1183 1217 1251 1286 1320 1291 1261 1232 1203 1199 1195 1145 1096 1141
1109 1141 1185 1230 1274 1309 1344 1304 1263 1234 1205 1176 1147 1227 1308 1328 1272 1219 1211 1218 1226 1238 1250 1262 1274 1218 1162 1106 1051 1041 1032 1022 1013 974 936 973 1011 1000 989
1104 989 1023 1058 1166 1274 1319 1289 1283 1278 1271 1264 1308 1397 1503 1533 1486 1439 1492 1546 1571 1596 1515 1434 1291 1149 1127 1181 1212 1198 1139 1079 1074 1068 1138 1208 1199 1190
1100A190O2O1K3n3q1l5%jLLN1N2J1J1O3J38J22P6O8O9K4q2j11l6K1K1o9o9j14j14n7n6j2j1
1096A168L9L9L8L9k6k7P5P5J4o1o5J2O2J6n9n8l9m0l9l9rqn5n4j2j3L3L2k2k3k3k2J02J02
1092A152K6K7QQQQP6P6P6P6j6j6J20J20J10J10O1O2N8J3n2j28j17p1k5k6r0q9q9q9m6m6j%
1088A294ppqpo8o9PPj9k0N6N5O2O1m4m4m6m5%jM0M0L9M0J4J5J5J4J0J0N3k3m8m8n0n0ON1O8
1083A353qn4n4M7M8oojjl3M3J01J01lp8o1j6l6l6l3l4k1k2k2k2K6K6K6K5%jLKN3R8J16M0m1
1078A519m0R1R0L7L6L6L6J0J1l5l5m0m0L6L5k1k1k1k1NNJ%j0q7p2k7j7o2n6j2J9O5O7K1l9
1074A464m0m3m3k8k9M7M7jjkjQQPQk1k2N4N4K3K3K3K3%J%%Q8Q7Q7Q8MNNMM4M3M3M4m6m7L0
1069B038K9OON1N1kkM3M3j9j9K6K6LKM7R2L4n6qQ3L3L4J48K39R4LJ05K56J50N8J91M03K45
$$ plain form
1100 1190 1252 1313 1336 1283 1202 1167 1167 1166 1169 1172 1223 1275 1286 1297 1360 1498 1620 1696 1764 1833 1857 1775 1664 1628 1649 1670 1601 1532 1418 1304 1247 1191 1179 1168
1096 1168 1207 1246 1284 1323 1297 1270 1345 1420 1434 1373 1308 1320 1382 1398 1339 1281 1242 1202 1163 1124 1115 1107 1052 998 986 973 1006 1038 1016 993 970 948 1050 1152
1092 1152 1178 1205 1213 1221 1229 1237 1313 1389 1465 1541 1525 1509 1629 1749 1859 1969 2030 2092 2150 2163 2111 1983 1866 1795 1770 1744 1654 1565 1476 1387 1341 1295 1294 1294
1088 1294 1287 1280 1272 1265 1197 1128 1135 1142 1123 1103 1159 1214 1276 1337 1293 1249 1203 1158 1158 1157 1197 1237 1276 1316 1330 1345 1360 1374 1384 1394 1447 1424 1376 1328 1278 1228 1234 1285 1353
1083 1353 1345 1291 1237 1284 1332 1326 1320 1319 1318 1285 1328 1429 1530 1527 1449 1388 1372 1336 1300 1267 1233 1212 1190 1168 1146 1172 1198 1224 1249 1249 1248 1251 1253 1306 1404 1520 1560 1519
1078 1519 1479 1570 1660 1697 1733 1769 1805 1815 1826 1791 1756 1716 1676 1712 1747 1726 1705 1684 1663 1668 1673 1674 1674 1664 1577 1505 1478 1461 1399 1343 1331 1350 1415 1482 1503 1464
1074 1464 1424 1381 1338 1310 1281 1328 1375 1374 1373 1371 1370 1378 1386 1393 1401 1380 1358 1412 1466 1489 1512 1535 1558 1558 1559 1559 1559 1647 1734 1821 1909 1913 1918 1923 1927 1971 2014 2057 2101 2055 2008 2038
1069 2038 2067 2073 2079 2130 2181 2179 2177 2220 2263 2244 2225 2251 2277 2280 2282 2329 2421 2455 2399 2391 2474 2507 2541 2689 2928 3022 3025 3130 3386 3536 3594 3785 4188 4433
1064D433J55M95R48R75J488L512N960N826J807l277n603m604k641j564j111n65j11j00j45
1062E878Q4L55K94J44K10L61L25L26N58P70P99P53Q81J154J344J496J770K163K499K953L772
1060B8889M769N947P307Q761R939J0200R203O848L312r55n034q132r793j0182r609q409p049
1057C6012n780m602l599k842k349k015j661j328j162j011p86o34o21o21n02k90k48l37l39
1055E285k48j99k43k34j44r1r2p3p4p3p4r6r6o5j10q7LPq4o0L1P5L1J4J5J1J2j3j3J8k7l2
1051C274N9L0j5qrlr3j12o6k3k2m8m9m9m8r2r1j6j6N4N4J4J5J2J02J03J2JKmmM3M3M3M4n9
1047C078n9n8n9m0l9m0m0n6n7j1j1o0o0P7P6J7J7R2R2K7K6K6K6N0N0N0N0N5N5N6N5N5N5N5
1043C550N6J5J5J5J6P9Q0P9Q0N7N8N8N7J17J17J17J17O9O9J14J15K45K46J70P9P6K28K93K03
$$ plain form
1064 4433 4588 5083 6031 7006 8494 12006 17966 23792 25599 22322 16719 12115 9474 7910 6799 6234 6123 6023 5878
1062 5878 5962 6317 6611 6755 6965 7326 7651 7977 8535 9305 10104 10857 11738 12892 14236 15732 17502 19665 22164 25117 28889
1060 28889 33658 39605 46912 55673 65612 75812 85015 91863 95175 94220 89186 81054 71261 61079 51470 43061 36012
1057 36012 30232 25630 22031 19189 16840 14825 13164 11836 10674 9663 8877 8243 7622 7001 6499 6209 5961 5624 5285
1055 5285 5037 4838 4595 4361 4217 4126 4034 3961 3887 3814 3740 3644 3548 3483 3373 3286 3289 3296 3212 3152 3183 3258 3289 3303 3318 3329 3341 3328 3315 3333 3306 3274
1051 3274 3333 3363 3348 3340 3331 3328 3235 3123 3057 3034 3012 2964 2915 2866 2818 2726 2635 2619 2603 2657 2711 2725 2740 2752 2854 2957 2969 2970 2972 2968 2964 3007 3050 3093 3137 3078
1047 3078 3019 2961 2902 2862 2823 2783 2743 2687 2630 2619 2608 2548 2488 2565 2641 2658 2675 2767 2859 2886 2912 2938 2964 3014 3064 3114 3164 3219 3274 3330 3385 3440 3495 3550
1043 3550 3606 3621 3636 3651 3667 3746 3826 3905 3985 4042 4100 4158 4215 4332 4449 4566 4683 4752 4821 4935 5050 5295 5541 5711 5790 5866 6094 6387 6590
1039F590J78J77K78K78L17L17L17L17L04L03M08M09L91L90N87N87O92O93Q59Q58R45R45J099
1036A8239J190J298J449J649J921K252K644L121L755M469N345O221P037P753Q086P768O469
1034I0666M283J532j326l955n969p208p669p457o869o115n264m509l784l150k534k080j743
1032B6849j470j244r72p81o89o60n69m06k56k29k29j50j50P6P7J86J86M18M18M44N34O34P85
1029B2802Q89J040J203J353J491J581J721J933K147K360K574K847L260L835M564N440O529
1027F7569Q011R800J1885J4228J6797J9138K0497K0081J7089J1412L647m835j2299j7439j9946
1025A65635k0145j8786j6526j4019j1634r489p616o074m885l948l181k547k045j592j153p61
1024D1234m79k68n6J55M13O85J036J550K103K738L531M407N294O170O938P329P098N980M068
$$ plain form
1039 6590 6768 6945 7223 7501 7818 8135 8452 8769 9073 9376 9784 10193 10584 10974 11561 12148 12840 13533 14392 15250 16195 17140 18239
1036 18239 19429 20727 22176 23825 25746 27998 30642 33763 37518 41987 47332 53553 60590 68343 76429 84197 90666
1034 90666 94949 96481 95155 91200 85231 78023 70354 62897 56028 49913 44649 40140 36356 33206 30672 28592 26849
1032 26849 25379 24135 23163 22382 21693 21033 20464 20058 19802 19573 19344 19194 19044 19120 19197 19383 19569 19987 20405 20849 21383 22017 22802
1029 22802 23691 24731 25934 27287 28778 30359 32080 34013 36160 38520 41094 43941 47201 51036 55600 61040 67569
1027 67569 75580 85380 97265 111493 128290 147428 167925 188006 205095 216507 220154 215319 203020 185581 165635
1025 165635 145490 126704 110178 96159 84525 75036 67420 61346 56461 52513 49332 46785 44740 43148 41995 41234
1024 41234 40755 40487 40431 40586 40999 41684 42720 44270 46373 49111 52642 57049 62343 68513 75451 82780 89878 95858 99926
1021I9926J500j308l815n625o502o524o070n293m296l250k254j363n46K50J066J886K762L839
1019F4383N018O271P390Q309Q763Q536P236M738J322k329n502p714q831q937q303p234n996
1017F7120m806l687k767k071j527j195r53q02o43m92k88M4M10Q64J284J737K259K893L716
1015F1096M713N923P463R290J1437J3709J5977J7807J8624J7713J4481Q872J469o447j3246
1013A88881j7844j9868j9669j8067j5707j3138j0748q663o954n534m435l619k938k364j885
1011C7448j491j131p99n78m26m02m02m78n68n89n89m47k36o0R0J85J85K81K81K42K41J80K70
1008C1207M95Q87J305J759K115K387K521K521K387K237K073J923J941K214K866L683M547N424
1006G4492O158O672O729O214N209L547J315j314l856n880p142p595p430o916o308n734n251
$$ plain form
1021 99926 101426 100118 96303 90678 84176 77652 71582 66289 61993 58743 56489 55126 54580 54830 55896 57782 60544 64383
1019 64383 69401 75672 83062 91371 100134 108670 115906 120644 121966 119637 114135 106421 97590 88653 80350 73116 67120
1017 67120 62314 58627 55860 53789 52262 51067 50114 49312 48669 48177 47889 47933 48343 49207 50491 52228 54487 57380 61096
1015 61096 65809 71732 79195 88485 99922 113631 129608 147415 166039 183752 198233 207105 208574 202127 188881
1013 188881 171037 151169 131500 113433 97726 84588 73840 65177 58223 52689 48254 44635 41697 39333 37448
1011 37448 35957 34826 34027 33449 33023 32621 32219 31741 31173 30584 29995 29548 29312 29252 29342 29527 29712 29993 30274 30516 30757 30937 31207
1008 31207 31702 32589 33894 35653 37768 40155 42676 45197 47584 49821 51894 53817 55758 57972 60838 64521 69068 74492
1006 74492 80650 87322 94051 100265 105474 109021 110336 109022 105166 99286 92144 84549 77119 70203 63895 58161 52910
1004E2910m858m518m185l834l320k837k383j955j562j241j030q12o01m31k80o1J50L38M28
1001A9918M54M55M00J88q3k96m50n40n78m87l05r4M5J97L52L51L28L28M53O03P61R72J299
999B4271J570J790J789J754J481J003L69l31r04j377j649j600j449j210r38p73p74q74j024
996B1124j176j267j291j291j176j025r18p67o36n46m50m50l38l39k99k99k14j23j35j35j74
994H075j74r7r6k1k1J3J3N8N9K6K6P1P1R5R5J29K20K39J48J35J80K33K34J45J46K23K23K71
990A0719K71K63L08L83M73M52M51M55N45O33O79O87O41O32O78P17P62Q39Q84R71J062J143
988B4648J294J506J718J982K253K639L093L536L929M311M824N467O221P132Q432J0199J2283
986A05467J4573J6839J8610J9124J7953J4961J0613N507J62m764q940j2053j3839j4171j3233
$$ plain form
1004 52910 48052 43534 39349 35515 32195 29358 26975 25020 23458 22217 21187 20375 19774 19343 19063 19002 19152 19490 19918
1001 19918 20372 20827 21227 21415 21332 21036 20586 20046 19468 18981 18676 18582 18627 18824 19176 19527 19855 20183 20636 21239 22000 22972 24271
999 24271 25841 27631 29420 31174 32655 33658 34027 33696 32792 31415 29766 28166 26717 25507 24569 23796 23022 22148 21124
996 21124 19948 18681 17390 16099 14923 13898 12980 12213 11577 11031 10581 10131 9793 9454 9155 8856 8642 8519 8384 8249 8075
994 8075 7901 7804 7708 7687 7666 7679 7692 7750 7809 7835 7861 7932 8003 8098 8193 8322 8542 8781 8929 9064 9244 9477 9711 9856 10002 10225 10448 10719
990 10719 10990 11253 11561 11944 12417 12869 13320 13775 14320 14953 15632 16319 16960 17592 18270 18987 19749 20588 21472 22443 23505 24648
988 24648 25942 27448 29166 31148 33401 36040 39133 42669 46598 50909 55733 61200 67421 74553 82985 93184 105467
986 105467 120040 136879 155489 174613 192566 207527 218140 223647 223809 219045 210105 198052 184213 170042 156809
984A56809j1329q941o676m893l775l567m142n250o550p645q220q204p690o886n950n023m146
982D7922l343k768k303j972j658j446j248j097r11p61o40m88l12j60nQ6K37L88N69O60P89
979C1539Q79J007J158J279J429J627J838K143K356K604K936L383L895M429M942N629O627P829
977H7529R190J0821J2845J5320J8189K1167K3794K5440K5290K2596J7308J0000J872n429j0656
975B85276j3216j3367j1895r749p921p105p702r726j2490j5240j7087j7721j7102j5621j3751
973I5583j1728r869q207o790n673m766m072l508l056k627k296k049j838j631j479j298j148
971B3548r96r05r07q17p05p06o99p00p29p28n78n78m70m70m25m25k59k59k14k14k08k09j17
968A1230j18j77j78j77j78m5m6m5m5j05j05M7M6J44J45J54J54K31L82N09N08N48N49P18Q09
$$ plain form
984 156809 145480 136539 129863 124970 121195 117628 113486 108236 101686 94041 85821 77617 69927 63041 57091 52068 47922
982 47922 44579 41811 39508 37536 35878 34432 33184 32087 31176 30415 29775 29287 28975 28815 28810 28896 29133 29521 30090 30750 31539
979 31539 32418 33425 34583 35862 37291 38918 40756 42899 45255 47859 50795 54178 58073 62502 67444 73073 79700 87529
977 87529 96719 107540 120385 135705 153894 175061 198855 224295 249585 272181 289489 299489 301361 295932 285276
975 285276 272060 258693 246798 237049 229128 222023 214321 204595 192105 176865 159778 142057 124955 109334 95583
973 95583 83855 73986 65779 58989 53316 48550 44478 40970 37914 35287 32991 30942 29104 27473 25994 24696 23548
971 23548 22552 21647 20740 19923 19218 18512 17813 17113 16384 15656 15078 14500 14030 13560 13135 12710 12451 12192 11978 11764 11556 11347 11230
968 11230 11112 10935 10757 10580 10402 10357 10311 10266 10221 10116 10011 10058 10104 10248 10393 10547 10701 10932 11314 11823 12331 12879 13428 14146 14955
965A4955Q99J050J319J650J969K300K671K942L133L042K668J974R34l04j516k454k984l075
963C1173k965k754k432k040j606j273j026q13n99m47l30k39j10k0J06K57M46N97O31P23Q26
961A8105R17J000J000J061J151J168J168J266J267J209R97P36M02j32p67j379j832k096k246
958B2995k261k111j903j692j443j231j032q81p76o24n18m28l64l64l03l03k58k58j97j96j91
956E661j91j98j07k3k2j22j21j28l6J0J1O1O2J26J26M0m9l5l5L5L6m3m2m2m3k6k7k7k7L9L9
952D902l6l6m3m2L4L3J2J1l3l4k8k7k8k8K2K1R7R7J32J32J31J32K12K11J66J66J82J82J82
948F722J82J63J62K08K07K03K02K87L78L93L93L59L59N10O00O31O30P12Q03R23R24J021J112
946A8084J137J137J059J059R65Q74O98N47L85K33Q6o5j34j35k32l82n25n24n80n80n80n80
$$ plain form
965 14955 15854 16904 18223 19873 21842 24142 26813 29755 32888 35930 38598 40572 41506 41202 39686 37232 34248 31173
963 31173 28208 25454 23022 20982 19376 18103 17077 16264 15665 15218 14888 14649 14539 14519 14625 14882 15328 15925 16556 17279 18105
961 18105 19022 20022 21022 22083 23234 24402 25570 26836 28103 29312 30309 31045 31447 31315 30548 29169 27337 25241 22995
958 22995 20734 18623 16720 15028 13585 12354 11322 10441 9665 9041 8523 8095 7731 7367 7064 6761 6503 6245 6048 5852 5661
956 5661 5470 5272 5165 5142 5120 4998 4877 4749 4713 4723 4734 4795 4857 4983 5109 5149 5100 5065 5030 5065 5101 5058 5016 4974 4931 4905 4878 4851 4824 4863 4902
952 4902 4866 4830 4787 4745 4779 4812 4824 4835 4802 4768 4740 4713 4685 4657 4679 4700 4797 4894 5026 5158 5289 5421 5633 5844 6010 6176 6358 6540 6722
948 6722 6904 7067 7229 7437 7644 7847 8049 8336 8714 9107 9500 9859 10218 10728 11328 11959 12589 13301 14104 15027 15951 16972 18084
946 18084 19221 20358 21417 22476 23441 24315 25013 25560 25945 26178 26264 26199 26065 25930 25698 25316 24791 24267 23687 23107 22527 21947
943B1947m39m39l58l58k22j30p0p0L2J23K47L38M43M42M49M48M41M40M86M86N11N11M21L30
940B6009K37J47R4Lj38l50n29o80p55p54q70q70q47q47p96p97o78n87m93m02l16l15k64k65
937A4937j91j92j16j16q9r0m4m4o0o1Q6J76J26J27J27K18K97K97K63K64L40M32M86M86N39
934A8198N39N63O54P24P24P91Q80R94J085J160J251J347J438J604J756J935K087K227K438
932D2395K691K963L254L587M001M455M949N463O058O632P093P546P983Q377Q765R038R181
929A44431R090Q909Q698Q443Q111P593O898O017M898L588K168N87j196l126n029o741q221
927A95118r512j0510j1124j1336j1257j0864j0255r501q752p997p289o534n775n079m489l975
925F0869l586l193k805k413k159j888j606j395j217j066q32n60l68k76j77k5J10K62M37O49
$$ plain form
943 21947 21508 21069 20711 20353 20131 20001 19931 19861 19893 20016 20263 20601 21044 21486 21935 22383 22824 23264 23750 24236 24747 25258 25679 26009
940 26009 26246 26393 26487 26490 26352 26002 25473 24793 24038 23284 22414 21544 20697 19850 19054 18257 17579 16992 16499 16097 15781 15466 15202 14937
937 14937 14746 14554 14438 14322 14233 14143 14099 14055 13995 13934 14020 14196 14322 14449 14576 14794 15091 15388 15651 15915 16255 16687 17173 17659 18198
934 18198 18737 19300 19954 20678 21402 22193 23073 24067 25152 26312 27563 28910 30348 31952 33708 35643 37730 39957 42395
932 42395 45086 48049 51303 54890 58891 63346 68295 73758 79816 86448 93541 101087 109070 117447 126212 135250 144431
929 144431 153521 162430 171128 179571 187682 195275 202173 208190 213088 216676 218844 219431 218235 215109 210080 203339 195118
927 195118 185606 175096 163972 152636 141379 130515 120260 110759 102007 94010 86721 80187 74412 69333 64844 60869
925 60869 57283 54090 51285 48872 46713 44825 43219 41824 40607 39541 38709 38149 37781 37505 37328 37303 37413 37675 38112 38761
923C8761Q48R40J077J289J542J754J987K260K486K759L024L357L666L939M196M408M578M668
921H7539M731M821M882M882M860M860M960M960M924M834M711M438L968L333K476J418J74j186
919A55585k617l977n277o395p332p905q210q300q210p938p537p023o510n935n301m727m232
917D8159l779l331k938k640k488k285k013j737j586j440j349j206j116r94q43p78o86o73o72
914A5605o16o16n46m55m31m30m25m25l20l19l53l54k68j78k36k37k06j15j22j21j91j91j12
911H338j12o6o7p3p3k8k7K5K5K5K5k2k1k1k2L0K9L5L4L3J24J48J48J92J92K67K68L22L23L23
908A0374L23K87K87K01J11J%nnq7q8q7q7j22j21j22j21j41j42j41j42j41j42j41j42j39j40
904I328j39j40j57j56j11k02l17m07l61l62l74l74l74l74l26l27l01k12k05k06j54j55j18
$$ plain form
923 38761 39609 40549 41626 42915 44457 46211 48198 50458 52944 55703 58727 62084 65750 69689 73885 78293 82871 87539
921 87539 92270 97091 101973 106855 111715 116575 121535 126495 131419 136253 140964 145402 149370 152703 155179 156597 156771 155585
919 155585 152968 148991 143714 137319 129987 122082 113872 105572 97362 89424 81887 74864 68354 62419 57118 52391 48159
917 48159 44380 41049 38111 35471 32983 30698 28685 26948 25362 23922 22573 21367 20251 19257 18414 17636 16950 16277 15605
914 15605 14989 14373 13827 13372 12941 12511 12086 11661 11341 11022 10669 10315 10047 9869 9633 9396 9190 9075 8953 8832 8641 8450 8338
911 8338 8226 8160 8093 8020 7947 7919 7892 7917 7942 7967 7992 7970 7949 7928 7906 7936 7965 8000 8034 8067 8191 8339 8487 8679 8871 9138 9406 9728 10051 10374
908 10374 10697 10984 11271 11472 11583 11584 11584 11579 11574 11487 11399 11312 11225 11103 10982 10860 10739 10598 10456 10315 10173 10032 9890 9749 9607 9468 9328
904 9328 9189 9049 8892 8736 8625 8423 8106 7699 7338 6976 6602 6228 5854 5480 5154 4827 4526 4314 4109 3903 3749 3594 3476
902C476j19j18j19n2n1n2n1k4k4k3k4p6p7q2RK3K4p6p6k9k9j00j00j13l8K6K6non1n0k9k9
898A961J7J6PQo9o8K6K6np9q7m1L5Q0M8k8q7q8j3j4k8p3m8K8M5o1j06o1J3J3m8m7K9K8m2m3
893A244m2m3p4p3j1O5J07J08L7L6J9K0J9J9K6K6k0k0j6j7N4N4M0l5l9l8j9k0o5o5J2J2J1J2
889A324J0J1l6l5O0N9j6j6J5J5J6J5nnonn5n5j0j0M2M2llk8k7J8J8j7j7K8K9k7k8k7k7oon
884A227oM6M6M6M6mlllk1k1k1k1m5m4m5m4QQN4N4l3l4l3l3L0L0P5P5n0n0nnJ9K0k6k6k4k3
879A161K2K3P4P3P4P4j0j0j0j0J5J6J5J5o7o7k2k1J8J7J8J8L5L5L4L5L5L6j0n6n0K4Q6Q5j7
875A688j7o2o3j3j3O2O2N3N3k3k2j10j10m9K7k4o8o4j9J0J1N4N4L0m6p5k9QQJ0J1L9M0ooo9
871A332o9L6L7L6L6rrl1l1l1l1RRo6o6j0j0O6O6NNONm5m4%JL8L8ppj6j5L0K9l3l3l4l3OPO
$$ plain form
902 3476 3357 3239 3120 3068 3017 2965 2914 2890 2866 2843 2819 2743 2666 2584 2593 2616 2640 2564 2488 2459 2430 2330 2230 2117 2079 2105 2131 2126 2120 2069 2019 1990 1961
898 1961 1978 1994 2001 2009 1940 1872 1898 1924 1919 1840 1753 1712 1747 1827 1875 1847 1760 1672 1659 1645 1617 1544 1496 1524 1569 1508 1402 1341 1354 1367 1319 1272 1301 1329 1287 1244
893 1244 1202 1159 1085 1012 1001 1066 1173 1281 1318 1354 1373 1393 1412 1431 1457 1483 1463 1443 1427 1410 1464 1518 1558 1523 1484 1446 1427 1407 1342 1277 1289 1301 1312 1324
889 1324 1334 1345 1309 1274 1334 1393 1377 1361 1376 1391 1407 1422 1417 1412 1406 1401 1346 1291 1281 1271 1313 1355 1352 1349 1321 1294 1312 1330 1313 1296 1324 1353 1326 1298 1271 1244 1238 1232 1227
884 1227 1221 1267 1313 1359 1405 1401 1398 1395 1392 1371 1350 1329 1308 1263 1219 1174 1130 1138 1146 1200 1254 1221 1187 1154 1121 1151 1181 1256 1331 1281 1231 1226 1221 1240 1260 1234 1208 1184 1161
879 1161 1183 1206 1280 1353 1427 1501 1491 1481 1471 1461 1476 1492 1507 1522 1455 1388 1366 1345 1363 1380 1398 1416 1451 1486 1520 1555 1590 1626 1616 1560 1510 1534 1620 1705 1688
875 1688 1671 1609 1546 1533 1520 1582 1644 1697 1750 1727 1705 1595 1485 1436 1463 1439 1371 1307 1288 1298 1309 1363 1417 1447 1401 1326 1297 1305 1313 1323 1334 1373 1413 1407 1401 1332
871 1332 1263 1299 1336 1372 1408 1399 1390 1359 1328 1297 1266 1275 1284 1218 1152 1142 1132 1198 1264 1269 1274 1280 1285 1240 1196 1196 1197 1235 1273 1266 1259 1243 1228 1258 1287 1254 1221 1187 1154 1160 1167 1173
866A173OM2M1l4l4RQRQK8K8K8K8K8K7K8K8J2J1J2J1L5L6L5L5oom6m6k9O2O2k9p3p2K7K7J4
861A523J4J4J4m8m8K8K7J1J0l5l4kjjkO4O4J8J9n1n2P9Q0pr8r7pQ9R0j1j1j5j6j5j6l8l7l8
856A464l8K2K2k4k3k2k2k2k2K9K8p8p7n1n0K5K5m8m8m8m8J7J6O2O2J7J8k8k8l5l5M0M1l4l4
852A073l5l4j5j6N7N8K2k3n5L7N6l4p8l3J8J8k5k4J5J6k9p4l1N9P9L4J2N9Q0rn7n7J0J0j6
848A068o0m4M7N7J2kkJ8J7J8J8n2n2opJ2J2J2J2M0M0nnj7j7j7j7L4L4m4m5l6q2j08j7O3O2
843I41K3K3K4K4n2n2J0RJ0Rn6n6j1j1N6N6J1J1k3k3K2K2K4K4q2q2J4J4l2l2M5M4M5M5k2k1
839I51r2j38o7Q3J24P9km7n0m%%LLl1l2l1l2O2O1J5J6K0K0n5n6L3L3L3L4m8m7m8m8RJ0N4N4
834H69M6M6k9l0p4p4k9k8K4K4K3K4K3K2K2K2J2J2l3p8n1L9R2R1pqn2n3n8n8M7M8N8N7j8j8
$$ plain form
866 1173 1179 1221 1262 1228 1194 1203 1211 1220 1228 1256 1284 1312 1340 1368 1395 1423 1451 1463 1474 1486 1497 1532 1568 1603 1638 1632 1626 1580 1534 1505 1567 1629 1600 1527 1455 1482 1509 1523
861 1523 1537 1551 1565 1517 1469 1497 1524 1535 1545 1510 1476 1474 1473 1472 1470 1534 1598 1616 1635 1584 1532 1611 1691 1684 1586 1489 1482 1571 1661 1650 1639 1624 1608 1593 1577 1539 1502 1464
856 1464 1426 1448 1470 1446 1423 1401 1379 1357 1335 1364 1392 1314 1237 1186 1136 1161 1186 1138 1090 1042 994 1011 1027 1089 1151 1168 1186 1158 1130 1095 1060 1100 1141 1107 1073
852 1073 1038 1004 989 973 1030 1088 1110 1087 1032 1069 1125 1091 1013 980 998 1016 991 967 982 998 969 895 864 923 1002 1036 1048 1107 1187 1178 1121 1064 1074 1084 1068
848 1068 1008 964 1011 1068 1080 1078 1076 1094 1111 1129 1147 1095 1043 1037 1030 1042 1054 1066 1078 1118 1158 1153 1148 1131 1114 1097 1080 1114 1148 1104 1059 1023 941 833 816 879 941
843 941 964 987 1011 1035 983 931 941 950 960 969 913 857 846 835 891 947 958 969 946 923 945 967 991 1015 933 851 865 879 847 815 860 904 949 994 972 951
839 951 859 721 654 737 861 940 938 891 841 837 837 837 840 843 812 780 749 717 779 840 855 871 891 911 856 800 833 866 899 933 885 838 790 742 751 761 815 869
834 869 915 961 932 902 828 754 725 697 721 745 768 792 815 837 859 881 893 905 872 794 743 782 874 965 958 950 898 845 787 729 776 824 882 939 921 903
830I03n9o0K0J11Q7lq3q2K0K0K0K1L3L4M2m9o3j9K6K6MMp2p2K5K4K5K5K7K7K8K7lmmml8l8
825I26PPR3R3J8J7J0Rl5l6r6r6n1n1k9k9P5J21R4Lj9j9Q3Q2L7L7QRQRl2l3l2l2K5K4K5K5P
820A262PPPj1j2j2j2J5J4J4J4LLLLj1j1j1j1L0L1L3L3L9Q4J09J8RQLKl5l4l5l5KKKKj2j2q8
$$ plain form
830 903 844 784 804 915 1002 999 916 834 854 874 894 915 948 982 1024 975 912 893 919 945 949 953 881 809 834 858 883 908 935 962 990 1017 1014 1010 1006 1002 964 926
825 926 933 940 1033 1126 1144 1161 1171 1180 1145 1109 1013 917 866 815 786 757 832 953 1047 1050 1031 1012 1095 1177 1214 1251 1259 1268 1276 1285 1253 1220 1188 1156 1181 1205 1230 1255 1262
820 1262 1269 1276 1283 1272 1260 1248 1236 1251 1265 1279 1293 1296 1299 1302 1305 1294 1283 1272 1261 1291 1322 1355 1388 1427 1511 1620 1638 1647 1655 1658 1660 1625 1591 1556 1521 1523 1525 1527 1529 1517 1505 1417
$$ [...]
-1605E49
##END=	
##END=	
