##TITLE=	RP198.12.fid
RP198 PhBF3K + TMSCl in py
F19CPD.ucl None {U:\400} tds 1

##JCAMP-DX=	6.0	$$ MestReNova 14.1.1-24571
##DATA TYPE=	LINK
##BLOCK_ID=	1
##BLOCKS=	1    
##ORIGIN=	Mestrelab Research S.L.
##OWNER=	hrzepa
##$MNOVA/LINK_BLOCK_TYPE=	ITEM	$$ NMR Spectrum
##$MNOVA/ITEM/POLYGON=	(XY..XY)
5321,5835
8722,5835
8722,8208
5321,8208
5321,5835
##$MNOVA/ITEM/Z=	0
##$MNOVA/ITEM/ANGLE=	0
##TITLE=	RP198.12.fid
##JCAMP-DX=	6.0	$$ MestReNova 14.1.1-24571
##BLOCK_ID=	2
##DATA TYPE=	NMR SPECTRUM
##DATA CLASS=	XYDATA
##NUMDIM=	1
##ORIGIN=	Bruker BioSpin GmbH
##OWNER=	aea
##.OBSERVE FREQUENCY=	376.4249615944390257
##.OBSERVE NUCLEUS=	^19F
##.SOLVENT NAME=	Pyr
##.PULSE SEQUENCE=	zgfhigqn.2
##LONGDATE=	2022/04/25 17:16:00.000
##.ACQUISITIONMODE=	SIMULTANEOUS (DQD)
##$ORIGINAL FORMAT=	Bruker XWIN-NMR
##$MNOVA/SCALES_VERSION=	9
##$PARAMETER FILE=	(acqus, ASCII, /var/folders/f6/rjf_tdyn2v98c5c0wvkgn4s80000gn/T/0plrDD$iRGKtFW3YYbIZxA/RP198/12/acqus, 0)
$$ ##TITLE= Parameter file, TOPSPIN		Version 3.2
$$ ##JCAMPDX= 5.0
$$ ##DATATYPE= Parameter Values
$$ ##NPOINTS= 1	$$ modification sequence number
$$ ##ORIGIN= Bruker BioSpin GmbH
$$ ##OWNER= aea
$$ $$ 2022-04-25 17:16:25.730 +0100  aea@chemb147
$$ $$ z:/400/data/tds/nmr/RP198/12/acqus
$$ $$ process C:\Bruker\TopSpin\prog\mod\dirdata.exe
$$ ##$ACQT0= 1000000
$$ ##$AMP= (0..31)
$$ 100 100 100 100 100 100 100 100 100 100 100 100 100 100 100 100 100 100
$$ 100 100 100 100 100 100 100 100 100 100 100 100 100 100
$$ ##$AMPCOIL= (0..19)
$$ 0 0 0 0 0 0 0 0 0 0 0 0 0 0 0 0 0 0 0 0
$$ ##$ANAVPT= -1
$$ ##$AQSEQ= 0
$$ ##$AQ_mod= 3
$$ ##$AUNM= <au_zg>
$$ ##$AUTOPOS= <1 >
$$ ##$BF1= 376.470138011
$$ ##$BF2= 400.1
$$ ##$BF3= 376.470138011
$$ ##$BF4= 376.470138011
$$ ##$BF5= 376.470138011
$$ ##$BF6= 376.470138011
$$ ##$BF7= 376.470138011
$$ ##$BF8= 376.470138011
$$ ##$BYTORDA= 0
$$ ##$CAGPARS= (0..11)
$$ 0 0 0 0 0 0 0 0 0 0 0 0
$$ ##$CFDGTYP= 0
$$ ##$CFRGTYP= 9
$$ ##$CHEMSTR= <none>
$$ ##$CNST= (0..63)
$$ 1 1 1 1 1 1 1 1 1 1 1 1 1 1 1 1 1 1 1 1 1 1 1 1 1 1 1 1 1 1 1 1 1 1 1 1
$$ 1 1 1 1 1 1 1 1 1 1 1 1 1 1 1 1 1 1 1 1 1 1 1 1 1 1 1 1
$$ ##$CPDPRG= (0..8)
$$ <> <> <waltz16> <> <> <> <> <> <>
$$ ##$D= (0..63)
$$ 0 1 0 0 0 0 0 0 0 0 0 0.03 2e-005 0 0 0 0.0002 0 0 0 0 0 0 0 0 0 0 0 0
$$ 0 0 0 0 0 0 0 0 0 0 0 0 0 0 0 0 0 0 0 0 0 0 0 0 0 0 0 0 0 0 0 0 0 0 0
$$ ##$DATE= 1650903381
$$ ##$DE= 6.5
$$ ##$DECBNUC= <off>
$$ ##$DECIM= 202.666666666667
$$ ##$DECNUC= <off>
$$ ##$DECSTAT= 4
$$ ##$DIGMOD= 1
$$ ##$DIGTYP= 12
$$ ##$DQDMODE= 0
$$ ##$DR= 21
$$ ##$DS= 4
$$ ##$DSPFIRM= 0
$$ ##$DSPFVS= 20
$$ ##$DTYPA= 0
$$ ##$EXP= <F19CPD.ucl>
$$ ##$F1LIST= <>
$$ ##$F2LIST= <>
$$ ##$F3LIST= <>
$$ ##$FCUCHAN= (0..9)
$$ 0 1 2 0 0 0 0 0 0 0
$$ ##$FL1= 0
$$ ##$FL2= 0
$$ ##$FL3= 0
$$ ##$FL4= 0
$$ ##$FOV= 0
$$ ##$FQ1LIST= <>
$$ ##$FQ2LIST= <>
$$ ##$FQ3LIST= <>
$$ ##$FQ4LIST= <>
$$ ##$FQ5LIST= <>
$$ ##$FQ6LIST= <>
$$ ##$FQ7LIST= <>
$$ ##$FQ8LIST= <>
$$ ##$FRQLO3= 1231288.40556097
$$ ##$FRQLO3N= 0
$$ ##$FS= (0..7)
$$ 83 83 83 83 83 83 83 83
$$ [...]
$$ 0 0 0 0 0 0 0 0
$$ ##$Sgu4PowerLevels= (0..7)
$$ 0 0 0 0 0 0 0 0
$$ ##$Sgu5PowerLevels= (0..7)
$$ 0 0 0 0 0 0 0 0
$$ ##$Sgu6PowerLevels= (0..7)
$$ 0 0 0 0 0 0 0 0
$$ ##$Sgu7PowerLevels= (0..7)
$$ 0 0 0 0 0 0 0 0
$$ ##$Sgu8PowerLevels= (0..7)
$$ 0 0 0 0 0 0 0 0
$$ ##$SguType= 2
$$ ##$ShimPowMaxUA= (0..63)
$$ 130000 130000 130000 130000 130000 130000 130000 130000 130000 130000 130000
$$ 130000 130000 130000 130000 130000 130000 130000 130000 130000 0 0 0 0
$$ 0 0 0 0 0 0 0 0 0 0 0 0 0 0 0 0 0 0 0 0 0 0 0 0 0 0 0 0 0 0 0 0 0 0 0 0
$$ 0 0 0 0
$$ ##$ShimPowMaxUC= (0..63)
$$ 130000 130000 130000 130000 130000 130000 130000 130000 130000 130000 130000
$$ 130000 130000 130000 130000 130000 130000 130000 130000 130000 0 0 0 0
$$ 0 0 0 0 0 0 0 0 0 0 0 0 0 0 0 0 0 0 0 0 0 0 0 0 0 0 0 0 0 0 0 0 0 0 0 0
$$ 0 0 0 0
$$ ##$ShimPowMaxUG= (0..63)
$$ 524287 524287 524287 524287 524287 524287 524287 524287 524287 524287 524287
$$ 524287 524287 524287 524287 524287 524287 524287 524287 524287 0 0 0 0
$$ 0 0 0 0 0 0 0 0 0 0 0 0 0 0 0 0 0 0 0 0 0 0 0 0 0 0 0 0 0 0 0 0 0 0 0 0
$$ 0 0 0 0
$$ ##$ShimPowRcbType= 3
$$ ##$ShimPowRes= (0..63)
$$ 1e-020 1e-020 1e-020 1e-020 1e-020 1e-020 1e-020 1e-020 1e-020 1e-020 1e-020
$$ 1e-020 1e-020 1e-020 1e-020 1e-020 1e-020 1e-020 1e-020 1e-020 0 0 0 0
$$ 0 0 0 0 0 0 0 0 0 0 0 0 0 0 0 0 0 0 0 0 0 0 0 0 0 0 0 0 0 0 0 0 0 0 0 0
$$ 0 0 0 0
$$ ##$ShimPowRng0= (0..63)
$$ 1 1 1 1 1 1 1 1 1 1 1 1 1 1 1 1 1 1 1 1 0 0 0 0 0 0 0 0 0 0 0 0 0 0 0 0
$$ 0 0 0 0 0 0 0 0 0 0 0 0 0 0 0 0 0 0 0 0 0 0 0 0 0 0 0 0
$$ ##$ShimPowRng1= (0..63)
$$ 1 1 1 1 1 1 1 1 1 1 1 1 1 1 1 1 1 1 1 1 0 0 0 0 0 0 0 0 0 0 0 0 0 0 0 0
$$ 0 0 0 0 0 0 0 0 0 0 0 0 0 0 0 0 0 0 0 0 0 0 0 0 0 0 0 0
$$ ##$ShimPowRng2= (0..63)
$$ 1 1 1 1 1 1 1 1 1 1 1 1 1 1 1 1 1 1 1 1 0 0 0 0 0 0 0 0 0 0 0 0 0 0 0 0
$$ 0 0 0 0 0 0 0 0 0 0 0 0 0 0 0 0 0 0 0 0 0 0 0 0 0 0 0 0
$$ ##$ShimPowRng3= (0..63)
$$ 1 1 1 1 1 1 1 1 1 1 1 1 1 1 1 1 1 1 1 1 0 0 0 0 0 0 0 0 0 0 0 0 0 0 0 0
$$ 0 0 0 0 0 0 0 0 0 0 0 0 0 0 0 0 0 0 0 0 0 0 0 0 0 0 0 0
$$ ##$ShimSysFunc= (0..63)
$$ 1 2 3 4 5 7 9 11 15 16 8 10 12 14 6 17 13 18 19 20 0 0 0 0 0 0 0 0 0 0
$$ 0 0 0 0 0 0 0 0 0 0 0 0 0 0 0 0 0 0 0 0 0 0 0 0 0 0 0 0 0 0 0 0 0 0
$$ ##$ShimSysMatrix= 0
$$ ##$ShimSysType= 1
$$ ##$TFXNUM= 0
$$ ##$TRIPLO2= 0
$$ ##$VTU= 1
$$ ##$VTUETH= <no>
$$ ##$VTUTY= <tty05>
$$ ##$WBREFAM= (0..15)
$$ 268.6 116.5 100 100 100 100 100 100 100 100 100 100 100 100 100 100
$$ ##$WBREFLM= (0..15)
$$ 0 0 0 0 0 0 0 0 0 0 0 0 0 0 0 0
$$ ##$WBREFPH= (0..15)
$$ 86.23 -73.34 0 0 0 0 0 0 0 0 0 0 0 0 0 0
$$ ##$WBSGU= (0..15)
$$ 0 0 0 0 0 0 0 0 0 0 0 0 0 0 0 0
$$ ##$XFAC= 2
$$ ##END=
$$ 
##$DECIM=	202.666666666667
##$DSPFVS=	20
##XUNITS=	HZ
##YUNITS=	ARBITRARY UNITS
##FIRSTX=	3828.8997022068069782
##LASTX=	-94854.557923332889914
##DELTAX=	-0.75290077611019745607
##XFACTOR=	1
##YFACTOR=	0.080077388148971875848
##FIRSTY=	3.16489410400390625
##MINY=	-35.571666717529296875
##MAXY=	14302.357421875
##NPOINTS=	131072
##XYDATA=	(X++(Y..Y))
$$ [...]
-49620h6K12m9j9k80K25k09J8J8J75q5j71M39j55j54J57j03N9N9k20M3m0m0J04J02k61jJ19
-49640a43J19j26J35n6K05k02N9m7m8J16J17k02N9N8O0j71R0n5n7J6J6O4O5L7k24N3N4n2n2
-49662a12P9P8m3m3m4m3O2O3P9P9j71Q9k04N8O8O8p3p4K66j71P5j86J46j15J5J5k0j9j9j9
-49684a16O2O2n1n2j64R9Q2Q1QRQQq4q5M6M6j6j5J31j30O2O0l7l6M8k12M9M9N7k04K21m1K5
-49709c0K5QQj6j7j49J14j48J14R7R7M2k20Q5Q5j96K39k18M3l3l3l3K28j5j6J8k44K8K9J58
-49732E0j01J1J2mmn2n2P9P8KJJ8J7p5J85k7k7j04j04J29J30k41K1j16J46j29L08k31K04m5
-49754G9m4j7j7M5M5j95j96J88J87n3n1j5j6J31j29O3O3j31j33o6J96J68k67K17m5m9n0J64
-49775G2r5j5j5K3K3j03j03K35k5m8m8j08L29p0o8o7o6jjJ09J09k29K07q9J71l02J34K1K0
$$ y = [-86, 126, 77, 58, -222, 3, -206, -188, -170, 5, -80, -251, 188, 33, -121, 36, -67, -8, 51, -169, -126, -166, -206, -102, 0, -261, -262, -143, -24, -150, -15, -71, 134, -68, -9, -56, -104, 12, 129, -73, -14, 44, 104, -67, 23, -32, -89, -73, -57, 7, 72, 109, -115, -62, -8, -60, -112, -33, 45, 2, -41, -85, -128, -66, -3, 76, 155, -16, 73, -131, -73, -5, 63, -10, -84, 182, 11, 86, -100, 46, -69, -54, -39, -59, -78, -97, -116, -54, 8, -43, -95, -259, -160, -78, 3, 11, 20, 28, 36, -48, -133, -87, -41, -57, -72, 59, -71, -9, 51, 14, -22, 26, -186, -137, -88, -31, -235, -14, -55, -30, -5, 3, 11, -5, -22, -171, -57, -205, -91, 6, 103, 145, -75, 10, 95, -101, 138, -80, -37, -70, -103, -136, 92, 77, 61, 79, -165, -137, -108, 50, -51, -40, -28, -32, -36, -88, -140, -61, 17, 19, 20, 38, 55, -20, 165, 138, 111, 7, -97, 32, 162, -79, -58, -174, -28, -157, 151, -80, 124, 79, 35, 18, 1, 46, 91, -104, -300, -112, 75, 22, -29, -44, -60, 71, -58, 5, 68, -63, -196, -262, -66, 102, -165, 52, 7, -42, -92, 72, -23, -38, -53, -30, -7, -110, -213, 22, -3, -51, -99, -207, 122, 52, -16, -83, -149, -150, -151, -42, 67, -162, 45, -44, 127, -175, -41, -20, 0]
-49797@j6j7mnK40j96k9l0R5R6j34j33M7M6J43j17J3J2J15j48j48J14N6N4POk5k5Q4Q4j89
-49821dj91O1L23m3l04P1P2j56J05K4K4n4n5nnJ19j43J52j11M6M5K9K7o7o8K5K4j37K98MM
-49844A10j84P6L9L8q8r0m0K20j31j32J08J07L0k31K23l8m6Q2p9M9m5m6K7K8K0K1m3m4L8L6
-49866A5k6k8j3j4N3N1n7n8R4R4n6n5p2p3J71q9J38j22J15J17k16M4L8k22Q4L47j55k4r6r8
-49889a13J35j25J76q4j9J10k07K28j50J11j47j7P3P1J19j43K9K9K8K9j31J32o3O8k35K00
-49909A04N4p8j64R7k2J08j38j39J10J09o0o1M0L9J3j16J69r2lkj9j9J1J1J1J1l8l7LJ33J93
-49932B28m18J74q8R9j64K24l8J8J8J38k97O0N9J7J7Ok56JK62j31J29l44K67k2k1Q1Q3p9p8
-49954e5L1L0l4l5L0L1M0M1qqj46J13l1l3QPJ54j08j7j6J4J6J37j25J04j56n5n4J26J26q8
$$ y = [0, -16, -33, -37, -42, 198, 2, -27, -57, 38, 134, 0, -133, -86, -40, 103, -14, -1, 11, 126, -22, -170, -56, 0, 54, 61, 67, 42, 17, 101, 185, -4, -195, -134, 189, 146, -158, -87, -15, -171, -66, -42, -18, -72, -127, -132, -137, -18, -161, -9, -120, -74, -29, 0, 27, -40, -108, -83, -59, -196, 102, 106, 110, -74, 2, 41, 79, -9, -99, -139, 81, -50, -182, -74, 33, 63, -168, 55, 17, -29, 53, -26, 23, -22, -68, -41, -13, 7, 28, -15, -59, -21, 15, -11, -39, -52, -66, -13, 38, -19, -77, 17, 111, 55, 0, -72, -145, 26, -63, 75, -47, 68, 185, -31, 13, 51, -171, -87, 260, 105, 81, -15, -113, 22, -103, 73, -11, -30, 80, -127, 101, -49, 62, -85, -102, -29, 42, 161, 18, 47, 76, 104, 133, 2, 134, 71, 139, -96, 104, 158, 80, -84, 13, -9, 99, -39, -178, -68, 41, -19, -80, -40, -1, 12, -104, 65, -27, -30, -32, -51, -70, -59, -48, -37, -26, -64, -101, -98, 35, 228, -190, -16, -104, -5, -169, 55, 17, 35, 53, 191, -106, -46, 13, 30, 47, 53, -203, -202, 60, -71, 58, -286, -19, -41, -62, 19, 102, 23, -55, -24, 6, -28, -63, -33, -2, 38, 79, 71, 63, -83, 30, -1, -34, -26, -19, 135, 27, 10, -6, 8, 24, 161, 36, 140, -16, -71, -125, 1, 127, 39]
-49977C9q8q2J78m7m6j52K86k52J0Q6Q5N7N6j56J04m4m2K01o1j12J50k09N1j45J16k1k82J10
-49998b10J11K41k0qrqqj54J05m0m1ONJ35j25Q1j80K07n5Q5Q5o8o8j14J45jjp1p1N2N4j91
-50022a31P0r3r4K11n1j99K39m4K17j75Q6k37J98N0N1o9J93k0k0j38j38L1L1m5K15k3k85Q6
-50043h4Q6Nk56K49j3RQOOOOj04j05K55ok04N8j3j3J33j27LLJ17j44l5l6L39k70N6N6J64r7
-50068E8l2l1j99K36p3p4M1M2K21k15qpJ11j49k6k6k5k6q2J80L3L3K0K0j04j05J84p7O9O9
-50091E8k5k5J3J3R2l44k19L93J02j59K6K6l6l5K75j60n6n6J29j31R7R6j75Q6k7k6N5N4k1
-50113B0k0k1k1L1L0J4J4K3k39J21J20j72Q9j57J06J49j10J33j27K0K2NNM6M6o3o3j0j1J36
-50135A16j25p4p4K10n2r6r6R0Q9O9j90O7o3K85j51m4m4J0J1P4P6o3o2O7O8q8q7J30l05K64
$$ y = [39, -49, -131, 47, 0, -46, -198, 88, -164, -154, -68, 17, 74, 130, -26, 78, 34, -8, 193, 132, 20, 170, -39, 12, -133, -17, -38, -320, -210, -99, 142, 122, 114, 105, 97, 89, -65, 40, 0, -41, -35, -30, 105, -20, 61, -119, 88, 33, 118, 203, 135, 67, -47, 98, 97, 96, 25, -46, 6, 60, -131, -61, -154, -248, -37, -88, -287, -48, -92, 125, -50, 36, -201, -3, 47, 98, 29, 222, 202, 182, 44, -94, -63, -32, -77, 138, 115, -170, -84, 2, 7, -249, 0, -13, -4, 4, 10, 16, 22, 28, -76, -181, 74, 68, -136, -78, -91, -104, 29, -98, -95, -92, 25, -119, -154, -190, 149, -121, -65, -9, 155, 58, 26, -5, -204, 32, -41, -115, -74, -32, 189, -26, -34, -41, 70, -79, -105, -131, -156, -182, -264, -84, -51, -18, 2, 22, -82, -187, -3, -80, -11, 58, 33, 8, 21, 34, 126, -218, -437, -44, 58, -101, -75, -49, -85, -120, 155, -5, -61, -117, 12, -119, -22, 74, -101, -15, -42, -68, -13, 41, 20, 0, -21, -42, -11, 19, 33, 47, 70, -169, -48, 72, -100, -11, -168, -62, 87, -23, 110, -17, 3, 25, 30, 35, 81, 127, 64, 1, -9, -20, 116, -9, -83, -157, 53, 1, -95, -191, -101, -12, 57, -133, -66, -129, 156, 5, -39, -83, -73, -62, 12, 88, 25, -37, 30, 98, 10, -77, 53, -252, 12]
-50158A2j71J99k36L26j11r5L4q2q3k0K42P1j91M6M6m8Q2R1j70R9R9m8m8j9k0j9k0J10J11
-50180A87r1r1j55J06L3r9P1P0r2J68J7j14J40j23j13J47N8p3o2o2O0N9J9K0j11j12J27J26
-50201A10r5L7R3j69l0J00L5r5K15k20J94o7p8p7R0R1j35j35J45J4K04k33L5L7k61JN3J83
-50222D2k22M0m0K21J16j46r5L5J1J0L3L4pj37k2K39J01j62POj0j0J4J5M2M2k14K22j70R1
-50244H6m5m4j76Q7llN2N1k75L35j71R1Q4j76J34j27MLj3j2M1M2j06J55j66j67J55J55J1J2
-50267A4n3n3k3k2J25j36k3k2l8K23n1K11j17J46k38K3J69r2n0n1K6K6k31K06l9K21j46J16
-50288A21q0q0N5N6j62j63J48J46p0p2M2M3P3j86j18J45J93o9k6k8j42K95j43J18k46J89j21
-50308h2j22K54qL7k25N3k10J53J52j09j09L40r6q3q5K14m8j4j4j55J07RRJ57j04M3M4j25
$$ y = [12, -159, 40, -196, 130, 19, -76, -42, -124, -207, -227, 15, 86, -105, -59, -13, -61, 21, 112, -58, 41, 140, 92, 44, 25, 5, -14, -34, 76, 187, 96, 5, -150, -44, -11, -110, -39, 31, -61, 107, 124, 10, 150, 27, -86, 61, 119, 46, -16, -78, -18, 41, 60, 80, -31, -143, -16, 110, 15, 52, 145, -24, -54, 46, 81, -14, 201, -19, 175, 108, 30, -47, 43, 134, -1, -136, 9, 23, 227, -6, 29, 66, -195, -194, -141, 42, -180, -140, -180, 41, 157, 11, -84, -49, -38, -28, 5, 39, 32, -105, -127, 112, 213, 51, 58, 64, 54, 44, 58, 73, 115, 157, -57, 165, -5, 86, 41, -3, -179, -92, -95, -98, -46, 5, -270, 65, -106, -15, 69, -107, 27, -100, -96, -93, -106, -118, -77, -35, -141, 14, -152, -319, -164, -9, 2, 14, -39, -92, -115, -137, -12, -148, -171, -193, -231, -8, -59, 152, 35, 181, -57, -34, 135, 43, -7, -58, -32, -6, -237, -31, -70, 151, 5, 121, 41, -39, 16, 72, -90, -253, -105, 41, -29, -101, -59, -16, 57, -129, -247, -102, 91, 22, -4, -32, -174, 121, -22, 96, -150, 39, -82, -204, 50, 42, 79, -146, -93, -303, -150, 2, -107, -216, 124, 28, -55, -140, 74, 26, 12, -2, -157, -50, -41, -32, 125, 21, 64, 108, -17]
-50330a7j26ONR0Q9l5l5J04j56rj0L9M0k07K30O6O7j6j5m4m4j25J35J4J3J12j51L6L6N8k03
-50353e3j4j5l0l1J24J23j15j16O8O7j44j45K69Pq7J75j85P7j10J52R3j69noL8L7j74Q7K3
-50375e9K4L8L9o3o4L06l04j54K81J35l01LLN7N7j86P6J1J0K60j76n6n7J71r0K9K8J11l24
-50397a95P3P3L0K9J4J4J16j46j06j08J24J22j59j61R1R1R0R0l9l9J25j36j01J61kkqpK06
-50418B40n7n9n9n9n8j23J40m5K15n3n2n2n3J40j21K6K5k9k9L7L6j38j38K75J5k21K14l0l0
-50440d3p3J90Q0j80m5m5J84k52rqK03K04j65j65P4j87J26j36J05J04O3O3j65R6k0k83J7J7
-50461b50L09M8k31K05j12J47q1q0R6R6j16j16K39k3k62jJ50J51j17j16j2j2j2j2J7J6Q2Q2
-50482H5j8j7j53K82j96j96R8R9J32j27KKJ38j23QPR0j72M1M0j3j2O8P0j84P6j51J10n8n7
$$ y = [-17, -143, -137, -132, -42, 47, 12, -23, 81, -75, -84, -94, -55, -15, -222, 8, 74, 141, 125, 110, 66, 22, -103, 32, 46, 59, 171, 20, 56, 92, 150, -53, -67, -82, -112, -143, -19, 104, -11, -127, -59, 8, -136, -281, -12, -5, -92, 83, -102, -25, -135, 17, 110, -59, -64, -70, -32, 5, -169, -82, -59, -35, 3, 42, -21, -85, 221, -83, -237, 44, 179, -122, -119, -116, -59, -2, -188, -112, -101, -91, 169, -7, -63, -120, 51, -39, -10, 18, 129, -195, -122, -49, -19, 10, 24, 38, 154, 8, -98, -206, -82, 40, -119, -280, -189, -98, -8, 82, 43, 4, 129, -7, -108, 53, 51, 49, 41, 34, 240, 183, 124, 65, 6, -52, -175, -35, -80, 135, 82, 30, -22, -75, 65, -56, -30, -5, -34, -63, -26, 10, -128, -266, 9, 24, -197, 17, -13, -43, -116, 74, 154, -26, -71, -116, 68, -184, -193, -201, 2, 206, 41, -124, -50, -237, -111, -247, -142, -38, 25, 88, -77, 19, -1, -284, -267, -250, 59, 107, -124, 81, -31, 116, 35, -45, 51, 147, 31, -85, 154, 131, -131, -132, 18, 169, 52, -64, -76, -88, -100, -112, -95, -79, 3, 85, 67, 50, -103, 179, -17, -213, -115, -16, 116, -11, -9, -7, 131, 8, 16, 23, 113, -59, -18, 22, 9, -3, 65, 135, -49, 27, -124, -14, -72, -129]
-50505a29K4K4K5K6K5K5m1m1J21j39r0J70PQKJR5l41R6R7k4k3L26j10P1j92J10j52nnj55J06
-50529h8j22J40L5L5k26L5J12J11J4J4j29J32q0q1M1M1M0M1k0k0l5l7J02j58j60J03P8P8R4
-50551I0j67J00j59L5L6M2M1p2p2r8J65J15j46j44J18Q6Q4KKm7m6r1J71k5k4r1J71M1k21J3
-50573i1J3J27J28j83j84L5L5P0O8p6p8J52j08L8L8J7J8l0l1j53J10R2R3o3o1o3J99j81Q0
-50595A1J63r9k0j9J11j49P3P5j00r9K13k23J69r3J18J18k64kK8K9j01j01K37k4K0J9k56J78
-50616A2j%R5R4l52Q4r7J65l5l7J44j16k15K21j7j6J57j03j00j00J18J18j30J30q1q2M3M2
-50637e9k3k3N7N6k4K36j37j36j21J42o5J96J81k56j8j7Q4Q6o0n9n8o0R8R9l2l2l5l4p3p3
-50660a60L72k37m2m2Q0j83J61j01J52j08J41j19K27k08Q5Q6p2p2P4P5j25J34p8p6k9k8k8
$$ y = [-129, -105, -81, -56, -30, -5, 20, -21, -62, 59, -80, -170, 0, 7, 15, 17, 18, 113, -228, -132, -35, -59, -82, 244, 134, 205, 13, 123, -29, -34, -39, -194, -88, -210, -70, -35, 0, -226, -191, -79, 32, 46, 60, -69, 63, -17, -98, -57, -16, 24, 65, 45, 25, -10, -47, 55, -103, -263, -160, -82, -4, 90, -77, 23, -136, -101, -65, -23, 18, -54, -126, -224, -59, 56, -90, -234, -116, -30, 54, 56, 58, 11, -35, -126, 45, 20, -4, -95, 76, 117, -104, -91, -78, 49, 177, -6, -190, -155, -120, -50, 18, -58, -136, 16, -92, -54, -16, 1, 19, -11, -42, -195, -85, 7, 100, 37, -24, -87, 112, -69, 11, 174, 75, 55, 36, 147, -2, 71, 146, 46, -53, 160, -63, 106, 13, 131, 249, -15, -17, 11, 40, -61, -162, 75, 51, 71, 90, -166, 12, 11, 11, 106, 200, -152, -68, -165, 0, -35, -72, 72, -44, -259, -38, -55, -71, 86, -17, -117, -217, -99, 19, -111, 19, -62, -144, -101, -59, -82, -105, -48, 8, -16, 220, 83, -53, -174, -32, -97, 99, 280, 24, 6, -11, 73, 159, 99, 40, -18, -78, 20, 119, 87, 55, 20, -14, -87, -160, 212, -25, -67, -109, -29, -212, -51, -152, 0, -108, 33, -86, 141, -67, 18, 104, 32, -40, 34, 109, -16, 118, 40, -36, -65, -93, -121]
-50680a21k9J6J7O5O5J10j50k1K41j02j00M5M6k4k4q8q9P8P7o8p0J23j39QRR0Q9p8p9K97l13
-50704a19L0L1Q0Q1n0n0J5J6L2L2k18M4K8K7K0J8j27j29K03o0K29k07j99K38n2K10LLj12J51
-50726A68j42J20k55J79l7l7NOj96O5K11k24J32j31J21J20m9m8j46J15J55j07n7n7q4J78r9
-50747i4j00J35J34O5j97L3L1m8m9J07J08r5r3n8K04k37K4K49j3j26J34n2n3j16J43P7P7j08
-50768H2j08j8K42j22j21j3j3N3N2r7r7l2l2J20J19j2j0N9O1l15J21M1M0m6m7j0K52j73Q8
-50790F4j0j1m2m2j46J17l0l1L7L7K0K0J5k47m0L96J2J1P1j90r9J62J6k46P5P5k3k3J59j02
-50812Ek0k0P3P4j44j45PPJ38J37p1p0K22l8j29J34m7m7N1k10j07J54K69j68n3n1J53j08j68
-50834a72K68k79L30j00r8j97O5J96o5N2N3r3J66j58J02L7L8j39j38O4O3J02j58j2j2QPr1
$$ y = [-121, -150, -134, -117, -52, 13, 123, -27, -48, 193, 91, -9, 36, 82, 58, 34, -54, -143, -65, 12, -56, -126, -3, -142, -134, -125, -35, 54, -24, -103, 194, -119, -89, -58, 22, 103, 53, 3, 18, 34, 66, 98, -120, -76, -48, -21, -1, 17, -110, -239, -36, -96, 133, -74, -273, -35, -87, 123, 126, 129, 17, 168, 26, 146, -109, 70, 33, -4, 1, 7, -189, -124, 87, -137, -5, -136, -15, 105, 56, 8, -138, -23, 132, 25, -32, -89, -173, 5, -94, -194, -59, 75, 140, -57, -24, 7, -41, -90, 17, 125, 30, -63, -121, 83, -154, -130, 119, 106, -20, 114, 62, 9, -107, 36, 113, 190, 82, -26, -44, 198, 76, -45, -58, -71, -18, 34, -63, -160, -192, -224, -104, 15, 3, -7, 52, 113, -202, -81, -40, 0, -46, -93, -103, 149, -24, 64, 54, 43, 1, -41, -187, -70, -100, -131, -94, -57, -37, -17, -2, -249, -289, 107, 119, 130, 201, 11, -88, 74, 90, -156, -81, -6, -29, -52, 107, 5, -15, -35, 38, 112, -32, -177, -170, -163, -25, 112, 41, -29, 193, 155, 26, 160, 113, 66, 117, -93, -200, -46, 223, 55, 2, -49, 104, -4, -172, 96, -183, 147, 47, -51, -248, -183, 13, -52, 0, 53, -40, 126, -32, 70, 107, 145, 6, -132, -68, -5, 97, -61, -73, -85, -77, -70, -161]
-50855a61L46j38J25j26j26L4L3l2l2P5P5k02N9Q0Q1j15J46j38j39k4K37j47K87j54J09p2
-50875H1p1k34K01L0L1P5j87jkM7M7l0l0L5L4m5m5L6L5j26J33j43J18r3J68j09J51n5n4l9
-50897d2l9N6N5N6N6j59j60K22m0j45J16m8m8J05J04j56J04j12J47J8J8m9n0R9j63M3M2l8
-50918hl9m4m3Q8Q7J9J8k27K09j2j2j31J30j2j2J35j27J07j55M1M1mmJ2k49J07J05M1M2j14
-50941a1J46o6o6M1M1j06J54j36j37J0J0N4N4k8k8R7j64K1K2J71k63R6R6Q1j79P1P0l01L08
-50963E8Q6j75K00k35J0Rj32J30j8j7lkkkQ4Q3p4p5K67j70j37J25p8p8J50j10P6P5ool2l1
-50987c0O0O1l53Q4K30K31k02k01L3L3j05J58RJ0O7O8k10N1j35j35K64Kj02J60j18j18J3K74
-51008I9J55k81K7K6jjm5m6O8O9P0j92k8k8j39J24J89p2k8k8J03J03j92O9N4N3j31j32K33
$$ y = [-161, 185, 47, 172, 46, -80, -46, -13, -45, -77, -2, 73, -129, -70, 10, 91, -24, 122, -16, -155, -179, 58, -89, 198, 44, 153, 81, 10, -224, -23, 7, 38, 113, -74, -75, -77, -30, 17, -13, -43, -8, 26, -19, -64, -28, 7, -119, 14, -129, -11, -104, 64, -45, 106, 51, -3, -42, -81, -25, 30, 86, 142, -17, -177, 45, 5, -140, -24, -72, -120, -15, 89, -67, 37, -75, 72, 90, 108, 59, 9, 108, -55, -12, 30, -8, -47, -91, -134, -46, 41, 60, 78, -149, 60, 48, 36, -95, 35, 23, 11, 146, 19, 126, -29, 12, 53, 49, 45, 57, -192, -85, 20, 61, 103, -11, 135, 69, 3, 44, 85, -21, 133, -3, -140, -130, -120, -66, -12, -40, -68, 29, -135, -114, -92, 79, -184, -88, 8, 89, -90, -19, 51, -250, 58, 144, -31, 169, -66, -56, -47, -179, -49, -67, -84, -87, -89, -91, -93, -9, 74, 0, -75, 192, 22, -115, 10, -68, -146, 4, -106, -30, 45, 39, 33, 1, -30, 30, 91, -262, -178, 52, 283, 81, -120, -87, -54, -159, -1, 8, 18, 85, 153, -57, -6, -141, -276, -12, -10, -112, 48, -70, -188, -175, 99, 254, -27, 0, 26, 25, 24, -21, -67, 1, 70, 140, -52, -80, -108, -247, -123, 66, -6, -34, -62, 41, 144, -48, 21, 75, 128, -3, -135, 98]
-51030I8k9j25j26q2L54j82j84K97L5l7l5J09j50r2J70PPl6l7j52K84r5r6J44j17M3M2j04
-51051h9j05J48J47k99J37r1J70O7j95RQR1j72l0K32o1o2L3L2J79q3n3n2M5M5J03j58j2j2
-51073b8j7j7%%q5J76N7N7l11J25j37J25PQK4K3KKj61J01R4j66L40k70nnK18k16j27J36J74
-51096A24q8O0O1q6q6ooJ24J25n8n9p5p4J07j53K55j81p7J84j20J40j59J02Q7l50J22J22K3
-51117E8k37J92J93j89P3j31j32J20J19j20J40j6k79K79j57J96m14K22K21j22j22ONk2k2L20
-51137A81j16J29j32Q8j73M9N0k40J95j30J29j7j7O4O4p5p4N6N6nmj51J10k9k8J4J4k42J93
-51158d1R5j66Q6Q4o0o2OOK18m4l8l7j19J41j69R1J07j53j9j9J38j22j82K56J39j22n2n4O2
-51180c0O0lkllOONOl4l3k79J57j0j1J80q0r5J67Q6j75j7j7R8R8n0m9n0n0J7J7K30l2L3L4
$$ y = [98, 69, -56, -182, -264, 90, -92, -276, 21, 56, 19, -16, 93, -57, -149, 21, 28, 35, -1, -38, -190, 94, -1, -97, 47, -70, -27, 15, -89, -194, -46, 101, -198, -61, -152, 18, 85, -110, -101, -93, -2, -174, -204, 28, -33, -95, -62, -30, 149, 66, 13, -39, 6, 51, 154, -4, -16, -28, -45, -62, -62, -62, -147, 29, 86, 143, -168, -43, -180, -55, -48, -40, -16, 7, 9, 11, -150, -49, 45, -121, 219, -51, -56, -61, 157, -59, -186, -50, 124, 36, 96, 157, 71, -15, -21, -27, 97, 222, 164, 105, 30, -44, 63, -90, 165, -16, -93, 91, -29, 111, -48, 54, 141, -209, -87, 35, 58, -179, 13, 206, 17, 90, -41, -173, -53, 66, -54, 86, 70, -209, 70, -87, 109, -305, -83, 138, 16, -106, -100, -95, -117, -139, 181, 65, 194, 62, 150, -23, 26, 76, -164, 31, -99, 30, 13, -4, 60, 124, 49, -25, 31, 87, 82, 78, -73, 37, 8, -20, -6, 8, -234, -41, 54, -112, -26, 58, -2, -64, -58, -52, 166, 122, 84, 47, -72, 69, -100, -9, 98, -55, -74, -93, 45, -77, -259, -3, 136, 14, -38, -92, -30, 30, 27, 25, 22, 19, 25, 31, 36, 42, 8, -25, -304, -147, -157, -168, 12, -68, -163, 4, 90, -85, -102, -119, -21, 77, 27, -22, -72, -122, -105, -88, 142, 110, 143, 177]
-51207A77j13j13Q6Q7k78j7J0RO5O4l27K86m2m3j05J57J55j04J7J8J47j13p4p5K4K4J49j10
-51228c9J33j27j01J60J44j18N9N8j05J57p5p5p4p5J31j29J81q0q3J77L1L1j39J24j55J07
-51247A18k03N9p3p2Q7Q6j25J35L7L7O9j92JJN0N0j05j07J12J12q8q9J73q8O6j95O6O7m7m7
-51270a05K14k21n6K05m9n1L0k32M6M7J75J77k15M4K51j87R2R3k40K2OOk7k6J20j40l9l9P6
-51292b3P5m1m1K03k31RJ0J29j32j0j1j20j21L54q1L2L2q2q4M8M7K5K4J23l14J25j38J41J40
-51314H8k43J92J3J3j7j7L2L3K5k35N8N8j13J48o4o4R7R8m9n0J87p5j57K79j57J06k93l1J7
-51335a21J6l2l3J35J34MLK7K7q8q7r7J64J8J7k9k9j2j3j16J44j48J12k3k3ooN4N4j57J04
-51359gj2j2J35J35k16k15J49j12J36J35k7k8J14j48K7K6k62J75N8O0o6o6q2q3K66NooJ44
$$ y = [177, 64, -49, 37, 124, -154, -171, -161, -152, -87, -23, -350, -64, -106, -149, -254, -97, 58, -46, -29, -11, 136, 23, -51, -126, -102, -78, 71, -39, 94, -33, -134, 26, 170, 52, 111, 169, 64, 221, 146, 71, -3, -78, 53, -76, 105, 25, -58, 119, 150, 181, 42, 166, 11, 118, -85, -26, -99, -171, -84, 2, -123, 12, 49, 86, 155, -37, -36, -35, 15, 65, -40, -147, -35, 77, -11, -100, 73, -15, 51, -144, -78, -11, -58, -105, 109, -112, -168, 37, -12, -63, -33, -265, -219, -172, 3, 180, -35, 9, 260, 73, 165, 258, 18, 40, 46, 52, 25, -1, 119, -21, -60, -99, -23, 52, 11, -30, 173, -58, -49, -39, 90, -42, -52, -63, -183, -304, 50, -31, 1, 33, -49, -133, -85, -38, -13, 11, 134, -180, -55, -193, -52, 88, -155, 37, 50, 63, 46, 29, 61, 94, 119, -116, -58, 0, -113, 35, -29, -93, 4, 102, 53, 3, 190, 115, -42, 237, 80, 186, -107, -138, -121, -105, -137, -170, -35, 99, 103, 106, 133, 160, 72, -15, -112, 52, 70, 87, 58, 29, 17, 4, -112, 32, -116, -4, -27, -50, -56, -62, -8, 46, -111, -7, -19, -31, 104, 239, 23, -192, -43, -155, -19, 116, 89, 61, 175, 27, 54, 80, -182, -7, 51, 111, 45, -21, -103, -186, 80, 85, 79, 73, 217]
-51381B17k92J16j45j49J12J77q3j88P4r0J73l7K25j24j24J3J3mmJ19j43j2K49j19j19J15
-51400c0J14n9n9P1P2j29j30Q8Q8l4l4n1n1J86p4Q7j72L9L9K3K2p5p7J85p5P4j86P5P4p2p3
-51423a44J67r4j47K88k35K01J48j14O0k01J06j55K48j87j64K72%%j30j32K34k6p4p4mK59
-51443A02j65R5j15J45l8l7nmj00J63q8q8r4L41j81P9L7L6r3r5J80q1k7k7k12L98l21J15P9
-51465aP8rqj30J32q0q1J5J5J5J5l0l0J00j60J21j41J21J20RJ0m0m0j29J31o4o4RK70k24L6
-51488c4j49J14j8j7O0N9q6J74o3o1J9J9N6N7k22M1m0m0J25j38O2O1J92p0j6j7l3l3n4n5P6
-51512c1P5j70j72J34J34l2l3L60p6j21J41j81Q1o7o5P9j80J75q5O0k00L6L7m6m5P8P8J2J2
-51533a2K8K8J3J2P1j91J03j58k0j9J12j51P9P9J76k59R0Q9K9k31k61L52rj0K8K8K6K8%%j96
$$ y = [217, -75, 41, -104, -253, -141, 36, -47, -235, -161, -251, -78, -115, 110, -14, -138, -125, -112, -116, -120, -1, -144, -156, 93, -26, -145, -30, 84, 25, -34, 37, 109, -20, -150, -62, 26, -8, -42, -93, -144, 42, -32, 55, -117, -78, -39, -16, 6, -69, -146, 39, -36, 38, -148, -73, 1, -71, -144, 23, -71, -218, 70, -165, 36, 184, 70, 130, -71, 35, -120, 128, -59, -223, 49, 49, 49, -81, -213, 21, -5, -79, -153, -157, 102, -63, 32, -83, 62, 24, -13, -18, -22, -122, 41, -47, -135, -229, 112, -69, 10, 47, 83, -10, -105, 75, -6, -33, -60, -272, 126, -195, -80, -1, 77, 68, 60, -70, 62, -18, -99, -84, -69, -54, -39, -69, -99, 1, -159, -38, -179, -58, 62, 71, 81, 41, 1, -128, 3, -61, -125, -116, 154, -70, -34, -183, -69, -87, -104, -44, 15, -71, 103, 40, -21, -2, 17, 73, 130, -92, -51, -91, -131, -6, -144, -82, -21, 171, 101, 85, 68, 35, 2, -52, -107, -31, 44, -126, -298, -164, -30, -62, -95, 265, 189, 68, 209, 28, 109, 42, -23, 56, -124, 51, -34, 26, -174, -138, -101, -147, -192, -114, -36, -24, -12, 16, 44, 57, 69, 140, -51, 52, -106, -126, -145, -33, -184, -105, -26, 150, -109, -19, 70, 99, -132, -393, -41, -50, -60, -32, -4, 22, 50, 50, 50, -146]
-51557a46O6j03J60M4k16P6P6N9O0%jj47J14j16j16K76j59K8K8n3K07k29K05M2M2j09j08K1
-51578AK2p0p1J0J1o7J95r9j00J79q2o7o6R3R3K7K8j37j37J85J84k19M2K5K4m6m6Q4Q3LKj60
-51602g6J00R6j64kkK7K6J09j52K6K6J08l28K77J5r8r9J08j53P5P6j06J56j9j8J88k48K14
-51623A62k20K25k10J55j07K0K1MMMMMMl6l5J10j50J3J3llk1k1l7l7K38k3ppn6n4R1j69N9
-51649f5N9N8O0j03J60j19j18RJ0J89k47O4O2J34j27j64R7Q1Q1j67R3mnJ46j16r9r9P4P3Q
-51671B5QJ2J1n5n3J03J04m3m4J1k50J74q6llM6M5k1k2J24j36q7q7K2K2K58j78O8O6J9J9j28
-51695e9J33LKj43J16R6j66j9k0J73q9N9N8q5q5K4K3P1P2k72j0J30J30j36j36MMK49j87J02
-51718D2J02j22j21K2K2K1K2j6j6J47j13j14J47%Jj47J14l3l4K9K8K7K8L5L4K9k32J%O6O5
$$ y = [-146, -80, -183, -23, 21, -195, -119, -43, 16, 76, 76, 75, -72, 42, -74, -190, 86, -73, -45, -17, -70, 137, -92, 113, 155, 197, 88, -20, 1, 23, -47, -118, -108, -97, -164, 31, -68, -168, 11, -71, -138, -204, -111, -18, 9, 37, -100, -237, -52, 132, -87, -45, -20, 4, -42, -88, -4, 79, 82, 84, -76, 24, 120, -44, -46, -48, -21, 5, 114, -38, -12, 14, 122, -206, 71, 86, -12, -111, -3, -156, -81, -5, -111, 45, 26, 8, 196, -52, 162, -58, 167, -43, 112, 5, 25, 46, 50, 54, 58, 62, 66, 70, 34, -1, 109, -41, -28, -15, -18, -21, -42, -63, -100, -137, 101, 78, 71, 64, 8, -46, 45, -124, -65, -6, 52, 112, 9, 169, 50, -68, -59, -49, 140, -107, -43, 19, 153, 26, -138, -41, 40, 121, -46, 47, 43, 38, 184, 68, -31, -130, -56, 17, 25, 33, 45, 56, 1, -52, 51, 155, 112, 68, 79, -171, 3, -83, -86, -89, -43, 2, -19, -41, 83, -53, -140, -227, -205, -183, 75, -103, -35, 31, 50, 69, -59, 74, 77, 79, -64, 52, 148, -18, -37, -57, 116, 27, 86, 144, 59, -26, -2, 21, 92, 164, -108, -118, 12, 142, 6, -130, -126, -122, 127, -60, 42, 144, 22, -99, -77, -55, -34, -12, -28, -44, 103, -10, -124, 23, 23, 24, -123, -9, -42, -76, -47, -19, 8, 36, 71, 105, 134, -98, -97, -97, -31, 34]
-51741C4j89P3J36j23M5M4l6l7R9J00rk70J43j17K74j62j10J50j70R1L9M1j88K47j92j93L09
-51762B9M7j0j0J21j41r5r6K31l0l9l8j20J41J74k61L26k83J98o2Q4j77LLKLj84P7l6K24P7
-51784A58j85Q7Q8j34j33K37k4L0k32n2K09o8o8N7N6o6o7Q6Q5O4O5M2k20j63K72n4n5J7J8
-51806E0k27K08L0L1n1n0K2K4m1m1n0m9K50j2k6k6j89P2n2n2J18J17m5m3m5m5L8L8r3J68j18
-51829h9J42J2J2m6m5n7K04k51J83O5O4r2r2j0j0j17J44j48J12l5l5j8j9L6L6L6L5J4J5J62
-51852B08j01pqk4k4L0L0j16J43o8o7llQ5j76K0K0Q1j80L3L2M8M7M8M9j4j3p8p9N2N0J34j29
-51877B0m8n0%%N7N5r5r6O9O9p8J82n9n9J69r3j07j09P1P2OOOPj5j4K4K3K09k28k62L50p4
-51902Hp4j01J60j46J15J31j29L2L1k2K40j28j27J45j17j8j7j17J45K1K2n4n5j0K52r2r1j
$$ y = [34, -155, -82, 54, -69, -24, 20, -16, -53, 46, 146, 137, -133, 10, -107, 167, 5, -105, 45, -125, -34, 5, 46, -142, 105, -87, -280, 29, 76, 66, 56, 177, 36, -59, -155, 76, 46, 7, -31, -151, -10, 164, -97, 229, -54, 144, 82, 166, -11, -8, -5, -3, 0, -184, -107, -143, 81, 158, -27, 60, 148, 14, -119, 118, 94, 124, -108, -160, 49, -19, -87, -30, 26, -40, -107, -21, 64, 128, 193, 235, 15, -148, 124, 70, 15, 32, 50, -177, 31, 61, 92, 41, -9, 13, 37, -4, -45, -95, -144, 106, 94, 68, 42, -147, -75, -127, -179, -61, 56, 11, -32, -77, -122, -84, -46, -139, 29, -89, 53, 65, 77, 31, -14, -71, 133, -118, 65, 130, 194, 102, 10, 0, -10, -127, 17, -131, -19, -54, -89, -107, -126, -90, -54, -18, 17, 31, 46, 208, 107, 100, 92, 68, 44, 74, 104, -12, 131, 63, -4, -7, -10, 75, -101, -81, -61, 20, -160, -127, -95, -47, 0, 48, 97, 83, 70, -8, -87, -35, 15, 149, 20, -28, -78, -78, -78, -21, 34, -61, -157, -88, -19, -97, 85, 26, -33, 136, 43, -64, -173, -102, -30, -24, -18, -12, -5, -20, -34, -10, 13, 222, -6, -268, 82, 8, -66, -167, -7, -153, -38, 93, -36, -4, 27, 5, 245, 117, -10, 135, 18, 0, -17, -134, 11, 32, 54, 0, -55, -65, 187, 95, 4, 3]
-51923Cjj5j7J37j22j23J38nop1J90q6q5Q2Q3j2j1j20j20M3M3j32J31J95k40J68r2L9L8K3
-51945E5K2j02j03R4R2j45j47J81J80k0k1k65J71M1M3n1K12k85J50MLr8J65l53Q2J38j22N1
-51966b8N0K2K1j09J51k85k5J45j17O3O3M7M5l2l1N9O1k42J94o7o8J29j31o6o6K04n9n8K03
-51988G3j01j02Q3Q3j77Q5P3P4N3k09j44J18k3k2J25j37J99o2M7k15J50j13J01R9j75Q7J34
-52008A04j26J31j30%%n6n6J40J40l4l4l4l5o5o6J30J30k00k02J54J53P0j92K1K0J06J06l29
-52030a54K80j70Q9j9j9%%j46J15M4M5m8m7N2N3O9P0k20M0LLm1m2Q2Q4k19M2K1K0j02J58n2
-52054in3l1l0J23J22M5M5j52j50J01J03j59K77P1j91j62R7j15j16M8M8o7J94q2q4N9N9N7
-52075D8N9m8m8m6m8M0M1L9M1q1q1JJn6K06p1p2L9L8J1J2K33k03N9N9j74Q6o0n9N2N2J34j28
$$ y = [3, 2, -13, -30, 107, -15, -138, 0, -5, -11, -82, 108, 22, -63, 19, 102, 90, 79, -41, -161, -118, -75, -207, -76, 119, -121, 47, -45, -6, 32, 55, 77, -25, -128, -34, 58, -87, -234, -53, 127, 107, 86, -179, -8, 33, 76, 25, 237, -48, 102, 106, 109, 11, 176, -177, -95, 43, -79, -28, 22, 44, 65, -44, 107, -178, -203, -58, -175, -112, -49, -2, 43, 11, -20, 39, 100, -142, 52, -15, -83, 46, -85, -151, -217, -13, -72, -130, 73, -28, -130, -47, 36, -141, -56, 17, 91, 144, -65, -209, -91, -114, -136, -11, -148, 51, -11, 36, -179, -29, -142, -41, 58, -117, -30, 104, -22, 109, -21, -21, -21, -77, -133, 7, 147, 113, 79, 45, 10, -55, -121, 9, 139, -61, -263, -109, 44, 114, -78, -57, -37, 69, 175, -154, 126, -44, 45, 26, 7, 7, 7, -139, -24, 20, 65, 17, -30, 22, 75, 144, 214, -6, 34, 37, 40, -1, -43, 39, 123, -96, -54, -33, -13, -115, 43, -9, -62, -93, -123, 0, 122, 167, 212, 60, -90, 11, 114, -45, 232, 303, 112, -50, 47, -68, -184, -136, -88, -155, 39, -43, -127, -68, -9, 48, 107, 59, 11, -35, -83, -43, -2, 37, 78, -3, -84, -83, -82, -138, 68, -3, -75, -36, 2, 13, 25, 258, 55, 114, 173, -1, 85, 25, -34, 18, 70, 204, 76]
-52100G6J6J5M3k19j59K76J6J5k0k0k1j9J3J4j4j2J73k63j7j8N7N6rrO4O4o6o6K8K7n3n4P5
-52124a1j87j53K83j0j1J48j13P9j81J51J50mk64J00J00p8p8J99o2m4m2j42J20k3k4Q6Q6K17
-52146B92l94Q1P9l8l7R2R2m9n0J6J6j26j27K0K0n5K06P6j85J23J24j11j10L6L5k59J78j35
-52167a90J27rj0K83K1j37j36o9o8L94m1p2p2M8M9j59J02o1o0J51j10N2N3j34J26k1k1q7q8
-52188a39M3M3j34j35L19N6k4k4P4P5J32j31m8m9n8o0J36j24J12j49l5K27q9q7q8J73J58J58
-52210C32l83j21K68Pk22K13O6j96N9O0j94O7P8P8j84K51k23K13k66nOOJ34J34j11j10J73
-52230A30k63J30J29j92O7j2j3K7K8j02j03R0Q9m1m1J06J07r5r5q1J80J7J7J36j27j09j10
-52250a31J6J6J46J46l1l1l1l1j1j0j1j0L8L9k7k7J8J9N6k05N2N0j94O8P3j89J11J11k29K08
$$ y = [76, 92, 107, 150, -69, -228, 48, 64, 79, 59, 39, 18, -1, 12, 26, 12, 0, 173, -90, -107, -125, -68, -12, -21, -30, 34, 98, 32, -34, -6, 21, -32, -86, -11, -198, -351, -68, -78, -89, 59, -54, 25, -156, -5, 145, 141, -123, -23, 77, -1, -79, 120, 58, 14, -28, -170, -50, -73, -97, -11, 75, 292, -102, -21, 58, 20, -17, 75, 167, 118, 68, 84, 100, -26, -153, -133, -113, -168, 38, 114, -71, 52, 176, 65, -45, -9, 26, -233, -55, -190, -63, -72, -82, 201, 222, 85, -51, -120, -188, 206, 165, 93, 21, 69, 118, -41, 61, 0, -60, 91, -19, 33, 86, -48, 78, 57, 36, -51, -139, -96, -53, -187, -322, -3, 53, 29, 5, 79, 154, 286, 155, 107, 58, 0, -60, 76, -48, 64, -85, -120, 107, 18, -69, -157, 16, 174, 332, -51, -172, 96, 103, -119, 94, 160, -36, 23, 83, -111, -44, 34, 112, -72, 179, -44, 169, -97, -102, -96, -90, 44, 178, 67, -43, 130, -133, -3, 126, -66, 1, -11, -24, 3, 31, -71, -174, -84, 5, -36, -77, 29, 136, 41, -54, -135, 45, 62, 79, 215, 88, -21, -131, -115, -99, 47, 193, 162, 131, 100, 69, 58, 48, 37, 27, 65, 104, 77, 50, 68, 87, 143, -62, -10, 40, -154, -86, -13, -202, -91, 20, -209, -1]
-52273aRJ1J16j45m8m8p3J89k03K33rqm6m6O5O5j31j31M5M5M5M5o8o7J71J73j77j76J24J22
-52295H1j21J39ppq0p9K48j5k33K02j25j24N8N7N2k09J38J37K9k32L3L3J63r8K3K4j01j02
-52316a16J0J0J57j04n2n2J28J28j83j83L08M6j17J43k0k0l8l8q6q7j10J52R8R7O0k00J1J1
-52337d7M5M4q5J75k69rK15k21k1k2J04J03p7p7K22m0RQqqk6k5L9M0j01j02N1N1j8j9j00J61
-52362hPOJ54j08P0j90M9M8M9N0j6j7j39j41J00R9l0l1l2l1J26J27o9o9k2k3R6j64K06k29
-52384a32J51J52r4r3O9j91l0K32LLj9k0J61k76N7N6R5R5j14j12J10J11K1k39j09j09K29l1
-52405b4OOj7j7P5P6J33j28p4p2n4K08m8m7J0J0j36J23QPK4K4m1m1K4K5k9k9j09J50l8l7J91
-52430A59p1j0j1k7k7k1k2k3k2J1J0J1J1O6O8q0J83l2l2k44J7J15j46J64r6RJ0O5O7r5L6J19
$$ y = [-1, 8, 19, 135, -10, -58, -106, -179, 10, -193, 40, 31, 23, -23, -69, -4, 61, -70, -201, -156, -111, -66, -21, -89, -156, 15, 188, 11, -165, -41, 81, -40, 99, 92, 85, 5, -74, 174, 159, -74, 128, 3, -121, -63, -6, 46, -163, -25, 112, 141, -91, -58, -25, 138, 40, 63, 87, -14, -116, -106, -96, 61, -43, -95, -147, -19, 109, -74, -257, 51, 97, -20, 123, 103, 83, 45, 7, -79, -166, -276, -124, -26, 71, 131, -69, -58, -47, -2, 42, -43, 132, -137, -146, 69, -152, -173, -195, -91, 12, -65, -142, 80, 40, 49, 57, 49, 41, 15, -10, 29, 69, -32, -134, -83, -32, -50, -69, -169, -8, -1, 5, 159, 51, 121, -69, -20, 28, 77, 127, 111, 94, -45, -186, -86, 13, -17, -48, -80, -111, 15, 142, 73, 4, -18, -41, 55, -109, 97, -132, 19, 171, 77, -16, 53, -138, -168, 64, 67, 70, 51, 31, 192, -84, -27, 29, 124, 219, 105, -7, 103, 214, 235, -4, -113, -222, 7, -24, -18, -12, -29, -46, 29, 105, 238, 110, 36, -36, -90, 118, 70, 23, 33, 43, -93, 30, 38, 45, 69, 93, 52, 11, 35, 60, 31, 2, -107, 43, 5, -32, 159, 88, 78, 67, 40, 13, -8, -30, -53, -75, -64, -54, -43, -32, 34, 102, 22, 205, 173, 141, -103, -86, 29, -117, 47, -49, -40, -30, 35, 102, 7, 43, 162]
-52454A62j44nJ26Jj30kjJ30j32J61L0r6L6J3J3k18M3j66R7K2j08K69Qr3r2J05J06j34j33
-52476a32N0N0M9N0M9M8o0o1m7m9K15m6j20J0p1p2J3J44j25J36j40J20r1J70p8p8J48J7P6
-52498A75j85m7m7M3M2k3k3P4P4r2L8o3J98p6p7j20J41p1N9o4O6j30J31j31J29p3N6p9q0J67
-52520A2J69n9o0J05j58j20J41j41J19j79K57J10k1j65l4K00o2j76Q5J21j0k02N8J32l04K11
-52540B9n0q6M5J33j29J65r6j0j41J86N5k7k7J3J4Q6j75k9k9mmM4M4P4j88rK53l27J09J08
-52563B7j53K5K85j12j11L87k24k77J58k5k5j5j5J97o5j74Q8L4L5M6k16P1O9j74Q7P0j91L8
-52584a60L7O4O3m4m5m4m4K66j68KLJ21j38j3j2Q0P9k6k6O5O7k83J54k6k7N1N1j5j4MLJ84
-52608B09k52L5L4QPjkk47J90K7K8N6N5j03j01O5O7j85P7j36J26p3J88j81P9p4J88rqQQR0
$$ y = [162, 18, 13, 139, 140, 10, 8, 7, 137, 5, 166, 196, 100, 136, 149, 162, -56, -13, -179, -82, -60, -168, 101, 109, 16, -76, 29, 135, 1, -132, -82, -32, 17, 67, 116, 164, 104, 43, -4, -53, 162, 116, -4, 6, -65, -137, -124, 20, -105, 31, -109, 11, -80, 90, 12, -66, 82, 99, 175, -10, -57, -104, -61, -19, -42, -65, 9, 83, -9, 29, -34, 164, 88, 11, -109, 32, -39, 20, -44, 22, -108, 23, -108, 21, -52, 4, -75, -155, 12, 181, 122, 62, 167, 9, -111, 30, -111, 8, -171, 86, 196, 175, 10, -24, 176, 114, -62, 23, 144, 134, -68, -10, 122, -182, 29, -21, -107, -62, 71, -58, 107, 11, 1, -140, 46, 101, 74, 47, 60, 74, 160, -15, -44, -73, -77, -81, -37, 7, 81, -107, -116, 137, -190, -81, 27, -126, -101, 184, 72, -39, 348, 124, -153, 5, -20, -45, -60, -75, 122, 57, -117, -29, 5, 40, 86, -130, -59, 10, -164, -77, -7, -198, -160, -123, -59, 4, -40, -85, -129, -173, 93, -75, -73, -70, 51, -87, -100, -112, -32, 47, 21, -5, 60, 127, -156, -2, -28, -55, -4, 47, 32, 18, 22, 25, 209, -43, -8, 26, 34, 41, 40, 38, -209, -19, 8, 36, 92, 147, 44, -57, 8, 75, -110, -33, -169, -43, -116, 72, -109, -30, -104, 84, 75, 67, 75, 83, 173]
-52632A73j72j3j5J66r7Qk53J44J43K9k32K13m7JKk60J76N2N3J95k42k5k7J42j18J00j60L5
-52653b9L4P9P9q0p9K94j42k78j7K01o1K19k19l1l2K19m3n3n4q5q7J87p4M6M4K21k17M6k16
-52675a28J27J26j08j07Q0P9l4l4j37J24opr9J61jjJ72r1n8n8j14J46J6J6j27J34j59J01p7
-52697f4p8Q5j76R7R7K28l4o7o6M8M8q6q4j29L07R5j68PQk0j9l5l6J27j34J4J3K4K5K5K5l0
-52721D7l0k9k9LLJ9J9j19J41nnl8m0R1R1l9m0R2R1q0q1p9q1L5L4L3L4p4p5N5N6L9L9r1r1
-52747a04L8L8J85p6J6J7j30j31N8N8N6N8n7n6J01J02k21K15l1l0o4o4O6O7o5o3j62R9J26
-52769D6j34l7l7J47J47k45J6K53j82J60j01MNj75Q6J10j51K9K9j03J58n4n4Q5Q6m4m4o6o6
-52791a32J52J53o1o2MMp4p5N5N5N2N2O8j93o9o9M6M6J9J8qrK78j59j57K78n9n8K3k38L20
$$ y = [173, 1, -12, -27, 139, 42, 50, -203, -59, 84, 113, -119, 94, 47, 48, 50, -210, -34, 18, 71, 266, 24, -1, -28, 114, -4, 96, -64, -29, 5, 84, 163, 83, 4, 298, 156, -122, -139, 62, 1, 220, 1, -30, -62, 157, 114, 61, 7, -78, -165, 22, -52, -6, 38, 259, 42, 88, -128, -1, 125, 17, -90, -10, 69, 35, 1, -136, -12, -18, -25, -124, 37, 36, 35, 207, 116, 58, 0, -114, 32, 48, 64, -63, 71, -88, 13, -64, -142, -57, -233, -136, -39, 189, 155, 88, 22, 70, 118, 32, -52, -181, 126, 221, 53, 60, 68, 48, 29, -6, -42, 85, -49, -35, -22, 2, 27, 52, 77, 47, 17, -12, -41, -38, -35, -16, 3, -116, 25, 20, 15, -23, -63, 28, 119, 80, 40, 132, 223, 143, 62, -17, -98, -63, -29, 4, 38, -36, -111, -56, 0, 39, 78, -13, -104, -66, -28, 157, 81, 97, 114, -16, -147, -89, -31, 25, 83, 26, -30, 71, 173, -48, 167, 136, 106, 42, -22, 44, 111, 46, -17, -179, -80, 46, -88, -125, -162, -15, 132, -113, -97, 156, -26, 134, 33, 37, 42, -133, -47, 63, -88, -59, -30, -133, 25, -29, -83, 2, 88, 44, 0, -66, -132, 20, 173, 112, 50, 54, 58, -16, -91, -36, 19, 71, 123, 191, -2, -71, -140, -94, -48, -29, -11, -19, -28, 250, 91, -66, 212, 153, 95, 118, -120, 200]
-52814B00j17m5m5K58j78J01j62m6K14k27L4J28J28n7n7j70R0QRQPn8n7O8O8k42J93K8K9j94
-52837h4O7j00L36m6m5n5n5r2J68l2l2O7O6R4l42J15j46%jJ35J36j26j25l4K28j5j5j07j07
-52859a47L7L6J02J03p0o8K2K3J18j45LLn7n8K69j67q8J72q4J78j25j25J02j58J14J12L1L1
-52880A64p5p6N6k06K48j4M6M6l72K37j86P4LKJ8J9m7m7KLK53pj59J01l9l8Q7Q7j04j04ON
-52904a7Q6Q8j42J21R6j66r5r5K70j65l0k9P0O9Q1j80r8J62j6j6J74q8J1J1j30J31j5j6L7
-52926A09L8m4m5Q1j81O9O9l13K97J99k37R4R4k32K7j6j5Q1j80P1O9j2j1K4K4r3r4J04k8K42
-52948A91j93n0K12j48J14k56J79%%J41j20P3j88pJ22l2l2nlN9O1L0K9q0q0Q0Q0k9l0k3k4
-52971G1LMj66K69r9L2j29J31q9J73n0n0k5k5q7M1K81j57OOk2k1jjj8j7N4k08L53q3j56J05
$$ y = [200, 83, 38, -7, 251, 73, 174, 12, -34, 180, -47, -13, 115, 243, 186, 129, -41, 49, 57, 66, 74, 81, 23, -34, 34, 102, -140, 53, 81, 110, -84, -17, -117, 219, 173, 128, 73, 18, -74, 94, 62, 30, 97, 163, 257, -85, 30, -116, -116, -117, 18, 154, 28, -97, -131, 97, 82, 67, -40, -147, -110, -74, 28, 131, 61, -7, 15, 38, 156, 11, 14, 17, -40, -98, 171, 4, -84, 88, 4, 182, 57, -68, 34, -124, -10, 102, 133, 164, 89, 13, 69, -137, 111, 97, 143, 189, -183, 54, -132, -58, -55, -53, -35, -16, -63, -110, -108, -105, 148, 141, -18, 83, 44, 6, 93, 180, 76, -28, -22, -17, 69, 157, 15, 136, 232, 66, -29, -124, 146, -19, -49, -78, -8, 61, 142, -38, -136, 26, 10, -6, 168, 80, 91, 102, -28, 103, 88, 72, 109, 147, 103, 58, 139, -42, 27, 96, -217, 80, 279, 42, 136, 230, -2, 25, 9, -6, 75, -105, -34, 35, 23, 12, 36, 60, -33, -127, -23, -51, 191, -2, -52, 160, 12, 126, -130, 49, 49, 49, 190, 70, 143, -45, -52, 70, 38, 6, 1, -2, 57, 118, 148, 177, 97, 17, 97, 177, 148, 118, 95, 71, 74, 78, -88, 181, 82, 114, -15, 116, 27, 200, 150, 100, 75, 50, -37, 4, 285, 128, 134, 140, 118, 97, 96, 95, 77, 60, 114, -94, 259, 176, 20, 125]
-52996A25p7N3nnLLM7M7j93O8l9K23k47J90j98O2r2L7K17k19J80q0M3M3l8l9O1O1q4q3j7J15
-53020A62R6j67o2J99J64k73K6j04J84N4j42J21j55J07j60K78l5l4N5k07j1j1N2k09K80K0
-53039B28j2j3k79L32R6j67k08K26j36J26OOj3j2R7R8q2q2p6J85n9o0q1J81j9j8O3j99J62
-53061B90j02l5l6J18J17p9q0O6O6m3m4m8m9K46j91K15m8j85P8%%j20L17r2r1o5o4N2N2l0
-53084B15l0J17j45o3o3J46J46j10j11j99K36J23j40J88p5j23L14j22j23r4r4J13J14K51j86
-53102B85r8r8j5j6N4N4N3N4J5J5j82Q1m4K19n0l11J38J38j5j4j53J10l8l8M1M2j71R1m0m0
-53125F7k3k4K6K6l9l8L2L3N5k07J20j40R8R8p1p1q3J79J38j25M0M0k6k6k6k6L5L5o9o8L57
-53148C17k55m2K21k62kq3J78k0k1J44j19J0J0N9N9j1j2j60J03l9l9J91p2KKk60J76R6R7l0
$$ y = [125, 48, 101, 96, 91, 94, 97, 144, 191, -2, 66, 27, 250, 3, 193, -5, 57, -35, 2, 219, 0, 180, 100, 143, 186, 148, 109, 170, 231, 147, 64, 47, 162, 258, 91, 29, 228, 392, 119, 145, 41, 225, 279, 137, 258, 103, 210, 50, 328, 293, 259, 314, 107, 96, 85, 137, -72, 208, 228, 216, 203, -76, 256, 352, 185, -23, 203, 67, 193, 199, 205, 192, 180, 277, 375, 293, 211, 135, 320, 261, 201, 120, 301, 282, 264, 327, 128, 290, 188, 153, 117, 235, 352, 273, 193, 259, 325, 282, 238, 190, 141, 387, 196, 411, 363, 178, 256, 256, 256, 136, 453, 361, 270, 205, 141, 193, 245, 215, 185, 302, 157, 94, 31, 177, 323, 213, 102, -97, 139, 262, 122, 310, 235, 112, 426, 304, 181, 87, -7, 106, 220, 471, 285, 187, 89, 74, 58, 112, 166, 219, 273, 288, 303, 121, 202, 158, 377, 327, 16, 154, 292, 277, 263, 110, 220, 182, 144, 185, 227, 56, 147, 107, 67, 44, 20, 46, 72, 33, -5, 27, 60, 115, -92, 28, -112, -14, 84, 13, -58, -141, 38, 176, 51, 91, 131, 105, 79, 53, 27, 62, 97, 28, -40, 317, 62, 20, 241, -21, -23, -106, 72, 52, 31, 175, 56, 66, 76, 135, 194, 183, 171, 11, 114, 75, 36, 227, 155, 157, 159, -101, 75, 171, 268, 238]
-53171B38k9PQj02j02l0l2R4R4J78k59LKj86P4j11J51mnp0p0K05n5n5K05p4p3N2N2m0m0K5
-53195E1K6LMM2k20QQp4p5J43J42n3n3K8K7j18J42Q2Q1j86P6j00J59j82P8J6J6l4l3l7l9j37
-53219b09J25J75q7J2J2m0m1m1m1J16J15M5k16%%j6j7l2l3o6J97N8k02m0l9R0R0R0j71J23
-53242d3j40N7N7q9q8K87j49j2j2n6n6K28l4jjj65R7n0n0LLQ6j78J50J50M0M0k83L26j47j48
-53265a78L3L2l3l4R4R3l6l8M2M0q9r0O1O0O0O0j19j21J42j21K31l0k65lJ17J16k26K09j45
-53287a38J17J10l24J44J43j01j01J51J53k51J0K04m06K00k37J42J42%Jj94O9J23J22K5k37
-53306a33J88p2j15j14K35k8o1o1J35j27J25J23j10j11J15J13j03j04O7O6o3o4J4J4J05J07
-53325A41k39J97o4o4J37j23p0p0J29l07K44K43o0o0l05J31Q7Q6j6j7j3j4k59J77k9l0kkL1
$$ y = [238, 209, 216, 224, 122, 20, -10, -42, 52, 146, 324, 65, 68, 70, -116, -42, -153, -2, -6, -11, -81, -151, 54, -1, -56, 149, 75, 2, 54, 106, 66, 26, 51, 77, 80, 84, 126, -94, -86, -78, -152, -227, -84, 58, 5, -48, -20, 7, -111, 31, 113, 194, 8, 84, -16, 143, -39, 39, 55, 71, 37, 4, -33, -72, -209, -84, 91, 4, 16, 28, -12, -53, -94, -135, -19, 96, 141, -75, -75, -75, -91, -108, -140, -173, -239, -42, 16, -186, -226, -265, -175, -85, 5, -166, -43, -183, -126, -69, -158, -246, 41, -108, -120, -132, -188, -244, -16, -50, -51, -52, -217, -120, -170, -220, -217, -214, -128, -306, -156, -6, 34, 74, -209, 117, -30, -178, -145, -113, -146, -180, -86, 7, -29, -67, -25, 15, -74, -164, -103, -43, 17, 77, -42, -163, -21, -142, 89, 59, -206, -209, -92, 24, -202, 7, -138, -21, 89, -235, -91, 52, -49, -150, 1, 154, -97, -87, 117, -289, -89, -326, -184, -42, -42, -41, -235, -166, -43, 79, 104, -133, 55, -17, -132, -246, -11, -39, -100, -161, -26, -153, -28, 95, -15, -126, -11, 102, -1, -105, -38, 28, -35, -99, -85, -71, 34, 141, -98, 99, 35, -29, 108, -15, -85, -155, -26, -333, -89, 154, 94, 34, -271, -140, -53, 33, 17, 0, -13, -27, -286, -109, -138, -168, -170, -172, -141]
-53347a41L0M7M7r6J66KKK7k34J30J30o2o0J01j59q6J75k33K03POq5J75k62J74K7K7k15M7
-53369a10J4J3nk68J86J85q2q4j8j8N6N5rj0N0M9N0N0n4n3nnJ3k48K64KQQj39j39R5R6k33
-53394b86K05J59j02n9K03j51J09k1k82K51j0j0rJ0J2J1J1k9k9kkk28K10l6l7M0M1j08J54
-53416A5n3n4l8l8N2N3k05N8J88J86j40j39J66r4j4j3ook3k3J41j20J89p2j47J15L1L2j14
-53437g3J46o6o5J7J7L2L3r6J65r1r0K7K7k29L2J78J76k20M1j4K47k70rJ5J4L1L0k9l0K0J9
-53461a5Q9j71n2n1K66j69m9n0J81q0m3m3J08J08q8q8P6P6O1O0%k62J40j19nnM5M4p8p8L0
-53484a62L1M9M9r9J62r3r4J36j27O6O6j80K56j51J10j0rj28j27L31j05j29J34QQJ47j14k38
-53505b13K3J15j47J64r8j2j2N4N3L02j34m1m1K4K5m2m0QQn8n7R1R0j8j8NNj42J19m8m8J63
$$ y = [-141, -111, -64, -17, -113, 53, 55, 57, 84, -150, -20, 110, 48, -12, 89, -70, -156, 19, -214, -11, -4, 2, -83, 92, -170, 4, 31, 58, -157, -110, -96, -83, -88, -356, -170, 15, -67, -151, -169, -187, -131, -76, -85, -95, -45, 4, 54, 104, 50, -3, -8, -13, 0, -248, 16, 18, 26, 34, -105, -244, -149, -53, -286, -81, 78, -24, -83, 120, -31, 78, 57, -225, 26, 16, 6, -3, 7, 19, 30, 41, 12, -17, -19, -21, -249, -39, -75, -112, -72, -31, -139, 15, -38, -92, -130, -168, -116, -63, -268, -210, -22, 164, 24, -115, 51, -43, -57, -70, -76, -82, -105, -128, 13, -107, 82, 10, -137, -22, 9, 41, -73, 73, 7, -58, -41, -24, 8, 41, -55, 110, 19, -71, -44, -17, -246, -214, -36, 140, -80, -39, -53, 194, -76, -85, -70, -56, -25, 5, -24, -54, -34, -15, 74, -97, -149, -200, 66, -103, -152, -202, -21, -101, -144, -187, -79, 29, -59, -147, -71, 5, 66, 126, 126, -136, 4, -115, -120, -125, -80, -36, -114, -192, -162, -131, -82, -33, -132, 30, -63, -157, -21, -148, -82, -16, -196, 60, -91, 19, 9, 0, -128, -255, 76, -29, -158, -24, -16, -8, 139, 25, -213, -190, -75, -222, -58, -156, -168, -180, -126, -73, 229, 95, 54, 13, 37, 62, 20, -20, -12, -4, -62, -119, -28, 62, 44, 26, 31, 36, -106, 13, -35, -83, 80]
-53529H0r6M6k13RRJ94o6k9k9K8K9l7l7J6J6J6J7o0n9K13m7j22J39k3k4j12j12O8L29j85j86
-53553b28K18m4Q3Q4j78K58l2l3j68R3Q8j73k6k6J99o2j97O4p1J90j96O6PPOPO6j94J49j14
-53575a57K38k3j48J13NOj24J36m6m5l0l0J9J9Q3Q5o9o7o9o8J4J5R7R6q0J80p5p5k0k0k0k0
-53599h0opJ24j36J42j17n3K09j98O3J77k58j7j8J04j60J81J80j35j36J46j14M8M9k3K39j05
-53620I9j03kjkjk6k6J04j56J21j40P2P2j36J25o0o0m1L95j77Q4k53Qj4j3J0J1P7P5m5m7Q4
-53644C4j77J77q4O2O4k07N5J7J6p4p5P8P8O7O9k31L0N6N5P2P2n5n5J58j04M0L9k60Jn9K02
-53667F1q0q1N1N0kK57l80N7K3K4m6m7J07J06m1m1j06j06Q8Q8L8k22N9N9Q2j81K8K9J2J3O8
-53690c3O7q3q5J03J02k2k3J2k50R4R3k8k9k8k8K3K4K3K4Q6Q7j52j54J43J43j95K40j74Q5
$$ y = [80, -16, 30, -183, -174, -165, 29, -37, -66, -95, -67, -38, -75, -112, -96, -80, -64, -47, -107, -166, 47, 0, -122, 17, -6, -30, -142, -254, -186, 143, -42, -228, -10, -54, 29, 113, -65, 193, 161, 128, -40, 53, 141, -32, -58, -84, 115, 53, -144, -80, -151, 39, -157, -91, -84, -77, -71, -64, 2, -192, -43, -157, 81, 58, -90, 23, 28, 34, -90, 46, 0, -45, -75, -105, -86, -67, 16, 101, 32, -35, -104, -172, -158, -143, -46, 50, -30, 150, 75, 0, -20, -40, -60, -80, -86, -93, 31, -105, 37, -80, -133, 76, -122, -59, 118, -140, -157, -175, -71, -231, -50, 130, -5, -141, 5, -109, -61, -12, -35, 204, 99, -4, -6, -7, -9, -10, -36, -62, 42, -114, 7, -133, -61, 11, -125, 0, -60, -120, -161, 234, 57, 141, -112, -104, -118, -131, -121, -110, -33, 42, -3, -50, 34, -143, 34, -50, 12, 76, -131, -76, -59, -43, -117, -192, -114, -36, 31, 100, -131, -101, -45, 10, 82, 154, 99, 44, 202, 98, 138, 177, -83, -82, -141, 61, -19, -100, -49, 1, -1, 256, -124, -67, -44, -20, -66, -113, -6, 100, 59, 18, -88, -194, -106, -18, 20, -202, -143, -84, -2, -183, -155, -126, -114, -101, -33, 34, -49, -134, -31, 71, 49, 26, 38, -212, -118, -25, -53, -82, -110, -138, -115, -91, -68, -44, 42, 129, -23, -177, -34, 109, -86, 154, -20, 65]
-53712F5q1q3m4K17j26j26Q9Q9K3K3r0r1L06j29K8K8j51j53P7P8N4k06Q6j77J08J07k1k0Q8
-53734c2Q7r0r2Q8Q8J17j45j06j07M7M7M7M7M6M7m6m5j13J50j44J16L7L6j8j8k30L79k74J61
-53756H0m2m0KJj62J00O1O1K2K2k89J48pom4m5L7L6N2N2j14J45K2k40O0k01L27j07j7j8J08
-53779DJ08lmo9o8j4j5L4L4K22l9j91O9L4L5j61R9m3m3J20j41O8O8p4p2J44j17K9L0p7p8M8
-53803f3M7J74k62%jr8J64J6J7p0p0J00R9j39J21k5k4J7J7j29J31j0j0j24J37j17J43j49J10
-53825BO8j94K08n3J78q4j06j05k6k5M1M0J4J5J61j00J1J2q5J74j47j48K23k13RRJ78q3J16
-53847I0j45j4j4p6p7J21J19p4p5J8J8R5j68j4K47QRm0m0lmmll3l2L4L3K9L1j82Q0N0M9J6
-53873D9J7j62R7k00K34J26j36j1j0J0K74j15j15O7O7k71J64j37J22LLj25j27Q7Q6j76Q7k3
$$ y = [65, -16, -99, -143, 74, -52, -178, -89, 0, 23, 46, -44, -135, 171, 42, 70, 98, -53, -206, -129, -51, 3, -203, -117, -294, -186, -79, -100, -120, -32, 55, -35, -127, -39, 49, 166, 21, -85, -192, -145, -98, -51, -4, 42, 89, 43, -2, -115, 35, -109, 7, 44, 80, 62, 44, -186, 193, -81, 80, 38, -2, 0, 1, -161, -61, 0, 61, 83, 105, -184, -36, -43, -49, -93, -138, -101, -65, -13, 39, -75, 70, 92, -148, -88, -289, 38, -69, -86, -104, 4, 112, 109, 105, 36, -32, -46, -61, -27, 7, 229, 190, -1, 68, 102, 137, -24, 75, 32, -11, 109, -32, 36, 104, 30, -42, 102, -15, 14, 44, -33, -111, -63, -16, 158, -104, -104, -105, -203, -39, -23, -6, -76, -146, -46, 53, -86, 35, 10, -14, 3, 20, -109, 22, 12, 2, -122, 15, -102, 41, -108, 2, 70, -124, 84, 31, 209, 125, 19, -86, -112, -137, -96, -56, -42, -27, 134, 34, 45, 57, -28, 146, -1, -149, 74, -139, -130, -121, 57, -26, 90, -55, -69, -83, -159, -236, -115, 4, -70, -145, -127, -109, -14, -182, -196, 51, 59, 68, 28, -12, -15, -19, -23, -26, -59, -91, -57, -24, 5, 36, -146, -66, -16, 33, 49, 66, -96, 1, -199, 35, 161, 25, 14, 4, 14, 288, 173, 58, 125, 192, -79, 85, -52, 70, 73, 76, -49, -176, -89, -3, -179, -92, -115]
-53894a15k3K71j63j2j2n7K04j55J06r1r3J20J20j44j44K15m5j03J60k1j9J76q6lk65J93o7
-53914e3o7J93j68R2j1j1j41K96J05j58j33J27j83P9N5N5k0k83J10J09K7K8J2J3j12j14J38
-53934a5j24K3K4k2k2Q7Q7o0o1L2L2P9j81K10k25J41J42j69j70M5M5K9K8J02j58J35j26O1
-53955c1N9j02J58n8n7q0J82n5n5P0P0n9n8o0n9O8O7JLn3n3N6N5m7m8j95O7O4O4o7J95JJM0
-53981H4k22J34j28J11J11j15j16K21k13J09j53K94l15J94o8j07J56j13j12J00J01J9K0q9
-53999i7r0J20J19K7k34J8J9o3o3Q4Q4L4L5j01J61K76j60k18M4l9l8P2j90O7O6J6J6r4r4Q0
-54022a43Q0P8Q0o9o8J71r1R0j72K4K4l2l3l2l3L8L9N4N5j85P6J24J26o3o3O3O2j77Q6o2o1
-54045a4o6o7J31J29q0p9K9K8J%J7J7k19M2K06k30K03K03k54Ok2k3k3k2J70r0J86p4M8k13
$$ y = [-115, -138, 133, -30, -42, -54, -111, 93, -62, 44, -47, -140, -20, 100, -44, -188, 27, -18, -121, 39, 18, -1, 175, 89, 86, -179, 14, -53, -120, 73, -95, -3, -14, -25, -166, 130, 235, 77, -56, 71, -112, -33, 22, 77, 57, -226, -116, -7, 20, 48, 60, 73, -39, -153, -15, -139, -116, -92, -114, -136, -49, 38, -22, -83, -51, -19, 60, -121, 89, -136, 5, 147, -22, -192, -147, -102, -73, -45, 57, -101, 34, -92, -31, 28, -74, 84, 26, -31, -111, 71, 16, -39, 31, 101, 42, -16, -76, -135, -67, 0, 1, 4, -49, -102, -46, 9, -38, -86, -281, -214, -150, -86, -153, 42, 43, 44, 84, -138, -4, -132, -21, 90, -25, -141, 80, -133, -24, -177, 117, -198, -4, -72, -179, -23, -136, -248, -148, -47, -28, -8, -97, -187, -67, 52, 79, -155, -137, -118, -181, -244, -160, -76, -42, -7, -108, 53, 329, 169, -49, -5, -44, -82, -10, -200, -133, -67, -51, -35, -129, -223, -143, -63, 15, 95, 26, -42, 129, 38, 128, -44, -20, 4, -28, -61, -93, -126, -88, -49, 5, 60, -125, -49, 75, 201, 138, 75, 138, 200, 23, 109, 47, -14, -80, -147, -16, 113, 33, -46, -17, 11, 12, 12, 29, 46, -173, -131, 75, -155, 48, 251, -3, 3, -19, -42, -65, -87, 83, -7, 179, 105, 153, -60]
-54068f0j7j8J%K62j73j25J37l7l7N3N1n5n7K7K6j2j2j24L13j30j28N9N8n0n0K7K8K7K6JJ
-54092A2o4o5R0R0j70K64R4j69M4k17M6M5J11j50P4P5J0Rj80P9jkO9O8m1m1m0l9k2k4q0J80
-54116E5j01j03n0K10q2J78n1n0J5J5N4k07P1j91K35k8Q6Q7k0k80J06J05kko6o7O2O2m6m7
-54138e2lkm1m1L12k97K9K8R5j65QRj41K96j5j4kkkj%%J51J53k06k05J97o4j30J31j63R8l5
-54163g4K26j29j28K90j46J8J7j07L28j41j42j93O8M6M6j50J11K26k09j00J61J68k68O9O8
-54182E5k3k4j01j01L5L5J13j49J30J29llj57J02m8j80M1M0K8K7J16j3j66R6Nj26P1o0o8O3
-54205a36Q1Q1o8o8J83k52J88p1M0k21m6L89rk71K51j83K62j74j3J17k07N4J76q6J14j47J21
-54225A05rj23j24J76M5k16M6J18j43r8J64J39j22J50J9p1p0J79q3Pj23RJ0K13m8j71j72J17
$$ y = [-60, -77, -95, -94, -94, 168, -5, -130, 7, -30, -67, -14, 37, -18, -75, -48, -22, -34, -46, -170, 143, 13, -115, -56, 2, -48, -98, -71, -43, -16, 10, 11, 12, -52, -117, -27, 63, -107, 157, 251, 82, 126, -91, -45, 0, 111, -39, 35, 110, 120, 129, -51, 28, 27, 25, 94, 162, 121, 80, 40, 1, -21, -45, -125, 55, -46, -149, -199, 11, -71, 107, 56, 6, 21, 36, 90, -117, -46, -237, -2, -30, 56, 143, 123, -157, -51, 54, 52, 50, -16, -83, -21, 41, -5, -52, -55, -57, -98, -139, 173, -124, -95, -67, 28, -137, -129, -120, -261, 35, 20, 6, 4, 2, 0, -1, -1, -1, 150, 303, 97, -108, 89, 25, -105, 26, -137, -39, -74, 152, 23, -105, 185, 39, 57, 74, -33, 295, 154, 12, -181, -113, -67, -21, -171, -60, 166, -43, -143, 18, 186, -82, -13, 55, 32, 8, -93, -194, -159, -124, -11, -160, -30, 99, 96, 93, -64, 38, -10, -190, -149, -109, -81, -54, 62, 49, -117, -21, -16, -142, -71, -131, -199, -136, -55, 26, -42, -110, 73, -179, 9, -62, -22, -243, -289, 100, 91, -180, 71, -112, 150, -24, -37, 80, -127, -73, 103, 17, 131, -16, 105, 96, -27, -151, 25, 70, -146, -100, 18, -125, -223, -59, 80, -42, 108, 127, 56, -14, 165, 82, 89, -34, -25, -15, 198, 150, -21, -193, -76]
-54246g6J16k0k0j0j2PJ38k13M8QPK5K3NMj33j34J86N5j49J13J5J4j08J53j23QJ38PJ26j37
-54269F1j53J08P4n6J97o4j63R9r2r1J50k86R1R1J5J6J78k57J55j05j33J28l4l4K28k08L4
-54290e1L4K2K3j39J20j56J05j38J25k3k3J21j39K68j66j69R3M9M9n2n3M0M0j75K62J7k44
-54310a60J78q2M8M8P8P9k16M5j5k77M4L06o9o9K42j94R8j63l2K29k98J39M0M0l1l0l0l1J6
-54332f7J6J5J6J3J2j34j34K21m2J22J23k44J7J15J16k90J46l2l4P7P7k01O1k8k9J35j26k0
-54353i9k0R4R4r1r3L9L9KKKKL1L2j7j7j48J14l3K28k15M7j8j9J2J1J58j03l2l1J7J6K8K8
-54378F0j03j03QQJ17J16j1j0o7o6l1J00m6K14j35lK2k40J52J51j47j49M2M1J80q1m7j79J90
-54400a7J89k75J61J45j18J66k71j43K93o9k00M0r1J08J08k5k5J06j54O6o5MMO1O0M6M6j07
$$ y = [-76, 40, 20, 0, -10, -22, -15, 123, -90, -42, -34, -27, -2, 21, 26, 30, -103, -237, -51, 4, -145, -32, -17, -3, -111, 42, -81, -73, 65, 72, 198, 61, -92, 16, 90, 34, 231, 167, 4, 103, 11, -80, 70, -216, -125, -34, -19, -3, 175, -82, 73, -32, -165, -37, -71, -105, 123, -85, -51, -17, 5, 28, -111, 9, -147, -42, -180, -55, -78, -101, 20, -119, 149, -17, -186, -93, -44, 5, -47, -100, -60, -20, -195, 67, 84, -160, 18, -64, -16, 32, 110, 189, -27, 18, 3, -274, -230, 76, 7, -62, 180, -14, 84, -79, -111, 118, -180, -41, -1, 39, 8, -22, -52, -83, -67, -51, -36, -20, -7, 5, -129, -263, -42, -84, 38, 161, -83, -66, 49, 165, -125, 21, -11, -45, 32, 109, -92, -31, -59, -88, 47, -79, -99, -119, -25, 69, -22, -115, -76, -37, -35, -33, -31, -29, 2, 34, 17, 0, -148, -34, -67, 161, -54, -7, -25, -44, -32, -21, 137, 34, 2, -29, -12, 4, 32, 60, -43, -146, -138, -130, -13, 103, 92, 82, 15, -51, -82, 18, -28, 186, 51, 48, 70, -170, -18, 133, -14, -163, -121, -80, 100, 19, -28, -207, -17, 172, -103, 58, 203, 85, 251, -20, -163, 130, 61, -139, -99, -190, -82, 26, 1, -24, 82, -72, -6, -71, -67, -63, -2, 58, 104, 150, 43]
-54421D3j06J18J18j73Q9j42j1n4K06j16J4j33kJ31j30r5J67j03L33k49J85j26j28J91o9P4
-54440C2n5j39J24k2J08N4k07l9R2Q2Q4j62R7R9j63Q5Q6k90k9L49Q7k02p1R5l6j19J1J28l06
-54462b27J87J86m7m6m7m5R5R6j48j5J60j01r2J69q6q5J75k60K7K7J46j14O4O6j04j04J59
-54483C6J60l15n3M3M4P7P5q5J75k27L4M1M2n0n0J1J2J1J2rrr1J70R3R3j75Q7j86P4RJ0qr
-54507D2j55J07m5m5K0K0J60j01l5l6J60j01k0j9j6j6K78j59L9k23P7P6k85J52J5J5M4M3n
-54529a3nr4J69L7L8j76Q3o2o3N5N4K19k19J36j27ooj7j6l3l3J87p4l5l5p4p3J23J23P9Q0
-54553B22j17j16J1J2n2n3P4P3p9p9K6K6K5K6K3K5Q9j71K33k8k40K2N1N3K06k32k4k4n2n2
-54575a22M5M5k0k1l4l4q3L52m0m1O8j93L4L4L3L4j77Q3R9j62m9K13J15l21l4K27j14j16J99
$$ y = [43, -63, 55, 173, 0, 89, -53, -64, -118, 88, -28, -14, -147, -149, -18, -148, -243, -76, -179, 154, -95, 90, -36, -164, 27, -42, 32, -23, -162, -38, -60, 48, 102, -105, -144, -52, 30, 114, -48, 49, 148, -15, 70, 156, -134, -163, 186, 273, 71, 0, 95, 59, -60, -49, 79, -227, -40, 146, 99, 53, 6, -39, 56, 152, 4, -11, 149, 48, -44, 125, 39, -46, 129, -131, -104, -77, 69, -45, 19, 85, -19, -123, 36, 196, -119, -172, -129, -85, -8, 67, -18, 157, -70, -36, 5, 47, -3, -53, -42, -30, -19, -7, -16, -25, -116, 54, 147, 240, 65, 152, -34, 40, 49, 59, 51, 42, -113, -6, -51, -96, -76, -56, 104, 3, -32, -68, 92, -9, -29, -48, -64, -80, 198, 39, 78, -145, -68, 8, -277, -125, -110, -95, -51, -8, -13, -18, -112, 57, 94, 132, -44, 39, -23, -86, -31, 23, 242, 23, 159, 32, 26, 20, 3, -13, -46, -79, 108, 34, -1, -36, -110, -183, -60, 63, 142, 222, 105, -11, 0, 12, -40, -93, -19, 54, -25, -104, -78, -52, -27, -1, 22, 47, 136, -35, 198, 170, -70, -48, 3, 56, 262, 30, 6, -18, -70, -122, -77, -32, -52, -73, -107, -141, -224, 128, 88, 47, 115, -78, -44, -10, 23, 57, -120, -37, 62, -100, -149, 64, 179, -142, -176, 51, -63, -179, 20]
-54597B0o0j71R1L0L0M6M6J3J3n2n2M1L9j06J54J00R9l53Q2j81Q0P0O8J8J8JJR7j65j7j7K1
-54621DK1n9o0J40j21J0RJ90p2R1R2j40J22m8l08J28j34o9J94j82Q1n1n1J60J59j24j24M2
-54642a00M2j05J57P7P8n8n9J15J15k99J36L1k30L7L6J22j39K4K4j05J56r9j00J00J00p8q0
-54662a02J71k64K91j43M9N1K3K3K6K6j00r9o4L74l03m1J8J9R9J01p5p4p3p5N6N5N5N5l8l7
-54685Dj29j31L19j17m1m2J44j17L0L0l3l3l3l3J12J11m1m0l9l9K7K6J02J03k95J42P2P3Q
-54707A40Qj78Q1m8m7l7K25l09m7P6P7K8K7l6l7r1J70J63j00jjm3m2K2K2o0o1J5K77Q4j79
-54730I8JKj10J51o1o2M9M8K24l9l26J09m3m2M0M2qqj39J21l1k92O7O7J96o3PNk5k6K37k4
-54754A65k20M1j9j9klM9M8O0k02J52k84J1J0J10J10k0k1N3N4p6p7N6N5N6N7j16j15L1L2j93
$$ y = [20, -40, -211, -120, -90, -60, -14, 32, 45, 58, 6, -46, -5, 34, -72, 82, 182, 281, -72, 10, -171, -91, -21, 47, 65, 83, 84, 85, 182, 17, 0, -17, 4, 25, -34, -94, 46, -75, -65, -56, 134, 62, 153, 245, 105, 227, 179, -129, -1, -135, -204, -10, -192, -111, -162, -213, -53, 106, -18, -142, -100, -58, -163, -6, 71, 149, 91, 32, 147, 262, -37, 99, 130, -100, -63, -27, 95, -44, -20, 4, -101, 55, -44, -144, -44, 56, -22, -102, 69, -195, 96, -47, 2, 53, 76, 99, 125, 151, 51, -48, -112, 262, -41, -82, -64, -45, 54, 155, 80, 6, -67, -142, -86, -31, 24, 79, 41, 4, -125, -256, 63, -54, -95, -137, 7, -110, -80, -50, -83, -116, -149, -182, -70, 41, 0, -40, -79, -118, -91, -65, 37, 140, -155, -13, 59, 132, 140, 148, -30, 51, 3, -44, -81, 144, -165, -212, -136, -59, -31, -4, -40, -77, -168, 2, 165, 65, 64, 63, 20, -22, 0, 22, -38, -99, -84, 193, 277, 98, 99, 101, -9, 142, 81, 19, 68, 116, 340, 301, -25, 84, 41, -1, 39, 81, 73, 65, -74, 47, 16, -276, -209, -142, 54, -9, -2, 3, -22, -48, 189, 165, -55, -14, -33, -52, -54, -57, -8, 40, 100, -102, 50, -234, -223, -213, -103, 7, -13, -34, 19, 73, -3, -80, -24, 31, 87, 144, 28, -87, -56, -24, -217]
-54778b17O9N3N2MMLMk3k2L04l05J51j08j%K2K2OOJ54j09O7O6k71J65O7j95L6L7j26J35n6
-54802fn6J07J08j67R3p0o9J51j10J55j05J66k70QPQ3j77J00R9J4J5j16J44j71R0m0m1J4J4
-54824c0j01L35j21j20K0K0J03j58j2j2N0M9L4L4J12j51o8o8J40J41j38J25M7M6k15M7J01
-54844B10J02j18j17Q3j79l3l2R5R7k80J57N4N6R3l42R1j71R6R7r2J69L9L9k19M3K6K6k6k6
-54866f2K11k24J32Jj7J13j18J2n2n3M8M7JJ33l35J01p9p9K20R1J09j53j26J35J19j43k1j9
-54887hk1k0p8J84R4l7J10j52k1k1Q3m9J57j06P1j91R7R8l30J06K20k15R9j61Q9Q8J9K0q2
-54909D3M9l68K43O9j90j6K46R9J00k11N1k26L5j15J47m9Q1j9J10M6M6j41j40Q6Q4j47j8J05
-54930@j56K41k1m2j72J04k8R5R5q2k12J1K72M3q8R2j70o6O5r1r1R6R6J04J04k68j37J55j07
$$ y = [-217, -148, -95, -43, -39, -35, -32, -28, -51, -73, 231, -74, 77, -31, -32, -32, -10, 12, 18, 24, 178, 69, 136, 202, -69, 96, 163, -32, 4, 41, -85, 50, -6, -62, 45, 153, -14, 79, 9, -60, 91, -19, 136, 31, 197, -73, -65, -58, 25, -152, -52, 47, 61, 76, -40, 104, -67, 23, -17, -58, -44, -30, -131, 204, 83, -37, -17, 3, 106, -52, -64, -76, -26, 23, 57, 91, 203, 52, -16, -84, 56, 197, 59, 184, 231, 277, 62, 109, 210, 312, 194, 77, 160, -19, -52, -84, 11, 108, -172, -15, 39, 95, 188, -154, -63, -234, -138, -41, -133, 36, 75, 114, -105, -62, -36, -10, -36, -62, 149, -75, 57, 58, 41, 154, 36, 48, -4, -57, -9, 38, 39, 172, -163, -62, -141, -220, 0, 91, 200, 47, -79, 56, 175, 32, 11, -8, -29, -49, -127, 57, 151, 114, 224, 72, 51, 30, 113, 64, 221, 115, 186, -5, 92, 190, -140, -34, 186, -29, 70, -91, -2, 86, 105, 125, 43, 92, -276, -33, 36, -154, -170, 76, 175, 275, 64, 115, -111, -76, -191, -44, -93, -12, -31, 79, 125, 171, 30, -110, -24, 60, -87, -105, 0, -156, 85, 64, 22, -150, -46, -74, 21, 116, 34, -178, -167, 105, 148, 60, 152, -18, -84, -19, -110, -201, -105, -9, 95, 199, -69, -206, -51, -158]
-54952a58j6j6K37k4Kj28j7K44M1k20j22J40o7J95j91P0QPJ05j56O7O7j4j5r5r6P4P4j81Q2
-54974a03Q2j81O7O7J97o5l4l3m6K16j25j24%%P5P3l6l4j20j19K78j58O9O8k3k5k8k8RJ0J81
-54997A10k54rrO2O1O1O2o1o0j2K49q7q7onn5n6j21L15k44J91m3m2K92L1k09N2l1l2j5j5m8
-55022a5n0q7J73RRq3q5O1O1M3M4R9j63JJj13J47j46J15l6l7l7l7K21m1q9r0M0M0M0L9k3k2
-55046a1k2k3k1k1O0O0j44J17n3K09j98O2p8J83l54Q3P7P5J41j23l9m0K5K6l0K32k40J95k45
-55068i7J6J22J24n6n7qqQQn2K08m7l09J59j01n3n3K47j4j23j24K28l2j15J47Q4j76J81J83
-55090B90j19j19J81q1m6m5j82Q0k49J87K03k33J06J04m8m6R5j66L1L0J54j08K86j51j40j39
-55110a25LKl7K24mnNk56K61%J06j56k4k5RRRQj19j20J98o5j41J20O7O5J4J4L1L1j47J14n0
$$ y = [-158, -174, -190, 47, 23, 25, -103, -120, 124, 165, -55, -177, -37, -104, 91, -100, -30, -22, -15, 90, -66, 1, 68, 54, 39, -56, -152, -78, -4, -185, -103, -21, -202, -135, -68, 129, 64, 30, -3, -49, 167, 42, -82, -82, -82, -7, 66, 30, -4, -124, -243, 35, -123, -54, 14, -9, -34, -62, -90, -81, -71, 110, -144, -153, -162, -100, -39, 22, 84, 23, -37, -49, 200, 113, 26, 20, 15, -40, -96, -217, 98, -146, 45, 2, -40, 252, 283, 74, 126, 95, 63, 48, 33, -15, -65, -152, 21, 30, 39, -44, -129, -68, -7, 36, 80, 179, 16, 17, 18, -95, 52, -94, 21, -15, -52, -89, -126, 95, 54, -35, -125, -85, -45, -5, 34, 11, -11, -33, -56, -77, -98, -38, 22, -122, -5, -58, 151, -47, 15, -63, 120, -234, -151, -74, 1, 142, 19, -20, -60, -35, -9, -39, 193, -47, 148, -97, -81, 41, 165, 109, 52, 44, 36, 44, 52, 0, 208, 161, -148, 11, -90, -143, -196, 51, 37, -86, -210, 18, -14, -129, 18, 102, -74, 107, 290, 171, 52, 233, 152, 106, 61, -121, -41, -290, -103, 100, -133, -27, 77, 29, -17, 78, -88, -57, -27, 127, 19, 305, 154, 14, -125, -122, -120, -157, 67, 63, 58, 63, -193, 68, 68, 174, 18, -6, -31, -22, -13, -4, 4, -115, -235, -37, -102, -243, -123, -56, 9, 23, 37, 68, 99, -48, 66, 16]
-55135A6m8J58j04k18K18J15j46K8K8m6m5j3K49l10J25R3R4o3o2j00J61klj98O4PPK3K4M2
-55157I4M2o7o7M8M7j8j7PQPQj43j45J24J23k36J99K1K0k0j9llj4K46j24j23J70k65J04J05
-55180A09j70Q9l9m1q3J79k13K22m4m3j6j7O1O1q6J75j21j21j3j2K20m1j93O8P2P3p9q0Q7
-55202Dj73J69J70j7j8k62J73j8j7j37J25n1n1R0R0J53k84n6n5J67r3L7L7Q1j80J80q1J1J0
-55224Dj52J09O7O7j89P3P5j85Q7Q6J1J1p0J90m1m1r0q9K4K3K3K3L5L6l0l0nnP6j84L5L5r
-55249c0qJ62k72K17k18J39J38n7n8M3k19j11J51O8O7j11j13J64J62k23L8P7P8p5p4J35j26
-55269e6Q5Q7K8K8l7l8k6k6j08J53n7n6p9J82O3O4j61J01j87P3L5L6K0k42N7N8L1L3j20j21
-55292a80P5P5j71K65k2k2J86k50O7O9j71Q9onJ0J1J1J0j36J25J02J03r4r4P9j82J4J4P9j82
$$ y = [16, -32, 126, 22, -196, 22, 137, -9, 19, 47, 1, -44, -57, 192, -118, 7, 100, 194, 131, 69, -31, 130, 128, 125, -73, -9, -2, 5, 28, 52, 94, 136, 69, 2, 50, 97, 79, 62, 69, 77, 84, 92, -51, -196, -72, 51, -185, 14, 35, 55, 35, 16, 13, 10, -4, 242, 118, -5, 165, -100, 4, 109, -61, 28, -11, -52, -135, 44, -169, 53, 9, -34, -50, -67, -6, 55, -31, 144, 23, -98, -111, -123, 97, 56, -137, -69, 3, 76, -3, -83, 4, -169, 0, 170, 153, 135, -127, 46, 28, 11, -126, -1, -52, -103, -13, 77, 230, -54, -110, -165, 2, -91, -54, -17, 64, -116, 64, -17, -6, 4, -148, -39, 28, 95, -94, -21, 54, -131, -44, 42, 53, 64, -6, 184, 143, 102, 12, -77, -53, -30, -7, 16, 51, 87, 57, 27, 22, 17, 93, -91, -56, -21, -30, -38, 124, -148, 69, -149, -10, 128, 71, 13, 56, -163, -274, -123, -55, 12, -99, -212, -48, 114, -109, -71, 6, 84, 9, -65, 70, -56, 29, 116, 144, 172, 135, 97, 71, 45, -63, 90, 33, -23, -102, 80, 143, 207, 46, 147, -40, 33, 68, 104, 124, -118, -61, -3, 28, 61, -59, -180, -105, -30, -201, 64, 42, 20, 206, -44, 23, 92, -79, 10, 4, -1, 9, 20, 31, 41, -95, 30, 132, 235, 141, 47, 126, -56, -42, -28, 51, -131]
-55314a31P5P3N9N8j54J06p2p2J56j04ook2k2R1R1j8j8m0l9k3k3k2K40j64R8O1O0o0o0j56
-55338d4J03n9n8K29l2L9k22J77k59J01J00q0q2M9M8onK06n5j20j18o5J96JJJ8J7l2l2m7m8
-55361g9J61r9q4q4J14J14j64R8J7J5l2l2O4O6%%j5j6l2l1N3k07P0j92K88K4l18K93M2M3J5
-55384I2J6m1m1m0m1J27J28r0r0M7M6j9j9n0n0n0n0O1O2L3L5J60k76p0o9L50k60Q4Q2j5j5
-55408C7j61J00j1j1NNM1M3j05j05K18m3L9L9l9l9J08J09j89P3p4p3K0J9Q5Q6r9r7L2L2J2
-55431E7J2j50J09J25j38K7K6o3o3N1N0Q9j73k6k7l4l4K59jr2J71j41j39J37j23j41J22J76
-55452F6q5O2O2M9k13j81K55l6l6OPn6K06p3p1J13J13p8p7k08K27l4l3J39j22K5K5j9k0M6
-55475E9M6J3J3j33j35K10n1l3l5O4O6o6o5L3L2L2L3o6o5R7j63q2J80J36j25K53j83J93o8
$$ y = [-131, -56, 17, 76, 134, -20, 86, 14, -58, 98, -6, -12, -18, -40, -62, 29, 120, 102, 84, 44, 5, -18, -41, -63, 177, 13, 111, 172, 232, 172, 112, -44, 59, 0, -58, 171, 139, 178, -44, 133, -126, -25, 75, -5, -87, -38, 10, 4, -1, 205, 150, 30, -88, -153, 43, 44, 45, 63, 80, 48, 16, -31, -79, 82, -17, -101, -185, -71, 43, -121, -23, -6, 9, -23, -55, 9, 75, 75, 75, 60, 44, 12, -19, 34, -173, -103, -295, -7, 17, -301, -8, 34, 77, 92, 108, 67, 26, -14, -55, 72, 200, 110, 20, 67, 113, 94, 75, 25, -25, -75, -125, -64, -2, 31, 66, 226, -50, -120, -189, 161, -99, -15, 67, 52, 37, -124, -24, -35, -46, -41, -36, 5, 48, -57, -162, 56, 13, 52, 91, 52, 13, 121, 230, 41, 114, 40, -33, -13, 6, 91, 177, 78, -19, 13, 45, 57, 69, -81, 28, 153, 15, 42, 68, 5, -58, -7, 43, 132, -41, -67, -94, -128, -162, 97, 96, 4, 175, 34, -105, 32, -91, -232, -110, 66, -19, 43, 105, 154, -59, -240, 15, -21, -57, -51, -44, -100, 106, 33, -38, 75, 188, 110, 33, -175, 52, 18, -15, 124, 2, 27, 52, 33, 13, 59, 105, 118, 131, -2, -137, 73, 22, -11, -46, 18, 84, 18, -47, -14, 18, 50, 83, 17, -48, 49, -114, -196, -16, 120, -5, 248, 65, 258, 190]
-55497A90j26j25J03J04k89J46M9k12R5R5k5k4j41K95q1q0K0J9K0K0Q9R0m2m1j48j48J31j32
-55518a48J13J12K05m05J31j29k1k2J17J15j78Q3P0j90J20J19j69R1J0J0n5n6K22l9m6m5j3
-55538Bj2J37j23PQJ26j36J1J1o1o3K21m0k52J84l9l9J49k85J12J11L7L6k09K27p4p3J8J8
-55560Io1o2j3j3L14N3l02m0K72j63L2L3m1m0K4K5m2m3O5O7N0N0n9o0ppq8q9J82p8O7O8J5
-55585A18J5k96J41M2M4l9l7OOo0o0M9M8Q5j74K0K1j16J46p7L60j97j95J00J00rrQ4Q4j40
-55607F0j39m0K20l5l5%JJ80k55MNQ5j75j47K89J75q7j00r8K44j8j50J10l7l6j75Q6O4O4J93
-55630B53k45KKo9o9K4K3K59kl6l5k10N1K9K8m9K11J5J5j48J13k3k85k0K41K8k32P3P3qql6
-55654c5l7j02J59j04J56K7K7l7l6R5j67J47j13J68J70j66j66j61J02J0J1j21J42k4k4j16
$$ y = [190, 64, -61, 42, 146, -143, 3, 52, -160, -65, 30, 5, -19, -160, 135, 54, -26, -6, 13, 33, 53, 142, 232, 190, 149, 1, -147, -16, -148, -35, 77, 282, -123, 8, -121, -142, -164, -47, 68, -110, -27, 43, -147, -27, 92, -77, 14, 24, 34, -21, -77, 145, 106, 60, 15, 2, -10, 127, 4, 11, 19, 145, 9, 20, 31, -30, -93, 128, 88, -164, 20, -19, -58, 91, -194, -82, 29, 66, 102, -107, 120, 46, -27, -9, 9, -52, -114, -127, -140, 174, 227, -75, -115, 157, -6, 26, 59, 18, -22, 2, 27, -15, -58, 7, 74, 124, 174, 115, 55, 48, 41, -47, -136, 46, -32, 35, 103, 118, 133, -163, -22, 20, 64, 25, -12, -6, 0, -60, -120, -71, -23, 62, -112, -92, -71, -187, -41, -118, 242, 45, -150, -50, 50, 41, 32, 116, 200, 60, -79, -119, 101, 66, 31, 31, 32, 212, -43, -39, -34, 51, -124, -271, 18, 193, 106, 6, -92, 152, 134, -16, 94, 57, 21, -154, -68, -4, 60, 253, 8, 10, 12, -57, -126, -102, -79, 180, 178, 142, 107, -103, -52, -23, 5, -44, 167, 182, 197, 49, 162, 139, -146, -166, 75, 103, -129, -56, 17, 9, 1, -35, -72, -174, -15, -119, 37, 64, 91, 54, 18, 113, -54, 93, -20, 148, 318, 152, -14, -175, -73, -63, -52, -173, -31, -55, -79, -195]
-55674a95J46J94k41J56J57J5k46N2N3o4o3JKR0R2M2k19J12J12n8n7J7J6p6p6p0J90q1q1J13
-55696C3j48j7j7Q7j75J42J41j69R3O9P1j46J13J32j31j81Q1j8j8L1L0j81Q0rrK36j99K45
-55717A66j6m9m9N3N2k59J77J4J3r0J72l01m0L31j05n3K09j89j89K96j41q4q6L85k26N2N2
-55738I5MLj27J34j60J01j60J02j35J28J43j18m9n0jjj19j20K68ON0M9p4p6Q6Q4j26J33J29
-55759A99J29p8l40Q9Q8k0k0j50J10n2n3J46j15L2L1k3k2j8K44n8n9n8n8K42j9j40j38K73
-55781A62j62k6k6J1J1P5P7j12j11M1M1Q7Q8k23K13j06j05j4j3N9N9n0n0k5k6M0M0M4M2k2
-55803A9k1l8l8J73q7NNp5p7J31J30j7j6K61l50j03L32l59K51j46j46K07n3J10J10k27L4l
-55824A2lP9P8l19J17KLj68K69J27j35P8j83l1l1J7J8O9O7m1l9L7L8j57J03n7K02l7l6k5k4
$$ y = [-195, -49, 145, -96, 60, 217, 232, -14, 38, 91, 27, -36, -35, -33, 57, 149, 191, -28, 84, 196, 138, 81, 98, 114, 38, -38, -108, 82, 1, -80, 33, -115, -132, -149, -62, -237, -95, 46, -123, -30, 39, 110, -36, 77, 209, 78, -103, -22, -40, -58, -27, 3, -178, -98, -107, -116, 120, -79, 166, 150, 101, 52, 105, 157, -102, 75, 89, 102, 12, 184, -117, -157, 174, 69, 16, 225, 36, -153, 143, 2, -82, -168, 217, -9, 43, 95, 99, 102, -25, 109, -51, 50, -110, -8, -143, -15, 128, 10, -39, -89, -90, -91, -210, -330, -62, -56, -6, 43, -31, -107, -21, 63, -63, 70, 199, 328, 250, -90, -1, 87, 67, 47, -103, 7, -45, -98, 48, -67, -35, -4, -27, -49, -67, 177, 119, 60, 2, -56, 186, 167, 27, -111, 162, 0, -26, -52, -41, -30, 45, 122, 10, -101, -60, -19, 68, 156, -67, 146, 40, -65, -79, -92, -33, 26, -24, -74, -99, -125, -85, -45, -1, 41, 19, -2, -40, -78, 95, 8, 13, 18, -57, -134, -3, 127, 110, 94, 355, 5, -98, 234, -125, 126, -20, -166, 41, -12, 98, 208, -19, 15, 12, 9, 88, 166, -153, -36, -34, -31, -199, 70, 197, 62, 140, -43, -74, -105, -88, -70, -1, 66, 25, -14, 23, 61, -96, 7, -50, 152, 115, 79, 54, 30]
-55848C0qqn7K03k00O1j7j6jjR2R3k07N3J0RJ74q9l6l5n1n1o4o4J32J32k2k1k2k1P7P8J3J2
-55873A78j80j81J03J01O2O2k21M0j3K49k24L6J1J1j19J41m9m8J63r8N0k12R9R8J27j34J3
-55893F5J3l6l6l6l6j1j2J57J58k41J9j8j8M1M1o7o8J%J47j13J2J2nmk2k3N4L16l02J34r5
-55918B7r4poj7K44k27K08q6q6J36J37k51J1m3m3K18k17Q7Q5ooo5o6j7j7K30l0j83P9l6l5
-55941g6J06J06j64R6Q1j81J91p0nnnnq6J74j14j13J31l05L00L9l8l7K5K6K5K6o1o0J09J08
-55963B18k61JM8N0j03j03j1K51K2K3j0j0p0J92j09j08k8k8L6L7PPj40J21j4j4J34j29P7j85
-55986i9K7K7J87k48R0Q9j81K55k36K00p5p5J8J8M5M7k37K5p9J84j2j3M4M5k1k1K5K6q3q4
-56009a12M5M5p6L61k61Kl5l6L45r1k87J49qpN8N8P3l63K42k0j30J30J15j47K7K7nnN0k12
$$ y = [30, 22, 14, -43, 160, -40, 21, 4, -12, -13, -14, 78, 171, -36, 17, 27, 36, 210, 121, 85, 50, -1, -52, -116, -180, -48, 84, 62, 41, 19, -2, 75, 153, 166, 178, -2, -183, -80, 21, 83, 145, -76, -36, -49, 200, -24, 12, 23, 34, -85, 56, 7, -41, 122, 24, 74, -138, -39, 59, 186, 52, 65, 78, 42, 6, -30, -66, -77, -89, 68, 226, -15, 4, -14, -32, 9, 50, -17, -85, -84, -84, 63, -50, -38, -26, -31, -35, -57, -80, -26, 290, -12, 122, 27, -67, -74, -80, -97, 147, -80, 128, 42, -44, 92, 229, -22, -11, -54, -97, 121, -96, -9, 76, 70, 64, -1, -67, -84, -101, 129, 99, -84, -5, -41, -76, 30, 136, -28, 68, 149, -32, 159, 89, 84, 79, 74, 69, -17, 157, 43, -70, 61, -244, 56, 95, 57, 20, 45, 71, 96, 122, 61, 1, 110, 218, -43, -42, 6, 56, -47, -150, -161, 90, 112, 135, 125, 115, 45, 237, 128, 20, -8, -36, 0, 37, 44, 51, -89, 32, 18, 4, 138, 9, 86, -99, -72, -45, 142, -106, -16, 73, -108, 147, -89, 111, 36, -39, -21, -3, 42, 89, -148, -123, -202, -18, -30, -43, 1, 46, 25, 4, 29, 55, -28, -112, -67, -22, -98, 263, 2, 4, -31, -67, 278, 187, -100, 49, 41, 34, 92, 150, 223, -140, 102, 82, -48, 82, 197, 50, 77, 104, 99, 94, 144, -68]
-56031f8n4L82l31p1L55q1j70R1q3q3L8L9m4K17j09j08O0N9m5m7L6L4J52k85k20K18Q3Q2M5
-56053I2M5j03j03R2R3j22j22L18j17k4k3J4J5o3o3J49j12L4L4L4L5j48J12j7j8j26J33j21
-56074h2j22L2L3J6J5J66r5J97o3K8K8J2J2m7m7j55j56M6M5L24k86N3N2J63j00r1r3Q7Q7K
-56097F1KJ12J11j66j65j3j3j5j6J32j30Q9Q7l7l8npj37J24p9J82LLj70R1O9O9j96O4j08j10
-56120b06L51q6p9q1L6L6l0k9J6J6o5J96MMK0K1QQj76Q3k17K17J20j42J89p4o8o8J24j37K5
-56143A6K6q6J74k34K02J12j50m0m0p5p5K08n2J30j30j6j6J69r3NOj78Q4j46J16M4M3k1k1
-56165c8J29j31J61r9kjr9j00J42j20k7K34P9j82M6M5J7J6j47J14J41j21j85K49j63R6q7q8
-56186a21N2N2M6k15Q7Q6N2N4J29j33j97O4r1r0J66J65j01j00J99o3M2M1J07j56m9m9K6K7
$$ y = [-68, -122, 260, -71, -142, 213, 132, -38, 53, -30, -113, -75, -36, -80, 137, 28, -80, -20, 39, -6, -53, -17, 17, 169, -116, -336, -118, -35, 47, 92, 137, 34, -69, 23, 116, -6, -128, 190, 73, 49, 26, 40, 55, -8, -71, 78, -34, 0, 34, 68, 103, -45, 67, 50, 32, -94, 39, -82, -204, -172, -139, -123, -108, 58, -37, 160, 97, 125, 153, 165, 177, 130, 83, -72, -228, -182, -137, 187, -99, -46, 6, 169, 69, -22, -115, -28, 59, 61, 63, 175, 286, 120, -45, -58, -71, -86, -102, 30, -100, -11, 76, 39, 1, -4, -11, -148, -24, -103, 79, 82, 85, -85, 6, 75, 144, -52, 12, -96, -206, 145, 59, -20, -101, -65, -29, -59, -88, -72, -56, -121, 75, 79, 83, 103, 124, 132, 140, -36, 47, -170, 47, 167, 25, 214, 140, 72, 4, 128, -9, 16, 42, -44, 130, -104, 98, 210, 60, 20, -20, -95, -170, 38, -14, 116, -14, -30, -46, 123, 30, 35, 41, -137, -53, -199, -83, -39, 4, -17, -38, 91, -40, 121, 22, 20, 19, -80, -180, -38, -158, -185, 49, 128, -54, -8, 37, 54, 70, -77, 37, 178, 57, -128, 121, -42, 54, -33, -121, -69, -17, 29, -186, -99, -13, 39, 93, 222, 89, -108, -44, -135, -225, -59, 106, 5, -95, 104, 41, 83, 124, 231, 75, 26, -23, 3, 30]
-56207C0J58j04j09j10K5K5m1m1Q3Q4J64r7J9J9K0J9j88P3J72k63M1M1R6R7k13M8K72j64j05
-56229E1J58k29L1J5J4L1L1klr5r4j1K49opj21j21L1L2l9l8K06k28P8P7j3j5p4p5j95M17P2
-56253A27j88J43j17l7l6J92k43O9O8J49j12k30K07L5L7J08j56N9N8j09j08j5j6J78q1J45
-56273A27j15mlM5M6q2q0K8K7M8M8q3J80k50J2j0j0K8K8j19J42R2R2k7k8k06N5p0J91k01O0
-56296c9j09J52O1O2J2J2m0m0j2j3j72K64r0r0J0RK05k29q2J79n9o0M6M5J94o9k2k2J08j53
-56319E8L1L1n1n1P2P2o5o5j21J40ppj7j6L2L3O0k02K7K7j62J00J06J06j31j31J68J69k53
-56341d7QJ71k64J09J08k8k8l3l5j8j8j37J25K88j48RQn6K05j35j34J81q0L7L7q9q7QQP3P4
-56364A12J3J2n3n3l0k8l0k9J10J11r6l58L90m6P3P4l3l3j6j7j22J38j55J05l3l2M8M9o6o5
$$ y = [30, 188, 84, -25, -135, -110, -85, -126, -167, -84, 0, 164, 67, 86, 105, 125, 144, -44, 29, 201, -62, -21, 20, 116, 213, 0, 48, 320, 156, 51, 209, -20, 11, 26, 40, 71, 102, 100, 97, 2, -92, -103, 146, 140, 133, 12, -109, -78, -46, -85, -123, 83, -145, -67, 10, -3, -18, -92, -167, -362, 55, 127, -61, 82, -35, -72, -108, 84, -159, -90, -22, 127, 15, -215, -8, 27, 64, 172, 16, 75, 133, 24, -84, -99, -115, 63, -18, 127, 12, 8, 5, 50, 96, 14, -66, -38, -11, 37, 85, 2, 182, -68, -56, -66, -76, -48, -20, -139, 3, 95, 187, 160, 132, -74, -19, -89, 102, -99, -39, -148, 4, 65, 127, 139, 151, 111, 71, 59, 46, -126, 138, 48, -42, -32, -23, 182, -47, -129, 50, -9, -69, -23, 22, 216, 147, 125, 103, 211, 58, 89, 120, 69, 18, 90, 162, 97, 32, -89, 51, 44, 37, 20, 4, 36, 69, 129, -73, -46, -19, -181, -81, 25, 131, 0, -131, 37, 206, -47, -39, 132, -132, -23, 85, 57, 29, -4, -39, -57, -75, -212, -87, 201, 53, 62, 70, 14, 219, 84, -50, 131, 51, 88, 125, 36, -51, -43, -35, 38, 112, 125, 137, 84, 31, 1, -27, -57, -86, 24, 135, 39, -319, 71, 25, 98, 172, 139, 106, 90, 73, -49, 89, -66, 39, 6, -26, 22, 71, 5, -60]
-56387f0J29J31r4r3J6J5j23j25K03K03n1n1n1n0J2J2J3J3k1k0j9k0K7K7K7K7j0rN6N6m5m4
-56411H1p2p1K61j76p6J84mnj56j57K77J6onj64K72r9r9K07n5m4m5j03J57n5n6K8K8j02J59
-56433A20j76Q5O4O4j07j06L0K9K35k8j09J53k96J40J95o7k71J64J49k87L7L8R3R3k40K2j6
-56454Hj5ook3k3J60j01j9k0NNJ51j09Q0Q1j32j31R5R6j00j01R3R2o0n9qrm6K15J0J1j26j25
-56478a17O2O2K4K4k53J82KKO5O7j30j30L3L3L4L3K4K5k47J89K48j89j87P4J14j46J6J7L8
-56500c1L7j25L10P7l58J69r1m5m6J33j26K10n1j33J28j5j5o3J97k84k3K32k8j3j3L6L6k4
-56521H1k4m5K16j30J32k98l7J05J06M1M1k06K29j64R9k8k9j74Q5J53j09N5N4j44j44J71q9
-56542e3j07J56r1r0J89p2R0R1j11J51k52RO8O6o8o9J19J20p8p6K3K4L36j02j43j43J29j31
$$ y = [-60, 69, 200, 106, 13, 29, 44, -79, -204, -1, 202, 151, 100, 49, -1, 11, 23, 36, 49, 28, 8, -11, -31, -4, 23, 50, 77, 67, 58, 114, 170, 125, 81, 9, -62, 199, 23, -53, 131, 127, 122, -34, -191, 86, 102, 96, 91, -73, 199, 100, 1, 208, 153, 109, 64, -39, 118, 63, 7, 35, 63, -39, 120, -56, 29, 93, 157, 50, -56, -26, 3, 238, 210, 101, 254, -42, 98, 293, 226, -45, 119, 268, -19, 18, 56, 149, 242, 2, 24, 8, -7, -13, -19, -42, -65, 95, -6, -25, -45, -40, -35, 116, 7, 87, 168, 36, -95, 0, 96, -4, -105, -12, 80, 20, -39, -47, -56, -102, 113, 123, 134, 8, -117, -55, 7, 31, 55, -198, -16, -14, -12, 53, 120, -10, -140, -107, -74, -40, -7, 17, 42, -205, -16, 232, 43, -144, -70, 44, -102, -86, -69, -31, 6, -119, 191, 268, -90, 79, -12, -57, -103, 30, -96, 114, 63, -70, 58, 43, 28, -35, 162, -122, -145, 87, 59, 46, 33, 69, 105, 81, 57, 12, 228, 98, 230, -68, -105, 0, 106, 147, 188, -18, 211, 47, 146, 118, 89, -85, 0, 153, 44, 99, 153, 9, -135, 36, -53, -160, -4, -95, -185, 4, -68, 22, 113, 2, 153, -99, -90, -22, 44, -24, -93, 26, 146, 68, -8, 15, 39, 375, 273, 130, -13, 116, -15]
-56563a5N2N3j91O9K05n6q4q3K83l26Q3Q2K1K1m4m4m0m0m0m0P3P2PPK1K1K1K1j0rK8k32O1
-56588e3O1J92o9l4l3j1j1J78k57O8j92M4M4r8r8L05M4k2k2K0k42K48j3KKJ33j30O5O4j05
-56610H0j04PQj41J22N1N2k85J50O0O0k2k2NNNNo1o2O4O3J08l27P1P0j8j8R0R1k2k2k2k1N
-56636B5ONOkjq2J78l1l2l1l1J58j03j09j09R5R3JKj02J59P7j83K25l6k04N6K0J9L6L6ppk3
-56661A04k3P7j84J09j52P6P7k22L9j43J20K00K02k10N3L0L1j51J12l7l6k9k9j3j2r0J71M1
-56682A11M1j49J13j43j43O8O7K14m7q3q1L6L8M6k15J20j1K55pk6k88J20J20j14j14L6L6L5
-56704C5L5POj24j25P6P6N6p4K53j84k0J12m0m1j21RJ66r6N1N2L0j02J20j42P7P7p0p0P1P2
-56727A72j17J5p2J88j85j84K36k5j04j04O8o3L21j15Q7Q7p1p2j3j3M2k20K61j75J43J3j05
$$ y = [-15, 37, 90, -101, -32, 173, 117, 33, -50, 233, -93, -10, 72, 93, 114, 70, 26, -14, -54, -94, -134, -61, 11, 18, 25, 46, 67, 88, 109, 99, 90, 118, -114, -53, 8, 200, 131, 97, 64, 53, 42, 220, -37, 31, -161, -117, -73, -171, -269, 36, 80, 58, 36, 56, -186, 62, 49, 51, 53, 186, 56, 121, 185, 80, -24, -17, -9, -150, -28, 23, 75, -210, -60, 0, 60, 38, 16, 21, 26, 31, 36, -25, -87, -23, 40, 148, -179, -108, -38, -56, -74, 16, 107, 85, 63, 41, 20, 25, 31, 36, 42, 40, 39, -43, 135, 104, 72, 41, 10, 168, 65, -44, -153, -58, 35, 36, 38, -64, 95, 172, -11, 214, 178, -26, 30, 50, 69, 105, 141, 134, 127, 104, 81, 158, -26, 83, -69, 7, 84, -138, -99, -242, -122, 78, 280, 70, 123, 153, 184, 33, 145, 108, 72, 43, 14, 1, -11, -101, 70, 111, 152, 3, 116, -27, -170, -102, -35, 179, 132, 49, -32, 4, 42, 88, -127, -7, -18, 237, 230, 204, -84, 36, 156, 42, -72, -36, 0, 35, 70, 77, 83, -41, -166, -90, -14, 42, -32, 221, 37, 17, 129, 89, 48, -73, -64, 102, 6, 57, 109, 139, 37, 157, 15, 92, 169, 99, 29, 100, 172, 55, 70, -2, 186, 1, -183, 53, 28, -76, -180, -112, -175, 146, 31, 118, 205, 134, 62, 49, 36, 78, -142, 119, -56, 87, 100, -5]
-56747eJ55j87n7j22J40O6O5j1j1p6J84k28L4J14j45Q5Q6l1J00J82k56n8P2r6J64m0m0o9o7
-56769e2O1O3J6J7j31j31K42j9k4j55J3j19M27rk05N5J3J3K8K9j27J35K1j11J27j35JJj6j5
-56792A3l1l2J15j46J2J2j52J10Q3Q2l2l2L6L6L6k25K65Lk30L0P1P2j90P2O1O2K9K9k04N7
-56814A2K4K5J08j54J79q4l91K20P7P8J8J8j45J15Mk56K98j38j39J22P7P9n9n9M4M5J31l05
-56835e6J24j36J69k66J79J81o1o1J85k52m2m2K08n3j8j7M7k13R5R3mmP9j84K41k0p5p5M0
-56857F2M0k5k6k6k5ooooKKKKR6R8j54J08k31K04P4j87p3J89O9j92j56K80N2k10l4K28q3q2
-56882b0J09j52P6P7j28J32J3J3k89J47L1L3L6L7m5m5J31j32J7J6m2m2k6k5k0K43n2n2Q5j77
-56905e1L5L4J5J5J5J4p1p0O0O0J1J1J0J1J7J6N0k12J6K78j04j04rj0rj0J0J0RJ0L6L7l07
$$ y = [-5, 150, -37, -94, -216, -76, -10, 55, 44, 33, -43, 141, -87, -53, 61, -84, 1, 87, 56, 156, 338, 82, 24, 96, 0, 164, 124, 84, 15, -52, 9, 72, 88, 105, -26, -157, 85, 66, 42, -113, -100, -219, 208, 199, -6, 49, 62, 75, 103, 132, 5, 140, 161, 50, 177, 42, 43, 44, 28, 13, -18, -50, 65, -81, -69, -57, -209, -99, -16, 66, 34, 2, 38, 74, 110, -115, 150, 153, -77, -47, 24, 96, -94, -22, 39, 101, 130, 159, -45, 12, 36, 61, 169, 15, 194, 110, -281, -61, 16, 94, 112, 130, -15, 100, 104, -152, 146, 8, -131, -9, 68, 147, 88, 29, 73, 118, 249, -56, 68, -68, 101, -165, 14, 195, 134, 73, 258, 6, -36, -78, 130, 77, 59, 42, 89, -124, -29, 64, 60, 56, 135, -49, 192, 172, 97, 22, 62, 102, 77, 51, 25, 0, -6, -12, -18, -24, -22, -20, -18, -16, 80, 178, 24, 132, -99, 105, 179, -8, -81, 108, 177, -15, -171, 109, 161, -49, -83, 145, 62, -20, 89, -63, 13, 90, -38, 94, 107, 120, -169, -22, 9, 42, 78, 115, 70, 25, 156, 24, 41, 57, 15, -27, -53, -78, -98, 145, 93, 41, 126, -51, -16, 18, 33, 48, 63, 77, 6, -64, -4, 56, 67, 78, 88, 99, 116, 132, 182, -30, -14, 264, 160, 56, 47, 37, 28, 18, 28, 38, 47, 57, 93, 130, -177]
-56929a77L03j02j00q0J81O3O4j50J12O7j94J97k38J98o3p4p3R8R9r7J65k14M7r9J61o1o1
-56950b8Q5Q6m4m4K2K1r7r6J21J21n7n7k03N8R1R0n7K05O2k01o9J93J08j54r4r3j09L27j20
-56972F7j19n2K10k31L0J71q8P3P4r8r6k7K34j30j30Q8Q7J31j31k77J59q2J79k2k1J20j40
-56992b1k6K35K2k40j1j2J24J24j55J08j25j24J09J10o6o5j49J15R8R9j62R8NNK1K1q1q0N0
-57014B7N0N0N1q1q1K9K9J3J2P2j90o0n9K14m7N1N2o2K00k26L6l2l3j5j5N6N8j3k74J62J61
-57037A35j33J29k0k0M6M6K4k37L9M1RRK5K6j63R9m9m7O7O7LKp0o9O1O1r7r8K23K24l14n1
-57061c2L4L6j02J59R4j68jjl2l4J41j18M3M4j57J03m2m3J77J78j28j28j7j5j6j6MMQ5Q6j62
-57085b4R7m9m8j8j7M8M7N8N9n0n1LLk42J93K0K1p7p8K08n3J49j14j33J26l6l7j3j5J32j28
$$ y = [-177, 126, 24, -76, -156, 25, 88, 152, 2, 114, 181, -13, 184, -54, 144, 81, 7, -66, 32, 131, 34, 199, -15, 32, -67, 94, 33, -28, 57, 143, 99, 55, 77, 98, 1, -95, 26, 147, 90, 33, -170, -112, -21, 69, 12, 217, 279, 78, 9, 202, 310, 156, 62, -31, -140, 187, 67, -52, -104, 106, -125, -95, 76, -12, 61, 135, 37, -59, -86, 148, 18, -112, -24, 63, 194, 63, -214, -55, -137, 42, 20, -1, 119, -21, -47, 188, 210, -30, -41, -53, 71, 195, 40, 148, 23, -101, 8, 118, 52, -13, -162, -47, 51, 150, -12, 86, 91, 96, 117, 138, 57, -23, 27, 77, 127, 178, 97, 16, 45, 74, 87, 99, 171, -19, -79, -138, 76, 29, 80, 132, 70, 270, 44, 80, 48, 15, 0, -15, 41, 99, 86, -188, -26, 135, 2, 131, 111, 91, 137, 183, 207, -30, 9, 50, 59, 68, 93, 119, -44, 55, 6, -41, 26, 93, 96, 98, 28, -41, 20, 81, -16, -114, 109, 333, 19, -32, 2, 38, -64, 95, 189, 21, 20, 19, -13, -47, 94, -24, 19, 63, -94, 9, -33, -76, 101, 279, 151, 23, 6, -9, -25, -41, -37, -33, 52, 138, -24, 73, 24, -24, -42, -59, -11, 36, 94, 153, 103, 52, 55, 58, -184, 9, 29, 50, -27, -105, 103, 50, 199, 85, -48, 78, 42, 5, -8, -23, 109, -19]
-57108a9J9J9m5m6l6K25K9k32R5R6RQl41K68P3j88J17J19j54J07J4J3k5K38l80N6K4K3m3m3
-57130@J04j57L9L7J20j42l4K27m5m5p7p6M9M7L69o9j07j07n8n8r5J65p1p1J1J0R2R3j6j6
-57153A19n9n8J82q1k16K18m3m3N0N0m3m2r4J66k41J94P4j88j5j4K4K3J70r1qqk4k3J08J10
-57176A97m4m3%%j19J41k62J73K6k35J34J33k09K26j68K67p6p6J20j41R9l38J27J25j57j58
-57195b58K70Qj3j2j09L27P7j86l6l7r0J70l9m0k3k2K0K1J5k46N2N2L79k33j8j7poJ50j10
-57218C9n5n6j52J10J76J76k90k8L7L8K60j76n5n5J80q1q6q6O9O8r4J66J11j51j34J26Q6Q6
-57239B29j70R1k47J87j22J38L3L2k61J73nom4m3K9L0O8j93O0N9J26j37L1L2j32J28q1q0K8
-57261d7K8J1k52K40k3J50J51k79J55j4k76L40r6LLk4k4L4L4L5L4K6K7j05j05P5P5p2p2J59
$$ y = [-19, 0, 19, -26, -72, -108, 117, 146, -86, 9, 105, 114, 122, -219, 49, 122, -66, 51, 170, 16, 123, 137, 150, 125, 363, -17, 39, 63, 86, 43, 0, 104, -53, -14, 23, 143, 1, -33, 194, 149, 104, 27, -49, 0, 47, 416, 347, 240, 133, 75, 17, -78, 87, 16, -55, -44, -34, 58, 151, 135, 119, 60, 2, 184, 103, -113, 105, 62, 19, 69, 119, 76, 34, -60, 106, -135, 59, 133, -55, -70, -84, -60, -37, 133, 42, 34, 26, 2, -21, 87, 197, 153, 110, 110, 110, -9, 132, -130, 43, 69, -166, -32, 101, -108, 118, -50, 217, 141, 65, 185, 44, 143, -195, -68, 57, -100, -258, 12, 20, 7, -5, -114, 213, 290, 104, 68, 31, -59, 111, 72, 32, 9, -13, 7, 28, 43, -203, -151, -99, 280, 47, 29, 12, 5, -1, 149, 39, -16, -72, -224, -114, 62, 238, -52, -80, -43, -5, 255, 79, 24, -31, 149, 68, -18, -104, -35, 33, -61, 105, 216, 65, -69, 57, 143, 229, 59, 150, -97, 90, -32, 106, 139, 171, -90, 83, 78, 72, 28, -15, 14, 44, 112, -81, -21, 38, 164, 27, 58, 90, -42, 86, 5, -75, -47, -19, -8, -260, -20, -43, 107, 258, -21, 134, 120, -156, 184, 88, 91, 94, 70, 46, 80, 114, 149, 183, 209, 236, 131, 26, 101, 176, 104, 32, 191]
-57283A91j04j02J57o8o8n0n2J8J7J65r7JJJ49j14r4J66KLj16j15J02J02k3k3M3M2M7M7j01
-57306A26j01J25j38K88K6j97j96J63J64rk71Q8j73J17J17l0l0k8k7m4m4J85p7P0P1J9J8j28
-57327H4j28K15m5k9k9O8O7j45J17j44j42O3O3J42k95J52J52Nk56L8L8o6J96J81k57j44J17
-57347A8n7n7J28J28lkk7k8k7k7k6k5m2m3K68Po4o4m1m0j40K97k39K2J95o5j11J49KLj17J43
-57371A15k31K04k19M3K16m4j38J22n7n6J55j08m0m2K00o2m6m4L6L7L7L7j75j76J30J29k7
-57392dk7J20j41N6N8M1M1j1j0j58J03opj97K38Q7l50J42J40o0n8o0o0P3P2p3J86j08j08K34
-57414A53k00l2K29k22M0Q8R0J39j23j15J47j64j63K44j7%%k0j9l6K26o8o9J3J4n7n6K6K5
-57436G3j34J25n9n8L86k26j00r8K3K3J69r1J03J02j59K77j89j89N5N7J0J1j20J41r9J63j15
$$ y = [191, 87, -15, 142, 74, 6, -44, -96, -78, -61, 104, 7, 8, 9, 158, 44, -50, 116, 118, 121, 5, -110, -8, 94, 71, 48, 91, 133, 180, 227, 126, 25, 150, 12, 300, 326, 129, -67, 96, 260, 251, -20, 68, -105, 12, 129, 99, 69, 41, 14, -30, -74, 111, 34, 104, 175, 194, 212, 84, -44, 171, 126, 97, 68, 136, 203, 58, 175, 31, -111, -48, 15, 157, -138, 14, 166, 171, -85, -47, -9, -75, 121, 302, 45, -99, 18, -39, -96, 32, 160, 157, 155, 128, 100, 73, 46, 20, -5, -47, -90, 178, 185, 121, 57, 16, -24, -164, 133, -106, -84, 111, 46, -65, 84, 86, 89, -28, 115, -116, 88, -131, -88, 128, 84, -54, 68, 11, -45, 110, 2, -38, -80, 120, 58, 12, -32, 4, 41, 78, 115, -60, -236, -106, 23, -4, -31, 89, -52, 4, 62, 103, 144, 133, 123, -35, 68, 62, 55, -142, 96, 183, -167, -25, 115, 55, -3, -63, -123, -50, 22, -51, 135, 27, -81, 153, -47, -79, 150, -72, -32, 56, 146, 285, 162, 47, 194, 30, -133, 111, 94, 94, 94, 74, 55, 19, 245, 177, 108, 121, 135, 78, 22, 48, 73, -61, 64, 5, -53, 333, 107, 7, -91, -68, -45, 124, 33, 136, 238, 79, 356, 167, -22, 33, 90, 100, 111, -9, 132, 33, 196, 81]
-57456H1J47j29j29L4L4j34J26J28j35l9l9q3L53j34j33l5K26l3l2N0N0n3n3R5j67K6K7J26
-57478A75l11P6P5M9M9M6M6k32K9m0m2J06J06LMj3j3J17j45o4o2O7O9Q4j77J46J46k63kK06
-57500B35k31j16J45J30J29j77j75J60j00M6M7LLj44J17k8k7J20J20j10j09j41J19J70r1P2
-57520A67P2j38j37k4k3K47j5JKr5r5J83p9l2l1j28J32M6M7j65K69k44J8M3M5K5K88k42K0
-57542A57pk68L58p7j08j07J43j18N4N6j08J53o8o6K26l5j10j10j2j3K11n1l4l4L8L7p7p6
-57563d6k8K34J6k46J13J14J15j49n5n5N9O0j49j50K15m6j4j4K63j73P9j82Q3Q5k02N8J29
-57583A14J30j19j19J00J00q4q3r9J62mmlmN2k09J50j11j8j8R6R7KLj29j27R1R0P5P5R4j68
-57606A32l7l7J80q2O5O5r4r5k9k9Q6Q5m5m5j03j02J86J87L2k29j7j6k4k3J90p3j5j5L4L4
$$ y = [81, 228, 99, -30, 4, 38, -96, 30, 158, 23, -16, -55, -138, 215, 81, -52, -87, 139, 106, 74, 124, 174, 121, 68, 163, -4, 22, 49, 175, -136, -60, 15, 64, 113, 159, 205, -27, 2, -38, -80, 26, 132, 135, 139, 126, 113, 230, 85, 21, -41, 26, 95, 179, 2, 148, 294, 31, 29, 235, 4, -112, 33, 163, 292, 115, -60, 100, 0, 46, 93, 96, 99, -45, 72, 44, 17, 137, 257, 147, 38, -103, 16, 186, 95, 167, 239, 101, -36, -60, -83, 164, 149, 150, 152, 57, -38, 145, 66, 34, 3, -125, 7, 53, 100, -65, 204, -40, -22, 21, 66, 91, 379, 137, 157, 150, -118, 240, 163, 55, -52, 91, -27, 27, 83, -25, 128, 60, -6, 220, 185, 75, -35, -47, -60, 151, 100, 66, 32, 70, 107, 30, -46, -74, 160, 176, -70, 43, 157, 272, 123, 68, 13, 72, 132, -17, -167, 48, 2, -12, -26, 237, 64, 143, -39, 44, 129, -73, -15, 114, 244, 125, 6, 106, 206, 122, 39, -60, 102, 98, 94, 91, 87, 139, -70, 80, -31, -49, -67, 29, 126, 128, 131, 2, -125, -34, 56, 131, 206, 300, 132, 95, 58, 238, 156, 221, 286, 192, 97, 68, 39, 125, 210, 165, 120, 17, -85, 101, 288, 320, 91, 74, 58, 34, 11, 201, 128, 113, 98, 132, 166]
-57629A66j1j1P1j91k2k0K07k28M4M6J8J8N8N7k85L24j77j76L08j28K13m8l05J31R2R2k62
-57649a9%J58j03mnj4j3l1l0K00o2j59K77j23j22J4J3L1L2L2L3l8l8l6l8LLJ49j11LMk7k9
-57674e0K29l3K2k39N9N9M2M3o9o8o8o9Q7Q6j09J52j54J07M1M2o4o4O0O1j98O2J11J12llk65
-57697h1J71Q3j78k1k0J14j45O7O5m9m8J03J03L6L5j01j01k2K40k07k07J50j12J01J00o0n8
-57718d2J52j09p1p2R2R1J85p8r4J68J6k45J74q7m6m4M6M7K6K5j86P3O0O0J1J1n7n6R2j70
-57740b8J09J11l2l2R3j69O0O0k01N9L9L9j32J28J01j61K33k05M1M1r3J70p1p1J96k41N4N4
-57761A52J17j45j28J32j88P3J88k47P4P5j15J45J78q4P4j88rro3J98j07j07L4L5j11J50k14
-57782i0K21j69K67j7j6j7j6J47j15j69R3J69r3J01j61k48L62j75Q7NNk63J72Q0Q0m7m6q5
$$ y = [166, 155, 144, 215, 24, 2, -18, 189, -39, 5, 51, 69, 87, 145, 202, -83, 241, 64, -112, 196, 68, 281, 233, -72, 59, 151, 243, -19, -19, 139, 36, 32, 27, 13, 0, -31, -61, 139, 77, -82, 195, 72, -50, -36, -23, 8, 40, 72, 105, 67, 29, -7, -45, -42, -39, 110, -1, 2, 6, -21, -50, 179, 146, 168, -71, -12, 47, 89, 132, 63, -5, -73, -142, -55, 31, -78, 74, -80, 27, 68, 110, 46, -18, 42, 103, -95, -33, 78, 190, 187, 184, -81, 90, 173, -5, -26, -46, 68, -77, -10, 55, 6, -42, 61, 164, 200, 235, 134, 33, 11, 251, 44, -163, -13, -125, -24, 76, 16, -42, 110, 1, -70, -142, -50, 41, 226, 148, 54, 222, 238, -7, 167, 80, 34, -10, 36, 83, 109, 134, -52, 21, 81, 141, 152, 163, 106, 50, 142, -28, 81, 192, 160, 128, 221, 52, 112, 172, -29, 30, 69, 108, -24, 104, 205, 44, 277, 72, 113, 154, 61, 231, 160, 89, 285, 44, 98, 152, 269, 124, -4, 128, -60, 13, 201, -46, 28, 103, -12, 133, 311, 227, 301, 113, 104, 95, 32, 230, 123, 16, 50, 85, -26, 124, -90, 131, -38, 229, 212, 196, 179, 163, 310, 195, 26, 119, 288, 195, 296, 135, -113, 249, 74, 161, 166, 171, -92, 80, 160, 240, 193, 147, 62]
-57803F2J77p4p3r5J65j15j13K01o1O2O1l7l7J45j17N7N8l01J35N3k08l4K26O4O4j41j40J25
-57824A09J27Kk59J27J28n5n5N5N4k1k1q7q7J5J4R6j65J65J67j34j35N9N8N9N8q7q7k1k1J9
-57846G7J8J8J9m5m4o0o1J63r7m3L93j08j08q0q0Q4Q5J9J9l8l9j20J41mln2n3R0Q9o3o3j1
-57871D3j0J38j25O2O2l7K26q4q5j50J13R2R2j05j05J90p1j82Q1o1o2K1K0%%J7J6r1J71m1
-57893A35m2N0N0K03k35j34J28KKJ06j56J55j07j20J44m8m9K17k20K34k04k06K30mk66R6R4
-57913E5R6R5p9J82p3p4j19j18J80q1l6l5N6N7RRj37J23Q7Q8j10j09K28l4k85J50LKR6R5M8
-57937C69M7k09k08J60j01M7M7N7N6k6k5J09j52k2J10K3j08j7J14k21M1M1k20K38J08K1k41
-57957C8O7o4J98o4k9j58L83n3j07j07O2O2M6M6o3o4N3N2J1j20k28L82l5l5p4p5N2N2n8K04
$$ y = [62, 239, 165, 92, -3, 162, 47, -66, 135, 74, 136, 197, 160, 123, 268, 151, 208, 266, -35, 100, 153, -55, -89, 137, 201, 265, 124, -16, 109, 236, 238, -21, 106, 234, 179, 124, 179, 233, 212, 191, 104, 17, 32, 46, 142, -23, 142, 309, 175, 40, 99, 157, 216, 274, 187, 100, 79, 58, 77, 95, 113, 132, 87, 43, -17, -78, 85, -12, -55, 338, 230, 122, 42, -38, 46, 131, 150, 169, 131, 92, -28, 113, 109, 106, 54, 1, 91, 180, 117, 54, 43, 33, 171, 46, 108, 170, 133, 359, 275, 190, 40, 153, 245, 337, 232, 127, 317, 246, 64, 145, 84, 22, 43, 63, 63, 63, 80, 96, 5, 176, 135, 93, 143, 193, 396, 161, 27, 155, 157, 159, 265, 109, 264, 157, 37, 181, 133, 84, 301, 81, 315, 111, -95, 135, 131, -135, -39, 55, 151, 246, 167, 349, 276, 202, 83, -35, 145, 64, 28, -7, 49, 106, 115, 124, -13, 110, 197, 285, 175, 66, 294, 260, -25, 125, 128, 130, 226, 321, 369, 416, 207, -1, 159, 58, 105, 152, 209, 265, 239, 214, 323, 171, 149, 259, 282, 174, 157, 271, 50, 91, 132, -88, 150, 258, 279, 38, 105, 41, 239, 175, 146, -12, 371, 318, 211, 104, 166, 228, 274, 320, 257, 193, 246, 298, 309, 189, -39, 343, 308, 273, 199, 124, 176, 228, 170, 374]
-57980C74j26NOOL8r2n2K11l3j63J47J7p9p9M0r1K36k00p4N7P1P1l90L95k03O0J40Rj0j1Q3
-58003C63Q2j14j14K1K1J86p7k11N1j34L02k23K14O8o2r5r5n2Q0j30J32ppJ4J5J70r2j54k3
-58025A29L7J68Q9j73j07K3Q9j74J87p5Q0n1J55j08QQN8N7q7q7k2k2N9N9N9N9l7l7l7l7l7
-58048B33l8K03K03o5o5o5o4m1m1j23J39J21J22Jk61O1O1k1k2j0j0N5N5j42j43J85p8J94o9
-58070C75J2J3k22M0KKJ83J82l04J33J0J0K18k19J0J0j7j7K6K7J58j05O2k00Q4Q4o4o4j02
-58092C27J61k2k1j53J10J30J31P0j92r7J66j73Q9K05k32j33L04j17J45K05k32M3M3jjK12
-58111I67n0p2p2J90p2P6P6o9o9lmM9N0M9M9O8O9j29J34j34J28klJ1J0P7P6O2O2P8P8j06J56
-58136A730P4P4Q6Q7j26J36J03J03K7K6RK71N7N8J27J28J27J28P0P0n0L88j02J60J50J50R0
$$ y = [374, 248, 253, 259, 265, 303, 211, 159, 370, 337, 174, 321, 338, 259, 180, 220, 129, 365, 165, 91, 148, 219, 290, -100, 295, 92, 152, 292, 301, 291, 280, 363, 445, 331, 217, 238, 259, 445, 368, 157, 208, 74, 376, 153, 367, 435, 373, 278, 183, 131, 211, 81, 213, 206, 199, 213, 228, 398, 306, 152, 129, 166, 334, 423, 250, 143, 166, 255, 81, 268, 193, 273, 222, 377, 269, 277, 285, 343, 400, 313, 226, 204, 182, 241, 300, 359, 418, 381, 344, 307, 270, 233, 195, 398, 601, 536, 471, 406, 342, 301, 260, 137, 276, 397, 519, 520, 259, 320, 381, 360, 338, 328, 318, 373, 428, 286, 143, 328, 250, 444, 375, 387, 400, 178, 218, 220, 222, 405, 587, 283, 416, 426, 436, 654, 435, 445, 455, 438, 421, 447, 474, 632, 527, 589, 389, 473, 557, 493, 429, 327, 488, 466, 445, 292, 402, 532, 663, 733, 541, 444, 610, 437, 526, 731, 499, 366, 670, 553, 698, 903, 671, 714, 757, 756, 755, 967, 917, 845, 773, 963, 891, 967, 1043, 974, 905, 902, 898, 947, 997, 1046, 1095, 1163, 1232, 1103, 1237, 1103, 1231, 1229, 1226, 1237, 1247, 1324, 1400, 1462, 1524, 1602, 1680, 1574, 1730, 1804, 1878, 1964, 2051, 1925, 2061, 2164, 2267, 2294, 2320, 2329, 2600, 2657, 2715, 2842, 2970, 3097, 3225, 3295, 3365, 3315, 3703, 3601, 3761, 3911, 4061, 4151]
-58157D151R1K65Lj57K81K14K15O0O0k3K40L1L1Q6Q6L15j21k3K39M4M4J26J26j10j09N9O0
-58177F284K33k04N9N8o3J99J34j28R9J00k6k6n2n1J4J4J2J3J3J2L6L5p3p4l2l1P8P8L3L3
-58200F777k23L9N8N8p9p9q1q1j5K47k45J7N6N5k65mJ8J9j69R3k83J54j53J11j20j19l7l7
-58221E712l8l7l3l3L2L3p7p7o1o0j7K46J47k90m1m2Q5Q4p3p4P4j88K4K3QPM9M8j07J56M5
-58244E525q7q6M5J88p3J7k46J34j28j3j3R3j68K35k6m8m7q8M3rk71K73J0k7k7m3m3L0K9l6
-58267E143l7m1m2n0n0J23qN9k02l2l1l2l2j77Q6O8j93K16m6r8L4k8k7Q0j83p5J88k26L8j32
-58289D293%J6j16J02J02j54j55k2j53J69r2R7l5j90P3m5m4k8k8q7q6K2K3p1p0j25J37Q2j81
-58311C434o1j92L3r8j6j6j66R6k15M6M2k21Rk54J11j51j29j29j11j11k8k9j95O7J0j22k02
$$ y = [4151, 4242, 4507, 4510, 4353, 4634, 4848, 5063, 5123, 5183, 5160, 5400, 5431, 5462, 5548, 5634, 5949, 5828, 5805, 6044, 6088, 6132, 6258, 6384, 6274, 6165, 6224, 6284, 6517, 6313, 6372, 6430, 6367, 6566, 6700, 6572, 6671, 6771, 6745, 6719, 6667, 6616, 6630, 6644, 6656, 6669, 6682, 6694, 6730, 6765, 6692, 6618, 6586, 6555, 6633, 6711, 6744, 6777, 6554, 6593, 6651, 6709, 6630, 6551, 6470, 6389, 6374, 6621, 6376, 6393, 6449, 6504, 6239, 6235, 6253, 6272, 6103, 6196, 5913, 6067, 5914, 6025, 5905, 5786, 5749, 5712, 5674, 5637, 5604, 5571, 5603, 5636, 5559, 5482, 5421, 5361, 5344, 5590, 5737, 5447, 5406, 5364, 5449, 5533, 5460, 5386, 5460, 5272, 5296, 5319, 5327, 5334, 5383, 5431, 5324, 5480, 5525, 5438, 5352, 5397, 5585, 5512, 5529, 5283, 5417, 5289, 5276, 5263, 5356, 5188, 5423, 5397, 5349, 5302, 5214, 5257, 5248, 4977, 5250, 5260, 5233, 5206, 5163, 5120, 5150, 5179, 5143, 5106, 5065, 5023, 4973, 4923, 5046, 5038, 5097, 4895, 4863, 4832, 4800, 4768, 4591, 4677, 4745, 4552, 4768, 4722, 4624, 4658, 4630, 4603, 4683, 4500, 4425, 4613, 4387, 4425, 4293, 4293, 4309, 4193, 4295, 4397, 4243, 4088, 4066, 3913, 4082, 3990, 4087, 4052, 3862, 3935, 3890, 3846, 3818, 3790, 3703, 3617, 3639, 3662, 3591, 3521, 3396, 3533, 3615, 3434, 3373, 3181, 3214, 3116, 3100, 3084, 2918, 3014, 2799, 2845, 2887, 2666, 2675, 2421, 2532, 2381, 2252, 2123, 2012, 1901, 1873, 1844, 1649, 1716, 1726, 1604, 1402]
-58331A402N9r7r6m2m1q0J82j76j77Q1j82J37j26j04j04JJJJJ4J5n1n1j8j7k63J73n0n0J24
-58354D66j37p0p0o5J98j67R5k70L40j02j02j02J60o1o1k24K11L2L3r4r2m2m1J11J11j37j38
-58374b18J19J18n5K06p8p8J25l12kjN3N3J35j27j2j2j66K71p1p3m5m5O4O4q3J77m8m9j7j6
-58397a23j43J20p6p7m0K23ppj59K78r4r3J65r8n9o0J2J3J2J2kkJ30j33K00o2j3j3j60K75
-58419A9j65R7j50J13j9j8L9L9p1p0M1M1M1M1l4l5K11k24n7n6K65ML9k22Q3j79j81K56L37
-58441A85k73q0q1K58j77J0Rjjj32J30J30j32Q1Q1o5o6%%%jp1p0P6P7j49J13j32J30J15j47
-58465a83J%J80q3j65K71j80Q1m0l9ppk3k3J41j21K6K7O7O7k11N1L2L3O6O4k12M9J21J19m7
-58488E5m7m6m7m4m4Q6Q7p8p9O9O9k02O1O0O1j13J48j46J17n8n7K86j49k17M6n9K04o1o1Q7
$$ y = [1402, 1461, 1364, 1268, 1226, 1185, 1105, 1287, 1111, 934, 1015, 833, 970, 844, 740, 636, 637, 638, 639, 640, 654, 669, 618, 567, 549, 532, 269, 442, 392, 342, 466, 329, 259, 189, 124, 322, 155, 250, -20, 320, 218, 116, 14, 174, 113, 52, -172, 39, 71, 104, 10, -82, -124, -165, -54, 57, -80, -218, -99, 19, -36, 170, 92, 14, 139, -173, -175, -176, -123, -70, 65, -62, -74, -86, -252, 19, -52, -125, -170, -215, -151, -87, -170, 7, -41, -90, -107, -123, -266, -146, -222, -299, -339, -116, -123, -130, -289, -11, -105, -198, -33, -131, -190, -250, -238, -225, -213, -201, -203, -205, -75, -208, -8, -70, -83, -96, -256, 19, -146, -49, -199, -86, -105, -123, -84, -45, -116, -186, -145, -104, -63, -22, -56, -91, 120, -104, -161, -217, 48, 52, 91, -131, -48, -227, -408, -152, 185, -88, -168, -249, 9, -168, -158, -149, -150, -151, -283, -153, -23, -155, -74, 7, -58, -124, -124, -124, -124, -125, -196, -266, -190, -113, -262, -149, -281, -151, -36, -183, -182, -182, -2, -85, -250, 21, -159, -78, -118, -157, -164, -171, -194, -217, -76, -197, -171, -144, -77, -10, -221, -170, -138, -105, -39, 25, -187, -138, -17, 102, 55, 8, -38, -85, -129, -173, -87, 0, -78, -157, -88, -19, -221, -160, -100, -39, -152, -4, -150, -33, -91, -148, 138, -11, -228, -182, -241, -37, -98, -159, -72]
-58511g2Q5l7l9M4M3k47J5Q6Q6j04j04K8K7qrJ40J38j35J25j68R4kkk32K05o3o3J39j24j58
-58533c12K78J6J6r0q9M2M1J3J4N6k05j49K88R0R1r6r5j12J50j16j15J63j00K66Nj59J03k4
-58554c0k85R6R7J7J8J7J8O7O8o4o2onJ40j19l4l4n0n1M9M8M8M8m7m6J01j61K7K7J1J1l1l1
-58579a48J00R9n6n7j55J07J78q2o7o6J49j11L6L6R7R8k77J57o2o3L0L0m3m3L9L9j87P6J0
-58601a36J0j66R5P9Q0N2N3p7p8o7o8K11n1k3k2M3M3j59J04m4m4N4N3N3N2ooj37J24j73Q8
-58624f3L9L8j31J30J0J1k99J38JJKKM0k22K13K11j05j03P1j91K2K1N6N7r2J70L6L6J62k74
-58647a3j07J54k0j8n0m9o6o6J47j15P1P1J62k73jjL77k32K9K8K8k34nnr4J68K1K1P2P2j23
-58670e1J36k10N0j5j5M7M6M6M6j11j12M1M1k5k6k5k5KKO8O7POPNk5k6m3m3J75q6nnl4l4k8
$$ y = [-72, 13, -24, -63, -19, 24, -223, -208, -122, -36, -140, -244, -216, -189, -197, -206, -66, 72, -63, 62, -106, -12, -14, -16, -248, -43, -106, -169, -30, -154, -312, -34, -18, -2, -92, -181, -139, -98, -85, -71, -15, -220, -369, -81, 9, 100, 4, -91, -203, -53, -169, -284, -121, -221, 45, 50, -109, -6, -30, -315, -219, -122, -105, -87, -70, -52, 15, 83, 19, -43, -49, -54, 86, -33, -67, -101, -151, -202, -153, -105, -57, -9, -56, -102, -1, -162, -135, -108, -97, -86, -117, -148, -48, 51, -5, -62, -217, -110, 68, -14, -81, -147, 2, -109, -73, -37, 60, 158, -119, 38, -24, -87, -57, -27, -70, -113, -74, -35, -222, -146, -136, -126, -292, -197, -118, -38, 14, 67, -10, -88, -155, -223, -12, -63, -86, -108, -65, -22, -181, -77, -121, -165, -111, -58, -5, 47, 41, 35, -102, 22, -151, -63, -24, 14, -117, 13, 23, 34, -265, -127, -126, -125, -123, -121, -81, -303, -90, 121, 16, -87, -16, -207, -185, -164, -108, -51, -143, 27, 63, 99, 261, -13, -120, 34, 14, -4, -54, -103, -169, -235, -88, -203, -132, -61, 101, -172, -173, -174, 203, -29, 0, 28, 56, -178, -183, -188, -282, -114, -93, -72, 0, 72, -51, 85, -125, -75, -90, -105, -58, -12, 34, 80, -31, -143, -102, -61, -86, -112, -137, -162, -160, -158, -90, -23, -16, -10, -3, 2, -23, -49, -92, -135, 40, -46, -51, -56, -90, -124, -152]
-58697a52K33m5m5k09K26K6K5k9k9k64J72K43j9j39J23Q88K724J241j994k124o39j63R9k16
-58715f7K18N1k11k0k0p8J83k8k8NOj03j04R9R7r7J63k15M7J71J72k89k8K2K2OPr7r7L34k75
-58739a54J50J50k23L9j08j09J65J63k66nL2L1J95o6r9r8R8R9j51J12j18J45j2j1j1j1J35
-58759G2j26K1K1N2N4r8r9K2K3j91P2J40J39j86P4o8o8N7N8P2P4j98O3M8k11J48J46j18j20
-58781a27j1j0L8L9K34k7L3k28R8R8q6q6K24k11q4q4K04n5j71R2L09j27N1k11J8J8l2l1K79
-58803A54j56L3L4j01j03J26J25k72J64l3l4K44l66L24j12J07l29J43j18J16J16Q3j78Q2Q3
-58821A32J16j46j5j5J06j55J39j23J6J7J31j31K36k6J82k56K86l27L19N6L51k61N48k39O88
-58840A629J299L026l84K710R442O1340R9544o234j08784m2384q027m300J207l219l831j416
$$ y = [-152, 81, 36, -9, -218, 8, 34, 59, 30, 1, -263, -91, 152, 133, -6, 117, 1005, 3729, 4970, 2976, 852, 213, 50, 149, -67, 151, 202, -9, -29, -49, -127, 56, 28, 0, 5, 11, -92, -196, -97, 0, -97, 66, -149, -102, 69, 241, -48, -76, -54, -32, -26, -19, -116, -213, 121, -154, -4, 146, -77, -38, -146, -255, -90, 73, -193, -198, -166, -135, 60, -6, -105, -203, -105, -6, -157, -45, -163, -18, -30, -41, -52, -63, 72, -54, -33, -12, 40, 94, -4, -103, -81, -58, -249, -177, -37, 102, -84, -10, -78, -146, -89, -31, 41, 115, -83, -20, 28, -183, -35, 111, -7, -127, -138, -148, -110, -71, 163, 136, 169, -59, 39, 137, 51, -35, 189, -22, -106, -190, 14, -41, -212, -120, 189, 62, 113, -98, -80, -62, -94, -125, 154, -2, 31, 65, -36, -139, -13, 112, -160, 4, -29, -63, 181, -185, 139, 27, 134, -195, -52, -170, -54, 62, 145, -33, 49, 132, 248, 102, 87, 72, 178, 23, 162, 39, 55, 72, 203, 72, 308, 282, 464, 208, 494, 167, 486, 542, 893, 632, 1180, 941, 1629, 2928, 5954, 5570, 8280, 17722, 79062, 178606, 172372, 63588, 21204, 13177, 8877, 10084, 6865, 3034, 1618]
-58852A618k79r46J91J49J461J198q13j818j57l53Q3j20J43l27J10j65K70j44J18j72R0k20
-58869h3K15K2K2l10J26j8K42j55J07p0p0n3K07j53J10j68R3O1O0K3k39j20J43k1k1n7n7L1
-58890a33K92j68R1ok67L8K99ok67l6K25o8o9N8N7k53J84Q1Q2l49K61j22J38l5l5k3k3k4k3
-58912a01N0N1r7r7J40j23n6K05J3J3j02J59j16J44J4J4k6k5j56J04j68R4N5N4j56K78r8r7
-58933c0L1L2l3l4R4R6k64J72j43J18kjo4o4q1J81L9L9j62j63P7P8J2J2M9M8j7j6QQq9J71
-58957A02J16j45m8m6o2o3j11j12QK70J22J23j76j76j8K43Q7Q7k62jL8L7k08K28J02j60J4
-58977a1J3k5k7k7k7Q7Q6J63P76K346J385k172j736k56k57k45J6OOj90P1L7L8j57J03L8L8
-58998G9R9j64j51K85j08j07j0rk6K35r3r2K8K7J70k65O1O1j34J27j9j9%JJJJ0J1J0J1k1k2
$$ y = [1618, 1339, 393, 584, 733, 2194, 3392, 2579, 761, 604, 251, 334, 214, 357, 30, 140, -25, 245, 101, 219, 47, 137, -83, 132, 154, 176, -134, -8, -26, 216, 61, 168, 98, 28, -25, 182, 29, 139, -29, 64, 125, 185, 208, -31, -151, -8, -29, -50, -107, -164, -133, 159, -9, 82, 76, -191, -153, 146, 140, -127, -163, 62, -6, -75, -17, 40, -213, -29, 52, 134, -215, 46, -76, 62, 27, -8, -31, -54, -78, -101, -51, 0, -97, -194, -54, -177, -233, -28, -15, -2, -104, 55, -61, 83, 97, 111, 85, 60, -96, 8, -160, -66, -11, 43, -113, 165, 67, -30, 1, 33, 0, -34, 60, 156, -108, 64, -79, 39, 37, 36, -28, -92, -173, 8, 47, 86, -76, -239, -162, -84, -72, -60, -11, 37, 20, 4, 12, 20, -69, 102, 218, 73, 25, -21, -83, -146, -257, -369, -361, -91, 31, 154, -22, -198, -216, 27, 114, 201, -61, -62, -24, 13, -195, 33, 135, -25, -11, 2, -23, -50, -77, -104, -17, 69, 232, 1008, 3354, 4739, 2567, 831, 575, 318, 73, 89, 95, 101, -89, -18, 19, 57, -100, 3, 41, 79, 178, 14, -137, 148, 40, -67, -77, -86, -112, 123, 30, -62, -34, -7, 163, -102, -41, 20, -114, 13, -6, -25, -25, -24, -23, -22, -12, -1, 9, 20, -1, -23]
-59022b3l8K23k30k31J79J78K8K7j85P6n9o0Q9Q7o3o4O7O7k2k3k2k2jjJ6J5k24L8J09J08N6
-59045I5N6Q8j73j27J34r3r5J04J02j57J02j71R1J05J07k09N1r4J65k20M1K5K5J45j15l4l4
-59065h6J20J21r7r7K1K1noJ89k45J46j15j1j2j48J14j75K63M8M9j91P1p6p7P7P6P5P7j21
-59087Fj19l3K29k00O2J82q0J76k59P2P3P7l58J05J04%%o5o6j4j3J32j27R3R2J0J1o8o8O2
-59110A6O3K4K5k53Qj3j4O9O8L6L8L7L7j24j23O7O6J90k46O4O4m6m6j10J49j10J49j10j12
-59132a37J13J11j65R5J4J4M7M7j73Q7n9n9j0j1k6k7J54j06O8O6j95K40J2k50Q9Q9j23J37
-59153D2j56J06N5N7k17M5J75q6L7L6j8j8j85K50j25j27Q6Q4j48j49K36k6PPj55J06n7n7J56
-59175c9j06J23j39J14J14j79Q2j0j0K02k33r5J68p3J88j91P1Q6j75J18J18n7n6Q8l48J86
$$ y = [-23, -61, 162, -68, -299, -120, 58, 86, 113, -72, 4, -55, -115, -26, 61, -2, -66, 1, 68, 46, 23, 1, -21, -22, -23, -7, 8, -216, -178, -69, 39, 95, 151, 239, 66, -61, 73, -20, -115, -11, 91, -66, 36, -135, -44, 61, 168, -41, 10, -84, 81, -139, -98, -73, -48, 97, -18, -52, -86, 34, 155, 58, -39, -18, 3, -2, -8, 181, -64, 82, -33, -44, -56, -204, -90, -265, -2, 46, 95, -96, -25, -101, -178, -101, -25, 50, 127, 6, -113, -146, 83, -117, -55, 127, 47, 223, -36, 36, 109, 186, -172, -67, 37, 37, 37, -28, -94, -108, -121, 11, -116, -23, 69, 79, 90, 22, -46, 16, 79, 103, 128, -125, -117, -130, -144, -75, -7, 29, 67, 104, 141, 17, -106, -39, 27, 217, -29, 35, 99, 53, 7, -103, 46, -64, 85, -25, -137, -24, 87, -78, 17, 31, 45, 92, 139, -34, 53, -6, -65, -75, -86, -112, -139, 15, -91, -23, 43, -152, 88, 100, -150, -61, 28, -95, 42, -114, -8, 47, 104, -113, -68, 107, 21, 58, 94, 76, 58, -127, 123, -2, -129, -43, 41, -107, -256, -20, -46, -39, -32, -187, -81, -138, -195, -39, -145, -22, -161, -47, 67, -112, -30, -40, -50, 152, -81, -176, -8, -81, 107, -84, -13, 73, -102, 16, 134, 77, 21, 109, -239, -53]
-59194e3J86rk70K42k0j8j8k41J95K65j71j40j0J63r9p3J88j66R4N4k07K6J55O6O6o6o7j31
-59215e9j32J03J02m9n0O1N9m7m9J4J4m3Q7j56J06j81Q1L3L4M9M9k0j9N3N4j56k5J55k81K
-59238b11J33P1j92N8N8j13J48P9n0R3j68j01J62N4p5J17j43J93O3j76Q4N0k12K29k06J61
-59257A06j01Kj28Q1Q1K6K7l9l00J73q9O6o5M13l73J16j47k4K38%J32j19j18M3q5o0K01j1
-59278D6J21j38J24k05p5J27ln9n8K71j65j24J38N8J89k29L4k29K06L2k29n1K11l5R5n5j88
-59299a91M7M7M0M0L1L2j2j41k8K33j5j44M5q5j31L06j76Q5j8k81J32J31j03K8J58j02J30
-59319E8jn3n1ooN9N8L9L8p1p0P2P2j83P7K0K1k0J11j88P1rj39K47j5p5N7k69J66J17l18P1
-59343a20K00j09K1p3J88pqq6M4k74J62N6N6j45J16O8j93J4J43r0L8k5k6M8M8o0o1O8O8k4
$$ y = [-53, 133, 124, -146, 96, 76, 58, 40, -201, -6, 259, 88, -52, -62, 101, 2, -71, 117, -49, 45, 99, -108, -82, 73, 139, 205, 139, 72, -59, -191, -88, 14, -35, -85, -24, 35, -12, -61, -47, -33, -76, 11, -145, -39, -220, -139, -106, -72, -23, 26, 6, -13, 40, 94, -62, -87, 68, -213, -211, -78, -7, -199, -141, -83, -196, -48, 31, -19, 74, -94, -195, -33, 21, -54, 63, -80, 113, 176, 0, 84, 134, -78, 151, -55, 106, 5, 7, -121, -40, 41, 67, 94, 55, -245, -72, -161, -95, -160, 253, -120, -4, -151, -175, 63, 63, 195, 76, -42, 1, -84, -144, 57, 46, 167, 29, 153, -52, -127, 0, -3, -62, -120, 151, -14, -138, 0, 58, 247, 18, 52, -177, 29, 61, -168, -219, -8, -43, 52, -3, -191, -144, -97, -57, -17, 14, 46, 34, -107, -135, 98, 83, -61, -16, -101, -232, 74, -102, -17, -35, -316, -184, -53, -156, -128, 30, -72, 58, 57, 4, -47, -53, -59, 0, 58, 97, 135, 64, -6, 66, 138, -45, 32, 52, 73, 53, 164, -24, 47, 38, -101, 146, 131, 56, 113, -156, 10, 127, -191, -120, 80, -29, -8, -81, 107, 100, 92, 6, 50, -224, -62, -6, 50, -95, 21, 89, -104, -90, 53, -37, 1, -24, -50, -2, 46, -14, -75, -7, 61, 37]
-59366C7k4j63R7J25pJ9j12P8P9r9J63p9k10J95o6j37oK1K82k22r1J13j8N5p4O8j93l3K29
-59388B7p3J87n1n2j2j2r3J68l3l2j46J15j81Q1P5P5j00J61j38j39L1L1j05L30L4L4nmj49
-59409B4j49R2R0rqj55J06N7N9p8p7RRK22m0k0j9j82P8l1l2JKq7J74K8K7r5r7N7N5j4j6J32
-59435A13j29j4j4L5L4M1M1j33J28k99L12l1l2J56j06j10j11Q9Q8k0j9L1L1p9p7J39J40j00
-59456A04j00M6M5K53j84k63J73j91K43j36j37J03J02j53J06n6n6K05n6Q6j75rj0k6k6k8k8
-59477a68K82j53P9P9j59J00l1l1O6O6k98l7L44r2l9l9o1K00r7r6l1l2J20j43J42J40O1k00
-59498b8k02O1O0O0J0J1NNL1L3j51K83j30j30J76q5lmN1N0n9n8l0l0P8P9mnJ1J2j90P2L2L3
-59523D4lmmmj16j17P9Q0j6j6R3R3m2m1k6k4l9K22p7p7K5K5K5K5p2p2p2p3J34J33j9k0RRR
$$ y = [37, 13, -150, -53, 72, 65, 84, -28, 50, 129, 30, 193, 114, -96, 99, 33, -104, -110, -89, 193, -29, -120, -7, -25, 30, -44, 24, -169, -202, 27, -46, 141, 90, 38, 26, 14, -79, 89, 56, 24, -122, -7, -188, -107, -32, 43, -57, 104, -34, -173, -142, -111, -216, 114, 148, 182, 177, 173, 24, -125, -33, 57, 48, 40, -115, -9, 48, 107, 29, -48, -39, -30, 192, 152, 132, 113, -69, 9, -22, -54, -53, -51, -138, 36, 64, 91, -4, -101, -44, 11, -3, -19, 113, -16, -30, -44, -9, 25, 66, 107, -26, 102, -197, 115, 84, 52, 208, 102, -8, -119, -30, 58, 38, 19, 50, 81, 2, -75, 64, 204, 104, 4, 50, 95, 348, 164, -99, 74, -117, 126, -10, -147, -44, 58, -95, 11, -45, -101, 104, 48, 134, -41, -50, -60, -86, -112, -140, -168, 114, -39, 40, 119, -40, 60, 29, -2, 64, 130, -168, -205, 139, 47, 8, -31, -92, 108, 11, -85, -116, -148, -28, -171, -29, 111, 172, -28, -230, -169, -109, -49, -39, -28, -23, -18, 13, 46, -105, 178, 48, -82, 94, 9, 6, 2, 53, 103, 44, -14, -44, -74, 4, 83, 79, 74, 85, 97, -93, -21, 11, 44, 41, 37, 33, 29, -87, -204, -125, -45, -61, -77, 16, 109, 67, 26, 0, -24, -63, 159, 82, 5, 30, 55, 80, 105, 33, -39, -111, -184, -50, 83, 64, 44, 53, 62, 71]
-59550G1RL2L2p7p6m8m8J8J8L7L6J35j27k2K39j37j36J28j32L1L0r7J64k2k1j97K39j36J23
-59571F6j25J35j42J18j2j2j41J18L4L3L4L3N5k08j53K83j10j08O6O5p1J89j05j04J44j15
-59591c3M6M7j27J32O8j94MLK64Mj95j94L40r7q4q6J65r5Q5Q7k08N4k4k5J39j22k8k9L8L7
-59614b8p1J90q8q6J04J05k6k6j22j23QQJ55J55m6m7j96O5J96o6KKJ17j45N3k08N4N3mmk0
-59637c9k1J17j43MLJ6J6J6J5O1O1nmJ1J0j19j21J22J20k00k01K06n7J0RJ56j05m0K22k9k9
-59660F2j3j3Q7Q7j47j47J04j57K68Ok6k7j07j09O2O2j51J12NOm4m4M2M3k3k4O0N8j86K50
-59683I6j6j6J2J2j4j3j3j3L4L3J65k72j43J19n6n6Q5Q4o1o3J03j57P1P2r3J69m4m2j8j8l4
-59706h7K27j60j61P4P4M6M8Q1j81k4K36m0m1j11J51p9p7Q9j72K04n8j11J49O9j93J77J78
$$ y = [71, 80, 112, 144, 67, -9, -57, -105, -87, -69, -32, 4, 139, 12, -10, 229, 92, -44, 84, -48, -17, 13, -84, 80, 58, 37, -160, 79, -57, 66, -59, 76, -66, 52, 40, 28, -113, 5, 39, 72, 106, 139, 194, -14, -167, 116, 6, -102, -36, 29, -42, 147, 42, -62, 82, -33, 13, 60, -67, 65, 133, -61, -57, -54, 210, 214, 19, -175, 165, 68, -16, -102, 63, -32, 53, 140, -68, -14, -38, -63, 76, -46, -74, -103, -65, -28, -99, 91, 3, -83, 21, 126, 100, 74, -48, -171, -163, -155, 0, 155, 109, 62, -134, -69, 127, 61, 63, 65, 182, 37, 90, -118, -64, -11, -15, -19, -39, -60, 57, -86, -82, -79, -63, -47, -31, -16, 45, 106, 101, 97, 108, 118, -1, -122, 0, 120, -80, -281, -75, -132, -122, -113, 43, -62, -102, 120, 91, 62, 49, 36, 123, 210, 63, -84, 20, -137, 131, 137, 111, 84, -23, -132, -70, -8, -159, -47, -42, -36, -80, -124, -82, -39, -62, -86, -26, 32, -154, 96, 80, 64, 76, 88, 74, 61, 48, 35, 69, 102, 267, -5, -148, -29, -85, -141, -56, 28, -33, -96, 7, -150, -79, -7, -100, 69, 25, -17, -35, -53, -87, 140, -20, -181, -107, -33, 13, 61, 142, -39, -63, 173, 133, 92, -19, 132, 53, -24, 65, -107, 97, 39, -72, 77, 146, -47, 130, 308]
-59726C08l90M7j8j9RRJ5J4J5J4Q0Q0n0n1j11j12R0Q9Q3j78J8J7K15m6j33j34K13m8o3J96
-59749A59M2k19p3J89r1q9M1M1J36j24j07j08P9Q0j3j3K41j94L4L4Nk57K55oo9o9L23k86K4
-59771c5K4r5J65o2o3J00j61K0K0k4k5K35k01J09J10o2o2j28j28J51J50kkj4j3pK54j30j30
-59793fq2J80L8k24K67j70J37k98K18m3MNj59J03K4K4J07j55J03j58Q2Q1j7j6j80Q2J44j17
-59814b6j18J44J25j36O4j96J21J20j52j52K17m3poK9K8M5M5j66R4J4J3L6L6m6m6O4j97J95
-59836I9k41K7K7O6O4N7N7k69rp6J86r2J69k9k8j1j2J5J4kkJ05j56N4N6K1K1m5m5o8o9K30
-59860A14l1n9n7PPm7K14k33K9O2O2J82m29LKK36k6J13l23P5P5j06J56J2k49J08K39k37K4
-59882g7O3O3p2p4j2j3MMp6J87J12j8j21j22K3K3JJJJn4n3K54pp5N3m3Q6qqO5O5q3q4p4p5
$$ y = [308, -82, -35, -53, -72, -63, -54, -39, -25, -10, 4, 84, 164, 114, 63, -48, -160, -70, 19, 102, -76, -58, -41, 174, 128, -5, -139, 74, 26, -37, 159, 201, -18, -91, 98, 7, -82, -41, 0, 136, 12, -95, -203, -124, -44, -57, -70, 171, -23, 11, 45, 50, -207, 48, 42, -27, -96, 227, -59, -35, -11, -106, 59, -3, -66, 34, -127, -107, -87, -111, -136, 99, -102, 7, 117, 55, -7, -135, -263, -112, 38, 36, 34, 20, 7, 0, 254, 124, -6, -88, 92, 130, -94, 173, 3, 140, -158, 60, 17, 21, 26, -133, -30, -6, 18, 125, -30, 73, -85, -3, 78, 61, 45, -135, -53, 91, -26, -144, 0, 125, -11, 53, -143, -22, 98, -54, -206, 11, -32, -39, -45, -16, 12, 57, 102, -64, 30, 44, 57, 93, 129, 83, 37, 101, -96, 99, -142, -115, -88, -22, 42, 99, 156, -113, -122, -198, -12, -104, 65, 36, 8, -3, -15, 0, 14, 12, 10, 115, -41, 13, 69, 90, 111, 66, 21, -47, -116, 114, 83, 24, -33, -26, -19, -66, 148, -85, -56, 6, 68, 250, -179, -176, -174, 62, 36, 149, -174, -99, -24, -130, 26, 38, -211, -103, 136, -101, -77, -14, 49, -23, -97, -109, -122, -118, -114, -190, -3, 109, 91, -30, -152, -129, -106, -105, -104, -103, -102, -156, -209, 45, 38, -37, 16, -27, 59, 51, 43, 108, 173, 90, 6, -68, -143]
-59909a43R3K24R6l40P7j83K14Q4j32kk1J09K1k40K09k26J59j03J80q0r4J68o9J94j55k4O6
-59929H2o4p2N7m0m0J06j54J24j39J85p5n4n4J63J64j04j02J86k49J43j18m1m0o8J94K10n2
-59949A48j36j36J09k2j13J50J97o5k27K07L3k28J44J4m1K22j01k31ppO7O5J42k94L0J60k5
-59970E5k5J58j05k53J81j3j4l5l6n1K09J0J0M2M3j71R1n6n5J0Qj37J24j4j4KLOOPOOOP1P2
-59996A47j42j42P6P5JJj18J42j58K78r9r7J00j60O9O7j55J05PPJ19j42P0P0m7m7j94O8N1
-60018d8N0o2o4O5O4Q2Q1j23J39j40J23k07N4J69k67M9M9J21l16J83p8M2M0J%J%j5j5j6j6
-60041e4rrK36k00N7N8j9j8k03N9J89p2l1l3m9m9J64J64l7l8j92O9j3j3K2K1o1K01J1J2l7
-60065A26l8r6r8j41J21J93k43J67r6J52J54POq4q3q3q4P2P0n8K02j74Q7n9K03j10j10L7L8
$$ y = [-143, -50, 174, 270, -70, 7, -176, 38, 122, -10, -12, -33, 76, 97, -143, 66, -160, -1, -104, 76, -4, -98, 70, 1, 195, 40, 16, 82, 18, -54, 3, -37, -77, 29, -125, -1, -140, 45, -30, -84, -138, 25, 189, 85, -17, 169, -80, 63, -55, -96, -136, -204, -10, 200, 148, 12, -124, -15, -37, -150, 0, 197, 132, -95, 112, 145, -83, 61, 75, 34, 256, 155, -76, -83, -90, -23, 42, 184, -110, -80, 80, 55, 30, 188, 83, -170, 11, -2, -16, -51, -87, -138, 71, 81, 91, 133, 176, 5, 96, 40, -15, -5, 3, -134, -10, -24, -38, -36, -33, -27, -21, -14, -8, -2, 4, 75, 147, 5, -137, -61, 14, 15, 16, -102, 40, -118, 160, 61, -36, 64, -96, -27, 40, -115, -10, -3, 4, 123, -19, 51, 121, 74, 27, -167, -99, -48, 2, -60, -124, -59, 5, 87, 168, 45, 184, 44, 167, -40, 14, 183, -84, -35, 14, 135, -181, 2, -76, -34, 6, 7, 7, 8, 8, -7, -22, -38, -54, -63, -72, 164, -36, 21, 79, 60, 42, -161, -102, 87, 15, -16, -49, -98, -147, 17, 181, 144, 106, -86, -17, -30, -43, -21, 0, -61, 140, 151, 163, 126, 88, -8, -106, -247, -126, 67, -176, -9, -105, 47, 201, 208, 214, 130, 47, -36, -120, -48, 22, -36, 166, -8, 79, 20, 223, 113, 3, 40, 78]
-60086G8l3l2j40M69k88k5o8p0O0N8k2k3J40j21j22J39n3n5P6P5k3k84L26j09J18J19j26j26
-60107f2Q4Q5m6m6j7j9j9j8OOK2K2n9K01p6p5L6L6N3k09J14J14j80Q1k7k5L8L9L9k22N5N6
-60132a3n2n2J3J4L1L1L0L2M4M5q6q5k5k5J88p4J0J0J25J25j61j60K05n7L7L8l23K88l4l3
-60154H6j42J18J6J7r8r8Q0P9J63j00n5n5j69K66k36K5L6L7P6P7j0k71K79J9j44J15L5k27
-60175h1j63J00J37j26N5N5j04J57j6j5J50k84J89p1j84P9J50J50k26L5m7m6J05J05L4k27
-60195h9L8L9L7L9m3K19l04J30j1j2p6p7L26j09NNn6n7n5K05k24L7L7L7M6M6j39J21k45J90
-60217F0K7K7m7m8j0rJ57k78R8R7k8k7k7k8l8l8j%K85j52K3k38J81J80k00N9l8l8M3M2m8m9
-60241f3Q1Q2N4N4p8p7j0j0j29J32k41J95o7J94J0k51J62r8K71j65o5o7J46J47k18M3m0m0
$$ y = [78, 45, 13, -127, 342, 54, 29, -39, -109, -49, 9, -13, -36, 104, -17, -139, 0, -53, -108, -32, 43, 20, -264, 62, -47, 71, 190, 64, -62, 22, 107, 61, 15, -2, -21, -40, -58, -52, -46, -24, -2, -61, 140, 64, -11, 25, 61, 114, -95, 19, 133, -47, 34, 7, -18, 20, 59, 98, -124, -69, -13, -65, -117, -104, -90, -59, -28, 2, 34, 78, 123, 37, -48, -73, -98, 90, 16, 26, 36, 161, 286, 125, -35, 170, 113, 150, 188, -135, 153, 119, 86, -56, 62, 78, 95, -3, -101, -21, 58, 221, 121, 66, 11, -158, 108, -128, -103, -67, -30, 46, 123, 113, -158, 121, 140, -4, 111, 146, -81, -244, -144, -7, -133, -78, -23, -127, 30, 14, -1, 149, -135, 54, -17, -201, -122, 28, 178, -48, -13, -60, -106, -1, 104, 138, -89, -51, -12, 25, 64, 21, 240, -64, 66, 55, 43, -33, -110, 216, 107, 112, 117, 61, 4, -51, 154, -70, -33, 4, 41, 87, 133, -6, 115, -130, 60, 87, 114, 67, 19, 9, 0, 157, -121, -23, 74, 46, 19, -8, -36, -74, -112, -113, -113, 172, 20, 43, -195, -14, 166, -34, 25, -13, -51, -8, 34, -14, -63, 18, 100, 154, 208, 130, 53, 43, 33, -96, 36, -205, -10, -77, 117, 127, -124, 38, -60, 211, 46, -19, -86, 60, 207, -11, 32, -8, -48]
-60263d8m0m0J29j31Q1P9J3J2M6k16j12J51K97j39m3m2nnp8p7J68J68k73J62j8j7K4K5j06
-60284c5j07M6M6J11J12j25j24n4K08n0m9J13j47R7R7l4l3j15J46j47J12L3L2q3q1O0O1nm
-60306H1o4o3o4o4J48J46J7J7n9n8Q9j73PPk5k6J89p3j42j44J15J15r9J63n1n2K25k09l7K24
-60329A40r7J65j46j45J48j12k9k9J13J13k64J71N7N8j4j3KLj61R9l0l0j73Q9P3P2j12j12
-60350a64K36k00K29k06J58j02k0k0K9K9L3L3n9n9K66j70J0k51K20m3l2K29k73J61jjl7l8
-60371d3K7K7J5J5Q0j81j67K70QQO5O4o0o1J75q7r2r1L8L8k6k6J2J3J60j02j7j7r8r9P9P7
-60395DJ61j02PPk6k6J17j44J8K0p8J82j12J50j24j23J04J06j38J26ooj57J04m3m2%%j32J31
-60418b2j05J56K6K6p3p1RJ0k1K41j63J00m6m5j92O9J67r4p8J83r3r3k8K34k4k4ppkjj8j7
$$ y = [-48, -88, -128, 1, -130, -49, 30, 43, 55, 101, -115, -227, -76, 221, 82, 39, -3, -8, -13, -91, -168, 0, 168, -105, 57, 39, 22, 46, 71, -35, -142, -96, -50, 61, 173, 48, -76, -130, 78, 28, -21, 92, -55, 42, 139, 105, 72, -43, 103, -44, 68, 101, 133, 50, -31, 29, 90, 85, 81, 17, -46, -110, -174, -26, 120, 137, 154, 95, 37, 126, -47, -40, -33, -58, -84, 105, 32, -110, -254, -139, -24, -123, 40, -11, -63, 162, -47, -84, 140, 43, 208, 62, -83, 65, -47, -76, -105, 8, 121, -143, 28, 85, 143, 129, 116, 118, 121, -40, 59, 29, -1, -174, -85, -12, 60, -52, -164, 72, -128, 101, -105, 53, -49, -69, -89, -60, -31, 2, 35, -24, -83, 183, 13, 23, -228, -8, -51, -83, 146, -127, 34, 33, 32, -5, -43, -16, 11, 26, 41, 121, -60, -227, 43, 51, 59, 124, 188, 128, 67, 242, 155, 63, -28, 10, 48, 22, -4, 8, 21, 181, 79, 62, 45, -53, -152, -73, 4, 165, 63, 70, 77, 51, 25, 142, -2, 16, 36, -42, 140, 28, 178, 54, -69, 35, 141, 3, 129, 123, 117, -40, 64, 21, -21, -21, -21, -153, -22, -127, 29, 55, 81, 8, -63, -54, -44, -65, 176, 13, 113, 67, 22, -170, -101, 66, -28, -106, 77, -16, -109, -137, 97, 73, 49, 42, 35, 33, 32, 14, -3]
-60442cQ4j77n2K10j40J20PPj22J38k20M0O1O0K57j79j24j26J16J14J2k49P8P8J19j41NOM2
-60464B1M4l8K24j25j24n8n8K16m5j37J23r9J62r4r4K02o0k1k2j8j8j01J60P9P9j45j44M9
-60485d2M8O5O5j52J08l8l8J05J06j79j78Q8Q7n9K02j2j2k41J95n5n5J19j41O4O5j80Q0J44
-60506A59j18r1r1n8K03r0J70jjJ5J5o8o7n2n2kK59KLk8k9r3r4P3P1PPRQj55J06P5j86J02
-60531HJ03j55J06J07j56J9J9KLq1q3%%K73j63rrj08J53J15J16j57j56N6N6J60k76K79j57
-60553F5K7K8o5o5p3p4J66r5J91p1nnOOj41J20JJM4M5j80K55n5n6j0j0j57J04p2p2o6J96j0
-60578b7k71K36k6N9N8M3M2n0n1m9n1N7N7q9J71K7K7Q1j80o4o2q5L51j27j26L1k31K60kK1
-60601C0K0k9k7k9k8J08J10j90P0j24j26j03J58P8P8J92o9j59J02J03j60j43J17O2O4O7O8
$$ y = [-3, 81, -96, -148, 62, -78, 42, 49, 56, -66, 72, -148, -108, -47, 13, 270, 91, -33, -159, -43, 71, 83, -166, -88, -10, 109, -32, -27, -21, 21, 65, 27, 251, 126, 2, -56, -114, 102, 57, -80, 43, -56, 106, 12, -82, 120, 60, 39, 17, -1, -19, -120, 40, 119, 198, 53, -91, -42, 6, 71, 136, -16, 92, 54, 16, 121, 227, 48, -130, -42, 45, -14, 188, 176, 164, -77, 118, 63, 8, 127, -14, 50, 115, -65, 15, 159, 41, -50, -141, -199, 4, -86, 84, 83, 82, 97, 112, 44, -23, -75, -127, -129, 130, 132, 135, 107, 78, -15, -109, -36, 35, 42, 49, 58, 66, -89, 17, 92, -94, 8, 111, -44, 62, 169, 13, 32, 51, 53, 56, -25, -108, -108, -108, 165, 2, -7, -16, -124, 29, 144, 260, 103, -53, 3, 59, 219, -57, 222, 65, 92, 120, 55, -10, -83, -157, 9, -86, 105, 34, 29, 24, 30, 36, -105, 15, 16, 17, 61, 106, -74, 181, 126, 70, 60, 50, -107, -3, -75, -147, -213, -17, -27, -298, -62, -88, -29, 29, 72, 114, 64, 13, -36, -87, -30, 27, -62, 109, 136, 163, 244, 64, 0, -62, -147, 204, 77, -49, -18, -249, 11, 9, 30, 50, 21, -6, -35, -63, 45, 155, -35, 35, -89, -215, -318, -160, -82, -4, 188, 119, -40, 62, 165, 5, -138, -21, 41, 105, 172, 240]
-60621B40j45j45K16m6k08K26l4l4J0Rj31J29J30j33o1n9R1R2j56J03k6k7j26J35j2j2n1n3
-60642g8J2J3M1M0J06j54Q9j72J71q9L3L4j95O6J10J10J59k77J99o4p9p9q9J72K5K6p2p0J0
-60664bJ0j31J30J31j32l4l4M1M1k89J46N4N4k8k8J68r3J63r9l4l3P6P6j63j65J32J31J22
-60685B10l15j71K66ppqqP2j87K39K41k62J75j43j42opK0J9K0J8OOj1j0N9k02J0K72j02J60
-60708B05k00K37k30L3k2k2J2J3R4R4k77j6K08n4Q4j77R9j61Q3Q3p0o9o2K00j3j2m2m1m2m2
-60731a07M1M2J33l02R4R3j5j6J95o6j31J30l8l7k50J87q3J79p1p2K8K7N3N4j99K37k5k5P0
-60753A26j91m5m4J1J1J1J2L8L8K18k18j3j4p4J88J33j29l1l0o0n9K34k7j27J32l1l0j0j0
-60775Irj1NNp8p7K63KP8j83K5K6n5n6j7j6R7R8Pk54J11J10k4k5M2M1m7m7m6m7J00J01N1N2
$$ y = [240, 95, -50, 166, 120, -88, 138, 104, 70, 80, 89, -42, 87, 217, 84, 23, -36, 55, 147, -9, 94, 68, 41, -85, 50, 38, 26, -25, -78, -66, -53, -12, 28, 134, -20, 69, -103, 68, -21, 12, 46, -149, -83, 27, 137, 296, 19, 218, 154, 75, -4, -93, 79, 104, 130, 58, -12, -2, 8, -123, 7, 138, 6, -28, -62, -21, 20, -269, -123, -69, -15, -43, -71, 97, 4, 167, 68, 34, 1, 77, 153, -10, -175, -43, 88, 210, -105, -276, -10, -17, -24, -32, -40, 32, -155, 84, 325, 63, 238, 95, -47, -53, -60, -40, -21, -1, 17, 23, 29, 18, 8, 67, -135, -125, 147, 45, 205, 5, 242, 12, 45, 23, 1, 13, 26, 120, 214, -63, -79, 129, 75, 159, -18, 81, -80, 3, 86, 16, -53, -115, 85, 72, 60, 18, -23, -65, -107, -66, -24, 109, -193, -99, -6, -21, -37, 158, 92, -39, 91, 53, 16, -234, -47, -130, 49, -22, -94, -66, -39, 14, 68, -131, 106, 81, 56, 126, -65, -110, -154, -143, -132, -121, -109, -71, -33, 185, -33, -46, -60, -134, 54, 187, 58, 27, -3, -63, -122, 112, 85, -42, 90, 59, 29, 19, 9, 0, -11, -6, -1, -79, -156, 107, 109, 187, 4, 29, 55, 0, -56, -73, -89, 8, 106, 113, -141, -30, 80, 56, 31, 73, 114, 67, 20, -26, -73, 27, 128, 179, 231]
-60800B31k25L7K1K1%%o5o4kkM8M6N6k06J58J60qrj39j39jjJ28J30j17j16n1n1J22J21j72
-60823h9Q9K00o2j76Q5MLj26J34m0l8m0l9Q6j76M30j81J99o3k58LJ98k36N2N1j74K61j30J30
-60845I7k5k6j0rJ03J02r3J68k26L6L6L6n0n0l3k95J44J43j00L34k94l4J35J36k0k81J55J55
-60866B34jk62J5J4N1N1N1N1j14j14J63r8p3p4M1M2P9Q1Q1j82J27j35mmk5k6m2K19j03j03
-60889f0M4M3p9p9K47j87j28J36K5K6M4M4J27j36p7p9J07J07ok66J57j03O0N9J58k78j8j8
-60910a30K5K87k9l0j59J01m2m1rrj40J22k5k6J6J5L2L3o7J95r9J63n2n3l5l6J3J3j17J44
-60933F0j33J27p6N4n5n6J06j53MJ34J19j43N4p6p6N4j10J52J60j02m2m1jjJ46J6k54Pj3j3
-60955a52J66r4PK69j79j77J08J08J3j18J35j26J2J3j8j7J28j31j0rJ61k73NJ37J73M4K0K0
$$ y = [231, 6, 43, 64, 85, 85, 85, 20, -44, -46, -48, 0, 46, 102, -104, 54, 214, 206, 197, 58, -81, -82, -83, 45, 175, 58, -58, -109, -160, -38, 83, -89, 0, 200, 138, -38, 47, 51, 54, -72, 62, 22, -16, -56, -95, -9, -185, 245, 64, 263, 200, -58, -55, 143, -93, -41, 10, -164, 97, -33, 97, 72, 46, 36, 27, 130, 232, 139, 307, 81, 117, 153, 189, 139, 89, 56, -239, -95, 48, -52, 282, -12, -46, 89, 225, 205, -76, 79, 234, 233, -29, -14, 0, 51, 102, 153, 204, 90, -24, 139, 41, -32, -106, -65, -23, 56, 137, 218, 36, 163, 28, 24, 20, -5, -31, -73, 146, 43, -60, -16, 27, -52, -131, 116, -71, -199, -63, -38, -12, 32, 76, 203, 67, -10, -89, 18, 125, 119, -147, 10, -93, -33, 26, 184, -94, -112, -130, -105, 182, 153, 123, -36, 65, 23, -18, -27, -36, -176, -54, -79, -105, -89, -74, -42, -9, -76, 119, 20, 183, 131, 78, 43, 7, 20, 33, -84, 60, -73, 54, -22, 32, -23, -79, 27, -126, -122, 12, 131, -12, 42, -34, -110, -56, -166, -14, 146, 44, 2, -39, -40, -41, 105, 121, -133, -126, -139, -152, 14, -80, -73, 196, 17, -160, -52, 56, 69, -49, 86, -40, -28, -15, -33, -50, 78, -53, -63, -72, 89, -184, -179, -42, 131, 175, 195, 215]
-60976B15j85P8j68R3L7r4RQN7p2J65r7J63k73J06j55J12j51J30J28K1K0j62R9j13j14P8P7
-60997A2J2J2o9p0Q3Q2n6n6J07j54o2J99l8R4jjj01j02L3L2J22qj24J37L7k25n2K09l54K57
-61020d5K4J55rk69K7J57p0N9J3J4K1K2n6n6n6n7m8m9J05J05M7M9j7j7Q6Q5r5r5j27J32j4
-61043B1j3O8O8j88P2l4l4K26k08J37J39q5q6q9r0J49J50n0n1j32J29k4k3k4k3J93o9j01j01
-61065g3K4K85k22M1R6j65kkNOp7p6K73J3l26J11L8L7J14J14J0k50R1R2q5q5N0N1J43j20k17
-61088a06K18r9r9N4N2j46J15L2L3j04j06J08J07j50J11L0L0RRJ84p9l21J14j70R2K49j87
-61109b0J55j05r4r5K32k9n6n6qpK8K8J09j51l0l0K25l6j78Q3K9K7n0n1R6j64L3L4R9j62P8
-61132f6P8m1m2j85K52NPjjJ46j16K7K6K6k35R5R4n3n1O5O6o4o4L7L9J05j57J28j32lkL2L3
$$ y = [215, 30, 108, -60, 33, 70, -24, -15, -7, 50, -22, 143, 46, 209, -64, 42, -113, -1, -152, -22, 106, 127, 147, -15, 84, -29, -143, -65, 12, 24, 36, -33, -103, -20, 62, 6, -50, 57, -97, -159, 40, 2, 96, 95, 94, -7, -109, -76, -44, 78, 70, -54, 83, 120, -105, -157, 52, -302, -45, -21, 134, 125, -144, -117, 40, -30, 29, 42, 56, 77, 99, 43, -13, -69, -126, -174, -223, -118, -13, 34, 83, 66, 49, 135, 220, 125, 30, -97, 35, 21, 8, 76, 144, -44, 28, -6, -40, 186, -22, 115, 254, 169, 83, -6, -96, 53, 203, 153, 102, -30, 99, 75, 52, 28, 5, 198, 129, 28, -73, -49, 236, 14, 55, 151, -14, -16, -18, -13, -7, -84, -160, 113, 126, -200, -89, -51, -14, 100, 214, 224, -26, 65, 157, 72, -13, 37, 88, 231, 111, -106, 112, 13, -86, -32, 20, -126, -11, 21, 54, -50, -156, -48, 59, -91, 20, 50, 80, 89, 98, 282, 203, -118, -4, -174, -82, 167, -20, 135, 30, -64, -159, 73, 44, -12, -68, -76, -83, -55, -27, 82, -69, -99, -129, 96, 60, -118, -35, -6, 21, -29, -80, 16, -148, -115, -81, 18, -144, -66, 12, -29, -71, -256, -4, 1, 8, 7, 6, 152, 36, 63, 89, 115, -120, -25, 69, 16, -35, 30, 96, 32, -32, 5, 44, 149, -8, 120, -12, -15, -17, 15, 48]
-61157D8l3l2n7n8P4P2O3O2j35J28k47J5m6K16j24j24J10J09l9l9R0R1o1o1n9o1O3O3lkJ16
-61180A39J16l37p6K4K5K85j51m3m5N9N8q0q0K4K3K77j59k7k8j77Q4O8O7l5l4j82Q0K6K5M2
-61203c2M1o9o9O2O2NLj58J03J37j23L9M0l1l0l1l2L9L8O4O6k20K14l0l0L1L1M7k14R5R6n1
-61227I3n1l0k9k9l0O9O7O9O8pqp8l40M9M8R8R6%jj31j32R4R4J09j52N8N6P4j88k8K32Q6j76
-61252E0p5p6J37j24l4K28q3q1P2j87R0Q9O5O6q2q1J14j46J%J9J8J65r6l1k9LKM4k16J49J47
-61276A18l6l6K10k27J2J1j5j6J6J7K13k25j53J08O3O4r7r6L4L5n3n3K40k0k45J5P0P0%J%
-61299B5JQ4Q5k27K09r3r2O4O5m8m8j13j13J58J57j46j48N7N7N7N6L0L1j15J44r9r9K17m5
-61321A11k8k9J03j59k3k3K6K4n5n6L7L7J14j45j6j6K41k2k6k7K4K4QQN8k03qpJ00j61N2N0
$$ y = [48, 15, -17, -74, -132, -58, 14, 77, 139, 4, 132, -115, -100, -146, 70, -54, -178, -68, 41, 2, -37, 53, 144, 83, 22, -37, -98, -35, 28, 25, 23, 139, 255, -82, -158, -134, -109, 176, 25, -18, -63, -4, 54, -26, -106, -82, -59, 218, 59, 32, 4, -173, -89, -21, 46, 11, -23, -205, -125, -99, -74, -32, 9, -60, -129, -67, -5, 0, 3, -155, -52, 85, -38, 1, 41, 10, -20, -51, -83, -44, -6, 58, 124, -96, 118, 88, 58, 89, 120, 167, -47, 48, 144, 93, 42, 12, -17, -46, -76, -7, 60, 129, 197, 190, 182, 104, -236, -187, -139, -41, 55, 55, 54, -77, -209, -115, -21, 88, -64, -6, 50, 124, -64, -92, 140, 226, 50, -25, -101, 36, -88, -122, 106, 23, -58, 14, -173, -83, 6, 71, 137, 55, -26, 88, -58, -57, -57, -38, -20, 145, 49, 18, -11, -8, -6, 38, -178, -29, 118, 82, 46, 256, 29, 41, 52, 37, 21, 37, 54, 267, 42, -111, -3, 60, 124, 27, -69, -35, 0, -53, -106, 134, 114, -131, -116, -46, 24, 24, 25, 25, 26, 110, 195, -32, 177, 84, -8, 56, 121, 73, 25, -88, -201, -43, 114, -32, -180, -123, -66, -9, 47, 77, 108, -7, 137, 38, -61, 156, 111, 83, 54, 157, -2, -25, -48, -22, 2, -53, -109, -72, -35, 79, -66, -82, -98, 143, 121, 95, 68, 92, 116, 124, 132, 190, -13, -21, -28, 72, -89, -37, 13]
-61345A3P3P2q1q0poppJ1J1P6P6j02j01J98o4P8P8j78j78Q8Q6L9L8k52J0N9N8RRppM6k15J28
-61372c6J27j19j21P7L38k41K2j85K50J57k80q9J71j0j0n9K02j98O2j49J12K2K2p0p0Q3Q5
-61392I3J9J9j00r9n0K10m6m6J34j28o9J92j24j23J16J15j24J37j42J19j19j21N2N1J98o3
-61411A01K6K5k84J50j55J06Q9R0l00L11j07j06J25oj43J16K4K3j15J5J21j39m2Q8q2J78k43
-61432a34J8j09J53J11j9j69R3o2O8j9J11m3Q7R4j68j75K60l1K31o4j96J22j0n3n3J06J06
-61452B55j26j27j64l5K35k7K5K6q0M8J43j19n6n6q9J72j13J48j40j0J5j16R0K20k55NJ00
-61472c1l1J12j48n4K06k2k2n4n5J1J0R7R8o3o3J4j16L00l09J90J91k34K7K3K4j26MK36k01
-61494A4q5M5J7J6M1M1k18M4J43j16J62L3k45L65k18q6J01J01l40R6J50j10j1j0J03J04pq
$$ y = [13, 86, 158, 77, -3, -10, -16, -23, -30, -19, -8, 68, 144, 42, -59, 139, 75, 153, 231, 53, -125, -37, 49, 88, 126, -126, -116, -57, 1, 10, 19, 12, 5, 51, -164, -36, 91, -28, -149, -72, 266, 25, 47, -138, 112, 269, -11, -100, 71, 61, 51, -8, 194, -4, 58, -91, 21, 43, 65, -5, -75, 8, 93, 112, 131, 31, -68, -118, 92, 46, 0, 134, 6, -63, 129, 5, -118, -2, 113, -11, 126, -16, 103, -16, -137, -85, -34, 164, 101, 127, 152, -132, 18, -137, -31, 58, 148, -152, 159, 52, -54, 71, 65, -78, 38, 62, 85, -30, -15, 106, -33, -75, 13, -69, 109, -134, -116, -225, -72, 39, 20, -149, -56, -118, -50, -69, 42, -1, 86, 180, 12, -163, 97, 66, 297, 233, 37, 159, 149, 96, 43, 149, 255, 129, 2, -162, -197, 38, 11, 36, 62, -18, 30, 173, 54, -2, -58, -147, 25, -88, 60, -80, -90, -75, -191, -101, 119, -136, -131, -31, -62, 50, -98, -152, 54, 32, 10, -44, -99, -88, -78, 19, 117, 54, -9, 5, -111, 189, -120, 70, 261, 27, 54, 77, 101, -25, -21, 215, 14, -71, -26, -9, 7, 48, 89, -129, -85, 58, -58, 104, 137, -108, 257, 39, -47, 54, 155, -185, -89, 61, -49, -60, -70, 33, 137, 130, 122]
-61515A22p3p3J6J4J14l22K08n1r1r1K91j44L6L6Q0Q0j97O4R5R6p9p9k01K34ONj79Q2Q2Q2
-61538A63k59LR1Q9k73j1J47J46p2p0q8J73o9p0L3K95k83k3J08j53K35k6j90K46j66R4k70
-61558b00J66opJ41j21L29j07n3l14J94o6j11J51J04l31J48J48o4o3j0K52K9k33R4j67p3J88
-61579A8J57j06J81q1r8J65j65j63N4N3Q0j82n1K10p4p6J36j24J78q4o7o7m8K13j6j5J82p9
-61600A31o4o3j03j04K7K6J37J35r9r8J70r3r1r2L01L9K8k33R5R7j98O3K5K6M2M2m4m5m4m3
-61622c0O6O7o5o4J8J6m8K13j80Q0n0m9jkJ45j16OOj0qL6L8k12M9j15L21k67J68j21J39MM
-61646C8J43j19K8K8m3m4j74Q7j48J13J78q3J72r1p4p2o9J93j9j9J9J9L5L6k43J9J50j11L2
-61668a9L2k23L9K19k16J91o8j1j1m4m3K80J9J07l29J03J05j67K68r5r4r4r4K62j73P1P1o2
$$ y = [122, 49, -24, -8, 6, 120, -202, 6, -45, -136, -227, 64, -80, -44, -8, 72, 152, -45, 19, 114, 210, 131, 52, -149, 85, 91, 96, -83, -1, 81, 163, -96, -93, -2, 87, -186, -197, -50, 96, 24, -46, -134, 39, -30, -100, -67, 228, -55, -78, 30, -123, 112, 86, -104, 142, -24, 70, -200, -34, -40, -47, 94, -27, 302, 195, 142, -172, 22, -44, -155, -4, 100, -231, -83, 65, 1, -62, -72, 180, 209, -24, 70, -97, -170, 18, 175, 69, 250, 169, 71, 236, 71, -92, -38, 15, 95, -87, -138, 72, -2, -78, 58, -66, 112, 28, -39, -106, -154, 59, 43, 28, 210, 131, 67, 4, -99, -203, -176, -150, -13, 122, 23, -75, 95, 2, -89, -181, 120, 159, 187, -46, 49, 146, -52, 11, 36, 62, 104, 146, 102, 57, 13, -30, 36, 103, 38, -26, -8, 8, -40, 173, -7, 73, 23, -26, -27, -29, 116, 0, 6, 12, 2, -6, 30, 68, -144, -95, -210, 111, -156, 12, -109, 30, 34, 38, 181, 62, 90, 118, 75, 31, -143, -56, -204, -91, 87, 4, 176, 85, 11, -61, -130, 63, 44, 25, 44, 63, 98, 134, -109, -90, 60, -51, -19, 13, -210, -171, 48, -168, 23, -45, -56, -67, -111, -154, 126, 145, 252, -77, 26, 131, -36, 232, 137, 43, -51, -145, 117, -56, 15, 86, 24]
-61689B4o1p8p9K49j3j27J33k50J2R9R8P4P5n7n7N1N1KKj40J22m2m2Q6j75R1j70L33j04j30
-61712b3j31K11n0J36j27n0n1Q5Q6k0j9llj95O6J30j29J06J07j07j05K4K4K4K3j1j1j2j1R
-61734b7J0q3q3l3K27M3M2k20K14j77Q4K4K5k3k3N1N2j4j3j4j4N2N2q2q2j7j6Q4Q6K0K0j5
-61759A50j4j4j4k5k5j72Q9N0N0m3m2KLQ3Q4k32K9R3j67J29J30l9l9o6o4J46j13M0M1K4K5
-61782I9j3j3J51j11p0J92k82J52j25j26N4N4R4R5j61j62K18m4j09J52NNk23K12j8j7J0J0
-61803B9O2O2m7m8o4o5M4M3o8o9N6N7j34J28J27j33M6M8j21j22K09K11j18j17j3j1Q0Q0k42
-61825i0J93j98O2ONK2K1k0j9J92o9L1L0o7o8k37K00L5L5j64R7J5J5RRRRM6M6o4o3n1n3J4
-61850f2J3J2J2J58j03nnk01K34r3r4K77J5l8l8j35J24N0M9k33K7L6L7P5j86K28l3n5n4K6
$$ y = [24, -37, -115, -194, 55, 42, -85, 48, -202, -190, -91, 7, 81, 156, 99, 42, 93, 144, 146, 148, 8, 130, 88, 46, 132, -43, 48, -122, 211, 107, -23, -154, 57, 7, 143, 16, -34, -85, 0, 86, 66, 47, 44, 41, -154, -88, 42, -87, 19, 126, 19, -86, -62, -38, -14, 9, -2, -13, -25, -36, -27, -17, -100, -183, -216, 11, 54, 96, -124, 90, -87, -3, 21, 46, 23, 0, 51, 103, 89, 76, 62, 48, 100, 152, 70, -12, -29, -45, 39, 125, 145, 165, 150, 136, 122, 108, 83, 58, -114, -25, 25, 75, 32, -10, -8, -5, 78, 162, -70, -41, 52, -115, 14, 144, 105, 66, 0, -64, 82, -31, 9, 50, 74, 99, 86, 73, 224, 113, 43, 235, -47, 105, -20, -146, -92, -38, 56, 151, -10, -172, 46, 2, -107, 45, 50, 55, -168, 44, 26, 9, 19, 29, 91, 153, 106, 58, -6, -71, -27, 16, -52, -121, -65, -8, -142, -14, 113, -20, 26, 74, -47, -169, 40, 251, 133, 16, 3, -8, 72, 152, -90, 103, -95, -33, -27, -22, 0, 21, 1, -18, 174, 105, 136, 166, 99, 31, -206, -6, 29, 64, -100, -3, 12, 27, 36, 45, 54, 63, 109, 155, 91, 28, -23, -76, -62, -49, -37, -25, 133, 30, 25, 20, -181, 53, -40, -134, 143, 158, 120, 82, -53, 71, 121, 170, -63, -36, 0, 37, 112, -74, 154, 121, 66, 12, 38]
-61873C8K6K6K6j6j6%%j16J44j49J12k6k5rrR2R2j48J14k31L1RQk3k3J72q8J92p0r1r1l1l1
-61898a11K24l7k7k7j90P1R3R2j7j6P0j92K1K0P8P8J72k66M3M3l4l3q7J74j42j41K96L6n8
-61920A33n7l0l0N2N2j56J04m3m1R7R7n5n5opooJ9J8Q4j77J63r7m9m7R5j66K37k4k3k3j85
-61944a32P5K9K9llq2J80r2r2K35k7k23L8P2P2M0k21J00J00j22L12m05K05m6m5O5O6%%l2l3
-61967F0p0J90j09j08k7k7N4N4J21J20p4p4N2N1k73j3K82j55L1L1k58J77J83q0J8k43j16J46
-61988e7J67r5K31k07m2m2M3M2J53J52j47j48l9l8J19J20k78J57p7p6J63r9K7K6p0J89o7o8
-62009C9q8J72k4k3ppj01j01P9P8L1k31L14j22k8l0RRQ8Q9l6l7j72K63m7m8j15j16J51J51
-62032A40j94K41j14j12o5o5Q8Q7oqp3p3N9N8n1n0J47J49k38K3P2P4l6l7k09K25k0j8L8M0
$$ y = [38, 64, 90, 116, 100, 84, 84, 84, -32, 112, -37, 75, 49, 24, 15, 6, 98, 190, 42, 156, -75, -44, -35, -27, -50, -73, 99, 11, 203, 133, 42, -49, -80, -111, 113, 76, 49, 22, -168, -97, -4, 88, 71, 55, 125, -67, -46, -26, 52, 130, 302, 36, 79, 122, 88, 55, -32, 142, 0, -141, 155, 191, 133, 76, 46, 16, 68, 120, -36, 68, 25, -16, 81, 178, 123, 68, 62, 55, 49, 43, 62, 80, 164, -13, 150, 53, 4, -43, 52, -114, 123, 99, 76, 53, -132, -57, -28, 1, -2, -5, -87, 93, 1, -91, 144, 117, -106, -68, 4, 76, 116, -105, -5, 95, -27, 285, -120, 85, 39, -6, 59, 125, 125, 125, 93, 60, -10, 180, 71, -37, -64, -91, -37, 17, 138, 258, 184, 110, 162, 213, -60, -73, 209, 54, 85, 116, -142, 35, 218, 138, 156, -87, -203, -57, 110, 15, 246, 39, -3, -45, -2, 40, 193, 345, 198, 50, 11, -27, 92, 212, -66, 91, 14, -62, 101, 2, 29, 55, -15, 174, 107, 39, -49, 123, 99, 76, 69, 62, -39, -140, -61, 17, 48, -183, 131, 9, -19, -49, -40, -31, 57, 146, 110, 73, -99, 164, 117, 69, -46, -162, -11, 140, -54, 187, 73, -39, -104, -169, -81, 6, 0, -8, -81, -154, -95, -37, -88, -138, 9, 158, -80, -57, 15, 89, 53, 16, -193, 32, 12, -6, 32, 72]
-62054G2j07J54j22j23K92j45N9N8L2L1j51j49L0L0J47j13l2l2J9J8J00J00j62R9j94O7J47
-62075A25J47l2l3j88j86J24J23J04j57K8k33J65J65r2r1K01K03j97j96j62J00K31l1NNr4
-62094C4J69j60j59J50j10r6J66LKm0m0K38k3L9M0j25j23K56om91M69l16K94j37J25o1o1J84
-62115B21k51J73q9J6J5J09j52onJ1J2J1J1OOONk4k4k09N3M16j95p0o8J38j23PON9k03P4P4
-62140A0K8K9k50J2J55J54m7m8j1j2r3J68K0K0k9l0rqrrJ6J6k12M9J83p8m4m6R8R8l3l3J6
-62165G1J7J31l05J09J10m8m8l9m0R0R1j08j08J37k98J93J93n2n2m4m2J1k52L71o6r7J63j35
-62186d7J26p1o9L8L6L8L7q5q4J9J9K16k20n6K05J8J9j13j12K10n1l5l4m3m3Q7Q7o8o7M6M7
-62210E0J30j31J6J5n4n2p1J91lln3n1o2o2j77K60N2N1J12j50j37J24R1R2j04j03J09j52L1
$$ y = [72, -35, 119, -3, -126, 166, 21, 80, 138, 170, 201, 50, -99, -69, -39, 108, -5, -37, -69, -50, -32, 68, 168, 6, 105, -89, -22, 125, 272, 240, 207, 19, -167, -43, 80, 184, 27, 55, -178, -13, 152, 60, -31, 170, 373, 176, -20, -182, -82, 149, 118, 123, 128, 34, 203, 43, -116, 34, -76, -172, -6, -3, -1, -41, -81, 157, 134, 173, 213, 88, -35, 221, 215, -276, 193, -123, 171, 34, 159, 98, 37, 221, -30, 143, 54, 70, 85, 194, 42, 36, 31, 42, 54, 65, 76, 82, 88, 94, 99, 75, 51, -158, -105, 311, 116, 46, -22, 116, -7, 0, 6, 65, -138, -64, 10, 38, 67, -183, -171, -16, 138, 91, 43, 32, 20, -73, 95, 115, 135, 106, 76, 67, 59, 50, 41, 57, 73, -139, -90, 93, 15, -29, -75, 23, 121, 88, 55, 71, 88, 219, -86, 23, 133, 85, 37, -2, -42, 48, 139, 31, -77, 60, -238, -45, 148, 96, 44, 0, -42, -31, -283, 88, 22, -75, 88, -47, 79, 8, -61, -23, 13, 51, 88, 3, -81, -62, -43, 173, -47, -103, 102, 120, 139, 26, -86, 124, 73, 38, 4, -39, -82, 5, 92, 24, -43, 3, 50, 180, 49, 65, 80, 26, -26, -97, 94, 91, 88, 35, -16, -78, -140, -317, -57, -5, 46, 158, 8, -129, -5, 86, 178, 74, -29, 80, -72, -41]
-62231d1L2n1n0N8N8J40j22llp3J87j87K48j12j11KKJKj4j3J32J34j77Q4r0q9J89k47J29J30
-62255A45r8r6J15j45ooO0N8j80Q2O4O4j18j19K29l2J92p0Ok55l7K25n2n2j40J22R4j66K58
-62277A42j77N1N2jkjkk8k9Q0Q1p2p3J74k63J10J12o9o9m5m6K10n1j05j05J02J01J16j47j24
-62299g8j24K47j4m5m7j24J38K35k00Q3Q3l6l7j50J10p4p5K80l31P8P9Q0Q1j33j31J65r6O5
-62320B9O7k21L9k11L99p1p0j41J20l07L05j59K76O9O8j60j60J86p4N5N7Q4j78J8J9J06j55
-62341a0rqL7L7n4n5r0J70K4K5qqp3p3J20J22n8n9j00J59r5r6P1P0NNn8n8l6K25j58J02j09
-62365d3J51j4j4O8O8p6p7J36j26j22j23J45J44L4L5k22L9N3N2P0O9j81j80L2L3KK63p9q0
-62387E7n6n6n6n7PPP2P3M5M7QQk63J71N3N3j69R1ooJ65r8r6J64o5o4J7J7j2j2k9k8J22j38
$$ y = [-41, -9, -60, -110, -52, 6, 146, 24, 21, 18, -55, 132, -55, 193, 81, -30, -28, -26, -25, -23, -37, -50, 82, 216, 39, 123, 33, -56, 133, -114, 15, 145, 47, -49, 66, -79, -85, -91, -31, 27, -153, -71, -7, 57, -61, -180, 49, 17, 209, 139, 145, -110, -147, 78, 26, -26, -166, -44, 50, -116, 142, -35, 16, 68, 67, 65, 64, 62, 34, 5, 85, 166, 94, 21, 195, -68, 42, 154, 85, 16, -29, -75, 135, 84, -21, -126, -24, 77, 193, 46, -78, -202, 45, 31, -14, -61, -185, -47, 188, -12, 71, 154, 118, 81, -69, 41, -33, -108, 172, -159, -81, -2, 78, 159, 26, -105, 60, -36, 29, 96, -125, -86, -297, 102, 31, -39, -180, -60, -367, -62, -221, 55, 124, 192, 32, -128, 58, -16, 39, 96, 180, 2, 20, 39, 145, -10, -19, -27, 10, 47, -7, -62, -152, 18, 42, 67, 59, 51, -22, -95, 25, 147, 89, 30, -70, 89, -6, -102, -31, 39, 44, 49, -9, -67, -103, 122, -36, 66, -43, 108, 94, 80, 148, 216, 140, 63, 199, 73, -49, -172, -27, 117, 151, 186, -36, 3, 56, 108, 178, 247, 66, -114, -82, -49, -47, 216, 137, 57, 1, -55, -111, -168, -161, -154, -82, -9, 36, 83, 91, 99, -164, 7, 60, 113, -56, 35, 29, 23, 188, 90, -6, 158, 93, 29, 46, 63, 51, 39, 10, -18, 104, -34]
-62413c4m1m1l8K23k35K02J9J9k0j9M8M8l4l4j20L15k47J5j35K99q1q2L6L6m7m6J66r7KJq7
-62436iJ73n6n6R4j67M4M5m3m3K01k34M0M0R5j67N2N3P4j87J09J10p5p6J25j37L8L8k64J72
-62458a1N1N3k08N3k8k9J02J00l6l5q1J80j6j7j80Q1j05J56k2k0N9O0l9l9n5n6J18j42MNQ5
-62481a2Q4o8o7Q2Q4j73Q9k5k5N5N7r5r7P3P2o6J93J84k54kkK16k20ppo1o1K74j62j13J48
-62505I4j91P0NMk4k4j06J56k4k4J38j21j2j2o6J94p3p4J54j06o0n9K24l8K8K7j36J24k7k8
-62527A3j1j0J14J16j25j25%jM7M8J44j19q1p9P1P3OPj45j46J98o4K3K3rj0R1j69J09j54K85
-62551A20K4j61R9N9k02M2M2r0J70l04J33J74q7nnK19k18j19J41m6m7J16j45J17J19QRj81
-62572a8Q0q3q4J71q9J05J06J8k44J70J71l30J06P3j87klJ45j16j09J53j1j0N7N8j23j22r
$$ y = [-34, -75, -116, -154, 69, -166, 36, 55, 74, 54, 35, 83, 131, 97, 63, -57, 258, 11, 26, -109, 190, 109, 27, 63, 99, 52, 6, 172, 75, 77, 78, -9, 164, 108, 52, 146, -21, 23, 68, 25, -18, 183, -51, -11, 29, 124, -43, 9, 62, 136, -51, 58, 168, 93, 17, 142, 5, 43, 81, -183, -11, 40, 93, -115, -62, -90, -119, -17, 83, 47, 12, -69, 111, 95, 78, -102, -21, -126, 30, 8, -12, 47, 107, 68, 29, -26, -82, 36, -106, -102, -97, -12, 72, 4, -63, 19, 103, -70, 19, -6, -31, 24, 81, -14, -111, -38, 34, -32, 161, 345, 91, 89, 87, 303, 83, 76, 69, 8, -53, 221, 59, -54, 94, -97, -27, -22, -18, -42, -66, -172, -16, -40, -64, 74, -47, -59, -71, -137, 57, -16, -90, 64, -42, -102, -161, 63, 25, 53, 80, -56, 68, 41, 13, 2, -8, 106, 222, 97, -28, -28, -29, 18, 66, 210, 91, 10, -69, 2, 75, 81, 88, -57, -203, -5, -69, -46, -23, -32, -42, 49, -120, -11, -165, 120, 144, -17, 82, 141, -61, -19, 23, -67, 103, -201, -68, 106, 19, 14, 9, 228, 10, -109, 32, -14, -61, 55, -90, 27, 146, 154, 163, -18, 62, -21, -105, 66, -23, 82, 188, 206, -38, 132, 303, -27, 79, 152, -35, -37, -40, 105, -11, -120, 33, 22, 12, 69, 127, 4, -118, -127]
-62593a27K52j94O7O5O6k7k7m5m3J9K1NMj58J03M6k15K65Ln0K12l94M3J08J08j75j76L74o3
-62615F7J29l08J13j47J83p6K5K4QRm6m8J8J9l9l8J30J30j56J04m3m2M9M9j36J24j93K42n2
-62636I9n2j2j2J36j26llk0j9JJo5o4J18J18J13j50L6L5j44J17K1k39M9M9J76k59j5j4N9N9
-62660a0ooJ6J5J48j15P1j90j1j1J12j49K93L1k76j4M1M1j5j5K4K3k09M03j2k74J17J17l1
-62682A08l0RRj21J39j56J04r1r2J13J12J13j49J56j07m0m1P8P8Pk54Q9R0n8K04k28L3L4L4
-62703A43l9l9j36J24J23j38q9q9RK70r5r4N1N3r4J66k5k6PPr9J60k14M6K00o2j00r9m7K14
-62726H8o3o2Q0Q1j97O5LLj28J33k4k6N5N7n4n4P6P7k1k1k2k1p2p3J44J45r5r4L5L5L7L8k9
-62751I6k8o8o8O3O2j29j29N0N1K57l53J21J21l1k9J16j44N7N7k4k4k1j9J10J11j09j08nn
$$ y = [-127, 125, -69, -2, 63, 129, 102, 75, 30, -13, 6, 27, 32, 36, -122, -19, 27, -188, 77, 80, 30, 242, -152, -109, -1, 107, -68, -244, 130, 67, 196, -112, 1, -146, 37, -39, -14, 10, 18, 27, -19, -67, -49, -30, -69, -107, 23, 153, -3, 101, 58, 16, 65, 114, -22, 102, -91, 151, 99, 47, 35, 23, 159, 33, 30, 27, 7, -12, -11, -10, -75, -139, -21, 97, 210, 60, 96, 131, -13, 104, 125, -114, -65, -16, 160, -99, -114, -128, -69, -10, -16, -22, -6, 9, 157, 42, 113, -77, -88, -99, 13, -136, 157, 188, -88, -102, -61, -20, -35, -50, -26, -3, -212, 191, 179, -95, 22, 139, 108, 78, 87, 96, -25, 114, -42, 62, -29, -121, -8, 104, 217, 68, 224, 117, 77, 36, 114, 192, 199, -55, 34, 124, 66, 270, 42, 75, 109, 143, 104, 65, -71, 53, 176, 38, -51, -140, -131, 139, 44, -50, 1, 54, -40, 126, 101, 75, 82, 89, -10, 150, -64, -18, 182, 120, 20, -79, -126, 88, 25, -37, 43, 124, -73, -8, -5, -2, -130, 3, -21, -47, 8, 65, 11, -43, 33, 110, 89, 68, 46, 25, -47, -120, 24, 169, 74, -20, 15, 50, 87, 125, 96, 68, 0, -68, -5, 57, -72, -201, -151, -100, 157, -196, -75, 46, 15, -14, 102, -42, 15, 72, 48, 24, 3, -16, 94, 205, 96, -12, -17, -22]
-62773b2K06k28Ok57K42j95L39P7k92J42J2J2p9q1O7O6q9J71k04K31j35J25p6p5K05n5j26
-62793a3j27Q8Q7m2m3N4N5k7K35r1r0rro8o9M6M5J85p7o1o0q5q5J17J16J26j35J1J2n1n0j99
-62817b14O4M2M1K05n7m4m2p6p6K67On0m9j34J26M5M5p7p7Q0Q1j84K50j14J48k22K12k60J75
-62839A11j0j0J7J7j8j7j8j7p7p8N4N2p8q0J23J22J01j61j28j29%K60j7j8K7K6j47J13J66
-62861A86k69j73R0J86p5J04J05j96O5J30j31m4m6N3N2J33j29J9J8K5K5j06j05O1O0J1J2j65
-62882a04R6n2n1Q1Q0L1L2j4K49m66l0K02n9j04j04J08J07npo8J92j9j9lllln1n0M0M1j80
-62906a36K55J25l11j3j2o7L69j22j21L6L6M8M7q3q3noooL2L1R8j64J90p0P7j85M3M1K5K6
-62929H9ppj37J23m2K20j89P3j3j3LLk0k0M6M5r7r7L3L2kjJ4J5r1J69j09j07J14J14l3l3R4
$$ y = [-22, 184, -44, -38, -295, -53, -248, 91, 168, -124, 18, 30, 42, -37, -118, -51, 15, -74, 97, -107, 124, -11, 114, 38, -37, 168, 113, -13, -140, -52, 35, -7, -50, 4, 59, 32, 267, 176, 86, 77, 68, 0, -69, -23, 22, 207, 130, 69, 9, -76, -161, -44, 72, 198, 63, 74, 86, 35, -15, -214, -150, -108, -67, 138, 81, 37, -5, -81, -157, 110, 116, 66, 17, -117, 9, 54, 99, 22, -55, 25, 106, -78, 172, 58, 206, -16, 196, -64, 111, 101, 91, 108, 125, 107, 90, 72, 55, -22, -100, -46, 6, -72, -152, -29, 93, 194, 33, -95, -224, -224, 36, 19, 1, 28, 54, -93, 20, 186, -83, -256, -166, 20, -55, 49, 154, -42, 23, 153, 22, -22, -68, -15, 37, 170, 41, 60, 78, 103, 128, 22, -83, -22, 38, 49, 61, -104, -8, -60, -111, -30, 50, 81, 113, 99, 348, -118, -148, 54, -5, -109, -213, -105, 2, -3, -10, -78, 114, 95, 76, 73, 70, 67, 64, 13, -37, 3, 44, -136, 119, 244, -67, -80, -92, -159, 210, 88, -33, 3, 39, 87, 134, 51, -32, -37, -43, -49, -55, -23, 8, 106, -58, 132, 62, 139, -46, -3, 38, 63, 89, 82, 75, -62, 61, 19, 239, 50, 123, 110, 97, 100, 103, 83, 63, 109, 154, 57, -40, -7, 25, 23, 22, 36, 51, -40, 129, 20, -87, 27, 141, 108, 75, 169]
-62954A69j68j83P7J71r0l0l1K72l38J09J08K48j88rqk3k4opj52J09l7l7R2R4j24j25J17J16
-62976A02j3j4q9r1J88p4Q8Q9j20j18j03L34L3k27p2J89q8q7p7J84j09j10K22l7k2k3M4M2
-62997D1O0k02Q7Q6Q8j75j1j1Q6Q7Lk59J9J9K8K7K7K6j51j52K13m8O9O8j11J50J00j62JKK9
-63020C4K9k16K19n7n6J88k47K88j48MNl2l2R8R8j73j72J92o9K9K8J3J2l1l0m8K14l3l4j64
-63043i1R7qrK3K4j12J49j28J33j88P3P2P4r4r4R7R7J16l20J54k82K80K0j39J23L9M0j56J04
-63065I4o6o5Q1Q1m9n0j%J46j17M7M8k26L5J8J9R6R7j82Q0o7o6Q0Q0q7q5K8K8J59j03j35L00
-63089B18o3o4j18J43n3n2J27j35r7J62j30J30j88P4P2P4m7m7J18j44r1J71QQQQK4k37K7K7
-63112f7P6P6j07j09J32j29j55K83L5L7q4J76j88j88K5K6K38k4q4q5j35J28K08n2j01J59l0
$$ y = [169, 1, -182, -105, 66, -24, -54, -85, 187, -151, -42, 66, 314, 126, 117, 109, 86, 62, 56, 49, -103, 6, -31, -68, 24, 118, -6, -131, -14, 102, 89, 75, -14, -105, 83, 9, 97, 186, 66, -52, -155, 179, 212, -15, -87, 102, 14, -73, -150, 34, -75, -185, 37, 0, -22, -45, -1, 41, 101, -101, -14, 72, 160, -15, -26, -37, 49, 136, 139, -120, -101, -82, -54, -27, 0, 26, -125, -277, -64, -112, -43, 25, -86, 64, 164, 2, 3, 5, 34, 63, -153, 66, 9, -47, 141, -106, 182, 34, 38, 43, 11, -21, 77, 175, 2, -170, 22, -47, -18, 10, 23, 35, 4, -26, -74, 140, 107, 73, -91, 6, -2, -11, 12, 36, -76, 73, -55, 78, -110, -37, 35, 109, 15, -79, 18, 115, 231, -89, 65, -217, 63, 83, -56, 67, 106, 146, -10, 94, 28, -37, 44, 125, 76, 26, 25, 25, 171, 54, 101, 149, -77, -42, -24, -5, 91, 188, 6, 86, 19, -47, 33, 113, 26, -59, -31, -3, 156, 53, -82, 218, 155, 91, -27, 116, 63, 11, 138, 3, -94, 68, -62, 68, -120, -46, 26, 100, 53, 6, 124, -20, -111, 60, 68, 76, 84, 92, 116, -121, -94, -67, 9, 85, -22, -131, 1, -128, -283, 0, 35, 72, -12, 164, -24, -212, -187, -161, 77, 53, -31, -116, -251, -123, 85, 33, -68, 91, 61]
-63132F1l0j3j4R7R7j38j37K14m7k76J61K9L1K22k15J04j58P6P6P9j83l5l5j4j4N1N0j9k0
-63154@O8l69L21j14L7L8ooJ40j20j6j7L3L1m4m5Q4Q6o7o6J77k57N9N7L1L1l6l5O6O8J92k46
-63178G5o5o4L8L6N3k07M1M1K5K5J2J4J3J4j9j9J28j34%%j5j6J7J5L3L4j49J12j81Q0M7M6
-63202C0n0n1p2J89N8k03J11J12K4k36M2M2k3k3p8J83k8k8L6L6K0K0Qk53J12J10n0n0J12j47
-63224d7r5J67MNR8R8j36j36J27j32k16K21j57J04l1l2K36k5N7N7l7l7j67j69J21J22j58J05
-63246e3Q0Q0q3q3l5K25j17J44k16M5POJ93o8o8J93n6n7l34J02L5K96m34J77j00J62J90k47
-63267a6L0L0J9J9j59J02K1K1M1M1k4k5q7q6k1k1M5M6K8L0M7k13J02J02j06J55k04N8l7l8
-63289a00M5M5J5J6N5k07K3K4J81q0k17K18K3K2m0l8N2N3k15K20k5k4m7m7m2K19r3r1R2R3
$$ y = [61, 31, 18, 4, 101, 198, 60, -77, 137, 90, -186, -25, 4, 35, 257, 42, 146, -12, 64, 140, 219, 36, 1, -34, -48, -62, -11, 39, 20, 0, 68, -301, 20, -94, -57, -19, -25, -31, 109, -11, -27, -44, -11, 20, -24, -69, 15, 101, 34, -32, 145, -112, -53, 4, 35, 66, 30, -5, 61, 129, 321, 75, 10, -54, -16, 20, 73, -134, -93, -52, -27, -2, 10, 24, 37, 51, 32, 13, 141, 7, 7, 7, -8, -24, -7, 8, 41, 75, -74, 38, -143, -63, -16, 30, -20, -71, -143, 46, 104, -99, 12, 124, 148, -88, -46, -4, -27, -50, -128, 55, 27, -1, 35, 71, 91, 111, 119, -134, -22, 88, 38, -12, 100, -47, -142, 25, 29, 34, 132, 230, 94, -42, 85, -47, -263, -42, -199, -95, -126, -158, 78, 53, 110, 167, 130, 93, -74, -243, -122, 0, -158, -53, 27, 107, 24, -59, -94, 131, 14, 158, -58, -13, -6, 0, 193, 125, 57, 250, 194, 137, -197, -95, -60, 236, -198, -21, -121, 41, 231, -16, 14, 44, 63, 82, -77, 25, 46, 67, 108, 149, 125, 100, 13, -73, -94, -115, -70, -24, 4, 34, 81, -132, -30, 72, -34, 121, -83, -25, -62, -100, -55, -10, 5, 21, 76, -131, -108, -84, 97, 17, -200, 18, 41, 63, 23, -15, 37, 90, -125, 95, 70, 46, -1, -48, -90, 129, 36, -55, 37, 130]
-63312A30k33K9l7l8L31j05R1j70J00J01j11j11M3M4j95O5K16k19P9Q0J82k56j0rMNONLKo2
-63335d0o3N2N1n7n8J19J20J1J1o9o9llK3K3N1N0k17K18j52j52J08j54K33k8R4j67M5M4j14
-63358i3J46J36k99PPk0k0N4N4Q0Q1k27K07K9K8m7m6L5L5j84P7l2l1K02k33K25l8p5p4J20
-63380A04j40K3K2P2P2r8r7P0P1j37J23q7q9M3M3M2M4J%j45J14l3l3J29j31k2k3N4N2J77q7
-63404A34r1r1M9N1l2K31j20j20N0N0k3k3k2k3N4N4n5n5P5P6p7p7L6L5L6L6p8p8j1j2j7j7
-63428e5k8K33L9k22K13k23j09L26j16j14R5j64K10n1j57J04J53j09k1k0J75q7o1o0j53K82
-63447H0j62R8k0k2L7L8j91P1J12j48R6R6j94O8P3P3k5k5m2m0J94o7o7J96p2p1l8l8q5J75
-63470A00l7l7N7N7k4k5R8j65M8M9r5r4N8N7k1k0k0k1N0N2M6k15R2R1j7j7m7K15j89P3p3p2
$$ y = [130, -103, -74, -111, -149, 182, 77, 168, -2, 98, 199, 88, -23, 20, 64, -131, -66, 150, -69, 10, 90, 272, 16, 6, -3, 1, 6, 12, 17, 20, 22, -40, -103, -51, 0, -57, -115, 4, 124, 135, 146, 77, 8, 5, 2, 25, 48, 99, 149, -68, 150, -2, -154, -46, -200, 33, 5, 99, -68, -23, 21, -93, 53, 189, -110, -103, -96, -116, -136, -82, -28, 52, 133, -94, 113, 142, 170, 123, 77, 112, 147, -37, 40, 8, -23, 179, -54, 171, 133, 58, -16, 104, -36, -13, 9, 81, 153, 55, -42, 28, 99, -38, 85, -2, -91, -48, -5, 37, 81, 82, 82, -63, 51, 18, -15, 114, -17, -39, -62, -8, 44, 221, 134, 43, -48, 1, 52, 20, 251, 131, 11, 61, 111, 88, 65, 43, 20, 74, 128, 73, 18, 93, 169, 92, 15, 51, 86, 122, 158, 80, 2, -9, -21, -38, -55, -83, 150, 189, -33, 180, -43, -152, 174, 58, -56, 39, -125, 85, 34, -123, -19, 134, 25, 4, -16, 159, 72, 11, -49, -202, 80, -82, 16, -4, -26, 11, 49, -142, -71, 41, -107, -11, 85, -109, -41, 32, 105, 80, 55, 13, -27, 167, 100, 33, 229, 157, 86, 48, 10, -75, 100, 63, 26, 83, 140, 116, 91, 189, 24, 72, 121, 26, -68, -10, 47, 26, 6, -14, -35, 15, 67, 113, -102, -10, 81, 64, 47, 0, 215, 26, 99, 26, -46]
-63494d6J55j05k6k7o5L72k95J41k8k8j3k74K59jJ6J7j6j5J24j37n5n5N0N1j5j6j5j5JJj04
-63517a64J57RJ0P3P3K4k38J51J51k79j8K49j87j37J24N2N4l9l9k4k3k4k4ooO0L21l23o1K0
-63540f4K0k1K41n9n9kjo7o7ppJ89p2J48j13m8m7qqJ00J01q2q1o1K01J61k77rK53j09j09j0
-63564B6j1j34J26K09k27J43j19JKR0R1k09N1k9k9m0m1L03j33M7M7j57j57J26J26k8k8J20
-63585A66j43K0K0p7J83L3L4m3l04Q0P9p2p3K16k21R1Q9p5p3L4L4J1J1j35J26J8J8j77Q4P0
-63608B4P1ONJ36j27poJ66k70M0M1m5m5O3O4j06j05K64j70j00J62j2j2pqp3p3O2O2O0O2l2
-63632I0l3m9m8P1j90qJ23P6P7j88P4J25j35j12J50p7N4J34j27J14j8lj34J1j20K07P6J7j14
-63654D3k12K23j39J22KJ33k43j12K60%k30j01L31j05J01k9R9R9k33L0J3j17J22ppJ23j29
$$ y = [-46, 109, 4, -22, -49, -114, 258, -37, 104, 76, 48, 35, -239, 20, 19, 35, 52, 36, 21, 145, 8, -47, -102, -52, -1, -16, -32, -47, -62, -61, -60, -164, -7, 2, 12, 85, 158, 182, -56, 95, 246, -33, -51, 198, 11, -126, -2, 50, 104, 65, 26, 2, -21, -45, -69, -75, -81, -21, 300, -23, -84, -64, -44, -65, 176, 117, 58, 56, 55, -12, -79, -86, -93, 96, 24, 172, 59, 11, -36, -44, -52, 48, 149, 67, -14, -75, 126, 287, 10, 1, 254, 145, 36, 26, 15, -119, 7, 216, -11, 132, 13, 14, 16, 106, 197, -12, 39, 10, -19, -59, -100, 203, 70, 117, 164, 7, -150, -24, 102, 74, 46, 166, 23, 43, 63, -14, 169, 202, 236, 193, -111, -31, 48, -24, -97, 119, -102, -11, 78, 3, -70, -36, -2, 9, 20, -115, 11, 29, 47, -130, -46, 24, 95, 101, 106, 242, 115, 108, 102, 268, -2, 38, 79, 34, -11, 52, 116, 10, -95, 169, -1, -101, 61, 49, 37, 30, 22, -51, -124, -62, 0, 60, 122, 90, 57, 8, -40, 31, -159, -167, -44, 32, 109, -79, -5, 120, -15, -127, 23, -54, 0, 134, 7, 121, 103, 100, -34, -23, -143, 64, 140, 157, 43, -169, 54, -85, 37, 39, 172, -71, -183, 77, 77, -153, -254, 77, -28, 73, 44, 143, 242, 9, 39, 52, -65, 57, 50, 43, 166, 37]
-63674C7Kj61J00P5j86l1J00j4j4Q4m7j16J46j42J22q9J72l1R9m2m3N6p5r5J65o4O8j04j04
-63696a32N7N6rqN5N7J2J1n4n3K0K1NNP4j87R0l9Q5m4j66K68M9q3l1l1j55J07k8K34o6O5j88
-63721cP3j40J20p5p5R5R5J33j29J3J3j34J27j49J12O3O3k33K8k7k7P9j82K65Lo1o0MNp5J86
-63744A07m2m2P6j85J89p1p7J84k34K6O9O7q3q5J09j52K67Nj98O3P8Q0qk70L03j34O5j97M8
-63766d2M7k15M5K96j39J35J37j47j47R9j62J48j12p4J87k54L57j22j21Q5Q5j59J01K0K0l
-63785F5lJ3J3j55J05K4K3k2k3NNj38K98j01j00k4k6lk66K93K8r4J65K3K3j13j13L4L4J97
-63808A67o4j58J03j52K83n9n8j95K41J25l12K44j8Q1j83jkJ14j48j47J14M8M8J6J6o4J99
-63828B38j02j02NNj2j1O6j95K62j73m6m6J55j04q8J73K6K7j11J49o3o1O7O8j12j11p4J86
$$ y = [37, 39, -122, -22, 53, -133, -164, -64, -78, -92, -8, -55, -171, -25, -167, -45, -134, 38, 7, 106, 64, 21, 77, 2, -93, 72, 8, 76, -28, -132, -75, -19, -28, -36, 19, 76, 88, 99, 45, -8, 12, 33, 38, 43, 117, -70, 20, -19, 66, 22, -144, 124, 173, 90, 59, 28, -127, -20, -48, 186, 120, 185, -3, 70, -70, 50, -25, -100, -5, 90, 223, 94, 107, 120, -14, 113, -36, 76, 139, 202, -31, -3, -30, -57, 22, -160, 105, 108, 47, -13, -9, -4, -79, 107, 65, 23, 99, -86, 103, 32, -45, 139, -95, -69, 0, 67, -16, -101, 8, -144, 123, 128, -70, -7, 71, 151, 143, -127, 176, 42, 107, -90, -42, 5, -210, -165, 131, -8, 127, 264, 117, -30, 69, -93, 55, -57, -131, 56, -198, 159, 37, -84, 1, 86, -73, 28, 48, 68, 65, 62, 75, 88, -67, 38, 62, 85, 63, 40, 45, 50, -88, 210, 109, 9, -15, -41, -44, -310, -17, 11, -83, 82, 105, 128, 15, -98, -64, -30, 167, 103, -55, 48, -104, 179, 120, 62, -133, 108, 233, -79, 165, 147, 228, 45, 44, 42, 156, 8, -139, -25, 23, 71, 87, 103, 39, 238, 136, 34, 39, 44, 32, 21, 87, -108, 154, -19, -65, -111, 44, -60, -148, 25, 51, 78, -33, 116, 53, -8, 59, 127, 15, -96, -170, 16]
-63849A6M0M1l3l2l2l1M9M9j13J47R6j66k14M7Q1Q0j3j2n7n9N1N1J5J7L9k22m0L97k62J73
-63872A03l7l7j0j0lllkkkkjl5l5l5l4K7K8K8K8J22J24k20k21K69Rm2m0j9j9L0K91q6q5o3
-63898A3J99j78j77K25l6J2J1n3n3l3K28n6n5K11k27LLJ16j46J8J8j16J45J5J4q4J79l29o7
-63920b00J62j00l4K27J52j11l9m0J42k94O0O0M0M1R6j66q5J77n2n1M2M4j09j09N2N1j3j4
-63941g1K5K6K5K6L9L9k01O1J59k76R5R4q7q8M9M9R0j70pqkK60n7n7K32l1n2n3k85J51l0l0
-63965h5j0j1K02o0K3K3m3m2r0J70K5K4o2o2K0K0j36J24j85K50j64R6M3M2k8k8k9k7j4j3k43
-63989b70J94p9J83O3O3l7l7l7l7rj0N5N6P7P7j20j20m5m5L6L6p0J92k49J87p7J84jk63P6
-64011b7j87K44j8n7n9J65r6J38j22P3P4o3o3M7M6l3l4L2L2RRRRp2p0L7L8RRn7n5L6L7j3j2
$$ y = [16, 56, 97, 64, 32, 0, -31, 18, 67, -46, 101, 197, 31, -183, -136, -55, 25, 12, 0, -57, -116, -65, -14, 1, 18, 57, -165, -205, 192, -70, 103, 66, 29, 19, 9, 6, 3, 0, -2, -4, -6, -8, -9, -44, -79, -114, -148, -121, -93, -65, -37, 85, 209, -11, -232, 37, 46, 4, -36, -55, -74, -44, 247, 161, 76, 13, 212, 34, -143, 82, 46, 58, 69, 16, -37, -70, 158, 102, 47, 258, 31, 34, 37, 153, 7, 25, 43, -73, 72, 87, 101, 17, 196, -133, -200, -38, -138, -172, 55, 207, 96, 57, 17, 159, -135, -75, -15, 25, 66, 162, -4, -89, 88, 36, -15, 27, 71, -38, -147, -95, -44, -57, -71, -46, -20, 5, 31, 70, 109, -92, -31, 128, -148, -53, 41, -46, -134, -85, -36, 54, -116, -123, -131, -133, 127, 70, 13, 245, 214, 162, 109, -176, -25, -55, -85, -95, -106, 96, 36, 59, 82, 39, -3, -93, 77, 102, 126, 64, 2, 22, 42, -94, 30, -155, 95, -69, 27, 70, 112, 84, 56, 27, 0, -14, -27, -270, -76, -155, 28, 91, 154, 117, 80, 43, 6, -3, -13, 42, 98, 175, 252, 132, 12, -33, -78, -42, -6, -76, 116, -133, 54, -23, 161, 160, -103, -27, -214, 30, 12, -45, -104, 61, -35, 103, -19, 54, 128, 65, 2, 49, 95, 62, 28, 60, 92, 101, 110, 119, 128, 56, -14, 23, 61, 70, 79, 22, -33, 3, 40, 27, 15]
-64038A5j39J23k4k5L2L1l2K27j11J51j93O9j15j13J41J43j34j32K75l35J40J40j54J06j7
-64056F9j7J64k73j33L04L1L1j06j06J76J78k13k13N5N3J12j49K09n2r7r7K41j95P1P2k1k1
-64077G3j28j30k05K31j25J37N5N5J98k36K4K5j47J14J14j46J64J65j36j34P5P6j79Q1N0N1
-64096A22K42l69J30j30M3M3l6l6k21M1L78k32J8J8JKJ8J8j40J21L9M0k5k4m1m0J53j08k5
-64118@k6kkJ33J34l05J29Q1j80J43j18J3J1l4l5M7M5K16k21J62k75Q4Q5p9p8j49J13J78q3
-64140a3ppK6K5K9k32J11J10O7O6j90P0n8o0p0p1K62j73P1P1MMo0o1J8J8J64r7l1l1J64r7
-64164B2m9m9J02J04k13M9J57j05MLj05L31j02j02k21M1J21J20K8K8j68j68N5N6J44j16j65
-64184a98K70J41j22k8k9Q0j82n2n2K30l1R4j66K45j7j41J20r7r5KKj24J38n8n8l1K30J9J8
$$ y = [15, -124, -1, -25, -50, -18, 13, -19, 208, 97, 248, 55, 124, 9, -104, 37, 180, 46, -86, 189, -146, -6, 134, -20, 86, 69, 52, 216, -57, -190, 114, 145, 176, 70, -36, 140, 318, 105, -108, -53, 0, 112, -37, 172, 120, 23, -74, 167, -28, 43, 115, 94, 73, -55, -185, -390, -159, -284, -147, -92, -37, 161, -75, -51, -26, -173, -59, 55, -91, 73, 238, 102, -32, 43, 119, -60, 21, 71, 122, 364, -5, 125, -5, 38, 81, 45, 9, -212, -171, 207, -25, -7, 11, 12, 14, 32, 50, -90, 31, 70, 110, 85, 61, 20, -20, 133, 25, 0, -26, -28, -30, 103, 237, -68, 61, 142, -38, 105, -13, 0, 11, -23, -58, -11, 34, 250, 29, 191, -84, 0, 85, 6, -72, -221, -108, 70, -13, -20, -27, -1, 24, 53, -179, -68, 42, 109, 175, -15, 55, -3, -63, -133, -204, 58, -115, -44, 27, 31, 35, -25, -86, -68, -50, 114, 17, -14, -45, 119, 22, -27, -76, 26, 130, -83, -34, 123, 18, 22, 25, -80, 251, 149, 47, -174, -133, -12, 108, 136, 164, -4, -172, -117, -61, 83, -33, -198, 72, 213, 91, 63, 34, 114, -68, -120, -172, 58, 27, 121, -45, 200, 183, 42, 162, 65, -30, -28, -26, -150, -12, -70, -128, -159, 71, 90, 108]
-64206A08j90j90L82n5k2k3Q1Q1j44j43K20m0O1O0M4M5j39j38n1K10k28L4J80q1qpj70R1P1
-64228C9P3j29j29R7R6J13j48O8O9p9p8N1N2p9p8O0N9n5n5q2J79L2L3o4o3Q3j78K4K4J37J38
-64251B10j19j19J1J2K5K6j53K83onj09j08jkj16L21m4m3j62R9LNK1K83k27L4j4j4j20J40
-64274A11r9r8K56j78K13m8j09j07J80J82n3n2j45j45K60j76K16m6jjk63J73j8j7RJ0j6j7
-64295B1J1J1j87K48LKJ8J8r7r6j38J25k3K38j11J52j10j10KJK47j90j8j8o2J99k2k1j35J25
-64318H3j02J58j36J27N1k10L4k27J68J67o8o6M8M9J96o6j84j83J8J7J07J06k5k4P4P5RRj17
-64339H8j16J5J3N5N5j1j1q2q1J30j30n0n1J36J34J2k49J33J32j52J08M3M4k30L1J5J5j9j9
-64361d2J11J11n2n2R6R5k29L3J6J6l7l7M5M5j54J05J07j55jkj7j7R2R3j25j25j9j9l5l6J96
$$ y = [108, -82, -272, 110, 55, 33, 10, 91, 172, 28, -115, 105, 65, 126, 186, 230, 275, 136, -2, -53, 157, -71, -37, 143, 62, 54, 47, -123, -32, 39, 112, -17, -146, -49, 47, 160, 12, 80, 149, 70, -8, 43, 95, 16, -62, -2, 57, 2, -53, -135, 44, 76, 109, 45, -18, 65, -113, -89, -65, 72, 210, 91, -28, -17, -5, 20, 46, -107, 176, 170, 165, 56, -52, -53, -55, -171, 150, 106, 63, -99, 0, 3, 8, 29, 312, 85, 119, 105, 91, -29, 111, 12, -86, 170, -8, 205, 157, 48, -59, 121, 303, 250, 198, 53, -92, 168, -8, 208, 162, 161, 160, -103, 70, 52, 35, 44, 54, 38, 21, 32, 43, -144, 104, 107, 109, 127, 145, 48, -48, -186, -61, -84, 154, 43, 195, 85, -25, -23, -22, 225, 35, 17, -1, -63, 136, 114, 93, -42, 83, -19, 139, 3, 130, 181, -29, 5, -222, -54, 113, 45, -21, 27, 76, 272, 206, 22, -161, -143, -126, -19, 87, 62, 38, 112, 187, 196, 205, 88, -28, -13, 0, 55, 110, 99, 88, 6, -75, 55, -75, -125, -176, -40, 94, 106, -143, -10, 122, -30, 78, 121, 165, -65, -34, -19, -4, -23, -42, 69, 180, 128, 76, 172, 267, 38, 71, 87, 103, 66, 29, 74, 119, -35, 70, 177, 22, 21, 19, 2, -15, 77, 170, 45, -80, -99, -118, -153, -189, 7]
-64385Go5n0K12j70R1K5K6j31j33J90J90j15J48j31j30Q6Q6m5m5J03J03j16j16O4O3o7o7K5
-64406C8K6kkJ69k67J24j36K4K5OQm2m4J04J04j57J03Q8Q8m5m4k08N3N6k05R0Q8O9P0p8p8
-64429B5J49j14j12J48r6r6J37J39p9p8N2N3kko8o6k9l0L7L5j27j29R0R1N7N7P3j87Q1Q2J48
-64452B39j15l5l5j71R0L24k87R0R0k98l7O1L22j63j63N5N4J86p6k23L8K10n2k48J87j71R0
-64473c8J17j44N8N7M1M2j22j22R6R6j20j20R8R8R2R3l70O5k6k6J16J15j5k76N1N0K45l65
-64494b14L54q2k0k1J82q1j69R2J74k62L6L6QRj3j4j4j3k2k2l9l8J12j50J29J28q9r0M2M1
-64516a0K1K3M9N0k87J49j4j5o9J91q6q5O2O1k1j9R1j69J08j53K79J7l15J21O9P0l4l4q0q2
-64539a12J31j30J4J4J44j16M7M6L1L0Q1Q1j16J46k83j9J10j50J41j19J90k45K9K9q0J81p5
$$ y = [7, -58, -108, 104, -66, 25, 50, 76, -55, -188, 2, 192, 77, 225, 94, -36, 50, 136, 91, 46, 149, 252, 136, 20, 84, 147, 80, 13, 38, 64, 62, 60, 229, -38, 86, -50, -26, -1, 5, 13, -29, -73, 31, 135, -22, 81, 169, 257, 212, 168, -40, 13, 69, -136, -46, 42, 111, 181, 103, 25, 174, 60, -52, 96, 0, -96, 41, 180, 101, 23, 75, 128, 126, 124, 56, -10, -39, -69, -32, 3, -124, -253, -163, -72, -15, 42, 115, -72, 9, 91, 239, 124, 89, 54, -117, -27, 297, 10, 100, 190, -108, -145, -84, 238, 75, -88, -33, 21, 207, 131, -92, -54, 156, 104, -144, 43, -128, -38, 79, -65, -7, 50, 91, 133, 11, -111, -15, 81, -39, -159, -61, 37, 129, 222, -148, -83, -109, -135, -19, 96, 81, -195, -144, -94, 151, -214, 140, 58, 38, 17, 199, 118, -51, 41, 215, -47, -11, 25, 33, 42, 29, 15, 1, -12, -34, -56, -95, -133, -21, -171, -42, 86, -3, -93, -51, -10, 11, 34, 83, 133, -154, -5, -19, -34, -103, 88, 2, -83, -21, 40, 19, 0, 91, -78, 30, -123, 156, 173, -142, -21, 48, 118, 84, 50, -30, -112, 19, -111, -97, -83, 61, -55, -8, 38, 69, 99, 180, 261, 145, 291, 8, -11, 99, -51, 90, -29, 161, -84, -55, -26, -106, 75, 0]
-64559@p5POL7L6r4J67j26J35K0k40j8j7K43j7n2n0P9j82Q3Q1J81k55p2p1N9N9j15L20p1p1
-64583a3q4l47K11K11j28J35LMj35J28k0k0K9K8M6M6j39J22J23j40q0q0l2l2klJ12J10j5k76
-64605b38n9K03L9L9Q2Q3j98K38k25K10k80J55o2o2JKJKJ3J4j39K97k80J58o2K00k19M3j05
-64627a49J57J0Rn4n6K01o1J53j10Q7j76J31j32j85K51j2j1O0O0k17M3NOOK68j37j37K6K7
-64649F3j57J03L9k22R9R8J6J7n7n8O1k00K96j39J04j55P0O9l9l9K10k25J9K0Q3Q4k10N0J05
-64671A05j57OOR0R1K5K5j67j66L4L5J81q1o4o4j3j3J19J17o3o3o4o4N9N9p2p2J18J17j00
-64693c6j01Q8Q7m3m3P0P1p7J85q5q5O3j99J70r0M0M0q2q3M9M8llllNNj43J20L7L6N3N3k1
-64719A20k1K42j95k02N8L3L2j32J28M8M7l5l5l5l5m3m3K2K3M0M1q8r0j1j0K29l3j96K39k2
$$ y = [0, -75, -68, -62, -25, 11, -83, 84, -42, 93, 113, -127, -145, -162, 81, 64, 12, -38, 41, -141, -58, 23, 204, -51, -123, -194, -135, -76, -191, 129, 58, -13, -97, -444, -233, -22, -150, -15, -12, -8, -143, -15, -35, -55, -26, 2, 48, 94, -45, 77, 200, 60, -20, -100, -132, -164, -166, -169, -57, 53, 38, -238, -297, -94, -55, -16, 66, 149, -49, 189, -36, 174, -106, 49, -13, -75, -74, -72, -71, -69, -56, -42, -181, 116, -164, -6, -68, 132, -87, -44, -149, 8, 18, 27, -27, -83, 118, 57, 210, 100, 187, 11, 142, 10, -175, 76, 64, 53, 113, 173, -44, -1, 4, 10, 16, 284, 147, 10, 36, 63, -94, 9, 48, -174, -75, 23, 39, 56, -1, -59, 2, -198, 98, -41, 63, -92, -22, 47, 8, -31, 179, -46, -27, -7, 76, 160, -50, 0, 105, -52, -46, -40, 50, 141, 166, 191, 24, -142, -108, -73, 108, 27, -37, -101, -114, -127, -8, 109, 46, -17, -81, -145, -86, -27, -99, -171, -53, 64, -36, -137, -49, 38, -5, -48, 22, 93, 16, 201, 116, 31, 94, -105, 65, -25, 15, 55, -27, -110, -61, -13, -16, -19, -22, -25, -20, -15, -158, -38, -1, 35, 88, 141, 120, 99, 341, 146, -56, 2, 35, 67, -65, 63, 111, 158, 123, 88, 53, 18, -25, -68, -46, -23, 17, 58, -30, -120, -131, -141, 88, 55, -141, 98, 76]
-64742G6k2m0l9J07j54J0Rj54J08M9M9%%j36j36J70J69p1p2M3M2J84p8k24L7J72r0QQOOJ53
-64766A90j09k0k0l6l6J1J2J0J1l4l5l5l6K0K0J66J68j83Q0o7o8K0K0N2k09m3K19p5p6O0N8
-64789C5J85m26O3O2J70q9N7N9N8k03J0Rk3k4J42j18q6L50j87j86K05n6N5N5p6p4o0K02k55
-64811a46J80l0k9o8o8nnK73J1n0n0O5j96J74q6J37J37l70O7J80k55K18m3n2n4J14J15j96
-64832c2K40j01j01P4P4j72Q8QPk9l0j27J34J28j34j82P9P6P6j85P7J53J55k23k22J47J45
-64852A23p2p2l2l3J14j47M1M1M0M1j12J48J49j14rj0j89P2J28j32M6M7j60J01J73k64K50
-64873A68j86M7M9q5J76j19J44j38j37K5K6j78Q5KLO6O6Q4Q3j89P1r1J70r4r2j43J19pK54
-64894A79l5k97J58J58k23L8J8J7l1l1J14J15j03j02l4l3j32J30J14j45K29l3m5m5o3o2J13
$$ y = [76, 54, 14, -25, 82, -72, -62, -53, -207, -99, -50, -1, -1, -1, -137, -273, -103, 66, -5, -77, -34, 8, 192, 114, -110, -73, 99, 9, 17, 25, 31, 37, 190, 81, 61, 41, 5, -31, -20, -8, 2, 13, -21, -56, -91, -127, -107, -87, 79, 247, 64, 144, 77, 9, 29, 49, 101, -108, -151, 68, -7, -83, -23, 35, 220, -206, -143, -81, 89, 0, 57, 116, 174, -29, -19, -10, -33, -57, 85, -33, -119, 231, 44, -142, 63, 7, 62, 117, 41, -33, -93, 109, -146, 34, 4, -25, -93, -161, -166, -171, 102, 113, 63, 13, 78, -118, 56, -30, 107, 244, -126, -59, 121, -134, 84, 41, -11, -65, 49, 164, -32, 208, 107, 6, 80, 154, -18, 70, 78, 85, 56, 26, -101, 33, 161, 27, -155, -76, 0, 76, -109, -32, 121, 276, 53, -169, -22, 123, 51, -21, -53, -86, 28, -119, -78, -37, 3, 44, -68, 80, 229, 115, 106, 96, -93, -21, 107, -25, 21, 68, -92, 9, 182, -82, 168, -18, 29, 78, -7, 169, 50, 194, 56, -81, -56, -30, -208, -123, -121, -118, -52, 14, 98, 181, -8, 63, -28, 142, 48, -44, -187, -68, -75, 179, 144, -153, 5, 163, -60, -22, -4, 13, -18, -49, 65, 180, 77, -25, -59, -92, -224, -94, 20, -125, 104, 71, 26, -19, -82, -144, -31]
-64915c1J11O9j92j69K67j24j25K23K24k29L3o2o3l5K26k55J81J00j62r0r0K59lM3M4J09j54
-64935A05l3l3J6J6K0K0j11j10O0N9j03J57J05j57PPPOJ55j08n1m9q4q3J83p6N3N2O6j95Q3
-64958a6j80K03n7PPO7O7q1p9J27j32N2N1k51L59j16j15N8N7j27J34j46K90p1p0R5R6j24j22
-64980a7l7l6R3j66J86p3rj0MLK15m6J49J50k55k54J85p6p5J86j00r8K7K6N3N3j3j2q1q2L16
-65004B06j21P1P0l01L10o0o0Jk61K01o0j1j1K20m1p4p4q4J76o3o3n5K07n0n0J8J7m8m7N1
-65026A4N3r3J66m4m4k8k7M1M2k4k4ppJ0Rj69R3K7K6n9K00k01N8ooJ1J0L1L0L1L1o8o8o1J99
-65052A46m3m3N5N6j95O5j6j5L9M0p0o8n9n8N0N1mnK52j0j05j04K21l9j41j39Q3Q3J8J8r0
-65076b7r1N3N4j43J19j20J43J91k45K0K0J39j21j2j1k8k8jjjjP2P2rj0Q7j75J83p7O5O6j03
$$ y = [-31, 80, 149, -43, -212, 55, -69, -194, 29, 253, 24, 57, -5, -68, -103, 123, -132, 49, 149, -13, -103, -193, 66, 63, 106, 150, 259, 105, 72, 39, 55, 71, 91, 111, 0, -110, -50, 9, -94, 63, 168, 11, 18, 25, 32, 38, 193, 85, 34, -15, -99, -182, 1, -75, -22, 30, 96, -99, -16, -196, 7, -50, -43, -36, 31, 98, 17, -62, 65, -67, -15, 36, -215, 144, 28, -87, -29, 28, -99, 35, -111, 179, 108, 38, 133, 229, 105, -17, -54, -90, 3, -163, 23, -50, -59, -69, -65, -62, 153, 107, 256, 406, 151, -103, 82, 6, -69, 117, 17, -81, -54, -28, 25, 78, 65, 53, -28, -110, 206, 85, 156, 226, -75, 235, 175, 115, 116, -145, 56, -4, -15, -26, 194, 153, 79, 5, -79, 97, 34, -29, -84, 123, 73, 23, 41, 58, 10, -37, 14, 67, -26, 140, 96, 52, 24, -3, 38, 80, 56, 32, 25, 18, 28, 37, -132, -39, -12, 14, -45, 155, -46, 12, 6, 0, 11, 21, 52, 82, 113, 144, 76, 8, -53, 146, 103, 60, 115, 171, -24, 41, 25, 10, 49, 89, 19, -49, -108, -166, -116, -65, -69, -74, 178, 168, 63, -41, 180, 141, 0, -139, -56, 27, 45, 63, -27, -118, -65, -11, -154, -35, -155, -12, 179, -66, -46, -26, 113, -8, -20, -31, -59, -87, -88, -89, -90, -91, -19, 53, 44, 34, 121, -54, 129, 52, 117, 183, 80]
-65100H0j03M8M9M9M9n3n4R4j67K7K7K8K7j26J35j59J02M2M3l4l4n5K08r3r2r0r1R0Q9J59
-65123A95j03J54k82j17J46k9k9j1j1Q7j75nK57m3m2j21J41pnl8l8M4M3q7J73o7o6J24l10
-65144b22K01K01j75K62j21j21j40J20N5N5j58J01l27J08L97k14j42J20K5K7o6o6PPJ53j06
-65164a9p1p1ONK15m5p8p9L37r9l4l3j70R1K87l23n0m9L27j10k05N6K35j99J26J27j41J22
-65185A58k03N8J0J0J73k62M7M7q1q1K72j63j6j7OOJ32j28J81k53J50j10k9K32k7k8j0j1l0
-65207C3l0m5m6J33j26j8K43R6R6l18n6K0J9K82j55k1k1m8m7J2J2r5J64K30k07r8r7J19J19
-65229A50j64R6J36l00P0O9j86j87R7L58j67R3k81J54K3K3M8N0JJN5k06J59k77L05j29K3K4
-65250C8j50J11N4N4P7l60R6R4p8J82m3m3K3K2J5k47N2N3rrrrQ3Q2p1o9M8M7j7j7k2k3M3M2
$$ y = [80, -23, 25, 74, 123, 172, 119, 65, 159, -8, 19, 46, 74, 101, -25, 110, -49, 53, 95, 138, 104, 70, 15, 223, 130, 38, -52, -143, -53, 36, 195, 92, 246, -36, -153, -7, -36, -65, -76, -87, 0, -175, -180, 77, 34, -8, -129, 12, 5, 0, -38, -76, -32, 11, -76, 97, 30, -36, 88, -222, -21, 180, 5, 267, 146, 25, -115, 5, 60, 115, -43, 58, -269, -161, 236, 22, -120, 0, 25, 52, -14, -80, -73, -66, 87, -19, -90, -161, -155, -150, 65, 20, -58, -137, 200, 101, 67, 34, -136, -45, 242, -81, -131, -180, 147, 37, -168, -112, 123, -76, 50, 177, 36, 158, -45, 13, 23, 33, 206, -56, -9, 38, -43, -124, 148, -15, -31, -48, -42, -36, 96, -32, 149, -104, 46, -64, -93, 139, 112, 84, 74, 63, 33, 3, -42, -88, 45, -81, -99, 144, 240, 336, 18, -38, -18, 1, 283, 128, 107, 86, 38, -9, 3, 15, -80, 84, 314, 107, 9, -88, 31, 150, -14, 82, 218, -82, -12, 57, -129, -316, -219, 139, -28, 65, -216, -62, -39, -16, 32, 82, 83, 84, 139, -67, 92, -185, 120, -9, 14, 38, -112, -1, 53, 107, 184, -176, -80, 14, -64, 118, 75, 32, 55, 77, 92, -155, -103, -50, -59, -68, -77, -86, -3, 79, 8, -61, -13, 34, 17, 0, -22, -45, -2, 40]
-65275D0j1j1N5N4q1q1J14J14L5L4k65mP5P5j32j31L01j35j28j29J73J71k14M7K0J8L6L5m3
-65297C2m3m3m4N8N8r4r5J61J59j49j51rK53j33j34J47J46o6o5O8j93q4J78L8L8L8L9J20j42
-65319H8j40J19r6r7P3P1qrqrM5M6o3o2J7J7k45J92J46j14oom7m6q4J77klJ4J4l0k9k9l0M7
-65345i7M8M7M6j6j6l2l2J00j60O9O8j86P5J84p8k4k4J39J39k93J42j01j03L3L2L3L2j6j4
-65367ej5j5J06J08j27j27J45j15J5J5J31j29JJJ37j25J86p5j30J31j78Q1opJ0RK2K2m3m3
-65390b0k7k8m3K17n3n2l7l7k2k2l8K23K6K6k68J67M6M7n7n6QQP4P5n2n2n1n1K9K8K9K9ON
-65415G7NOK8K9j03j02mmM5M4O1k00J42j18J32j28j5j5J74q6O0O0J0J1j20J40j73Q7m3m2J4
-65439b8J5R5j65J08J09j26j26N6N6N6N6n6n5n6n6L6L5j12J51j0rj0rJ10j50Q8Q9k50J85Q8
$$ y = [40, 29, 18, 73, 127, 46, -35, 79, 193, 228, 262, -3, -7, 68, 143, 11, -120, 181, 46, -82, -211, -38, 133, -81, -34, -14, 4, 40, 75, 32, -11, -54, -98, -40, 18, -76, -171, -10, 149, 0, -151, -160, 93, -40, -174, -27, 119, 53, -12, 56, -137, -221, -43, -5, 33, 71, 110, 230, 88, -52, 67, -29, -126, -53, 18, 10, 1, -7, -16, 29, 75, 12, -50, -33, -16, -261, -69, 77, -37, -43, -49, -96, -142, -226, -49, -51, -54, -40, -26, -56, -85, -114, -144, -97, -49, -2, 44, 28, 12, -20, -52, 48, -112, -43, 25, -161, -86, 98, 20, -4, -28, 111, 250, -43, 99, -2, -105, -72, -40, -7, 25, 9, -5, -20, -35, 71, 179, 52, -75, 70, -45, -30, -15, 116, -13, -12, -11, 126, 1, 187, 112, -18, 113, -65, 16, 10, 3, 13, 22, 44, 66, 23, -20, -47, -75, -118, 99, 46, -6, -43, -80, -102, -124, -162, 61, 87, 113, -155, 12, 58, 105, 48, -8, 0, 8, 82, 157, 105, 53, 2, -49, -20, 8, 37, 66, 72, 77, 82, 88, 116, 145, 42, -60, -64, -68, -23, 21, 82, -118, 24, -94, 38, -90, -105, -120, 54, -32, 28, 88, 98, 109, -11, 129, -44, 43, 0, -42, -28, -13, 82, -83, 25, 134, 8, -118, -62, -6, 50, 106, 50, -5, -61, -117, -81, -46, -158, -7, -17, -26, -36, -45, 65, -85, 3, 92, -158, 27, 115]
-65461A15Q8j58J05k87J47j7j8K5K5j25J35J37j26j23j25L23j13p7p7K06k29J26J25J54j09
-65480A27k56L54j69R3J9k43N2N1Q9Q9j30j29O0O2o9p0J00J02k64kP6P6R3R3j66j64J99o2
-65501A1L0L1kkK4k37K74J3j20j20R8R6k14M7J17J18n9n8rrL2k30r9J63J28J29m6m6k05K31
-65524H6K32k05K2K1j37j35N3N4p7p8N1N1L5L3O5j96Q2Q0o7o9O2O2q3q4J35J34j32j33J45
-65546Gj16O6O6q0q2J10J10j08j09J31J30k35K7N5N5J10J10l79K32j76K58p7l39J03J03J59
-65565A31j02m6m7l7K23l2l2j6j6J%p1J89j69j70K84K3j73Q8OPOPJ28j33L0L0j05J57j00r9
-65589c8J8J7J6J8o5o6J46j14llj5K48l4l3o6o5n1K10j17j15j41J21N5N6q7J74n4K08q0q0
-65611F0o2o4M8M7l4l4J66r6r5J66kjl28K82r9j00M8L09k28L3J32j31j12J49l1k9K44j7k51
$$ y = [115, 203, 45, 150, -137, 10, -7, -25, 0, 25, -100, 35, 172, 46, -77, -202, 121, 8, -69, -146, 60, -169, -43, 82, 236, 127, -129, 225, 56, 149, 168, -75, -23, 28, 117, 206, 76, -53, 7, 69, 0, -70, 30, 132, -132, -134, -58, 18, 111, 204, 38, -126, 73, 11, 41, 72, 70, 68, 92, -145, 129, 142, 22, -98, 0, 96, -118, -71, 46, 164, 105, 47, 38, 29, 61, -169, -268, -105, 23, 152, 106, 60, -145, 86, 318, 113, 135, 156, 19, -116, -63, -9, -86, -164, -113, -62, -27, 6, 71, -125, -43, 37, -30, -99, -37, 25, -58, -142, -7, 127, -5, -138, 7, -109, -43, 23, -57, -139, -29, 81, -27, -136, -5, 125, -110, -83, -28, 27, 137, 247, -132, 100, -76, 182, 105, -234, -131, -28, 131, 29, -17, -64, -101, 122, 90, 58, 42, 26, 27, 27, -44, 145, -24, -194, 90, 113, -60, 28, 34, 41, 47, 54, 182, 49, 79, 109, 4, 161, 61, -38, -20, -3, 13, 31, -34, -100, 46, -68, -71, -74, -89, 159, 125, 92, 26, -39, -90, 120, 3, -112, -253, -132, -77, -21, -108, 66, 12, 220, 140, 60, -2, -66, -18, 29, -5, -39, 127, 31, -64, 102, 100, 99, -229, 53, -46, -146, -98, 211, -17, 16, 148, 17, -95, 54, 23, -6, 238, 221, -30]
-65633c0J85k41K0qpJ96o5p0p1O7O7m2m2k4k5n2n2K85j51K8K9l2l2P7P7mnk1k1J19j43k41
-65657b29J95l2l1J18j3J40j23O6O6K7k33r8J63k31K05LJ33j23k52L08J77r4k24J27mj81Q1
-65677e9R1l8P3j87K54j81P3n5J53j09j29J31j6j5j9K41k40K1j00L1M8q4n5n5J34J32QPj01
-65699d6j02M8M8M8M7o0o0o1o1J51J50r0q8j4j4J33j27J15J16jk63J47J7l4l5J9J9J67r5j2
-65722F2j2J03j58J07j52K87j48J2J3j13J49O3k00JJ31m8m9Q0j81J90k46K67Nk09K27j00r9
-65742a8J1RJ1J0m8m8O0O0n2n3P1P3j74Q7P6P6R4j68j67R3L1L0Q5j76k0k0p4J87mlJ50k86
-65766i7QQk00K38P5P6n0m9l5l6qrk20K16J17j43M9M8R7R8p9p8O9j93P5P3l5l3j50J12J11
-65790E5j49Q9Q8J28j35j62R9j28J32j22J39K5K4r1J69j31j30K0J9K0K0O9P0j59J02k28K07
$$ y = [-30, 155, -86, -66, -74, -81, 115, 50, -20, -91, -24, 43, 1, -41, -65, -90, -142, -194, 91, -60, -32, -3, -35, -67, 10, 87, 83, 78, 57, 36, 155, 12, -229, -34, -66, -97, 21, 8, 148, 25, 91, 157, 184, -49, -147, 16, -215, -10, -7, 126, 3, -249, 59, 236, 142, -82, 45, 41, -140, -59, 32, -6, 67, -120, 134, -47, 26, -29, 124, 15, -114, 17, 1, -14, -33, 208, -32, -11, -111, -80, -32, -116, -171, -226, -92, 40, 48, 55, -46, -148, -100, -52, -4, 43, -17, -77, -138, -199, -48, 102, 12, -76, -90, -104, 29, -98, 17, 133, 132, -131, 16, 33, -1, -36, -17, 2, 169, 74, 62, 50, 153, -5, 102, -50, 237, 89, 101, 114, 1, 150, 213, 13, 14, 145, 97, 48, 128, -53, 137, -109, 158, 163, -46, 181, 81, -18, -7, 2, 13, 23, -25, -73, -13, 47, -5, -58, 13, 86, -88, -1, 75, 151, 245, 77, -90, 3, 34, 64, 149, -27, -47, -67, -141, 46, 42, 39, 189, -97, -89, -81, -281, -43, 32, 108, 58, 9, -26, -62, -70, -79, -299, -83, 34, -109, -60, -12, 85, 183, 104, 26, 95, -98, -23, 50, 15, -18, -168, -56, 55, -94, -5, 83, 211, 76, -86, 13, -115, 17, -105, 34, 59, 83, -8, 161, 30, -100, -80, -61, -41, -21, 48, 118, -41, 61, -167, 40]
-65810D0k1k1m6m6K81l30J54j07KKP4P3l6l4L3L5j94O7M7k15K49j2K2K2j89P2o4J98J34j29
-65832F1N5k06L4L4l7l7n3n3J98o6J64J64k59JN1N1j09j10k8k8Q3L44Lj27j80Q0L5L5m5m6
-65855IM4q6j43J19L0K8M6M6o3o2L2L0p7p8L9M0L9L9k3k1k2k2K6K6M1M3k19M2J04k5k62J74
-65879a06P4P3ppppPQn7K03q0J82k57MQ1n1j15J45K6j05oJ23j74Q6P8j82R2j67J16J14p8p7
-65903g1J61J63j29j27M8q1k99L14Pj23K30k04K4K4j0j41K32k7l5l4J04j57O7J96j92O9ml
-65924BR6j67P2P2R4j68m7m8M5M5Q2Q3n4n4K08k29R9j62J1J2q8J75l1l2p9q0N2N1N1N2n7n5
-65948d9J89k47M0L9j36J27k6k6K29l1j71K64k36K5j80Q3J79q0o2J99j76Q5j27j28J62j00
-65968a54L23j12N1N1r3r3M2M3j83K52n8n9L3L4j63R8j38J23j55J07Q5Q6j10J52j40j40K30
$$ y = [40, 19, -2, -48, -94, 187, -143, 11, -96, -94, -92, -18, 55, 19, -15, 18, 53, -141, -74, -27, -242, 7, -5, 17, 39, -150, -78, -142, 56, 190, 61, 116, -90, -56, -22, -59, -96, -149, -202, -4, -70, 94, 258, -1, 0, 51, 102, -7, -117, -145, -173, -90, 254, 257, 130, -50, 30, 65, 100, 55, 9, 53, -33, -176, -57, -27, 1, 47, 93, 30, -32, 0, 30, -47, -125, -86, -46, -7, 32, 9, -12, -34, -56, -30, -4, 37, 80, -139, -97, 7, -18, -280, -106, -32, 41, 34, 27, 20, 13, 20, 28, -29, 174, 94, 276, 19, 23, 104, 53, -62, 83, 109, 4, -2, 121, -53, 33, 111, -71, 21, -146, -30, 84, 6, -71, 90, 253, 124, -3, 45, -36, -335, -21, -14, -137, 93, -111, -87, -63, -73, -214, 18, -9, -44, -78, 26, -131, -64, 132, -60, 9, 5, 2, 98, -69, 3, 75, 169, 1, -46, -94, -49, -4, 78, 161, 107, 53, 261, 32, 131, -31, -20, -8, -96, 79, 48, 16, -63, -143, -91, -40, 11, 63, 6, -49, 140, -107, -67, -28, -164, -37, -63, -89, 140, 109, -62, 202, -34, -9, -189, -106, 73, -7, -69, 130, -46, 39, -88, -216, -54, -154, 169, 57, 108, 159, 66, -27, 15, 58, -125, 127, 69, 10, 43, 77, -86, 12, -126, -3, -158, -51, 34, 120, 10, 162, 22, -118, 112]
-65988A12k04R4R6p8J83r7r7j18J42jkJ68k68L12j25R4R4j03j04k2k2k03N9J06J08N2N1j61
-66009F6j60J29j32J5J6Q2Q4k27K08k8k8%%J6J6L2L3j77Q3KKnnj40K95o7o6j47j49J55J54
-66033E7KKl6l5K19m1n0n0j7j7O9j92O3O3j29j30J37J36Q7j75j65K71m0l8j93K44klj54K81
-66055A64r1r1M5M5j6j6j7j6mlp0p0J06J04J2k49J78J79j38J24j70j68N9O0J76k59K26l6J18
-66077A82j45p8p9L8L7j10J51L4L4j4j5n1n1J4J4O5O5j46J14K8K7o5o4R5R5k20M2Q2j77N0
-66100d8N0j4j6J15j45J39j21J56j06k3k4j23J40J3J1r5r7K06n4K7K6m6m7J9J8m1m2N1N1k31
-66122b51K05K05k31R7R7k29L2j7j7j%L7L7k8k8P2P2j83P8J26J26k39K3R4j66k0K42j79j79
-66144b25J87p5K91L0l03J33n0n0K6K7J54j06j21J38R8j63%%n3n4P8P7l8l8j20J42j0j0PP
$$ y = [112, -92, 2, 98, 20, 203, 106, 9, -109, 33, 32, 30, 198, -70, 242, 117, 211, 305, 202, 98, 76, 54, -149, -90, 16, 124, 176, 227, 66, -94, 35, -97, -82, -66, 16, 100, -127, 81, 53, 25, 25, 25, 41, 57, 89, 122, -55, 28, 30, 32, 27, 22, -118, 177, 110, 44, -103, -252, -97, 57, 59, 61, 25, -10, 209, 168, 118, 68, 51, 34, 103, -89, -26, 37, -92, -222, -85, 51, 138, -37, -202, 69, 29, -9, -202, 42, 40, 37, -117, 164, 73, -18, 27, 72, 56, 40, 23, 7, 3, 0, -70, -140, -34, 70, 82, -167, 11, 190, 52, 176, 6, -162, -103, -43, 133, -126, 100, 64, 182, 37, -41, -120, -82, -45, -155, -4, 30, 64, 50, 35, -16, -67, -53, -39, 26, 91, -55, 59, 87, 114, 49, -15, 80, 175, -45, -3, 79, -98, -48, 2, -12, -28, 87, -58, 81, -40, 116, 10, -13, -37, -160, -20, -7, 4, -91, -188, 18, -36, -9, 17, -29, -76, -57, -39, -80, -122, -71, -20, -251, -46, 159, -72, 25, 122, -107, -75, -92, -109, -110, -110, -73, -36, -64, -92, -20, 52, -131, -53, 73, 199, -40, -17, 77, -89, -109, 133, -46, -225, -38, -113, 178, 208, -95, 38, -12, -62, -36, -9, 145, 39, -82, 56, 154, -9, -9, -9, -62, -116, -38, 39, 1, -37, -157, -15, -25, -35, -28, -21]
-66167b1N6N7n8n6j64R8m9n0O3O3K09n2J0J1J1J1j20J43Q2l54K59j76M1M1k0j9mmj21J39p2
-66190d6p3O0O0p0p0L7L8J84p8J3J3J3J3j42J18n5n5K94j43k8k8j5j4N1N1rqj07J56Qk54K04
-66214A18n8k07N5K1K2J6J6Q1Q2o2o1MMn2n3O7j95L36j00j64R7Q1j79j6K45j43J18p7p8k5
-66237a07k5K20k15J37J38j09j07noO0N9QQL5L5l16J20J52j09K7K5l8l9q0J81l1l0Q4Q4o3
-66259I3o3K6k35M2M2P4P3P4P3q6q6P2P3k77J59j67R4N6N8R0j73KJj5j4KLO7O8j08j08K3K2
-66284d5k2k3J08j53K77J7n5n5j28J32j4j4MMj43J18k8k9J33j26lmlmj34J28J26j33M4M3K8
-66308D6K7LLj43J17L6L5r5r4J66r5r5J66j7j7J6k46N8N8k4k3Q9Q9m2m1j3j3j3j3Q2Q3j94
-66332a04O7o5o4K29l1l1k9m7m7Q6Q5m5m5NNk08N4J54J52j34j36J11J11k0k0l0l0L4L5q1q2
$$ y = [-21, 35, 92, 34, -22, -186, -88, -137, -187, -124, -61, 148, 96, 106, 117, 128, 139, 19, 162, 244, -110, 149, -27, 14, 55, 35, 16, 12, 8, -113, 26, -46, -119, -59, 1, -69, -139, -102, -64, 120, 42, 55, 68, 81, 94, -48, 70, 15, -40, 254, 111, 83, 55, 40, 26, 77, 128, 119, 111, 4, 160, 168, -86, 118, 60, -147, -92, -71, -49, -33, -17, 64, 146, 84, 23, 27, 31, -21, -74, -7, -202, 134, 34, -130, -33, 48, -131, -147, 98, -45, 73, -4, -82, -107, -132, 88, -127, 10, 148, 39, -68, -73, -79, -19, 40, 48, 56, 91, 126, -190, -70, 82, -27, 0, 25, -13, -52, -132, 49, 18, -12, 72, 156, 93, 30, 56, -179, -137, -95, -21, 52, 126, 199, 113, 27, 99, 172, -105, 54, -113, -19, 37, 95, 185, 12, 14, 15, 0, -14, -12, -9, 58, 126, 18, -90, -67, -45, -67, -90, 18, -135, 142, 159, 104, 49, -79, 53, 39, 25, 29, 33, -110, 8, -20, -49, 84, -42, -45, -49, -52, -56, -190, -62, 64, -69, -25, 18, 46, 73, 76, 79, -64, 53, 89, 124, 29, -65, 101, 6, -89, 77, 60, 43, 59, -187, -129, -71, -95, -118, -29, 60, 18, -23, -36, -49, -62, -75, 7, 90, -104, -37, -102, -166, 63, 32, 1, -28, -75, -122, -36, 49, 4, -41, -36, -31, -239, -185, -31, 121, -13, -149, -38, 73, 53, 33, 3, -27, 7, 42, -39, -121]
-66355a21J30j29N7N8m1m1J24j36R2R2j88P3p4J87k36K5J29J29k25L6J23J24k41K1K38k3j50
-66375C3j49N2N2J9K0m4m6l6l6R6R4n6n6J06j53p6J86r7J64k61J75n5n5J29J29P6j88j16J43
-66397E0q3q5J02J02j32j33K57nj35J25j6j6j29j31J71J70j93O7j9j8K26l5j05J57j55J08
-66417A45j50j50K58lk90J47J62r9o0o2K01o1j14j15J03J03j09J52Q7j74K5K4l9m1j18J43
-66436c5j56K79j80K55k40K1O3O5j20j21q4J78l5l5O2O2O1j99J59j02K9K9MNMMK2K1K2K2k4
-66460C6k5k3k4j1j0J48J48l74O3L5L5j1j1o0o0o4J99j14J48R0j72K36k00m0m1O4O2J5J5J07
-66482A61J08l02J32L6k26L4L4J7J7M5M5q6q6O3O2rk69l6l6K97L5J68r4r4r3O0N9onPOK4k38
-66507a70P6P7R2j69jK60j21j20J18J19j86j86R8R8l3l4J08J09L8k23q5q5J34J33k18M3K07
$$ y = [-121, 9, -120, -63, -5, -46, -87, 37, -99, -7, 85, -103, -30, -104, 83, -153, -128, 1, 130, -95, -59, 64, 188, -53, -32, 206, 183, 33, -116, -64, -12, 7, 27, -17, -63, -99, -135, -39, 55, -1, -57, 49, -104, -180, 6, -91, 73, -188, -13, -68, -123, 6, 135, 211, 23, -93, 50, -33, -118, -16, 86, -46, -179, 78, 73, -62, 63, 47, 31, -98, -229, -58, 112, -81, -14, -33, -51, 175, 140, 35, 192, 37, 145, -5, -155, 103, 100, -190, -43, 119, 20, -40, -102, 99, 38, -76, -191, -88, 15, -94, 58, 145, -29, -4, 20, -19, -60, -178, -35, -191, 88, -92, 163, -77, -56, 7, 72, -48, -169, -253, -75, -110, -145, -83, -21, 40, -159, 0, -102, -73, -44, -40, -35, -31, -27, -5, 16, 38, 60, 36, 11, -12, -36, -47, -57, 91, 239, -135, -72, -37, -2, -13, -24, -84, -144, -208, -9, -123, 25, 115, -57, 179, -21, -61, -102, -38, 24, 39, 54, 161, 269, -33, 99, 135, -91, -57, -23, -6, 11, 56, 101, 15, -71, -8, 54, 45, -224, -260, -296, 1, 36, 204, 110, 16, -77, -17, 42, 36, 31, 38, 44, 68, -170, -94, -17, 75, -94, -95, 165, 44, -76, 42, 161, -25, -211, -113, -15, -48, -82, 26, 135, 173, -50, -135, -220, -86, 47, -171, -128, 79]
-66527G9k29P9P7j4j4J07J09j27j25K34k7j0j1p3p2p3p4J11J09k0k1l3l5J5J5R9j61N1N0K
-66550A8Kj5j3J15j45KKj7j8J29j31o0o1oK55K1K2k57NJ46j16J78q2J70r1j07J53p5p5Q8j73
-66573a36K0K0J18J18R1j71j70R1M9N1m8m8n4K06j41j42j2K49k9k8O6O7j29J32k61%J6J7r8
-66595a56J63J7J7k9k9J34j27r3J68J53j09k6k6m3m1K0K0k19M2K92j44M6k15j%K60%j34j34
-66617a94K14m6L0L2J5J5k6k6k5k5J1J1J73q7j48J13jkN5k06P1P0jjO5O4j6j6q2q1O5O6o5
-66642B2o5N5N6N6N6p8p8r4J67m4m3J03J04j64j63J13j46mlR5R4P5j87R0R2l8l7K8K8k9k9
-66665C2L6L7p6p4M0L8P9j82j34L02k70j0J65r7PK68L4k27q1q1K51j0J03j58J19j41KKJ98
-66687A72o3K3K3j25j24P6P4N9N9j5k76Q9Q9p6p6r2J69P6P7l8l8k7k7J04J04j20j19J1J1n2
$$ y = [79, -150, -71, 6, -8, -22, 85, 194, 67, -58, 176, 149, 139, 128, 55, -17, -90, -164, -53, 56, 36, 15, -18, -53, -38, -23, 76, -85, -34, 16, 18, 20, 5, -8, 107, -38, -36, -34, -51, -69, 60, -71, -131, -192, -198, 57, 78, 100, -157, -152, -6, -122, 56, -26, 144, 53, -54, 99, 24, -51, 37, -136, -116, -96, 22, 140, 231, 60, -110, -19, 30, 81, 33, -15, -69, 137, -4, -146, -158, 91, 62, 34, 100, 167, 38, 170, -91, -91, -75, -58, -156, 7, 24, 41, 12, -17, 117, -10, -103, 65, 218, 109, 83, 57, 14, -27, -7, 13, -206, -164, 128, -16, 30, -185, -186, -186, 74, 74, -60, -194, 20, -26, 4, 36, 51, 66, 40, 14, -11, -36, -25, -14, 159, 72, -76, 37, 36, 34, 89, -117, -46, 24, 23, 22, 87, 151, 135, 119, 37, -44, 21, 87, 22, -43, 12, 68, 124, 180, 102, 24, -70, 97, 53, 10, 113, 217, 53, -110, 3, -143, -147, -150, -55, 39, 114, -73, 17, 109, 71, 34, 62, 90, 61, 32, 68, 105, 29, -45, -5, 33, 112, -70, -204, 98, -172, -182, -17, -114, -107, 161, 195, -32, -113, -194, 57, 47, 150, -8, 111, -30, -28, -26, 172, 109, 132, 155, 30, -94, -18, 56, 115, 174, 159, -117, -28, 61, -15, -91, -183, -14, 62, 139, 101, 63, 36, 9, 113, 217, 97, -22, -11, 0, -52]
-66710e2n3N2N1J56k80j49K87m6m7O3O2j91P1N5N3J5J5j97O4ooJ1J1L4L3j94K41j96O6K7K8
-66733b2p2J90q8q7j4j5j4K47k35K6m0l9O8O9o3o3O2O2q6q6J35j27J68r4J07J07k4k4j13J47
-66756H2j46j47K62Jl16J21Q0P9l9m1J76q6Q9Q9k36J99J9K0j57j56O2O1MNk08N4N5N6m2m3
-66778a03j34J28J11j49K57mr1r0L5L6L5L5o1o1MMQ5Q6j59j60K76j59K0K0n2n3L24j12k7k6
-66801A5n3n4m2m1K36k5M4M5l8l7o1o3j2j3J65r6N0N1j65j66J40J39k4k5k6k5M8M8M8M8pp
-66825I7l4l4J74k61Q6Q8J49k87K3K4J4J4J4J4N8N8p3p3l6l6K9K9k1k0k1k1L8L7l06L05J6
$$ y = [-52, -105, -53, -2, 154, -126, -275, 12, -34, -81, -18, 44, -147, -76, -21, 32, 47, 62, -135, -71, -77, -83, -72, -61, -27, 6, -188, 53, -143, -77, -50, -22, -94, 96, 8, -79, -93, -108, -122, 125, -110, -84, -124, -163, -95, -26, -89, -152, -90, -28, -114, -200, -65, -192, -24, -118, -11, 96, 72, 48, -65, 82, -64, -211, 51, 52, -264, -143, -63, 16, -23, -64, 112, 26, 115, 204, -32, 167, 186, 206, 49, -107, -45, 16, 20, 25, -183, -129, -74, -18, -60, -103, -237, -109, 2, -147, 110, 106, 15, -75, -40, -4, 31, 66, 5, -56, -52, -48, 37, 123, -36, -196, 80, -79, -59, -39, -91, -144, 180, 68, 41, 15, -38, -92, -134, -175, 61, 36, 80, 125, 87, 50, -11, -74, -86, -99, 66, -30, 20, 71, -94, -260, -120, 19, -5, -30, -56, -81, -33, 15, 63, 111, 104, 97, 63, 29, 203, -58, 28, 116, 265, -22, 1, 25, 39, 53, 67, 81, 139, 197, 124, 51, 15, -21, 8, 37, 16, -4, -25, -46, -8, 29, -277, 28, 44]
$$ [...]
-94855I
##END=	
##END=	
