##TITLE=	(1) kmi-TMSCCIPhOTf.40.fid



(2)  #1
##JCAMP-DX=	6.0	$$ MestReNova 14.1.1-24571
##DATA TYPE=	LINK
##BLOCK_ID=	1
##BLOCKS=	2    
##ORIGIN=	Mestrelab Research S.L.
##OWNER=	hrzepa
##$MNOVA/LINK_BLOCK_TYPE=	PAGE
##TITLE=	 #1
##JCAMP-DX=	6.0	$$ MestReNova 14.1.1-24571
##DATA TYPE=	LINK
##BLOCK_ID=	2
##BLOCKS=	1    
##ORIGIN=	Mestrelab Research S.L.
##OWNER=	hrzepa
##$MNOVA/LINK_BLOCK_TYPE=	ITEM	$$ Molecule
##$MNOVA/ITEM/POLYGON=	(XY..XY)
5557,6071
6512.09,6071
6512.09,6630.03
5557,6630.03
5557,6071
##$MNOVA/ITEM/Z=	1
##$MNOVA/ITEM/ANGLE=	0
##TITLE=	
##JCAMP-CS=	3.7	$$ MestReNova 14.1.1-24571
##ORIGIN=	Mestrelab Research S.L.
##OWNER=	hrzepa
##BLOCK_ID=	3
##NAMES=	
##ATOMLIST=	
$$ AN	AS	NH
	1	C	 
	2	C	 
	3	I	 
	4	C	 
	5	C	1
	6	C	1
	7	C	1
	8	C	1
	9	C	1
	10	Si	 
	11	C	3
	12	C	3
	13	C	3
	14	O	 
	15	S	 
	16	O	 
	17	O	 
	18	C	 
	19	F	 
	20	F	 
	21	F	 
##BONDLIST=	
$$ AN1	AN2	BT
	1	2	T
	1	10	S
	2	3	S
	3	4	S
	3	14	S
	4	5	D
	5	6	S
	6	7	D
	7	8	S
	8	9	D
	9	4	S
	10	11	S
	10	12	S
	10	13	S
	18	21	S
	18	20	S
	18	15	S
	18	19	S
	15	17	D
	15	16	D
	14	15	S
##MAXRASTER=	32768
##XY_RASTER=	
$$ AN	X	Y	Z
	1	15292	3200	0
	2	6554	3200	0
	3	-2182	3200	0
	4	-6554	-4369	0
	5	-2182	-11937	0
	6	-6554	-19500	0
	7	-15292	-19500	0
	8	-19658	-11937	0
	9	-15292	-4369	0
	10	24029	3200	0
	11	28395	10761	0
	12	32767	3200	0
	13	28395	-4369	0
	14	-6554	10761	0
	15	-15292	10761	0
	16	-15292	2024	0
	17	-15292	19500	0
	18	-24029	10761	0
	19	-28395	18331	0
	20	-28395	3200	0
	21	-32767	10761	0
##END=	
##END=	
##TITLE=	kmi-TMSCCIPhOTf.40.fid


##JCAMP-DX=	6.0	$$ MestReNova 14.1.1-24571
##DATA TYPE=	LINK
##BLOCK_ID=	4
##BLOCKS=	1    
##ORIGIN=	Mestrelab Research S.L.
##OWNER=	hrzepa
##$MNOVA/LINK_BLOCK_TYPE=	ITEM	$$ NMR Spectrum
##$MNOVA/ITEM/POLYGON=	(XY..XY)
5321,5835
8722,5835
8722,8208
5321,8208
5321,5835
##$MNOVA/ITEM/Z=	0
##$MNOVA/ITEM/ANGLE=	0
##TITLE=	kmi-TMSCCIPhOTf.40.fid
##JCAMP-DX=	6.0	$$ MestReNova 14.1.1-24571
##BLOCK_ID=	5
##DATA TYPE=	NMR SPECTRUM
##DATA CLASS=	XYDATA
##NUMDIM=	1
##ORIGIN=	Bruker BioSpin GmbH
##OWNER=	root
##.OBSERVE FREQUENCY=	500.13308850747802126
##.OBSERVE NUCLEUS=	^1H
##.SOLVENT NAME=	CDCl3
##.PULSE SEQUENCE=	zg30
##LONGDATE=	2021/11/26 20:15:00.000
##.ACQUISITIONMODE=	SIMULTANEOUS (DQD)
##$ORIGINAL FORMAT=	Bruker XWIN-NMR
##$MNOVA/SCALES_VERSION=	9
##$PARAMETER FILE=	(acqus, ASCII, /Users/hrzepa/Library/Mobile%20Documents/com~apple~CloudDocs/C2/Pure%20samples/kmi-TMSCCIPhOTf/phenyl((trimethylsilyl)ethynyl)-%CE%BB3-iodaneyl%20trifluoromethanesulfonate/acqus, 0)
$$ ##TITLE= Parameter file, TOPSPIN		Version 3.2
$$ ##JCAMPDX= 5.0
$$ ##DATATYPE= Parameter Values
$$ ##NPOINTS= 1	$$ modification sequence number
$$ ##ORIGIN= Bruker BioSpin GmbH
$$ ##OWNER= root
$$ $$ 2021-11-26 20:15:04.369 +0900  root@CZC31189P3
$$ $$ Z:/miyamoto/kmi-tmSCCIPhOTf-1/40/acqus
$$ $$ process C:\Bruker\TopSpin3.2\prog\mod\dirdata.exe
$$ ##$ACQT0= -2.52100840336134
$$ ##$AMP= (0..31)
$$ 100 100 100 100 100 100 100 100 100 100 100 100 100 100 100 100 100 100
$$ [...]
$$ 130000 130000 130000 130000 130000 130000 130000 130000 130000 130000 130000
$$ 130000 130000 130000 130000 130000 130000 130000 130000 130000 130000 130000
$$ 130000 130000 130000 130000 130000 130000 130000 0 0 0 0 0 0 0 0 0 0 0
$$ 0 0 0 0 0 0 0 0 0 0 0 0 0
$$ ##$ShimPowMaxUC= (0..63)
$$ 130000 130000 130000 130000 130000 130000 130000 130000 130000 130000 130000
$$ 130000 130000 130000 130000 130000 130000 130000 130000 130000 130000 130000
$$ 130000 130000 130000 130000 130000 130000 130000 130000 130000 130000 130000
$$ 130000 130000 130000 130000 130000 130000 130000 0 0 0 0 0 0 0 0 0 0 0
$$ 0 0 0 0 0 0 0 0 0 0 0 0 0
$$ ##$ShimPowMaxUG= (0..63)
$$ 524287 524287 524287 524287 524287 524287 524287 524287 524287 524287 524287
$$ 524287 524287 524287 524287 524287 524287 524287 524287 524287 524287 524287
$$ 524287 524287 524287 524287 524287 524287 524287 524287 524287 524287 524287
$$ 524287 524287 524287 524287 524287 524287 0 0 0 0 0 0 0 0 0 0 0 0 0 0 0
$$ 0 0 0 0 0 0 0 0 0 0
$$ ##$ShimPowRcbType= 3
$$ ##$ShimPowRes= (0..63)
$$ 1e-020 1e-020 1e-020 1e-020 1e-020 1e-020 1e-020 1e-020 1e-020 1e-020 1e-020
$$ 1e-020 1e-020 1e-020 1e-020 1e-020 1e-020 1e-020 1e-020 1e-020 1e-020 1e-020
$$ 1e-020 1e-020 1e-020 1e-020 1e-020 1e-020 1e-020 1e-020 1e-020 1e-020 1e-020
$$ 1e-020 1e-020 1e-020 1e-020 1e-020 1e-020 1e-020 0 0 0 0 0 0 0 0 0 0 0
$$ 0 0 0 0 0 0 0 0 0 0 0 0 0
$$ ##$ShimPowRng0= (0..63)
$$ 1 1 1 1 1 1 1 1 1 1 1 1 1 1 1 1 1 1 1 1 1 1 1 1 1 1 1 1 1 1 1 1 1 1 1 1
$$ 1 1 1 1 0 0 0 0 0 0 0 0 0 0 0 0 0 0 0 0 0 0 0 0 0 0 0 0
$$ ##$ShimPowRng1= (0..63)
$$ 1 1 1 1 1 1 1 1 1 1 1 1 1 1 1 1 1 1 1 1 1 1 1 1 1 1 1 1 1 1 1 1 1 1 1 1
$$ 1 1 1 1 0 0 0 0 0 0 0 0 0 0 0 0 0 0 0 0 0 0 0 0 0 0 0 0
$$ ##$ShimPowRng2= (0..63)
$$ 1 1 1 1 1 1 1 1 1 1 1 1 1 1 1 1 1 1 1 1 1 1 1 1 1 1 1 1 1 1 1 1 1 1 1 1
$$ 1 1 1 1 0 0 0 0 0 0 0 0 0 0 0 0 0 0 0 0 0 0 0 0 0 0 0 0
$$ ##$ShimPowRng3= (0..63)
$$ 1 1 1 1 1 1 1 1 1 1 1 1 1 1 1 1 1 1 1 1 1 1 1 1 1 1 1 1 1 1 1 1 1 1 1 1
$$ 1 1 1 1 0 0 0 0 0 0 0 0 0 0 0 0 0 0 0 0 0 0 0 0 0 0 0 0
$$ ##$ShimSysFunc= (0..63)
$$ 1 2 3 4 5 6 7 8 9 10 0 37 38 35 16 15 14 13 12 11 28 27 26 25 24 23 36
$$ 22 30 29 20 21 34 33 32 31 17 18 19 0 0 0 0 0 0 0 0 0 0 0 0 0 0 0 0 0 0
$$ 0 0 0 0 0 0 0
$$ ##$ShimSysMatrix= 0
$$ ##$ShimSysType= 4
$$ ##$TFXNUM= 0
$$ ##$TRIPLO2= 0
$$ ##$VTU= 2
$$ ##$VTUETH= <149.236.99.20>
$$ ##$VTUTY= <no>
$$ ##$WBREFAM= (0..15)
$$ 100 100 100 100 100 100 100 100 100 100 100 100 100 100 100 100
$$ ##$WBREFLM= (0..15)
$$ 1 0 0 0 0 0 0 0 0 0 0 0 0 0 0 0
$$ ##$WBREFPH= (0..15)
$$ 0.03 0 0 0 0 0 0 0 0 0 0 0 0 0 0 0
$$ ##$WBSGU= (0..15)
$$ 0 0 0 0 0 0 0 0 0 0 0 0 0 0 0 0
$$ ##$XFAC= 2
$$ ##END=
$$ 
##$DECIM=	2000
##$DSPFVS=	20
##XUNITS=	HZ
##YUNITS=	ARBITRARY UNITS
##FIRSTX=	8088.5074780258000828
##LASTX=	-1911.3399340835749172
##DELTAX=	-0.152587890625
##XFACTOR=	1
##YFACTOR=	0.0099558183216281893185
##FIRSTY=	14.224822998046875
##MINY=	6.29640960693359375
##MAXY=	11852.6337890625
##NPOINTS=	65536
##XYDATA=	(X++(Y..Y))
$$ [...]
$$ plain form
2368 1777 1743 1707 1672 1727 1782 1827 1873 1863 1854 1789 1724 1611 1680 1657 1633 1706 1778 1804 1722 1640 1666 1700 1733 1842 1841 1719 1706 1752 1798 1836 1874 1821 1768 1825
2363 1825 1883 1813 1743 1770 1797 1794 1682 1692 1703 1638 1682 1820 1848 1890 1932 1873 1815 1654 1675 1682 1689 1708 1726 1664 1601 1629 1657 1675 1693 1711 1729 1774 1819 1857
2358 1857 1895 1907 1810 1781 1752 1634 1625 1614 1712 1732 1644 1569 1603 1561 1628 1756 1775 1781 1788 1733 1679 1704 1728 1692 1655 1755 1746 1730 1823 1836 1741 1641 1649 1825
2353 1825 1819 1759 1699 1688 1678 1667 1657 1737 1818 1905 1883 1859 1835 1810 1786 1663 1649 1762 1766 1738 1710 1724 1737 1785 1724 1754 1894 1910 1925 1880 1944 1937 1821 1774
2348 1774 1726 1634 1541 1606 1670 1771 1764 1666 1677 1704 1730 1709 1689 1702 1715 1855 1995 1940 1884 1883 1882 1949 2016 1955 1895 1774 1652 1730 1808 1735 1663 1717 1771
2343 1771 1760 1749 1737 1726 1705 1685 1719 1753 1734 1715 1696 1678 1730 1783 1824 1865 1919 1790 1651 1693 1782 1690 1693 1878 1857 1728 1664 1709 1719 1728 1745 1762 1870
2338 1870 1979 1924 1869 1832 1796 1759 1722 1753 1784 1724 1664 1712 1760 1754 1747 1780 1813 1755 1697 1682 1667 1706 1745 1638 1531 1624 1716 1713 1710 1708 1705 1696 1688 1679 1671 1703 1736 1714
2332 1714 1692 1738 1784 1776 1767 1782 1796 1720 1644 1669 1694 1774 1853 1825 1797 1769 1741 1677 1613 1567 1631 1788 1764 1758 1752 1765 1777 1699 1621 1659 1697 1680 1663 1616 1569 1648
$$ packed form
2368A777l4l6l5N5N5M5M6j0ro5o5j13O9k3k4P3P2K6q2q2K6L4L3J09jj22j3M6M6L8L8n3n3N7
2363A825N8p0p0K7K7lj12J0J1o5M4J38K8M2M2n9n8j61K1PPJ9J8o2o3K8K8J8J8J8J8M5M5L8
2358A857L8J2r7k9k9j18rj1R8K0q8p5L4m2O7J28J9OPn5n4K5K4l6l7J00rj6R3J3r5j00QJ76
2353A825oo0o0j1j0j1j0Q0Q1Q7k2k4k4k5k4j23j4J13Mk8k8J4J3M8o1L0J40J6J5m5O4pj16m7
2348A774m8r2r3O5O4J01pr8J1K7K6k1k0J3J3J40J40n5n6jjO7O7o1o0j21j22P8P8p3p2N4N4
2343A771j1j1j2j1k1k0L4L4j9j9j9j8N2N3M1M1N4j29j39M2Q9r2LJ85k1j29o4M5J0RJ7J7J08
2338A870J09n5n5l7l6l7l7L1L1o0o0M8M8opL3L3n8n8j5j5L9L9j07j07R3R2llklrqrqL2L3k2
2332A714k2M6M6qrJ5J4p6p6K5K5Q0P9k8k8k8k8o4o4m6O4J57k4ooJ3J2p8p8L8L8j7j7m7m7P9
$$ plain form
2326 1648 1728 1759 1790 1821 1852 1874 1895 1949 1784 1744 1705 1779 1852 1837 1822 1807 1792 1785 1778 1771 1764 1754 1743 1732 1721 1788 1854 1830 1806 1752 1699 1700 1701 1666 1632 1653 1673
2321 1673 1655 1637 1620 1602 1610 1619 1718 1817 1802 1787 1718 1649 1693 1738 1782 1826 1766 1707 1647 1588 1623 1659 1695 1731 1712 1694 1676 1657 1686 1714 1742 1770 1803 1836 1814
2315 1814 1792 1790 1787 1826 1864 1940 1797 1723 1648 1723 1799 1820 1840 1728 1615 1702 1789 1783 1776 1770 1764 1766 1767 1768 1770 1766 1761 1757 1753 1803 1854 1813 1773 1765 1758 1805 1852 1763 1675 1678 1680 1646
2309 1646 1611 1630 1650 1668 1687 1705 1723 1738 1753 1768 1782 1871 1960 2049 2138 2017 1896 1865 1835 1813 1791 1769 1746 1781 1815 1759 1703 1669 1636 1675 1605 1545 1665
2304 1665 1739 1703 1743 1783 1725 1668 1620 1573 1653 1732 1768 1804 1676 1548 1556 1563 1570 1578 1608 1638 1722 1806 1823 1839 1801 1763 1737 1711 1685 1660 1716 1773 1740 1706 1669
2299 1669 1631 1649 1666 1733 1801 1742 1682 1723 1763 1830 1897 1826 1755 1738 1721 1690 1660 1656 1652 1632 1612 1646 1681 1717 1753 1699 1644 1620 1595 1624 1654 1765 1876 1860
2293 1860 1844 1786 1728 1725 1722 1695 1669 1643 1617 1659 1701 1743 1785 1732 1679 1717 1755 1776 1797 1763 1730 1706 1682 1712 1742 1758 1773 1761 1749 1713 1677 1798 1738 1694 1650
2288 1650 1686 1722 1717 1713 1681 1649 1670 1690 1711 1732 1755 1779 1802 1826 1764 1703 1669 1635 1606 1576 1674 1771 1742 1713 1739 1764 1771 1777 1729 1680 1710 1739 1742 1744 1776 1808 1786
$$ packed form
2326A648Q0L1L1L1L1K2K1N4j65m0l9P4P3j5j5j5j5ppppj0j1j1j1O7O6k4k4n4n3JJl5l4K1K0
2321A673j8j8j7j8QRR9R9j5j5o9o9M4M5M4M4o0n9o0n9L5L6L6L6j9j8j8j9K9K8K8K8L3L3k2
2315A814k2klL9L8P6j43p4p5P5P6K1K0j12j13Q7Q7opooKJJKmnmmN0N1m1m0qpM7M7q9q8LKl4
2309A646l5J9K0J8J9J8J8J5J5J5J4Q9Q9Q9Q9j21j21l1l0k2k2k2k3L5L4n6n6l4l3L9p0o0J20
2304A665P4l6M0M0n8n7m8m7Q0P9L6L6j28j28QPPQL0L0Q4Q4J7J6l8l8k6k6k6k5N6N7l3l4l7
2299A669l8J8J7O7O8n9o0M1M0O7O7p1p1j7j7l1l0mmk0k0L4L5L6L6n4n5k4k5K9L0J11J11j6
2293A860j6n8n8llk7k6k6k6M2M2M2M2n3n3L8L8K1K1l4l3k4k4L0L0J6J5j2j2l6l6J21o0m4m4
2288A650L6L6nml2l2K1K0K1K1K3K4K3K4o2o1l4l4k9l0R8R7k9k9K6K5POm8m9L0K9LKL2L2k2
$$ plain form
2282 1786 1764 1724 1683 1770 1857 1828 1798 1796 1794 1737 1680 1714 1748 1735 1722 1764 1806 1712 1617 1686 1755 1732 1709 1740 1772 1821 1871 1757 1643 1600 1558 1607 1655 1714
2277 1714 1773 1831 1890 1739 1588 1636 1685 1770 1856 1778 1700 1740 1780 1794 1807 1802 1798 1794 1789 1796 1804 1811 1818 1752 1686 1747 1808 1786 1764 1715 1665 1689 1712 1762 1813 1785 1758
2272 1758 1821 1884 1759 1633 1635 1636 1700 1764 1828 1892 1801 1709 1745 1780 1768 1756 1799 1841 1866 1890 1823 1757 1750 1743 1791 1839 1964 2089 1876 1662 1659 1765 1755
2267 1755 1746 1739 1733 1799 1756 1706 1837 1768 1699 1746 1793 1786 1778 1745 1711 1677 1643 1692 1741 1804 1757 1782 1916 1891 1865 1830 1796 1727 1767 1902 2038 2047 1874 1851 1828
2261 1828 1794 1760 1763 1765 1768 1770 1789 1809 1767 1834 1709 1584 1630 1675 1722 1769 1721 1781 1841 1791 1658 1633 1659 1684 1689 1694 1727 1760 1710 1659 1601 1652 1794 1827 1782
2256 1782 1738 1741 1745 1789 1833 1823 1813 1754 1696 1759 1714 1666 1726 1787 1738 1714 1798 1821 1735 1776 1816 1856 1787 1758 1729 1747 1765 1917 2070 1986 1902 1808 1714 1613
2251 1613 1621 1603 1585 1657 1730 1766 1694 1621 1657 1660 1662 1732 1694 1715 1736 1805 1874 1845 1815 1785 1755 1738 1721 1704 1687 1652 1616 1608 1599 1694 1788 1828 1868 1849 1829 1810 1790
2245 1790 1679 1569 1658 1747 1707 1667 1681 1695 1737 1779 1821 1863 1856 1849 1751 1654 1743 1833 1795 1758 1754 1751 1747 1744 1724 1703 1683 1663 1661 1659 1711 1764 1703 1642 1708 1775 1835
$$ packed form
2282A786k2m0m1Q7Q7k9l0kkn7n7L4L4j3j3M2M2r4r5O9O9k3k3L1L2M9N0j14j14m3m2M9M8N9
2277A714N9N8N9j51j51M8M9Q5Q6p8p8M0M0J4J3nmmnPQPPo6o6O1O1k2k2m9n0K4K3N0N1k8k7
2272A758O3O3j25j26KJO4O4O4O4r1r2L6L5j2j2M3M2K5K4o7o6ppM8M8J25J25k13k14lJ06j0
2267A755rpoO6m3n0J31o9o9M7M7pql3l4l4l4M9M9O3m7K5J34k5k6l5l4o9M0J35J36Rj73k3k3
2261A828l4l4LKLKJ9K0m2O7j25j25M6M5M7M7m8O0O0n0j33k5K6K5NNL3L3n0n1n8N1J42L3m5
2256A782m4LMM4M4j0j0n9n8O3m5m8O0O1m9k4Q4K3q6M1M0M0o9k9k9J8J8J52J53q4q4r4r4j01
2251A613Qj8j8P2P3L6p2p3L6LKP0l8K1K1O9O9k9l0l0l0j7j7j7j7l5l6qrR5R4M0M0j9k0j9k0
2245A790j11j10Q9Q9m0m0J4J4M2M2M2M2ppr8r7Q9R0l8l7mlmlk0k1k0k0kkN2N3o1o1O6O7O0
$$ plain form
2239 1835 1896 1902 1908 1882 1856 1830 1804 1817 1831 1790 1749 1676 1604 1731 1859 1899 1940 2007 2075 1887 1698 1710 1721 1775 1830 1793 1757 1783 1809 1808 1806 1808 1810 1757 1704
2234 1704 1733 1761 1699 1637 1685 1733 1727 1720 1737 1754 1778 1801 1754 1816 1898 1798 1631 1572 1568 1673 1714 1575 1489 1585 1670 1646 1695 1743 1784 1825 1811 1797 1784 1771
2229 1771 1849 1927 1827 1728 1720 1711 1799 1887 1921 1954 1926 1897 1842 1786 1740 1694 1647 1601 1564 1528 1618 1708 1760 1811 1808 1804 1823 1841 1859 1878 1836 1794 1842 1891 1908 1925
2223 1925 1851 1778 1786 1794 1802 1810 1807 1804 1801 1798 1881 1964 1956 1948 1894 1840 1840 1840 1886 1932 1851 1770 1796 1822 1794 1766 1719 1671 1651 1631 1678 1726 1682 1639 1713 1787 1770 1753 1777 1800
2217 1800 1770 1739 1756 1772 1734 1696 1645 1593 1669 1744 1797 1850 1739 1628 1620 1611 1694 1776 1722 1668 1669 1669 1790 1911 1905 1898 1840 1782 1815 1848 1856 1864 1781 1698 1708 1719
2212 1719 1675 1630 1695 1759 1796 1833 1816 1800 1784 1767 1772 1776 1788 1799 1743 1795 1787 1778 1781 1784 1760 1736 1706 1675 1700 1724 1718 1712 1804 1895 1817 1847 1979 1930 1797 1773 1767 1761
2206 1761 1705 1648 1647 1645 1678 1710 1721 1622 1565 1618 1697 1668 1634 1709 1689 1669 1688 1708 1705 1593 1585 1685 1778 1872 1827 1891 1866 1841 1798 1755 1766 1777 1755 1733 1772
2201 1772 1703 1650 1598 1604 1720 1737 1755 1688 1622 1637 1652 1667 1682 1716 1749 1782 1816 1774 1732 1778 1715 1737 1758 1609 1642 1732 1713 1719 1724 1663 1711 1753 1794 1807 1820
$$ packed form
2239A835O1OOk6k6k6k6J3J4m1m1p3p2J27J28M0M1O7O8j88j89J2J1N4N5l7l6K6K6jkKKn3n3
2234A704K9K8o2o2M8M8opJ7J7K4K3m7O2Q2j00j67n9mJ05M1j39q6R6Q5k4M9M8M1M1j4j4j3j3
2229A771P8P8j00r9qrQ8Q8L4L3k8k9n5n6m6m6m7m6l7l6R0R0N2N1lmJ9J8J8J9m2m2M8M9J7J7
2223A925p4p3QQQQllllQ3Q3qqn4n4%%M6M6q1q1K6K6k8k8m7m8k0k0M7M8m4m3P4P4j7j7K4K3
2217A800l0l1J7J6l8l8n1n2P6P5N3N3j11j11qrQ3Q2n4n4J%J21J21opn8n8L3L3QQq3q3J0J1
2212A719m4m5O5O4L7L7j7j6j6j7NMJ2J1n6N2qrLLk4k4l0l1K5K4ooR2R1p8L0J32m9j33k4oo
2206A761n6n7jkL3L2J1r9n7N3P9k9l4P5k0k0J9K0lj12qJ00R3R4m5O4k5k5m3m3J1J1k2k2L9
2201A772o9n3n2OJ16J7J8o7o6J5J5J5J5L4L3L3L4m2m2M6o3K2K1j49L3R0j9ONo1M8M2M1J3J3
$$ plain form
2195 1820 1743 1665 1714 1762 1715 1777 1788 1690 1613 1718 1710 1702 1705 1709 1783 1858 1842 1827 1835 1842 1771 1700 1642 1766 1761 1756 1782 1807 1778 1749 1740 1730 1768 1806 1859 1803 1781 1760
2189 1760 1815 1871 1909 1838 1663 1671 1758 1735 1703 1671 1754 1728 1704 1788 1804 1820 1828 1835 1870 1905 1897 1888 1825 1762 1814 1866 1828 1789 1804 1819 1833 1848 1803 1757 1766 1775 1713
2184 1713 1650 1776 1793 1767 1741 1769 1798 1717 1746 1840 1935 1878 1822 1820 1818 1783 1749 1776 1694 1727 1759 1792 1824 1755 1796 1843 1780 1666 1661 1642 1623 1702 1781 1768 1756
2178 1756 1817 1877 1847 1817 1775 1733 1745 1866 1946 1844 1736 1736 1730 1724 1698 1672 1648 1625 1717 1701 1746 1792 1776 1760 1787 1813 1778 1743 1787 1722 1718 1715 1685 1656 1661 1557
2173 1557 1544 1531 1570 1719 1824 1820 1857 1894 1936 1978 1893 1808 1758 1709 1786 1864 1872 1880 1833 1786 1690 1593 1660 1727 1729 1730 1787 1843 1823 1804 1784 1764 1792 1820 1757 1694
2167 1694 1695 1696 1797 1789 1724 1841 1903 1965 1911 1857 1857 1857 1834 1811 1788 1765 1757 1750 1715 1680 1712 1745 1722 1700 1680 1659 1612 1564 1657 1751 1817 1883 1864 1845 1771 1697 1671
2162 1671 1645 1646 1647 1673 1699 1697 1696 1791 1887 1782 1678 1648 1617 1708 1798 1800 1694 1595 1677 1809 1832 1765 1697 1742 1787 1788 1790 1686 1764 1775 1676 1683 1691 1692 1693 1713 1733
2156 1733 1698 1663 1684 1704 1779 1854 1906 1959 1848 1736 1695 1654 1696 1739 1875 1901 1753 1787 1846 1796 1764 1732 1727 1722 1663 1604 1650 1696 1651 1606 1673 1741 1729
$$ packed form
2195A820p7p8M9M8m7O2J1r8p7J05qqLMP4P5j6j5QPp1p1n8J24nnK6K5k9k9rj0L8L8N3n6k2k1
2189A760N5N6L8p1j75QQ7k3l2l2Q3k6k4Q4J6J6QPL5L5qro3o3N2N2l8l9J5J5J4J5m5m6RRo2
2184A713o3J26J7k6k6K8K9q1K9R4R5n7n6kkl5l4K7q2L3L2L3L2o9M1M7o3j14nj9j9P9P9j3j2
2178A756O1O0l0l0m2m2J2J21Q0j02j08%ook6k6k4k3R2j6M5M6j6j6K7K6l5l5M4o5mll0k9Nj04
2173A557j3j3L9J49J05mL7L7M2M2q5q5n0m9P7P8QQm7m7r6r7O7O7KJN7N6k0j9k0k0K8K8o3o3
2167A694JJJ01qo5J17O2O2n4n4%%k3k3k3k3qpl5l5L2L3k3k2k0k1m7m8R3R4O6O6j9j9p4p4k6
2162A671k6JJK6K6kjR5R6j05j04l0l1R1R0Kj06r9Q2J32K3o7o8M5M5JKj04P8J1r9PQJJK0K0
2156A733l5l5K1K0P5P5N2N3j11j12m1m1M2M3J36K6j48L4N9n0l2l2nnn9n9M6M6m5m5O7O8j2
$$ plain form
2151 1729 1717 1650 1764 1879 1812 1830 1848 1854 1861 1845 1828 1812 1795 1745 1694 1734 1774 1714 1654 1648 1642 1582 1522 1625 1728 1700 1673 1700 1727 1744 1761 1778 1795 1785
2146 1785 1776 1712 1648 1622 1597 1662 1728 1771 1814 1857 1901 1876 1851 1826 1801 1760 1718 1732 1745 1714 1683 1706 1729 1733 1737 1796 1855 1805 1756 1707 1658 1661 1664 1612 1561 1584 1608
2140 1608 1588 1568 1506 1626 1643 1661 1690 1718 1675 1740 1844 1767 1677 1695 1735 1666 1611 1737 1882 1918 1863 1809 1779 1750 1811 1872 1793 1714 1799 1883 1826 1769
2135 1769 1711 1654 1736 1819 1810 1802 1753 1705 1784 1863 1843 1823 1713 1602 1633 1664 1605 1545 1566 1588 1609 1630 1652 1673 1705 1738 1601 1646 1679 1712 1666 1619 1693 1767
2130 1767 1838 1799 1760 1831 1808 1785 1769 1753 1724 1695 1854 1904 1764 1623 1676 1728 1733 1738 1749 1761 1710 1768 1717 1667 1523 1489 1568 1756 1722 1688 1667 1646 1638
2125 1638 1738 1838 1829 1734 1639 1730 1640 1610 1579 1592 1605 1653 1701 1756 1810 1690 1678 1696 1823 1893 1782 1718 1763 1767 1772 1835 1645 1612 1579 1552 1635 1767
2120 1767 1790 1791 1791 1768 1745 1667 1589 1629 1670 1710 1751 1734 1718 1702 1686 1718 1750 1788 1718 1759 1800 1834 1869 1842 1816 1881 1945 1916 1886 1850 1922 1916 1911 1821 1731 1753
2115 1753 1774 1632 1490 1499 1508 1607 1707 1692 1677 1668 1660 1642 1734 1709 1685 1752 1820 1803 1787 1700 1722 1730 1738 1860 1873 1783 1694 1692 1690 1743 1795 1701 1608 1652 1806 1809
$$ packed form
2151A729j2o7J14J15o7J8J8OPj6j7j6j7n0n1M0M0o0o0ooo0o0J03J03k8k7K7K7J7J7J7J7j0
2146A785ro4o4k6k5O5O6M3M3M3M4k5k5k5k5m1m2J4J3l1l1K3K3MMN9N9n0m9m9m9LLn2n1K3K4
2140A608k0k0o2J20J7J8K9K8m3O5J04p7r0J8M0o9n5J26J45L6n5n4l0k9O1O1p9p9Q5Q4n7n7
2135A769n8n7Q2Q3rqm9m8P9P9k0k0j10j11L1L1n9o0K1K2K1K1K2K1L2L3j37M5L3L3m6m7P4P4
2130A767P1l9l9P1k3k3j6j6k9k9J59N0j40j41N3N2NNJ1J2n1N8n1n0j44l4P9J88l4l4k1k1q
2125A638J00J00rr5r5R1r0l0l1J3J3M8M8N5N4j20j2J8J27P0j11o4M5MNO3j90l3l3k7Q3J32
2120A767K3J%k3k3p8p8M0M1M0M1j7j6j6j6L2L2L8p0M1M1L4L5k7k6O5O4k9l0l6P2onr0r0K2
2115A753K1j42j42RRR9J00j5j5rqj8R2k5k4O7O8j7j6q7K2QQJ22J3r0q9kkN3N2r4r3M4J54L
$$ plain form
2109 1809 1812 1823 1833 1788 1742 1690 1747 1843 1939 1853 1767 1674 1762 1755 1747 1744 1849 1828 1698 1751 1804 1821 1730 1750 1771 1792 1813 1794 1884 1883 1773 1754 1734 1867 1891
2104 1891 1780 1779 1869 1849 1800 1860 1907 1953 1904 1855 1861 1866 1868 1871 1843 1707 1687 1668 1703 1738 1728 1827 1859 1890 1797 1595 1623 1760 1906 1944 1825 1815 1776 1736
2099 1736 1704 1671 1708 1744 1781 1818 1777 1736 1750 1764 1763 1761 1869 1868 1890 1804 1826 1848 1837 1825 1806 1787 1839 1782 1786 1790 1700 1611 1619 1627 1522 1527 1598 1668 1743 1817 1801
2093 1801 1785 1703 1622 1678 1844 1804 1764 1785 1807 1815 1823 1733 1643 1634 1517 1547 1758 1863 1787 1551 1497 1641 1676 1718 1651 1637 1623 1657 1691 1742 1793 1844 1895
2088 1895 1813 1730 1738 1746 1790 1835 1879 1924 1862 1799 1937 2074 2017 1959 1902 1845 1853 1861 1870 1878 1883 1888 1802 1716 1778 1841 1849 1857 1768 1679 1716 1754 1719 1683 1701 1720 1714 1709 1714 1720
2082 1720 1607 1675 1695 1716 1702 1688 1837 1987 1919 1850 1836 1823 1822 1820 1765 1709 1714 1718 1723 1728 1749 1771 1702 1632 1651 1669 1633 1596 1753 1911 1941 1971 1890 1809 1855
2077 1855 1901 1750 1600 1540 1481 1573 1666 1668 1669 1760 1851 1851 1851 1789 1726 1664 1602 1672 1743 1759 1775 1760 1744 1729 1713 1752 1790 1774 1758 1737 1715 1755 1795 1837 1988
2071 1988 2042 1986 1922 1748 1793 1837 1834 1831 1882 1933 1925 1917 1855 1792 1702 1612 1649 1686 1697 1707 1718 1729 1684 1639 1654 1777 1849 1812 1789 1766 1740 1715 1805 1786 1775
$$ packed form
2109A809LJ1J0m5m6n2N7R6R6q6q6r3Q8pqlJ05k1j30N3N3J7r1K0K1K1K1j9R0jj10j9k0J33K4
2104A891j11jR0k0m9O0M7M6m9m9ONKLk8j36k0j9L5L5j0R9L2L1r3k02K8J37J46L8j19j0l9m0
2099A736l2l3L7L6L7L7m1m1J4J4jkJ08jK2q6K2K2j1j2j9j9N2n7MMr0q9QQj05NP1P0P5P4j6
2093A801j6q2q1N6J66m0m0K1K2QQr0r0rj17L0K11J05p6k36n4J44L5M2o7j4j4L4L4N1N1N1N1
2088A895q2q3QQM4M5M4M5o2o3J38J37n7n8n7n7QQRQNNq6q6O2O3QQq9q9L7L8l5l6J8J9onNO
2082A720j13O8K0K1j4j4J49J50o8o9j4j3jkn5n6NMNNK1K2o9p0J9J8l6l7J57J58L0L0q1q1M6
2077A855M6j51j50o0n9R2R3KJR1R1%%o2o3o2o2P0P1J6J6j5j6j5j6L9L8j6j6k1k2M0M0M2J51
2071A988N4n6o4j74M5M4llN1N1qqo2o3r0r0L7L7J1J0J1J1m5m5J5J23P2l7k3k3k6k5R0j9j1
$$ plain form
2066 1775 1765 1686 1716 1747 1778 1762 1745 1698 1651 1792 1825 1730 1636 1590 1543 1586 1629 1665 1702 1725 1638 1734 1829 1857 1777 1758 1738 1768 1799 1829 1859 1850 1842 1786 1911
2061 1911 1849 1788 1723 1768 1857 1838 1886 1934 1860 1786 1759 1732 1817 1792 1775 1757 1722 1686 1712 1628 1605 1582 1642 1703 1688 1673 1706 1739 1814 1781 1748 1824 1821 1819 1823 1828
2055 1828 1748 1669 1644 1619 1689 1760 1776 1792 1710 1629 1540 1561 1617 1674 1689 1705 1616 1636 1685 1735 1726 1717 1660 1603 1569 1644 1748 1852 1815 1777 1794 1811 1807 1802 1797 1793
2050 1793 1711 1629 1608 1587 1588 1698 1753 1700 1681 1663 1624 1694 1782 1762 1700 1820 1855 1781 1848 1805 1810 1923 1914 1904 1864 1823 1884 1764 1789 1814 1834 1855 1779 1812
2045 1812 1729 1646 1766 1887 1807 1728 1721 1715 1756 1797 1791 1675 1675 1676 1696 1717 1745 1663 1640 1616 1586 1555 1595 1636 1730 1825 1857 1889 1914 1940 1942 1836 1730 1732 1752
2039 1752 1771 1798 1824 1886 1948 1853 1758 1667 1684 1688 1692 1826 1851 1767 1683 1769 1746 1717 1796 1800 1695 1665 1635 1604 1683 1708 1732 1709 1794 1873 1843 1877 1803 1783 1763
2034 1763 1824 1884 1854 1824 1768 1712 1710 1708 1743 1778 1723 1667 1734 1801 1813 1825 1783 1741 1790 1839 1881 1923 1874 1825 1741 1657 1736 1816 1820 1824 1883 1942 1944 1945 1856 1767 1800
2028 1800 1834 1867 1900 1839 1778 1716 1655 1754 1854 1827 1799 1810 1821 1886 1952 1901 1851 1800 1750 1778 1807 1835 1864 1792 1721 1777 1832 1848 1863 1787 1712 1685 1659 1723
$$ packed form
2066A775j0p9L0L1L1j6j7m7m7J41L3r5r4m6m7M3M3L6L7K3q7R6R5K8q0j9k0L0L1L0L0rqn6J25
2061A911o2o1o5M5Q9j9M8M8p4p4k7k7Q5k5j7j8l5l6K6q4k3k3O0O1j5j5L3L3P5l3l3P6lkMN
2055A828q0p9k5k5P0P1J6J6q2q1q9K1N6N7J5J6q9K0M9N0rrn7n7l4P5J04J04l7l8J7J7mnnm
2050A793q2q2k1k1JJ10N5n3j9j8l9P0Q8k0o2J20L5p4O7m3NJ13rj0m0m1O1j20K5K5K0K1p6L3
2045A812q3q3J20J21q0p9poM1M1oj16%JK0K1K8q2k3k4l0l1M0M1R4R5L2L2K5K6Kj06j06KK0
2039A752J9K7K6O2O2r5r5r1J7MMJ34K5q4q4Q6k3k9P9Mj05l0l0l1P9K5K4k3Q5P9l0L4p4k0k0
2034A763O1O0l0l0n6n6kkL5L5n5n6O7O7J2J2m2m2M9M9M2M2m9m9q4q4P9Q0MMN9N9KJq9q9L3
2028A800L4L3L3o1o1o2o1R9J00k7k8J1J1O5O6n1n0n1n0K8K9K8K9p2p1N6N5J6J5p6p5k7k6O4
$$ plain form
2023 1723 1787 1770 1753 1736 1719 1745 1771 1797 1823 1726 1629 1622 1616 1668 1721 1773 1826 1783 1740 1789 1837 1811 1785 1759 1734 1713 1693 1673 1653 1746 1840 1770 1700 1608 1517
2018 1517 1553 1589 1627 1664 1701 1738 1787 1836 1830 1824 1785 1745 1705 1665 1616 1566 1570 1575 1648 1722 1741 1761 1664 1566 1510 1672 1790 1909 1877 1846 1817 1788 1704 1621 1638
2012 1638 1656 1673 1690 1746 1802 1767 1732 1704 1675 1647 1619 1595 1570 1760 1731 1685 1639 1779 1920 1924 1929 1806 1684 1695 1706 1704 1702 1751 1583 1537 1491 1588 1685
2007 1685 1727 1770 1820 1871 1831 1790 1760 1730 1700 1670 1684 1699 1767 1836 1821 1806 1804 1803 1666 1747 1796 1845 1894 1943 1938 1932 1892 1852 1812 1772 1773 1773 1752 1730 1985 1877
2002 1877 1737 1597 1630 1662 1695 1728 1723 1718 1768 1817 1731 1644 1721 1798 1782 1766 1750 1734 1786 1838 1763 1688 1667 1646 1624 1603 1633 1663 1638 1614 1593 1573 1643 1713
1997 1713 1706 1699 1693 1686 1735 1785 1834 1884 1838 1792 1801 1810 1754 1699 1698 1697 1725 1754 1727 1701 1720 1738 1730 1721 1685 1648 1706 1547 1562 1577 1633 1689 1686 1682 1769 1856 1851 1845 1784 1724 1729
1990 1729 1734 1739 1744 1745 1747 1776 1805 1746 1687 1682 1678 1640 1603 1620 1637 1656 1676 1723 1770 1757 1743 1729 1715 1721 1726 1759 1792 1706 1621 1627 1632 1697 1762 1773 1783 1821 1858 1840 1823 1873
1984 1873 1924 1920 1917 1794 1671 1711 1752 1746 1741 1776 1811 1904 1780 1750 1721 1666 1611 1610 1610 1595 1581 1566 1552 1621 1690 1668 1646 1656 1665 1701 1738 1760 1783 1873 1746 1732
$$ packed form
2023A723O4j7j7j7j7K6K6K6K6r7r7poN2N3N2N3m3m3M9M8k6k6k6k5k1k0k0k0R3R4p0p0r2r1
2018A517L6L6L8L7L7L7M9M9ool9m0m0m0m9n0MNP3P4J9K0r7r8n6J62J18J19l2l1k9k9q4q3J7
2012A638J8J7J7N6N6l5l5k8k9k8k8k4k5J90k9m6m6J40J41MNj23j22J1J1kkM9j68m6m6R7R7
2007A685M2M3N0N1m0m1l0l0l0l0J4J5O8O9j5j5kjj37Q1M9M9M9M9nom0m0m0m0J%k1k2K55j08
2002A877j40j40L3L2L3L3nnN0M9q6q7P7P7j6j6j6j6N2N2p5p5k1k1k2k1L0L0k5k4k1k0P0P0
1997A713ppopM9N0M9N0m6m6RRn6n5jjK8K9k7k6J9J8qrl6l7N8j59J5J5N6N6lmQ7Q7noo1o0N
1990A729NNNJKK9K9n9n9nml8l7J7J7J9K0M7M7j3j4j4j4ONL3L3q6q5ONO5O5J1J0L8L7j8j7N0
1984A873N1mlj23j23M0M1onL5L5R3j24l0k9n5n5j%j5j4j5j4O9O9k2k2J0RL6L7K2K3R0j27j4
$$ plain form
1979 1732 1718 1744 1771 1782 1794 1778 1762 1749 1736 1778 1820 1771 1722 1728 1734 1692 1649 1485 1538 1556 1575 1608 1640 1667 1693 1774 1855 1746 1638 1693 1747 1828 1909 1936
1974 1936 1962 1930 1898 1839 1780 1762 1745 1782 1820 1868 1916 1873 1830 1868 1905 1815 1725 1674 1623 1571 1520 1537 1553 1570 1586 1622 1658 1816 1757 1708 1659 1688 1716 1750
1968 1750 1784 1728 1671 1671 1672 1763 1854 1867 1881 1841 1800 1829 1857 1795 1733 1739 1746 1725 1704 1673 1643 1703 1763 1845 1927 1896 1864 1717 1788 1790 1793 1785 1777 1769 1762 1835 1908 1781
1963 1781 1655 1681 1708 1644 1579 1585 1590 1650 1710 1714 1719 1751 1783 1784 1785 1731 1678 1705 1731 1731 1731 1698 1665 1723 1781 1773 1764 1756 1747 1765 1782 1800 1817 1810 1803 1769 1735 1670 1606 1632 1659
1956 1659 1757 1855 1949 1825 1760 1695 1671 1648 1718 1788 1768 1747 1704 1661 1617 1574 1619 1665 1656 1646 1691 1736 1782 1827 1766 1705 1699 1693 1762 1831 1875 1737 1731 1725 1708 1690
1951 1690 1730 1770 1810 1850 1772 1694 1670 1646 1691 1735 1689 1642 1623 1604 1585 1566 1556 1546 1536 1526 1612 1699 1785 1871 1877 1882 1833 1784 1757 1731 1704 1678 1775 1872 1843
1945 1843 1813 1773 1733 1692 1652 1703 1753 1803 1853 1758 1663 1695 1727 1689 1652 1741 1831 1785 1738 1782 1827 1778 1730 1773 1815 1799 1782 1766 1749 1737 1725 1713 1701 1794
1940 1794 1888 1818 1748 1743 1738 1733 1728 1696 1665 1802 1757 1540 1503 1615 1617 1574 1531 1572 1613 1721 1829 1883 1936 1881 1826 1832 1838 1779 1830 1873 1916 1888 1860 1778 1695
$$ packed form
1979A732j4K6K7J1J2j6j6j3j3M2M2m9m9OOm2m3j64N3J8J9L3L2K7K6Q1Q1j09j08N5N4Q1Q1K7
1974A936K6l2l2n9n9j8j7L7L8M8M8m3m3L8L7r0r0n1n1n2n1J7J6J7J6L6L6J58n9m9m9K9K8L4
1968A750L4n6n7%JR1R1J3J4m0m1K9K8o2o2OPk1k1l1l0O0O0Q2Q2l1l2j47P1KLqqqpP3P3j27
1963A781j26K6K7o4o5ONO0O0MNL2L2JJn4n3K7K6%%l3l3N8N8qrqrJ8J7J8J7ppl4l4o5o4K6K7
1956A659R8R8R4j24o5o5k4k3P0P0k0k1m3m3m4m3M5M6rj0M5M5M6M5o1o1ooO9O9M4j38ooj7j8
1951A690M0M0M0M0p8p8k4k4M5M4m6m7j9j9j9j9j0j0j0j0Q6Q7Q6Q6ONm9m9k7k6k7k6R7R7k9
1945A843l0m0m0m1m0N1N0N0N0r5r5L2L2l8l7Q9R0m6m7M4M5m9m8M3M2j6j7j6j7j2j2j2j2R3
1940A794R4p0p0nnnnl2l1J37m5k17l7J12Km3m3M1M1J08J08N4N3n5n5OOn9N1M3M3k8k8q2q3
$$ plain form
1935 1695 1685 1674 1671 1667 1565 1571 1571 1571 1598 1625 1597 1570 1532 1494 1584 1673 1675 1677 1679 1681 1697 1712 1728 1744 1680 1616 1643 1671 1723 1775 1772 1770 1752 1734 1717 1699 1753 1806 1769
1929 1769 1732 1797 1861 1871 1881 1889 1897 1814 1731 1735 1739 1797 1856 1923 1991 1968 1763 1663 1671 1741 1811 1775 1847 1760 1674 1728 1673 1528 1492 1537 1582 1580 1578 1657 1737 1750
1923 1750 1655 1710 1764 1789 1705 1646 1695 1725 1754 1855 1848 1811 1774 1814 1853 1667 1591 1577 1562 1548 1534 1702 1761 1754 1748 1753 1759 1778 1689 1635 1691 1763 1834 1835 1728
1918 1728 1667 1716 1765 1704 1698 1800 1896 1883 1848 1812 1784 1756 1782 1808 1715 1621 1690 1760 1664 1568 1600 1631 1591 1551 1602 1653 1673 1694 1714 1734 1716 1698 1679 1661
1913 1661 1636 1611 1677 1743 1727 1712 1750 1789 1799 1809 1819 1829 1825 1821 1727 1633 1641 1650 1658 1667 1710 1754 1798 1841 1810 1778 1746 1715 1718 1722 1707 1802 1835 1686 1592 1607 1572 1646
1907 1646 1665 1685 1666 1647 1683 1718 1746 1774 1801 1829 1774 1719 1664 1609 1578 1548 1645 1742 1800 1858 1789 1720 1758 1796 1815 1726 1668 1791 1896 2001 1950 1899 1902
1902 1902 1905 1892 1879 1811 1743 1769 1794 1820 1845 1863 1881 1899 1917 1773 1629 1684 1740 1774 1809 1843 1878 1851 1824 1743 1661 1684 1706 1729 1751 1724 1696 1669 1642 1572
1897 1572 1503 1634 1764 1796 1828 1805 1782 1780 1779 1722 1666 1711 1756 1710 1664 1676 1688 1701 1713 1781 1849 1862 1876 1830 1783 1864 1945 2103 2262 2111 1961 1826
$$ packed form
1935A695j0j1lmj02O%%K7K7k8k7l8l8R0Q9KKKKJ6J5J6J6o4o4K7K8N2N2lkj8j8j7j8N4N3l7
1929A769l7O5O4J0J0QQq3q3MMN8N9O7O8k3k05j00QP0P0l6P2q7q6N4n5j45l6M5M5kkP9Q0J3
1923A750r5N5N4K5q4n9M9L0K9J01pl7l7M0L9j86p6j4j5j4j4J68N9poNOJ9q9n4N6P2P1Jj07
1918A728o1M9M9o1oJ02R6j3l5l6k8k8K6K6r3r4O9P0r6r6L2L1m0m0N1N1K0K1K0K0j8j8j9j8
1913A661k5k5O6O6j6j5L8L9J0J0J0J0mmr4r4QRQRM3M4M4M3l1l2l2l1LMj5R5L3j49r4J5l5P4
1907A646J9K0j9j9L6L5K8K8K7K8n5n5n5n5l1l0R7R7N8N8o9o9L8L8J9q9n8J23J05J05n1n1L
1902A902Lj3j3o8o8K6K5K6K5J8J8J8J8j44j44N5N6L4L5L4L5k7k7q1q2K3K2K3K2k7k8k7k7p0
1897A572o9J31J30L2L2k3k3kjn7n6M5M5m6m6J2J2J3J2O8O8J3J4m6m7Q1Q1J58J59j51j50j35
$$ plain form
1892 1826 1692 1721 1750 1769 1788 1807 1826 1866 1906 1891 1876 1793 1709 1788 1868 1811 1754 1788 1822 1879 1937 1995 2052 1924 1795 1757 1720 1699 1678 1749 1819 1812 1805 1743
1887 1743 1682 1709 1736 1818 1899 1884 1868 1798 1728 1766 1804 1751 1698 1690 1682 1673 1665 1691 1716 1864 1795 1768 1741 1754 1768 1680 1591 1630 1669 1672 1676 1679 1683 1700 1717 1734 1752 1711
1881 1711 1671 1722 1773 1841 1910 1816 1721 1748 1775 1802 1829 1790 1751 1712 1673 1747 1821 1805 1788 1774 1761 1802 1843 1857 1872 1763 1764 1869 1865 1806 1857 1904 1843 1729
1876 1729 1616 1564 1620 1707 1793 1861 1929 1895 1752 1744 1736 1798 1752 1550 1602 1733 1865 1908 1842 1815 1679 1628 1687 1745 1695 1645 1703 1639 1575 1608 1641 1681
1871 1681 1721 1682 1753 1755 1757 1820 1773 1720 1775 1817 1750 1600 1558 1711 1865 1783 1701 1760 1711 1609 1689 1850 1829 1855 1773 1786 1799 1805 1811 1771 1731 1583 1543
1866 1543 1566 1699 1839 1869 1794 1718 1691 1663 1731 1798 1714 1738 1795 1851 1915 1978 1922 1867 1811 1755 1736 1716 1696 1677 1725 1774 1768 1653 1492 1513 1547 1472 1429
1861 1429 1495 1547 1599 1638 1677 1764 1851 1865 1770 1694 1617 1519 1603 1640 1676 1689 1703 1717 1730 1723 1716 1708 1701 1646 1591 1627 1663 1637 1611 1639 1668 1609 1550 1546 1541 1591 1641
1855 1641 1690 1740 1632 1524 1529 1535 1758 1764 1631 1607 1590 1573 1618 1662 1747 1832 1790 1747 1736 1724 1713 1701 1706 1712 1663 1614 1667 1720 1646 1572 1625 1679 1732 1786 1758
$$ packed form
1892A826j34K9K9J9J9J9J9M0M0j5j5q3q4P9Q0n7n7L4L4N7N8N8N7j28j29l8l7k1k1P1P0ppo2
1887A743o1K7K7Q2Q1j5j6p0p0L8L8n3n3qqrqK6K5J48o9k7k7J3J4q8q9L9L9LMLMJ7J7J7J8m1
1881A711m0N1N1O8O9r4r5K7K7K7K7l9l9l9l9P4P4j6j7j4j3M1M1J4J5j09JJ05mn9N1M7o1j14
1876A729j13n2N6Q7Q6O8O8l4j43qqO2m6k02N2J31J32M3o6k7j36n1N9N8n0n0N8o4o4L3L3M0
1871A681M0l9P1KKO3m7n3N5M2o7j50m2J53J54q2q2N9m9j02Q0J61k1K6q2J3J3OOm0m0j48m0
1866A543K3J33J40L0p5p6k7k8O8O7q4K4N7N6O4O3n6n5n6n6j9k0k0j9M8M9oj15j61K1L4p5m3
1861A429O6N2N2L9L9Q7Q7J4r5p6p7r8Q4L7L6J3J4J4J3ppqpn5n5L6L6k6k6K8K9n9n9mnN0N0
1855A641M9N0j08j08NOK23Oj33k4j7j7M5M4Q5Q5m2m3j1j2j1j2NOm9m9N3N3p4p4N3N4N3N4k8
$$ plain form
1850 1758 1730 1792 1855 1855 1854 1854 1854 1810 1766 1735 1704 1628 1770 1789 1809 1748 1688 1683 1677 1675 1673 1616 1559 1617 1675 1678 1682 1616 1549 1483 1417 1482 1547 1612 1678 1659 1640 1676 1712
1844 1712 1678 1645 1666 1687 1682 1677 1762 1848 1816 1783 1819 1637 1620 1602 1699 1795 1797 1799 1801 1803 1817 1831 1755 1679 1748 1818 1725 1631 1634 1636 1693 1750 1717 1683 1741 1798 1772 1746
1838 1746 1747 1748 1756 1763 1825 1887 1833 1778 1815 1852 1888 1925 1907 1889 1859 1829 1708 1588 1619 1650 1736 1822 1869 1917 1946 1866 1671 1658 1627 1596 1650 1704 1758 1812 1696
1833 1696 1580 1555 1530 1577 1623 1642 1662 1702 1742 1873 2004 2019 2034 1922 1809 1764 1719 1674 1628 1610 1591 1627 1663 1636 1610 1560 1693 1796 1717 1593
1828 1593 1578 1612 1538 1658 1779 1816 1853 1863 1873 1854 1834 1842 1849 1852 1855 1767 1679 1670 1661 1743 1824 1830 1836 1842 1848 1770 1691 1776 1861 1814 1767 1747 1727 1689 1651 1612 1574 1633
1822 1633 1693 1752 1812 1803 1794 1731 1668 1678 1689 1644 1600 1581 1562 1571 1579 1593 1607 1621 1635 1688 1742 1795 1848 1879 1911 1888 1864 1847 1829 1757 1685 1649 1613 1631 1649 1622
1817 1622 1595 1659 1722 1671 1620 1696 1772 1880 1987 1895 1803 1734 1665 1723 1781 1740 1698 1747 1796 1769 1742 1770 1798 1795 1792 1789 1786 1819 1852 1795 1737 1653 1569 1576 1583 1631
1811 1631 1679 1672 1665 1703 1740 1723 1706 1699 1692 1686 1679 1663 1646 1684 1722 1716 1710 1853 1779 1820 1861 1833 1806 1762 1719 1766 1813 1763 1713 1663 1613 1664 1714 1738 1761 1679 1597 1665
$$ packed form
1850A758k8O2O3%j%%m4m4l1l1p6J42J9K0o1o0nokkn7n7N8N8LMo6o7o6o6O5O5O5O6j9j9L6L6
1844A712l4l3K1K1nnQ5Q6l2l3L6j82j7j8R7R6KKKKJ4J4p6p6O9P0r3r4LKN7N7l3l4N8N7k6k6
1838A746JJQPO2O2n4n5L7L7L6L7j8j8l0l0j21j20L1L1Q6Q6M7M8K9q0j95j3l1l1N4N4N4N4j16
1833A696j16k5k5M7M6J9K0M0M0J31J31J5J5j12j13m5m5m5m6j8j9L6L6k7k6n0J33J03p9j24
1828A593j5L4p4J20J21L7L7J0J0j9k0QPLLq8q8rrQ2Q1OOOOp8p9Q5Q5m7m7k0k0l8l8l9l8N9
1822A633O0N9O0rro3o3J0J1m5m4j9j9RQJ4J4J4J4N3N4N3N3L1L2k3k4j7j8p2p2l6l6J8J8k7
1817A622k7O4O3n1n1P6P6J08J07r2r2o9o9N8N8m1m2M9M9k7k7K8K8llllL3L3n7n8q4q4PPM8
1811A631M8ppL8L7j7j7ppopj6j7L8L8ooJ43p4M1M1k8k7m4m3M7M7n0n0n0n0N1N0K4K3q2q2O8
$$ plain form
1806 1665 1734 1714 1477 1562 1647 1627 1608 1615 1622 1704 1786 1777 1768 1714 1660 1733 1806 1686 1566 1682 1798 1788 1779 1643 1507 1569 1630 1637 1645 1685 1725 1765 1805 1851
1801 1851 1897 1889 1881 1864 1846 1856 1866 1817 1768 1809 1669 1512 1609 1606 1603 1617 1631 1482 1514 1610 1596 1467 1447 1595 1743 1771 1799 1773 1747 1646 1727 1736 1745 1766
1795 1766 1787 1697 1607 1644 1682 1670 1659 1647 1635 1595 1556 1606 1657 1790 1923 1929 1934 1822 1710 1688 1667 1689 1712 1686 1661 1533 1515 1671 1646 1599 1662 1742
1790 1742 1823 1750 1677 1659 1641 1709 1777 1845 1913 1913 1913 1822 1731 1722 1713 1703 1694 1732 1771 1754 1738 1740 1742 1744 1746 1658 1570 1646 1722 1717 1713 1799 1886 1800 1714 1719 1723 1739 1755 1716 1677
1784 1677 1788 1900 1812 1724 1723 1723 1750 1777 1773 1769 1764 1760 1794 1828 1807 1786 1728 1670 1702 1735 1761 1788 1760 1731 1776 1820 1824 1828 1639 1668 1665 1662 1748 1834 1793 1751 1690 1629
1778 1629 1681 1733 1908 1866 1946 2027 1986 1946 1815 1684 1665 1646 1740 1835 1966 1880 1788 1697 1715 1733 1696 1659 1585 1511 1637 1762 1804 1846 1797 1748 1697
1774 1697 1647 1651 1655 1714 1773 1804 1836 1728 1620 1639 1659 1671 1684 1684 1683 1544 1624 1608 1592 1645 1697 1636 1575 1525 1693 1739 1784 1785 1787 1842 1898 1877 1856 1889 1922
1768 1922 1812 1702 1755 1808 1842 1876 1882 1888 1789 1689 1680 1671 1712 1754 1740 1727 1711 1694 1678 1661 1726 1791 1728 1666 1743 1821 1771 1721 1768 1815 1807 1800 1767 1735 1793 1852
$$ packed form
1806A665O9k0k37Q5Q5k0j9PPQ2Q2rrn4n4P3P3j20j20J16J16j0rj36j36O2O1PQM0M0M0M0M6
1801A851M6qqj7j8J0J0m9m9M1j40j57R7llJ4J4j49L2R6j4j29k0J48J48K8K8k6k6j01Q1RRK1
1795A766K1r0r0L7L8j2j1j2j2m0l9N0N1J33J33ONj12j12k2k1K2K3k6k5j28j8J56k5m7O3Q0
1790A742Q1p3p3j8j8O8O8O8O8%%r1r1rrj0rL8L9j7j6KKKKq8q8P6P6nmQ6Q7q6q6NMJ6J6l9l9
1784A677J11J12q8q8j%K7K7mmnmL4L4k1k1n8n8L2L3K6K7k8k9M5M4MMj89K9llQ6Q6m1m2o1o1
1778A629N2N2J75m2Q0Q1m1m0j31j31j9j9R4R5J31q6r2r1J8J8l7l7p4p4J26J25M2M2m9m9n1
1774A697n0MMN9N9L1L2j08j08J9K0J2J3%jj39Q0j6j6N3N2o1o1n0J68M6M5JKN5N6k1k1L3L3
1768A922j10j10N3N3L4L4OOr9j00rrM1M2j4j3j6j7j6j7O5O5o3o2P7P8n0n0M7M7qpl3l2N8N9
$$ plain form
1763 1852 1938 2025 1949 1872 1809 1746 1751 1756 1623 1708 1761 1814 1796 1778 1788 1797 1879 1960 1908 1855 1945 1926 1968 2011 1963 1914 1932 2059 2366 2672 2905 2810 2462
1758 2462 2222 2108 1994 1894 1903 1837 1881 1928 1866 1873 1879 1926 1974 2021 2068 2061 2054 1956 1858 1848 1839 1830 1820 1842 1864 1832 1799 1743 1687 1721 1756 1789 1822 1869 1807 1771
1752 1771 1844 1855 1867 1780 1801 1877 1845 1785 1724 1610 1495 1495 1604 1645 1686 1740 1684 1690 1804 1874 2053 2087 2120 2201 2283 2232 2073 1928 1892 1842 1793 1761
1747 1761 1730 1721 1821 1900 1869 1822 1775 1706 1745 1864 1874 1858 1660 1593 1636 1608 1689 1599 1619 1683 1747 1733 1720 1670 1729 1782 1834 1742 1650 1617 1693 1706 1610
1742 1610 1715 1821 1702 1691 1801 1803 1918 1925 1769 1721 1652 1692 1745 1690 1576 1572 1651 1622 1627 1632 1678 1723 1783 1733 1738 1743 1804 1756 1777 1797 1703 1717 1664 1719
1737 1719 1712 1705 1698 1691 1730 1659 1650 1640 1716 1792 1709 1734 1752 1661 1692 1724 1698 1672 1640 1716 1795 1874 1937 1891 1784 1787 1880 1865 1728 1700 1731 1762 1755 1748 1809 1762 1674
1732 1674 1696 1718 1630 1596 1671 1678 1684 1651 1618 1517 1525 1657 1680 1655 1740 1771 1802 1785 1769 1744 1719 1742 1765 1812 1750 1688 1735 1741 1748 1809 1870 1894 1810 1787 1764 1817
1726 1817 1870 1857 1735 1749 1764 1644 1524 1545 1566 1586 1607 1626 1645 1719 1793 1726 1658 1743 1719 1626 1534 1598 1662 1687 1711 1681 1650 1630 1610 1656 1702 1603 1687
$$ packed form
1763A852Q6Q7p6p7o3o3NNj33Q5N3N3j8j8J0RQ2Q1n2n3R0j9M2M3m8m9J8J27L07L06K33r5l48
1758B462k40j14j14j00Ro6M4M7o2POM7M8M7M7ppr8r8j0rrj0K2K2l2l3n6n6L4L5L3L3M7o2l6
1752A771P3J1J2q7K1P6l2o0o1j14j15%J09M1M1N4n6OJ14P0J79L4L3Q1Q2n1j59j45l6n0m9l2
1747A761l1rJ00P9l1m7m7o9L9J19J0j6j98o7M3k8Q1r0K0O4O4j4j3n0N9N3N2r2r2l3P6J3r6
1742A610J05J06j19j1J10KJ15Pj56m8o9M0N3n5j14mP9k9NNM6M5O0n0NNO1m8K1K0r4J4n3N5
1737A719ppppL9p1rj0P6P6q3K5J8r1L1L2k6k6l2P6P9P9O3m6j07LR3j5j37k8L1L1ppO1m7q8
1732A674K2K2q8l4P5POl3l3j01QJ32K3k5Q5L1L1j7j6k5k5K3K3M7o2o2M7OPO1O1K4q4k3k3N3
1726A817N3j3j22J4J5j20j20K1K1K0K1J9J9P4P4o7o8Q5k4r3r2O4O4K5K4l0l1k0k0M6M6r9Q4
$$ plain form
1721 1687 1668 1649 1706 1763 1729 1696 1680 1664 1594 1524 1589 1653 1718 1783 1787 1790 1739 1689 1692 1696 1700 1703 1772 1841 1783 1725 1687 1649 1611 1574 1703 1832 1797 1763 1813 1864
1716 1864 1860 1857 1736 1615 1549 1483 1505 1528 1550 1572 1563 1554 1544 1535 1644 1754 1773 1792 1743 1695 1646 1598 1641 1684 1637 1589 1601 1612 1569 1526 1606 1685 1710 1735 1681
1710 1681 1626 1699 1772 1769 1765 1707 1650 1709 1769 1828 1888 1822 1757 1692 1626 1689 1751 1686 1621 1651 1680 1710 1739 1722 1704 1686 1669 1680 1690 1756 1821 1794 1768 1741 1714
1705 1714 1642 1570 1625 1680 1681 1682 1684 1685 1707 1730 1589 1558 1634 1528 1622 1717 1751 1785 1764 1744 1741 1738 1735 1733 1686 1639 1598 1558 1526 1603 1691 1671 1562 1634 1677 1720 1821
1699 1821 1741 1647 1662 1679 1695 1779 1755 1721 1687 1633 1688 1722 1648 1580 1621 1595 1568 1602 1637 1664 1690 1771 1852 1833 1814 1705 1595 1623 1652 1626 1600 1637 1673
1694 1673 1626 1579 1611 1751 1886 1838 1643 1556 1633 1710 1788 1866 1817 1768 1817 1866 1909 1952 1944 1828 1705 1691 1711 1623 1595 1677 1692 1707 1722 1736 1798 1750
1689 1750 1650 1731 1891 1870 1834 1799 1743 1687 1630 1574 1566 1559 1642 1726 1769 1812 1764 1717 1803 1889 1892 1894 1805 1825 1761 1588 1485 1491 1556 1622 1654 1687 1628 1570 1535
1684 1535 1501 1618 1627 1610 1594 1510 1535 1658 1782 1749 1715 1654 1592 1578 1564 1656 1639 1602 1746 1858 1860 1834 1698 1651 1604 1578 1552 1566 1580 1620 1661 1674
$$ packed form
1721A687j9j9N7N7l4l3j6j6p0p0O5O4O5O5MLn1n0LMMLO9O9n8n8l8l8l8l7J29J29l5l4N0N1
1716A864mlj21j21o6o6K2K3K2K2rrj0rJ09J10J9J9m9m8m9m8M3M3m7m8J2J1m3m3Q0P9K5K5n4
1710A681n5P3P3lmn8n7N9O0N9O0o6o5o5o6O3O2o5o5L0K9L0K9j7j8j8j7J1J0O6O5k7k6k7k7
1705A714p2p2N5N5JJKJK2K3j41l1P6j06R4R5L4L4k1k0lllkm7m7m1m0l2P7Q8k0j09P2M3M3J01
1699A821q0r4J5J7J6Q4k4l4l4n4N5L4p4o8M1k6k7L4L5K7K6Q1Q1j9j9j09j10K8K9k6k6L7L6
1694A673m7m7L2J40J35m8j95q7P7P7P8P8m9m9M9M9M3M3qj16j23j4K0q8k8Q2J5J5J5J4O2m8
1689A750j00Q1J60k1l6l5n6n6n7n6qpQ3Q4M3M3m8m7Q6Q6LKq9K0o4j73j03OO5O6L2L3n9n8l5
1684A535l4J17Rj7j6q4K5J23J24l3l4o1o2j4j4R2j7l7J44J12Kk6j36m7m7k6k6J4J4M0M1J3
$$ plain form
1679 1674 1686 1725 1764 1775 1786 1797 1808 1768 1728 1778 1829 1834 1839 1817 1795 1769 1744 1691 1639 1599 1559 1610 1661 1703 1744 1840 1936 1795 1655 1677 1700 1734 1768 1748
1674 1748 1728 1645 1563 1572 1580 1670 1761 1651 1542 1616 1691 1718 1745 1654 1672 1858 1862 1809 1756 1819 1882 1783 1684 1676 1668 1722 1776 1802 1829 1809 1788 1641 1602 1736
1669 1736 1689 1598 1616 1603 1590 1557 1524 1472 1421 1460 1500 1658 1816 1853 1891 1786 1790 1836 1699 1691 1683 1663 1643 1642 1642 1641 1640 1627 1614 1629 1643 1613 1583 1601 1619 1696
1663 1696 1665 1502 1520 1618 1716 1699 1681 1666 1650 1635 1620 1707 1795 1883 1971 1868 1765 1753 1741 1736 1731 1671 1611 1670 1728 1786 1844 1820 1795 1770 1746 1756 1767 1777
1658 1777 1788 1796 1805 1650 1494 1539 1584 1628 1673 1621 1569 1644 1720 1723 1727 1676 1626 1674 1722 1715 1709 1748 1787 1735 1683 1758 1832 1816 1800 1721 1641 1688 1736 1659 1581 1631
1653 1631 1681 1637 1593 1603 1613 1648 1683 1718 1753 1691 1630 1623 1616 1666 1716 1675 1635 1711 1788 1774 1760 1749 1737 1699 1660 1688 1717 1718 1719 1741 1764 1732 1700 1724 1748 1718
1647 1718 1688 1709 1730 1696 1662 1683 1704 1670 1637 1712 1788 1809 1830 1724 1618 1603 1587 1665 1743 1869 1813 1743 1673 1756 1838 1792 1746 1754 1763 1805 1848 1800 1751 1739
1642 1739 1726 1768 1810 1814 1817 1766 1715 1725 1735 1654 1573 1600 1627 1654 1681 1692 1702 1658 1614 1604 1594 1585 1575 1525 1476 1481 1486 1554 1623 1637 1651 1655 1659 1662 1666 1652 1639 1626 1612
$$ packed form
1679A674J2L9L9J1J1J1J1m0m0N0N1NNk2k2k6k5n3n2m0m0N1N1M2M1R6R6j41j40K2K3L4L4k0
1674A748k0q3q2RQR0R1j10j09P4P5K7K7r1J8J86Mn3n3O3O3r9r9qqN4N4K6K7k0k1j47l9J34
1669A736m7r1J8j3j3l3l3n2n1L9M0J58J58L7L8j05MM6j37qqk0k0j%jjj3j3J5J4l0l0J8J8P7
1663A696l1j63J8R8R8j7j8j5j6j5j5Q7Q8Q8Q8j03j03j2j2nno0o0N9N8N8N8k4k5k5k4J0J1J0
1658A777J1QRj55j56M5M5M4M5n2n2P5P6LMn1n0M8M8poL9L9n2n2P5P4j6j6p9q0M7M8p7p8N0
1653A631N0m4m4J0J0L5L5L5L5o2o1ppN0N0m1m0P6P7j4j4j1j2l8l9K8K9JJK2K3l2l2K4K4l0
1647A718l0K1K1l4l4K1K1l4l3P5P6K1K1j06j06j5j6P8P8J26n6p0p0Q3Q2m6m6QRM2M3m8m9j2
1642A739j3M2M2MLn1n1J0J0q1q1K7K7K7K7J1J0m4m4j0j0rj0n0m9NNO8O9J4J4MMLMj4j3j3j4
$$ plain form
1636 1612 1622 1631 1640 1650 1632 1614 1596 1579 1639 1699 1759 1820 1810 1801 1738 1675 1708 1742 1776 1810 1817 1823 1830 1837 1759 1682 1659 1636 1685 1733 1850 1749 1733 1716 1741 1765 1756
1630 1756 1746 1646 1545 1640 1734 1738 1741 1696 1650 1660 1669 1689 1710 1730 1751 1774 1798 1836 1873 1726 1797 1745 1694 1701 1709 1716 1723 1721 1718 1716 1713 1629 1545 1551 1558 1611 1665 1664 1663 1767
1624 1767 1870 1847 1823 1824 1825 1771 1717 1778 1839 1834 1720 1670 1619 1561 1503 1672 1840 1874 1908 1874 1731 1715 1808 1703 1598 1634 1671 1679 1797 1824 1742 1735 1728
1619 1728 1769 1810 1763 1715 1752 1789 1920 1943 1713 1737 1776 1707 1646 1694 1760 1716 1581 1556 1635 1605 1691 1777 1832 1777 1668 1667 1683 1699 1630 1562 1566 1571 1629 1688
1614 1688 1646 1603 1724 1845 1848 1850 1787 1616 1630 1644 1742 1840 1815 1789 1691 1702 1822 1761 1620 1588 1678 1768 1773 1779 1825 1872 1823 1665 1621 1686 1682 1679 1699 1719
1609 1719 1739 1759 1687 1615 1611 1499 1496 1602 1647 1583 1584 1585 1669 1754 1786 1818 1703 1587 1448 1563 1691 1638 1681 1724 1694 1773 1723 1673 1629 1586 1653 1721 1661
1604 1661 1602 1613 1625 1637 1649 1668 1687 1767 1738 1689 1639 1610 1580 1601 1621 1648 1566 1612 1658 1643 1627 1676 1724 1616 1508 1475 1552 1594 1636 1693 1750 1739 1837
1599 1837 1814 1683 1564 1628 1689 1642 1511 1561 1548 1535 1587 1640 1678 1716 1762 1698 1746 1795 1809 1823 1767 1710 1749 1679 1578 1587 1683 1780 1799 1709 1625 1542 1520
$$ packed form
1636A612J0RRJ0j8j8j8j7O0O0O0O1j0ro3o3L3L4L4L4POPPp8p7k3k3M9M8J17j01j6j7K5K4r
1630A756j0j00j01R5R4MLm5m6J0RK0K1K0K1K3K4L8L7j47P1n2n1PQPPklklq4q4OPN3N4jjJ04
1624A767J03k3k4JJn4n4O1O1nj14n0n1n8n8J69J68L4L4l4j43j6R3j05j05L6L7QJ18K7q2pp
1619A728M1M1m7m8L7L7J31K3k30K4L9o9o1M8O6m4j35k5P9l0Q6Q6N5n5j09jJ6J6o9o8MNN8N9
1614A688m2m3J21J21LKo3j71J4J4R8R8k5k6r8J1J20o1j41l2R0R0NOM6M7m9j58m4O5mlK0K0
1609A719K0K0p2p2mj12lJ06M5o4JJQ4Q5L2L2j15j16j39J15J28n3M3M3l0P9n0n0m4m3O7O8o0
1604A661n9J1J2J2J2J9J9Q0k9m9n0k9l0K1K0K7q2M6M6j5j6M9M8j08j08l3P7M2M2N7N7j1R8
1599A837k3j31j19O4O1m7j31N0j3j3N2N3L8L8M6o4M8M9J4J4n6n7L9p0j01RR6R7J9r0q4q3k2
$$ plain form
1594 1520 1498 1567 1635 1670 1704 1676 1649 1766 1773 1815 1856 1759 1662 1517 1554 1541 1529 1466 1513 1555 1597 1591 1585 1690 1795 1816 1837 1733 1739 1710 1681 1739 1797 1827
1588 1827 1858 1781 1705 1690 1675 1591 1617 1635 1654 1633 1612 1744 1876 1980 1903 1873 1843 1725 1606 1583 1668 1771 1764 1772 1779 1765 1750 1736 1721 1676 1631 1640 1650
1583 1650 1617 1584 1483 1600 1697 1793 1812 1832 1829 1827 1770 1713 1638 1563 1579 1595 1688 1781 1783 1786 1754 1722 1745 1768 1748 1728 1762 1797 1787 1777 1794 1812 1775 1738 1673
1578 1673 1609 1671 1732 1739 1747 1782 1818 1799 1780 1777 1774 1716 1659 1642 1625 1663 1700 1695 1689 1738 1787 1836 1885 1844 1802 1800 1798 1795 1793 1818 1842 1704 1783 1884 1767 1732 1697 1661
1572 1661 1624 1642 1660 1680 1701 1694 1688 1724 1760 1705 1650 1690 1730 1770 1810 1801 1792 1784 1775 1757 1740 1631 1523 1522 1521 1575 1629 1616 1603 1590 1576 1577 1577 1523 1469 1495 1520 1601
1566 1601 1681 1697 1712 1701 1689 1747 1806 1773 1740 1710 1680 1650 1620 1655 1690 1698 1706 1790 1874 1830 1787 1751 1716 1628 1794 1771 1748 1803 1748 1760 1773 1724 1675 1697 1719
1561 1719 1686 1653 1672 1690 1708 1727 1761 1796 1777 1757 1751 1745 1793 1841 1791 1740 1689 1639 1730 1821 1785 1749 1702 1654 1600 1655 1739 1823 1780 1737 1755 1665 1551 1438
1556 1438 1381 1434 1491 1656 1699 1741 1656 1572 1560 1439 1542 1646 1650 1653 1610 1566 1503 1550 1723 1787 1804 1821 1742 1772 1805 1838 1758 1677 1637 1706 1720 1625 1608
$$ packed form
1594A520k2O9O8L5L4k8k7J17PM2M1r7r7j45L7j3j2o3M7M2M2ooJ05J05K1K1j04Ok9k9N8N8L0
1588A827L1p7p6j5j5q4K6J8J9k1k1J32J32J04p7l0l0j18j19k3Q5J03pQPj4j5j4j5m5m5RJ0
1583A650l3l3j01J17R7R6J9K0lkn7n7p5p5J6J6R3R3KLl2l2K3K3k0k0L4L5j0j0J7J8l7l7o5
1578A673o4O2O1PQL5L6j9j9lln8n7j7j7L8L7noM9M9M9M9m1m2kklkK5K4j38P9J01j17l5l5l6
1572A661l7J8J8K0K1poL6L6n5n5M0M0M0M0rrqrj8j7j09j08jjN4N4j3j3j3j4J%n4n4K6K5Q1
1566A601Q0J6J5j1j2N8N9l3l3l0l0l0l0L5L5QQQ4Q4m4m3l6l5q8J66k3k3N5n5J2J3m9m9K2K2
1561A719l3l3J9J8J8J9L4L5j9k0ooM8M8n0n1n1n0R1R1l6l6m7m8n4N5Q4Q4m3m3J8r0j14j13
1556A438n7N3N7J65M3M2q5q4j2j21J03J04MLm3m4o3M7J73O4J7J7p9L0L3L3q0q1m0O9J4r5j7
$$ plain form
1551 1608 1590 1682 1664 1668 1673 1615 1558 1596 1634 1644 1654 1668 1681 1796 1730 1708 1686 1671 1547 1455 1546 1561 1576 1585 1702 1799 1787 1674 1670 1732 1794 1762 1839 1957
1546 1957 1894 1861 1828 1784 1740 1738 1736 1734 1732 1752 1772 1737 1702 1721 1741 1760 1780 1744 1707 1514 1503 1592 1682 1692 1702 1681 1660 1693 1726 1678 1631 1638 1645 1671 1696 1783 1761
1540 1761 1681 1601 1728 1600 1463 1580 1691 1692 1667 1642 1664 1686 1694 1701 1736 1771 1780 1789 1771 1753 1754 1755 1736 1718 1637 1666 1688 1710 1678 1646 1669 1691 1739 1787 1678
1535 1678 1569 1495 1530 1594 1658 1750 1841 1813 1784 1602 1529 1558 1587 1627 1667 1720 1665 1619 1683 1645 1606 1688 1662 1642 1622 1630 1638 1585 1531 1537 1434 1333 1486
1530 1486 1654 1713 1722 1731 1758 1785 1728 1672 1624 1685 1630 1575 1626 1677 1830 1801 1726 1652 1620 1588 1537 1486 1537 1697 1705 1713 1674 1634 1590 1546 1586 1626 1743 1751 1687
1524 1687 1623 1710 1689 1577 1574 1634 1693 1668 1644 1606 1567 1559 1659 1697 1735 1762 1607 1566 1635 1751 1867 1898 1820 1803 1785 1729 1672 1601 1640 1714 1678 1650 1621
1519 1621 1679 1628 1414 1308 1451 1594 1653 1711 1699 1687 1628 1568 1529 1599 1574 1549 1665 1671 1685 1698 1690 1681 1584 1596 1635 1674 1809 1834 1779 1724 1655 1696 1759
1514 1759 1823 1839 1854 1817 1780 1688 1596 1570 1545 1665 1675 1709 1633 1578 1632 1706 1780 1777 1773 1670 1675 1771 1758 1675 1593 1566 1538 1512 1596 1679 1654 1614 1575 1596 1509
$$ packed form
1551A608j8R2j8MNn8n7L8L8J0J0J4J3J15o6k2k2j5j24r2R1J5J5RJ17R7j2j13mO2O2l2P7J18
1546A957o3l3l3m4m4kkkkK0K0l5l5J9K0J9K0l6l7j93j1Q9R0J0J0k1k1L3L3m8m7PPK6K5Q7k2
1540A761q0q0J27j28j37J17J11Jk5k5K2K2QPL5L5RRj8j8JJj9j8q1K9K2K2l2l2K3K2M8M8j09
1535A678j09p4L5O4O4R2R1k8k9j82p3K9K9M0M0N3n5m6O4l8l9Q2k6k0k0QQn3n4Oj03j01J53
1530A486J68N9RRK7K7n7n6m8O1n5n5N1N1J53k9p5p4l2l2n1n1N1J60QQl9m0m4m4M0M0J17Qo4
1524A687o4Q7k1j12lO0N9k5k4l8l9qJ00L8L8K7j55m1O9J16J16L1p8j7j8n6n7p1L9P4l6k8k9
1519A621N8n1k14j06J43J43N9N8j2j2n9o0l9P0k5k5J16OJ4J3qrr7J2L9L9J35K5n5n5o9M1O3
1514A759O4J6J5l7l7r2r2k6k5J20J0L4p6n5N4P4P4lmj03NR6j3q3q2k7k8k6Q4Q3k5m0l9K1q7
$$ plain form
1509 1509 1510 1621 1749 1696 1543 1571 1613 1655 1636 1617 1725 1834 1818 1803 1856 1799 1745 1801 1660 1629 1769 1728 1632 1536 1597 1658 1559 1570 1637 1596 1466
1504 1466 1517 1541 1565 1608 1541 1506 1471 1629 1787 1759 1732 1796 1859 1802 1744 1679 1723 1716 1709 1709 1709 1700 1690 1790 1708 1599 1599 1617 1636 1587 1538 1580 1622 1691 1760
1499 1760 1775 1790 1791 1792 1738 1685 1718 1751 1736 1721 1663 1714 1759 1621 1550 1589 1677 1656 1579 1611 1695 1779 1752 1615 1567 1519 1533 1547 1683 1710 1593 1585 1519 1454
1494 1454 1441 1610 1676 1743 1795 1847 1808 1769 1772 1775 1805 1835 1769 1703 1659 1725 1807 1781 1706 1741 1773 1806 1852 1789 1756 1722 1805 1778 1619 1568 1613 1658 1710 1761
1488 1761 1790 1710 1605 1608 1605 1602 1550 1606 1692 1596 1431 1520 1607 1584 1592 1600 1601 1602 1593 1584 1677 1770 1681 1773 1919 1884 1763 1642 1709 1777 1797 1816 1745 1674 1665 1655 1700
1483 1700 1745 1774 1803 1809 1706 1559 1520 1534 1548 1654 1652 1657 1661 1657 1652 1763 1766 1756 1745 1667 1698 1766 1834 1757 1789 1763 1737 1699 1771 1783 1613 1679 1746 1647 1547
1477 1547 1507 1576 1751 1817 1825 1832 1797 1762 1734 1707 1586 1575 1630 1685 1702 1719 1688 1658 1598 1648 1581 1515 1509 1504 1528 1662 1636 1611 1647 1683 1673 1664 1552 1622 1611
1472 1611 1600 1533 1574 1672 1661 1664 1667 1671 1675 1726 1778 1785 1683 1698 1712 1656 1601 1553 1504 1510 1625 1679 1733 1778 1823 1705 1587 1616 1645 1729 1813 1768 1724 1691 1658
$$ packed form
1509A509JJ11J28n3j53K8M2M2j9j9J08J09j6j5N3n7n4N6j41l1J40m1r6r6O1O1r9J1O7m1j30
1504A466N1K4K4M3o7l5l5J58J58k8k7O4O3n7n8o5M4pp%%rj0J00q2j09%J8J9m9m9M2M2O9O9
1499A760J5J5JJn4n3L3L3j5j5n8N1M5j38p1L9Q8k1p7L2Q4Q4k7j37m8m8J4J4J36K7j17qo6o5
1494A454j3J69O6O7N2N2l9l9LLL0L0o6o6m4O6Q2k6p5L5L2L3M6o3l3l4Q3k7j59n1M5M5N2N1
1488A761K9q0j05Llln2N6Q6r6j65Q9Q7k3QQJJrrR3R3q9R2J46l5j21j21O7O8K0J9p1p1rj0M5
1483A700M5K9K9Oj03j47l9J4J4J06kNMmnJ11Lj0j1p8L1O8O8p7L2k6k6l8P2J2j70O6O7r9j00
1477A547m0O9J75O6QPl5l5k8k7j21j1N5N5J7J7l1l0o0N0o7o6onK4J34k6k5L6L6j0rj12P0j1
1472A611j1o7M1R8j1LLMMN1N2Pj02J5J4n6n5m8m9OJ15N4N4M5M5j18j18K9K9Q4Q4m5m4l3l3
$$ plain form
1467 1658 1635 1794 1724 1653 1679 1704 1675 1646 1650 1654 1712 1771 1756 1741 1726 1710 1689 1667 1645 1623 1647 1671 1749 1828 1770 1713 1655 1597 1686 1775 1700 1625 1617 1609 1692 1775
1461 1775 1724 1672 1676 1679 1654 1628 1603 1578 1633 1687 1687 1687 1704 1721 1684 1647 1565 1484 1493 1503 1538 1574 1555 1536 1569 1602 1635 1668 1592 1516 1603 1690 1647 1603 1559 1516 1572
1456 1572 1628 1630 1631 1644 1656 1668 1680 1638 1596 1717 1838 1778 1717 1657 1596 1671 1745 1729 1713 1641 1568 1586 1604 1591 1577 1618 1659 1630 1601 1663 1725 1759 1792 1735
1450 1735 1678 1665 1651 1638 1625 1694 1764 1743 1722 1690 1658 1717 1776 1784 1792 1698 1786 1856 1927 1918 1909 1902 1894 1795 1697 1633 1569 1559 1549 1580 1612 1643 1674 1711 1747 1770 1793
1445 1793 1835 1660 1477 1513 1603 1584 1586 1587 1595 1602 1700 1798 1841 1883 1874 1755 1640 1744 1840 1719 1709 1699 1702 1706 1675 1644 1697 1750 1795 1731 1606 1699 1694 1689 1698 1707
1439 1707 1650 1592 1590 1587 1563 1539 1606 1672 1714 1757 1672 1587 1602 1617 1632 1647 1657 1667 1677 1687 1688 1688 1716 1744 1699 1655 1701 1747 1750 1753 1702 1650 1671 1693 1687 1680 1686 1692 1698 1704
1433 1704 1688 1673 1657 1641 1648 1655 1662 1669 1679 1688 1697 1707 1737 1767 1770 1773 1751 1729 1798 1866 1787 1707 1682 1658 1692 1726 1670 1613 1575 1537 1553 1569 1624 1678 1649 1620 1657 1803
1427 1803 1760 1718 1689 1661 1648 1636 1752 1687 1519 1533 1675 1635 1520 1405 1384 1544 1649 1573 1637 1701 1602 1612 1719 1826 1777 1728 1757 1786 1761 1736
$$ packed form
1467A658k3J59p0p1K6K5k9k9MMN8N9j5j5j5j6k1k2k2k2K4K4P8P9n8n7n8n8Q9Q9p5p5qqQ3Q3
1461A775n1n2MLk5k6k5k5N5N4%%J7J7l7l7q2q1RJ0L5L6j9j9L3L3L3L3p6p6Q7Q7m3m4m4m3N6
1456A572N6KJJ3J2J2J2m2m2J21J21o0o1o0o1P5P4j6j6p2p3J8J8j3j4M1M1k9k9O2O2L4L3n7
1450A735n7j3j4j3j3O9P0k1k1l2l2N9N9QQr4Q8P0P1rrpqr9r8o4o4j0j0L1L2L1L1L7L6K3K3
1445A793M2j75j83L6R0j9KJQPR8R8M3M2rj19j15J04R6j21j0j0LMl1l1N3N3M5o4j25R3nnRR
1439A707n7n8klk4k4O7O6M2M3q5q5J5J5J5J5J0J0J0J0J%K8K8m5m4M6M6LLn1n2K1K2opOOOO
1433A704j6j5j6j6PPPPJ0RRJ0L0L0LLk2k2O9O8p9q0k5k4L4L4n6n7l8l8J6J6N5N4k9k9L7J46
1427A803m3m2k9k8j3j2J16o5j68J4J42m0j15j15k1J60J05p6O4O4r9J0J07J07m9m9K9K9k5k5
$$ plain form
1423 1736 1654 1572 1555 1539 1555 1752 1756 1760 1774 1788 1782 1775 1689 1712 1764 1817 1813 1809 1744 1788 1709 1629 1654 1679 1674 1777 1825 1765 1690 1615 1660 1705 1705 1706 1653 1599 1621 1643
1417 1643 1666 1688 1671 1654 1576 1607 1623 1638 1640 1642 1559 1584 1671 1649 1625 1710 1700 1690 1641 1592 1427 1517 1532 1546 1625 1703 1799 1785 1742 1699 1652 1604 1646 1578 1589
1412 1589 1600 1695 1790 1799 1807 1725 1643 1585 1527 1524 1521 1555 1590 1598 1605 1647 1688 1702 1717 1705 1694 1683 1672 1746 1819 1802 1784 1791 1798 1714 1630 1667 1705 1742 1780 1729 1679 1756
1406 1756 1833 1820 1807 1667 1527 1621 1715 1754 1794 1688 1582 1712 1842 1731 1620 1600 1579 1548 1516 1539 1561 1652 1742 1778 1813 1693 1572 1578 1584 1672
1401 1672 1760 1757 1754 1662 1571 1643 1715 1695 1676 1711 1746 1743 1741 1738 1736 1682 1628 1664 1701 1740 1779 1763 1747 1718 1688 1658 1628 1684 1739 1667 1596 1613 1630 1557 1484 1582 1680
1396 1680 1687 1694 1667 1640 1614 1587 1664 1742 1729 1715 1696 1677 1658 1639 1606 1573 1595 1617 1658 1700 1741 1782 1836 1890 1816 1743 1781 1818 1801 1784 1786 1789 1791 1793 1808 1824 1784
1390 1784 1745 1745 1745 1630 1515 1419 1505 1503 1392 1356 1430 1563 1695 1735 1774 1814 1854 1842 1831 1819 1808 1798 1789 1780 1770 1702 1633 1620 1606 1662 1719 1830 1941
1385 1941 1792 1642 1619 1596 1609 1622 1683 1562 1505 1447 1506 1564 1613 1662 1620 1578 1516 1454 1483 1511 1522 1534 1599 1665 1659 1653 1647 1642 1700 1759 1727 1696 1631 1566 1556
$$ packed form
1423A736q2q2j7j6J6J97MMJ4J4opq6K3N2N3mmo5M4p9q0K5K5nJ03M8o0p5p5M5M5%Jn3n4K2K2
1417A643K3K2j7j7p8L1J6J5KKq3K5Q7k2k4Q5j0j0m9m9j65R0J5J4P9P8R6j4m3m3m7m8M2o8J1
1412A589J1R5R5RQq2q2n8n8llL4L5QPM2M1J4J5j2j1j1j1P4P3j7j8PPq4q4L7L8L7L8n1n0P7
1406A756P7j3j3j40j40R4R4L9M0j06j06J30J30j11j11k0k1l1l2K3K2R1R0L6L5j20j21OOQ8
1401A672Q8llr2r1P2P2k0j9L5L5lklkn4n4L6L7L9L9j6j6k9l0l0l0N6N5p2p1J7J7p3p3R8R8
1396A680PPk7k7k6k7P7P8j3j4j9j9j9j9l3l3K2K2M1M2M1M1N4N4p4p3L8L7j7j7KLKKJ5J6m0
1390A784l9%%j15j15r6Q6kj11l6P4J33J32M0L9M0M0j2j1j2j1j0rrj0o8o9j3j4N6N7J11J11
1385A941j49j50k3k3J3J3O1j21n7n8N9N8M9M9m2m2o2o2K9K8J1J2O5O6ooonN8N9l2l1o5o5j0
$$ plain form
1380 1556 1545 1581 1618 1600 1581 1641 1702 1707 1713 1692 1672 1651 1631 1570 1508 1538 1567 1592 1617 1642 1666 1665 1664 1663 1661 1658 1655 1652 1649 1752 1854 1793 1732 1756 1780 1798 1815 1884
1374 1884 1845 1703 1743 1711 1570 1399 1410 1507 1603 1619 1636 1737 1838 1739 1640 1670 1701 1641 1580 1550 1520 1544 1568 1600 1631 1564 1498 1634 1661 1629 1597
1369 1597 1614 1740 1721 1701 1680 1768 1863 1849 1655 1571 1520 1579 1610 1642 1681 1720 1773 1826 1789 1751 1741 1731 1837 1834 1783 1732 1820 1798 1908 1909 1837 1766 1705
1364 1705 1645 1669 1692 1679 1556 1586 1616 1657 1698 1623 1658 1652 1646 1634 1730 1814 1789 1705 1621 1626 1631 1635 1640 1638 1635 1688 1740 1691 1643 1594 1546 1614 1682 1660 1638 1633 1628 1569 1691
1358 1691 1708 1616 1596 1576 1602 1627 1562 1497 1502 1507 1512 1517 1470 1424 1469 1514 1521 1528 1536 1543 1559 1576 1484 1573 1629 1576 1542 1507 1523 1539 1549 1558 1658 1649 1640 1740 1794 1849 1896
1352 1896 1835 1679 1778 1843 1799 1747 1695 1666 1746 1692 1638 1784 1748 1752 1755 1700 1644 1611 1687 1757 1644 1550 1564 1658 1642 1589 1535 1601 1668 1640 1612 1675 1738 1695
1347 1695 1653 1665 1677 1731 1785 1840 1894 1890 1885 1790 1694 1751 1808 1865 1922 1851 1780 1709 1638 1649 1660 1671 1682 1661 1640 1620 1599 1634 1669 1705 1740 1700 1660 1511 1544
1342 1544 1660 1667 1746 1826 1843 1860 1822 1785 1767 1749 1731 1713 1749 1784 1765 1746 1706 1665 1679 1693 1672 1651 1630 1609 1584 1560 1627 1693 1689 1686 1682 1678 1667 1656 1700 1744
$$ packed form
1380A556j1L6L7j8j9O0O1NOk1k0k1k0o1o2L0K9K5K5K5K4jjjkllllJ03J02o1o1K4K4J8J7O9
1374A884l9j42M0l2j41j71J1R7R6J6J7J01J01r9r9L0L1o0o1l0l0K4K4L2L1o7o6J36K7l2l2
1369A597J7J26j9k0k1Q8R5j4j94q4n1N9L1L2L9L9N3N3l7l8j0j0J06ln1n1Q8k2J10Jp2p1o1
1364A705o0K4K3j3j23L0L0M1M1p5L5ooj2R6Q4k5q4q4NNMNklN3N2m9m8m9m8O8O8k2k2nnn9J22
1358A691J7r2k0k0K6K5o5o5NNNNm7m6M5M5PPQPJ6J7r2Q9N6n3l4l5J6J6J0RJ00rrJ00N4N5M7
1352A896o1j56R9O5m4n2n2k9Q0n4n4J46l6MLn5n6l3P6P0j13r4J4R4j6n3n4O6O7k8k8O3O3m3
1347A695m2J2J2N4N4N5N4mnr5r6N7N7N7N7p1p1p1p1J1J1J1J1k1k1k0k1L5L5L6L5m0m0j49L3
1342A544J16PP9Q0J7J7l8l7j8j8j8j8L6L5j9j9m0m1J4J4k1k1k1k1k5k4O7O6mlmmj1j1M4M4
$$ plain form
1336 1744 1740 1736 1732 1728 1676 1624 1662 1701 1702 1704 1705 1706 1741 1775 1810 1845 1793 1742 1745 1748 1800 1852 1813 1775 1695 1616 1627 1639 1679 1719 1705 1691 1707 1722 1737 1753 1737 1722 1707
1330 1707 1691 1629 1567 1488 1410 1432 1635 1744 1743 1737 1731 1664 1597 1593 1588 1650 1711 1663 1796 1838 1699 1670 1641 1601 1561 1575 1588 1601 1614 1629 1643 1658 1672 1664 1655 1647
1325 1647 1639 1659 1679 1699 1719 1664 1609 1718 1827 1784 1741 1753 1765 1686 1607 1619 1631 1681 1731 1690 1649 1607 1565 1650 1735 1706 1677 1648 1620 1578 1536 1585 1634 1620
1320 1620 1607 1566 1525 1519 1513 1598 1682 1673 1663 1600 1536 1570 1605 1640 1675 1659 1644 1683 1723 1734 1745 1701 1658 1656 1654 1707 1760 1611 1463 1478 1493 1542 1592 1668 1745 1740
1314 1740 1736 1725 1714 1804 1785 1814 1661 1614 1748 1783 1709 1610 1620 1726 1649 1632 1724 1757 1681 1598 1625 1703 1782 1762 1634 1621 1608 1646 1683 1687 1690 1733 1667 1649
1309 1649 1739 1732 1616 1525 1434 1438 1624 1694 1583 1534 1667 1631 1596 1563 1530 1588 1646 1672 1699 1671 1643 1697 1750 1775 1690 1731 1772 1648 1632 1682 1623 1578 1533
1304 1533 1563 1594 1672 1750 1786 1713 1674 1635 1639 1642 1680 1718 1657 1706 1659 1612 1720 1719 1717 1716 1779 1733 1694 1654 1669 1684 1699 1714 1752 1791 1707 1732 1795 1749 1717 1685
1298 1685 1687 1688 1647 1606 1529 1634 1651 1558 1502 1555 1594 1633 1682 1731 1719 1707 1741 1667 1585 1613 1692 1662 1621 1580 1488 1577 1701 1643 1609 1685 1708 1732 1721 1601
$$ packed form
1336A744mmmmn2n2L8L9JKJJL5L4L5L5n2n1LLN2N2l9l8q0p9J1J2M0M0j4j4J6J5J5J6j6j5j5
1330A707j6o2o2p9p8K2K03J09jooo7o7mnO2O1m8J33M2j39k9k9m0m0J4J3J3J3J5J4J5J4qrq
1325A647qK0K0K0K0n5n5J09J09m3m3J2J2p9p9J2J2N0N0m1m1m2m2Q5Q5k9k9k9k8m2m2M9M9j4
1320A620j3m1m1ooQ5Q4rj0o3o4L4L5L5L5j6j5L9M0J1J1m4m3kkN3N3j49j48J5J5M9N0P6P7n
1314A740mj1j1R0j9K9j53m7J34L5p4r9J0J06p7j7R2L3p6q3K7P8P9k0j28j3j3L8L7MLM3o6j8
1309A649R0pj16r1r1MJ86P0j11m9J33l6l5l3l3N8N8K6K7k8k8N4N3K5q5M1M1j24j6N0n9m5m5
1304A533L0L1P8P8L6p3l9l9MLL8L8o1M9m7m7J08jkjO3m6l9m0J5J5J5J5L8L9q4K5O3m6l2l2
1298A685KJm1m1p7J05J7r3n6N3L9L9M9M9j2j2L4p4q2K8P9l0m1m1r2Q9J24n8l4P6K3K4j1j20
$$ plain form
1293 1601 1561 1702 1796 1781 1809 1728 1720 1713 1644 1685 1662 1749 1800 1668 1553 1547 1558 1570 1576 1582 1527 1581 1643 1704 1646 1587 1559 1531 1521 1620 1708 1615 1631 1647 1662
1288 1662 1677 1601 1525 1631 1737 1715 1694 1683 1673 1662 1652 1705 1758 1611 1464 1500 1536 1579 1621 1559 1605 1681 1756 1742 1729 1660 1592 1673 1755 1746 1736 1795 1854
1283 1854 1822 1790 1658 1526 1467 1517 1509 1610 1671 1622 1564 1614 1542 1469 1482 1495 1508 1521 1571 1621 1653 1794 1805 1635 1596 1666 1669 1563 1514 1646 1647 1647 1598
1278 1598 1658 1690 1723 1762 1802 1793 1784 1727 1670 1678 1795 1796 1798 1671 1545 1516 1487 1418 1459 1554 1540 1558 1577 1650 1614 1645 1676 1646 1507 1411 1496 1625 1644 1607
1273 1607 1570 1520 1578 1620 1662 1738 1632 1487 1596 1605 1614 1629 1644 1660 1675 1698 1721 1697 1672 1633 1703 1711 1610 1662 1604 1594 1694 1722 1751 1793 1727 1732 1737 1735 1733
1267 1733 1634 1536 1633 1620 1547 1582 1604 1625 1636 1646 1595 1653 1638 1622 1565 1509 1473 1547 1613 1680 1749 1818 1825 1942 1906 1871 1842 1813 1777 1740 1710 1680 1673 1775
1262 1775 1689 1603 1615 1628 1586 1544 1633 1722 1709 1587 1555 1524 1541 1557 1581 1606 1684 1763 1692 1621 1605 1588 1575 1562 1604 1645 1693 1741 1760 1670 1615 1560 1552 1545 1528
1257 1528 1512 1616 1720 1739 1649 1606 1673 1717 1652 1594 1645 1657 1669 1688 1707 1713 1719 1658 1705 1723 1633 1604 1684 1691 1698 1712 1726 1647 1568 1543 1519 1556 1594 1541 1488
$$ packed form
1293A601m0J41R4j5K8q1qpo9M1k3Q7N1j32j15oJ1J2OOn5N4O2O1n8n9k8k8j0R9Q8r3J6J6J5
1288A662J5p6p6J06J06k2k1j1j0j1j0N3N3j47j47L6L6M3M2o2M6P6P5j4j3o9o8Q1Q2rj0N9N9
1283A854l2l2j32j32n9N0qJ01O1m9n8N0p2p3J3J3J3J3N0N0L2J41J1j70l9P0Lj06m9J32J%m9
1278A598O0L2L3L9M0rrn7n7QJ17JKj27j26k9k9o9M1R5j4J8J9P3l6L1L1l0j39r6Q5J29J9l7
1273A607l7n0N8M2M2P6j06j45J09RRJ5J5J6J5K3K3k4k5l9P0Qj01N2n8j0J00K8K9M2o6NNkk
1267A733r9r8R7j3p3L5K2K1J1J0n1N8j5j6n7n6l6P4O6O7O9O9PJ17l6l5k9k9l6l7l0l0pJ02
1262A775q6q6J2J3m2m2Q9Q9j3j22l2l1J7J6K4K5P8P9p1p1j6j7j3j3M2M1M8M8J9r0n5n5qpj7
1257A528j6J04J04J9r0m3O7M4o5n8N1J2J2J9J9OOo1M7J8r0k9Q0PPJ4J4p9p9k5k4L7L8n3n3
$$ plain form
1251 1488 1599 1710 1694 1677 1713 1749 1731 1712 1704 1695 1632 1569 1575 1581 1587 1593 1631 1669 1579 1490 1629 1768 1843 1701 1594 1705 1806 1908 1827 1746 1793 1839 1795
1246 1795 1751 1708 1664 1628 1592 1557 1521 1549 1577 1605 1633 1638 1644 1649 1654 1699 1745 1790 1835 1757 1680 1602 1525 1533 1542 1550 1559 1603 1648 1639 1629 1610 1590 1662 1733 1719 1706 1747 1787
1240 1787 1728 1669 1610 1551 1648 1744 1713 1683 1634 1585 1590 1595 1601 1606 1557 1508 1463 1419 1502 1585 1596 1607 1619 1630 1615 1599 1638 1678 1645 1613 1580 1548 1583 1618 1653 1688
1235 1688 1665 1642 1619 1597 1653 1710 1640 1570 1568 1565 1563 1561 1589 1616 1650 1576 1471 1365 1355 1454 1410 1366 1390 1414 1423 1541 1659 1668 1614 1561 1530 1609 1597 1586 1581 1577
1229 1577 1603 1629 1648 1668 1805 1833 1766 1700 1570 1550 1552 1554 1586 1509 1493 1477 1507 1538 1568 1599 1654 1709 1710 1711 1703 1694 1602 1510 1500 1598 1635 1672 1650 1628 1606 1584
1224 1584 1639 1694 1701 1709 1585 1571 1688 1624 1590 1556 1518 1480 1447 1523 1597 1780 1865 1840 1720 1600 1595 1589 1675 1760 1742 1724 1638 1661 1760 1750 1612 1584 1631
1219 1631 1569 1575 1580 1644 1708 1710 1712 1802 1783 1770 1758 1678 1598 1547 1605 1555 1504 1399 1402 1473 1544 1723 1721 1668 1615 1605 1595 1588 1582 1507 1541 1601 1551 1569 1588 1656 1724
1213 1724 1629 1533 1616 1699 1618 1538 1637 1736 1744 1752 1769 1785 1801 1817 1755 1692 1750 1808 1767 1618 1522 1536 1531 1526 1582 1638 1683 1728 1834 1831 1762 1693 1617 1541 1536 1530 1416
$$ packed form
1251A488J11J11j6j7L6L6j8j9qro3o3OOOOL8L8r0q9J39J39P5j42j07J11J01J02q1q1M7M6m4
1246A795m4m3m4l6l6l5l6K8K8K8K8NONNM5M6M5M5p8p7p8p7QRQRM4M5rj0j9k0P2P1j4j3M1M0
1240A787n9n9n9n9R7R6l1l0m9m9NNONm9m9m5m4Q3Q3J1J1J2J1j5j6L9M0l3l2l3l2L5L5L5L5
1235A688k3k3k3k2N6N7p0p0klkkK8K7L4p4j05j06j0R9m4m4K4K4RJ18J18Rn4n3l1P9j2j1nm
1229A577K6K6J9K0J37K8o7o6j30k0KKL2p7j6j6L0L1L0L1N5N5JJqrr2r2j0R8L7L7k2k2k2k2
1224A584N5N5PQj24j4J17o4l4l4l8l8l3P6P4J83Q5k5j20j20noQ6Q5j8j8q6K3R9j0j38k8M7
1219A631o2ONO4O4KKR0j9j3j2q0q0n1N8n0n1j05LP1P1J79kn3n3j0j0pop5L4O0n0J8J9O8O8
1213A724r5r6Q3Q3q1q0R9R9QQJ7J6J6J6o2o3N8N8m1j49r6J4nnN6N6M5M5J06lo9o9p6p6noj14
$$ plain form
1208 1416 1483 1582 1572 1634 1697 1670 1642 1554 1575 1578 1582 1531 1480 1634 1679 1657 1636 1585 1533 1427 1431 1425 1528 1553 1470 1442 1523 1597 1562 1676 1790 1758 1618
1203 1618 1592 1566 1534 1610 1592 1683 1738 1611 1563 1624 1725 1646 1535 1606 1716 1717 1671 1625 1621 1616 1707 1688 1647 1606 1517 1537 1622 1708 1704 1700 1702 1705 1632 1668 1697 1726
1197 1726 1691 1655 1681 1706 1670 1742 1801 1860 1874 1778 1751 1723 1608 1602 1643 1503 1480 1567 1574 1690 1733 1775 1660 1546 1507 1467 1518 1570 1534 1499 1591 1683 1712
1192 1712 1742 1771 1800 1745 1689 1688 1687 1642 1596 1551 1505 1577 1648 1719 1790 1737 1683 1720 1757 1704 1650 1651 1652 1648 1643 1693 1743 1740 1737 1735 1732 1713 1695 1676 1658 1696 1735 1697 1659
1186 1659 1498 1555 1581 1606 1610 1615 1619 1623 1664 1704 1691 1677 1686 1695 1581 1685 1670 1655 1613 1571 1396 1439 1486 1534 1486 1438 1481 1524 1527 1530 1587 1645 1723 1801 1788 1775
1181 1775 1786 1798 1732 1666 1578 1709 1717 1724 1708 1692 1621 1551 1524 1498 1562 1627 1642 1658 1619 1580 1568 1557 1600 1642 1653 1663 1510 1357 1405 1453 1500 1548 1621 1693
1175 1693 1638 1584 1595 1606 1629 1651 1648 1826 1805 1784 1842 1791 1801 1812 1737 1663 1679 1696 1717 1738 1759 1780 1692 1605 1608 1612 1641 1671 1694 1717 1769 1713 1650 1696 1821
1170 1821 1836 1792 1749 1719 1688 1658 1628 1652 1676 1645 1615 1591 1567 1543 1519 1618 1718 1654 1590 1570 1550 1585 1619 1645 1670 1689 1816 1802 1788 1664 1650 1633 1617
$$ packed form
1208A416O7R9j0O2O3k7k8q8K1LMn1n1J54M5k2k1n1n2j06MoJ03K5q3k8Q1P4l5J14J14l2j40
1203A618k6k6l2P6j8R1N5j27m8O1J01p9j11P1J10Jm6m6mnR1j9m1m1q9K0Q5Q6mmKLp3L6K9K9
1197A726l5l6K6K5l6P2N9N9J4r6k7k8j15oM1j40k3Q7PJ16M3M2j15j14l9m0N1N2l6l5R2R2K9
1192A712L0K9K9n5n6jjm5m6m5m6P2P1P1P1n3n4L7L7n3n4JJmnN0N0llklj9j8j9j8L8L9l8l8
1186A659j61N7K6K5MNMMM1M0j3j4RRj14J04j5j5m2m2j75M3M7M8m8m8M3M3LLN7N8P8P8j3j3
1181A775J1J2o6o6q8J31QPj6j6p1p0k7k6O4O5J5J6l9l9j2j1M3M2J1J0j53j53M8M8M7M8P3P2
1175A693n5n4J1J1K3K2lJ78k1k1N8n1J0J1p5p4J6J7K1K1K1K1q8q7LMK9L0K3K3N2n6o3M6J25
1170A821J5m4m3l0l1l0l0K4K4l1l0k4k4k4k4R9J00o4o4k0k0L5L4K6K5J9J27j4j4j24j4j7j6
$$ plain form
1165 1617 1662 1706 1685 1663 1725 1787 1831 1766 1708 1650 1632 1613 1686 1758 1753 1749 1744 1739 1698 1658 1624 1590 1514 1547 1525 1504 1513 1632 1736 1660 1666 1672 1750 1829 1863 1788 1690
1159 1690 1592 1583 1683 1699 1605 1516 1536 1572 1608 1636 1555 1547 1538 1543 1730 1784 1730 1704 1679 1737 1795 1815 1835 1801 1766 1814 1861 1818 1774 1667 1559 1572 1585 1640
1154 1640 1587 1602 1617 1598 1688 1819 1768 1754 1741 1710 1678 1706 1626 1559 1492 1408 1432 1621 1700 1598 1496 1484 1473 1475 1586 1643 1591 1598 1605 1697 1788 1784 1780 1776 1772
1149 1772 1743 1714 1692 1670 1646 1730 1747 1763 1788 1703 1680 1657 1665 1672 1673 1674 1702 1621 1554 1486 1486 1595 1642 1689 1716 1743 1770 1797 1741 1685 1616 1655 1676 1587 1574 1560
1143 1560 1532 1612 1625 1637 1681 1615 1543 1580 1674 1658 1591 1523 1584 1753 1734 1716 1673 1630 1527 1532 1587 1642 1559 1585 1529 1582 1641 1592 1596 1599 1548 1497 1516 1644
1138 1644 1725 1696 1634 1681 1722 1653 1675 1698 1713 1728 1719 1710 1617 1524 1597 1779 1863 1838 1822 1698 1639 1581 1575 1750 1906 1952 1917 1774 1739 1705 1669 1632 1651
1133 1651 1669 1701 1733 1711 1689 1730 1772 1820 1759 1739 1720 1784 1848 1802 1755 1762 1770 1753 1737 1605 1582 1543 1505 1534 1564 1529 1603 1704 1696 1674 1652 1707 1762 1778 1685
1128 1685 1647 1718 1728 1739 1804 1687 1645 1602 1481 1468 1527 1477 1476 1585 1787 1807 1700 1593 1579 1565 1666 1659 1727 1795 1661 1636 1667 1589 1606 1623 1550
$$ packed form
1165A617M5M4k1k2O2O2M4o5n8n8j8j9P3P2nmnnm1m0l4l4p6L3k2k1RJ19J04p6OOP8P9L4p5r8
1159A690r8rJ00J6r4q9K0L6L6K8q1qrNJ87N4n4k6k5N8N8K0K0l4l5M8M7m3m4j07j08J3J3N5
1154A640n3J5J5j9R0J31n1j4j3l1l2K8q0o7o7q4K4J89P9j02j02j2j1KJ11N7n2PPR2R1mmmm
1149A772k9k9k2k2k4Q4J7J6K5q5k3k3QPJJK8q1o7o8%J09M7M7K7K7K7K7n6n6o9L9K1q9j3j4
1143A560k8Q0J3J2M4o6p2L7R4j6o7o8O1J69j9j8m3m3j03NN5N5q3K6n6N3N9m9MLn1n1J9J28
1138A644Q1k9o2M7M1o9K2K3J5J5rrr3r3P3J82Q4k5j6j24n9n8oJ75J56M6l5j43l5l4l6l7J9
1133A651J8L2L2k2k2M1M2M8o1k0j9O4O4m6m7PQj7j6j32k3l9l8K9L0l5P4J01qk2k2N5N5J6r3
1128A685l8P1J0J1O5j17m2m3j21j3N9n0jJ09K02K0j07j07j4j4J01pO8O8j34k5L1p8J7J7p3
$$ plain form
1123 1550 1476 1504 1641 1648 1654 1568 1591 1739 1706 1600 1603 1589 1683 1723 1763 1726 1690 1744 1798 1748 1697 1702 1706 1711 1716 1649 1690 1821 1771 1702 1634 1603 1573 1634 1694 1660
1118 1660 1626 1653 1680 1597 1623 1615 1607 1662 1718 1732 1747 1853 1741 1538 1553 1633 1714 1680 1647 1716 1784 1762 1739 1627 1514 1601 1688 1684 1679 1702 1724 1717 1709 1728 1747
1112 1747 1604 1461 1482 1502 1486 1470 1482 1493 1601 1710 1691 1673 1685 1697 1709 1721 1754 1786 1791 1797 1717 1637 1611 1586 1652 1719 1758 1797 1780 1763 1720 1676 1704
1107 1704 1732 1706 1680 1639 1599 1685 1772 1796 1820 1790 1759 1751 1743 1681 1619 1593 1567 1596 1624 1594 1563 1478 1393 1432 1470 1563 1656 1719 1783 1755 1728 1672 1615 1613 1612 1675
1102 1675 1738 1829 1920 1886 1853 1728 1604 1711 1818 1871 1924 1973 2022 2058 2094 2221 2565 3133 3918 4536 4209 3416 2840 2622 2405 2328 2252
1098 2252 2215 2179 2029 1879 1703 1745 1755 1765 1759 1752 1746 1739 1719 1699 1624 1550 1534 1517 1501 1485 1534 1582 1685 1788 1792 1796 1722 1649 1480 1530 1620 1710 1777 1844
1092 1844 1857 1869 1801 1733 1792 1852 1840 1828 1816 1804 1803 1802 1802 1801 1775 1749 1777 1805 1847 1889 1877 1864 1851 1838 1824 1811 1851 1891 1840 1790 1733 1676 1709 1743 1733 1724 1715
1087 1715 1705 1707 1708 1709 1711 1627 1543 1623 1703 1712 1720 1729 1738 1659 1580 1628 1677 1672 1667 1608 1548 1621 1693 1674 1656 1766 1876 1860 1843 1818 1793 1769 1744 1736 1728 1775 1821 1733 1644
$$ packed form
1123A550p4K8J37POq6K3J48l3j06Lj4R4M0M0l7l6N4N4n0n1NMNNo7M1J31n0o9o8l1l0O1O0l4
1118A660l4K7K7q3K6qqN5N6J4J5J06j12k03J5Q0Q1l4l3O9O8k2k3j12j13Q7Q7mnK3K2pqJ9J9
1112A747j43j43K1K0j6j6J2J1J08J09j9j8J2J2J2J2L3L2NOq0q0k6k5O6O7L9L9j7j7m3m4K8
1107A704K8k6k6m1m0Q6Q7K4K4l0l1qqo2o2k6k6K9K8l0l1q5q5L9L8R3R3O3O4k8k7n6n7kjO3
1102A675O3R1R1l4l3j25j24J07J07N3N3M9M9L6L6J27L44N68P85O18l27p93n76k18k17p7p6
1098B252l7l6j50j50j76M2J0J0opopk0k0p5p4j6j7j6j6M9M8J03J03MMp4p3j69N0R0R0O7O7
1092A844J3J2o8o8N9O0j2j2j2j2jj%jk6k6K8K8M2M2j2j3j3j3j4j3M0M0n1n0n7n7L3L4j0rr
1087A715j0KJJKq4q4Q0Q0RQRRp9p9M8M9nnn9o0P3P2j9j8J10J10j6j7k5k5k4k5qqM7M6q8q9
$$ plain form
1081 1644 1610 1576 1676 1775 1906 1820 1818 1816 1801 1786 1764 1743 1630 1518 1583 1647 1658 1668 1655 1642 1629 1616 1592 1569 1673 1777 1728 1679 1721 1763 1780 1797
1076 1797 1687 1577 1553 1528 1595 1661 1640 1618 1650 1682 1639 1595 1679 1762 1684 1606 1583 1560 1549 1538 1473 1407 1444 1481 1518 1554 1587 1620 1652 1685 1620 1555 1581
1071 1581 1607 1646 1685 1633 1581 1663 1745 1628 1510 1506 1501 1442 1383 1408 1433 1404 1374 1383 1392 1455 1519 1548 1577 1607 1636 1643 1650 1657 1665 1565 1466 1457 1448 1540 1631 1632 1632 1667 1702
1065 1702 1646 1589 1609 1629 1703 1778 1726 1674 1622 1571 1655 1739 1768 1797 1798 1800 1801 1802 1757 1713 1669 1625 1631 1636 1642 1648 1651 1654 1657 1661 1633 1606 1633 1660 1632 1603 1575 1547 1449 1352
1059 1352 1491 1629 1690 1750 1684 1617 1560 1502 1499 1496 1494 1492 1544 1596 1592 1589 1585 1581 1585 1589 1647 1706 1689 1673 1656 1639 1540 1440 1431 1422 1484 1547 1609 1672 1641 1610 1579 1548 1536
1053 1536 1523 1456 1389 1511 1634 1550 1466 1580 1586 1523 1679 1731 1675 1566 1457 1494 1530 1567 1604 1602 1601 1654 1707 1664 1622 1580 1538 1581 1625 1579 1532 1498 1465
1048 1465 1523 1580 1560 1540 1519 1499 1418 1338 1421 1504 1610 1716 1586 1456 1489 1521 1554 1586 1633 1680 1673 1666 1687 1708 1638 1568 1625 1682 1684 1687 1628 1569 1587 1605
1043 1605 1733 1642 1620 1598 1667 1737 1852 1749 1635 1739 1707 1675 1594 1513 1487 1461 1527 1593 1605 1616 1583 1549 1570 1590 1668 1746 1697 1648 1648 1648 1648 1647 1692 1736
$$ packed form
1081A644l4l4J00R9J31q6kkj5j5k2k1j13j12O5O4J1J0j3j3j3j3k4k3J04J04m9m9M2M2J7J7
1076A797j10j10k4k5O7O6k1k2L2L2m3m4Q4Q3p8p8k3k3j1j1o5o6L7L7L7L6L3L3L2L3o5o5K6
1071A581K6L9L9n2n2Q2Q2j17j18mnn9n9K5K5k9l0RRO3O4K9K9L0K9PPPQj00r9rrR2R1J%L5L5
1065A702n6n7K0K0P4P5n2n2n2n1Q4Q4K9K9JKJJm5m4m4m4ONOOLLLMk8k7K7K7k8k9k8k8r8r7
1059A352J39J38O1O0o6o7n7n8llkkN2N2mlmmMMN8N9j7j6j7j7r9j00rrO2O3O2O3l1l1l1l1j2
1053A536j3o7o7J22J23q4q4J14Oo3J56N2n6j09j09L7L6L7L7kjN3N3m3m2m2m2M3M4m6m7l4l3
1048A465N8N7k0k0k1k0q1q0Q3Q3J06J06j30j30L3L2L3L2M7M7ppK1K1p0p0N7N7KLn9n9J8J8
1043A605J28r1k2k2O9P0J15j03j14J04l2l2q1q1k6k6O6O6J2J1l3l4K1K0P8P8m9m9%%%jM5M4
$$ plain form
1037 1736 1726 1716 1687 1658 1628 1599 1619 1638 1585 1641 1701 1580 1513 1628 1756 1776 1814 1851 1719 1586 1581 1575 1558 1540 1613 1686 1716 1746 1776 1806 1778 1749 1721
1032 1721 1693 1696 1700 1703 1706 1713 1720 1727 1734 1718 1702 1740 1779 1666 1553 1567 1581 1572 1562 1553 1543 1508 1473 1638 1803 1778 1753 1729 1704 1680 1655 1630 1606 1635 1663 1638 1612
1027 1612 1569 1527 1484 1441 1472 1503 1535 1566 1601 1636 1671 1706 1731 1755 1726 1696 1680 1663 1646 1630 1640 1651 1662 1672 1761 1850 1776 1702 1637 1571 1597 1622 1620 1618 1616 1614
1021 1614 1574 1533 1511 1597 1671 1563 1564 1566 1544 1522 1555 1588 1604 1621 1709 1689 1580 1651 1782 1731 1596 1642 1697 1643 1544 1554 1695 1836 1934 2031 1929 1826
1016 1826 1865 1903 1814 1726 1683 1641 1653 1666 1662 1659 1600 1542 1642 1742 1715 1688 1688 1688 1688 1688 1657 1626 1594 1563 1560 1557 1609 1660 1647 1633 1619 1606 1615 1624 1633 1642 1692 1742 1738 1733
1010 1733 1697 1661 1679 1698 1720 1742 1764 1786 1707 1628 1640 1652 1619 1587 1645 1703 1716 1729 1742 1755 1747 1739 1731 1723 1746 1769 1791 1814 1714 1614 1634 1654 1742 1720 1566
1005 1566 1595 1676 1758 1724 1690 1671 1652 1723 1795 1744 1693 1642 1591 1605 1619 1632 1646 1597 1547 1498 1448 1542 1635 1638 1640 1544 1447 1586 1726 1749 1773 1705 1638 1649
1000 1649 1660 1581 1501 1551 1600 1595 1591 1607 1623 1755 1779 1713 1648 1667 1685 1667 1648 1684 1720 1756 1792 1774 1755 1774 1792 1720 1648 1670 1691 1652 1722 1748 1774 1716 1549
$$ packed form
1037A736j0j0k9k9l0k9K0J9n3N6O0j21o7J15J28K0L8L7j32j33noj7j8P3P3L0L0L0L0k8k9k8
1032A721k8LMLLPPPPj6j6L8L9j13j13J4J4rj0rj0l5l5J65J65k5k5k4k5k4k5k5k4K9K8k5k6
1027A612m3m2m3m3L1L1L2L1L5L5L5L5K5K4k9l0j6j7j7j6J0J1J1J0Q9Q9p4p4o5o6K6K5kkkk
1021A614m0m1k2Q6P4j08JKk2k2L3L3J6J7Q8k0j09P1J31n1j35M6N5n4r9J0J41J41R8R7j02j03
1016A826L9L8q9q8m3m2J2J3mln9n8J00J00k7k7%%%%l1l1l2l1llN2N1j3j4j4j3RRRRN0N0mn
1010A733l6l6J8J9K2K2K2K2p9p9J2J2l3l2N8N8J3J3J3J3qqqqK3K3K2K3j00j00K0K0Q8k2j54
1005A566K9Q1Q2l4l4j9j9P1P2n1n1n1n1J4J4J3J4m9n0m9n0R4R3LKr6r7J39J40K3K4o8o7J1
1000A649J1p9q0N0M9nmJ6J6J32K4o6o5J9J8j8j9L6L6L6L6j8j9J9J8p2p2K2K1l9P0K6K6n8j67
$$ plain form
994 1549 1478 1588 1673 1759 1749 1631 1574 1517 1578 1639 1761 1774 1732 1690 1695 1701 1692 1684 1621 1559 1633 1707 1781 1855 1843 1831 1764 1697 1669 1640 1618 1596 1514 1541 1561
989 1561 1581 1668 1755 1820 1775 1674 1681 1682 1574 1590 1607 1610 1613 1686 1650 1617 1475 1465 1565 1719 1764 1629 1604 1674 1744 1713 1682 1698 1715 1747 1671 1594 1627 1657
984 1657 1686 1723 1759 1689 1619 1737 1747 1690 1632 1630 1627 1566 1613 1715 1707 1671 1634 1645 1656 1735 1814 1846 1877 1832 1895 1843 1791 1699 1607 1605 1604 1637 1670 1635 1709 1783
978 1783 1749 1754 1650 1666 1683 1639 1594 1634 1674 1625 1686 1695 1704 1593 1482 1531 1580 1568 1557 1697 1729 1829 1820 1783 1746 1730 1713 1586 1459 1422 1386 1438 1490
973 1490 1542 1594 1608 1622 1732 1732 1670 1717 1811 1796 1789 1782 1822 1862 1777 1691 1726 1761 1771 1672 1634 1596 1568 1540 1478 1525 1638 1751 1701 1650 1702 1645 1457 1450 1481
968 1481 1512 1608 1704 1728 1752 1649 1545 1519 1493 1684 1766 1727 1580 1516 1561 1616 1671 1733 1795 1711 1626 1597 1567 1647 1728 1754 1781 1748 1715 1621 1636 1627 1617
963 1617 1615 1612 1617 1621 1694 1657 1600 1651 1634 1617 1651 1686 1781 1768 1634 1500 1450 1400 1483 1566 1725 1701 1622 1542 1590 1638 1599 1741 1872 2003 1921 1839 1811 1783
958 1783 1845 1907 1878 1849 1805 1761 1716 1672 1555 1437 1556 1674 1661 1648 1662 1676 1679 1682 1685 1688 1651 1615 1523 1614 1721 1719 1699 1680 1580 1481 1545 1610 1569 1528
$$ packed form
994A549p1J10Q5Q6j0j18n7n7O1O1J22J3m2m2NOrqo3o2P4P4P4P4j2j2o7o7k8k9k2k2q2K7K0
989A561K0Q7Q7O5m5j01PJj08J6J7LLP3l6l3j42j0J00J54M5j35k5P0P0l1l1J6J7L2p6p7L3L0
984A657K9L7L6p0p0J18J0n7n8klo1M7J02ql6l7J1J1P9P9L2L1m5O3n2n2r2r2kjL3L3l5P4P4
978A783l4Nj04J6J7m4m5M0M0m9O1RRj11j11M9M9j2j1J40L2J00rl7l7j6j7j27j27l7l6N2N2
973A490N2N2J4J4J10%o2M7R4j5ppM0M0q5q6L5L5J0r9l8l8k8k8o2M7J13J13n0n1N2n7j88pL1
968A481L1R6R6K4K4j03j04k6k6J91Q2l9j47o4M5N5N5O2O2q4q5k9l0Q0Q1K6K7l3l3r4J5rj0
963A617klNMP3l7n7N1j7j7L4L5R5j3j34j34n0n0Q3Q3J59k4p9q0M8M8l9J42J31J31q2q2k8k8
958A783O2O2k9k9m4m4m5m4j17j18J19J18j3j3J4J4LLLLl7l6r2R1J07kk0j9j00r9O4O5m1m1
$$ plain form
953 1528 1514 1501 1599 1697 1704 1711 1677 1643 1608 1574 1504 1434 1454 1475 1503 1531 1614 1697 1683 1669 1782 1895 1873 1852 1803 1755 1748 1742 1736 1730 1728 1725 1723 1721 1769 1818 1739 1660 1633
947 1633 1605 1632 1659 1682 1705 1674 1642 1636 1631 1598 1564 1548 1531 1569 1606 1589 1572 1609 1646 1692 1738 1693 1648 1713 1777 1786 1796 1837 1878 1865 1852 1799 1747 1722 1697 1734
941 1734 1771 1718 1664 1709 1753 1707 1661 1659 1656 1563 1470 1533 1597 1714 1832 1799 1765 1713 1843 1896 1839 1765 1690 1675 1660 1735 1811 1778 1746 1823 1718 1633 1656 1698
936 1698 1740 1714 1688 1753 1818 1800 1783 1657 1713 1829 1835 1751 1667 1654 1641 1682 1724 1649 1575 1591 1608 1553 1498 1497 1497 1576 1655 1679 1703 1753 1803 1726 1649 1673 1697
931 1697 1775 1854 1818 1782 1855 1746 1631 1624 1636 1647 1661 1674 1687 1701 1747 1793 1749 1704 1695 1687 1733 1778 1773 1768 1763 1757 1676 1594 1712 1829 1866 1902 1883 1865 1838 1811
925 1811 1784 1757 1699 1641 1674 1707 1713 1718 1669 1620 1683 1746 1754 1763 1791 1818 1846 1874 1826 1779 1750 1830 1867 1722 1625 1637 1699 1762 1832 1901 1874 1846 1818 1790 1784 1777 1771 1765
919 1765 1814 1863 1822 1780 1712 1643 1665 1687 1687 1687 1687 1687 1657 1628 1598 1568 1626 1684 1615 1545 1482 1418 1409 1400 1526 1651 1650 1648 1589 1530 1561 1593 1641 1690 1738 1787 1772 1757
914 1757 1687 1618 1596 1574 1551 1529 1578 1626 1674 1722 1646 1570 1658 1745 1730 1715 1701 1686 1781 1876 1808 1739 1743 1748 1752 1756 1724 1691 1785 1880 1870 1860 1850 1840 1837 1833 1738 1644
$$ packed form
953A528j4j3R8R8PPl4l4l5l4p0p0K0K1K8K8Q3Q3j4j4J13J13k2k1m9m8poooklkkM8M9p9p9k7
947A633k8K7K7K3K3l1l2onl3l4j6j7L8L7j7j7L7L7M6M6m5m5O5O4RJ0M1M1j3j3n3n2k5k5L7
941A734L7n3n4M5M4m6m6klr3r3O3O4J17J18l3l4n2J30N3n7p4p5j5j5P5P6l3l2P7j05q5K3M2
936A698M2k6k6O5O5j8j7j26N6J16Oq4q4j3j3M1M2p5p4J6J7n5n5j%P9P9K4K4N0N0p7p7K4K4
931A697P8P9l6l6P3j09j15pJ2J1J4J3J3J4M6M6m4m5rqM6M5nnnoq1q2J18J17L7L6j9j8k7k7
925A811k7k7n8n8L3L3ONm9m9O3O3QRK8K7K8K8m8m7k9Q0L7j45r7J2O2O3P0O9k7k8k8k8opoo
919A765M9M9m1m2o8o9K2K2%%%%l0k9l0l0N8N8o9p0o3o4rrJ26J25jkn9n9L1L2M8M9M8M9j5j5
914A757p0o9k2k2k3k2M9M8M8M8p6p6Q8Q7j5j5j4j5R5R5o8o9MNMMl2l3R4R5j0j0j0j0lmr5r4
$$ plain form
908 1644 1694 1743 1702 1661 1695 1728 1708 1687 1667 1648 1719 1790 1749 1708 1668 1627 1619 1611 1603 1595 1649 1704 1758 1812 1785 1758 1730 1703 1752 1800 1849 1897 1905 1913 1866 1819 1900 1981
902 1981 1935 1888 1817 1746 1802 1858 1914 1970 2001 1850 1847 1844 1739 1634 1704 1774 1717 1660 1646 1632 1709 1785 1822 1858 1839 1821 1786 1752 1809 1865 1804 1743 1773 1803
897 1803 1801 1800 1852 1905 1903 1901 1808 1715 1693 1672 1651 1629 1690 1750 1713 1676 1783 1781 1678 1755 1920 1975 2008 1932 1855 1887 1789 1800 1738 1676 1712 1747 1796 1845 1804 1762
891 1762 1780 1799 1817 1835 1774 1713 1742 1772 1763 1754 1745 1736 1750 1764 1705 1755 1876 1816 1810 1804 1887 1971 1818 1666 1678 1689 1646 1603 1638 1672 1754 1654 1641 1627 1766
886 1766 1905 1865 1826 1798 1770 1675 1762 1863 1855 1875 1895 1908 1921 1874 1828 1781 1734 1758 1783 1807 1832 1854 1877 1808 1740 1811 1882 1898 1915 1985 2055 1961 1868 1934
881 1934 2001 1868 1734 1771 1808 1845 1882 1825 1768 1838 1908 1880 1852 1879 1905 1935 1965 1995 2025 1999 1973 2002 2030 1989 1948 1962 1975 1945 1915 1976 2036 2003 1969 1936
876 1936 1902 1954 2006 1967 1928 1906 1884 1916 1949 1969 1989 1954 1920 1943 1966 1935 1904 1929 1954 1979 2004 2024 2045 2065 2085 1933 1780 1705 1848 1946 2045 2030 2014
870 2014 1981 1948 2006 2063 1960 1857 1808 1759 1795 1832 1814 1797 1915 2034 1989 1944 1932 1921 1964 2007 1992 1977 2016 2056 2042 2028 2014 2000 2064 2128 2138 2148 2100
$$ packed form
908A644N0M9m1m1L4L3k0k1k0j9P1P1m1m1m0m1qqqqN4N5N4N4k7k7k8k7M9M8M9M8QQm7m7Q1Q1
902A981m6m7p1p1N6N6N6N6L1j51llj05j05P0P0n7n7j4j4P7P6L7L6j9j8l5l4N7N6o1o1L0L0
897A803kjN2N3kkr3r3k2k1k1k2O1O0l7l7J07kj03P7J65N5L3p6p7L2r8J1o2o2L6L5M9M9m1m2
891A762J8J9J8J8o1o1K9L0rrrrJ4J4n9N0J21o0ooQ3Q4j53j52J2J1m3m3L5L4Q2j00j3j4J39
886A766J39m0l9k8k8r5Q7J01qK0K0J3J3m7m6m7m7K4K5K4K5K2K3o9o8P1P1J6J7P0P0r4r3O6
881A934O7j33j34L7L7L7L7n7n7P0P0k8k8K7K6L0L0L0L0k6k6K9K8m1m1J4J3l0l0O1O0l3l4l3
876A936l4N2N2l9l9k2k2L2L3K0K0l5l4K3K3l1l1K5K5K5K5K0K1K0K0j52j53p5J43R8R9j5j6
870B014l3l3N8N7j03j03m9m9L6L7j8j7J18J19m5m5j2j1M3M3j5j5L9M0j4j4j4j4O4O4J0J0m8
$$ plain form
865 2100 2052 2058 2064 2084 2104 2070 2035 2000 1964 1983 2002 2078 2154 2103 2051 2071 2090 2056 2021 1955 1890 1824 1759 1855 1951 1986 2021 2058 1987 1863 1921 2004 1907 1977 2047
860 2047 2133 2219 2178 2137 2103 2068 2034 2000 1998 1997 2086 2175 2232 2288 2290 2293 2263 2233 2204 2174 2166 2159 2151 2143 2143 2142 2141 2140 2144 2147 2150 2153 2170 2187 2204 2220 2224 2228 2231 2235 2170 2106 2169 2231 2281
853 2281 2331 2327 2322 2220 2118 2143 2168 2133 2099 2118 2138 2116 2094 2162 2231 2217 2202 2188 2174 2224 2274 2325 2375 2368 2361 2361 2360 2376 2500 2539 2395 2340 2286 2274 2262 2316
848 2316 2370 2369 2369 2387 2406 2370 2334 2312 2291 2270 2248 2334 2421 2416 2412 2304 2196 2216 2235 2294 2353 2321 2289 2316 2344 2371 2398 2370 2342 2313 2285 2334 2383 2432 2481 2481
842 2481 2480 2479 2479 2463 2448 2432 2417 2319 2222 2251 2280 2439 2598 2666 2734 2661 2589 2516 2443 2437 2432 2481 2529 2485 2441 2524 2606 2598 2590 2582 2574 2572 2570 2567 2565 2586 2608 2629 2650 2637
836 2637 2624 2774 2924 2877 2830 2783 2736 2829 2923 2853 2783 2818 2854 2944 3034 2936 2839 2795 2752 2771 2790 2809 2829 2809 2789 2823 2858 2944 3029 2879 2729 2697 2665
831 2665 2761 2856 2967 3078 2990 2901 2903 2905 2961 3017 2989 2961 2988 3015 2936 2858 2980 3101 2969 2838 2906 2974 2965 2957 2948 2939 3020 3101 3182 3264 3268 3272 3276 3280 3254 3227 3255
825 3255 3283 3315 3348 3380 3413 3362 3312 3352 3392 3424 3455 3432 3408 3318 3228 3265 3302 3362 3421 3481 3541 3545 3549 3607 3666 3652 3637 3532 3427 3476 3526 3575 3624 3629 3633 3651
$$ packed form
865B100m8OOK0K0l4l5l5l6J9J9P6P6n1n2K0J9l4l5o6o5o6o5R6R6L5L5L7p1j24N8Q3r7P0P0
860B047Q6Q6m1m1l4l5l4l4kjQ9Q9N7N6KLl0l0k9l0qpqq%jjjMLLLJ7J7J7J6MMLMo5o4O3O2N0
853B281N0mnj02j02K5K5l5l4J9K0k2k2O8O9j4j5j4j4N0N0N1N0pp%jJ6J24L9j44n5n4j2j2N4
848B316N4j%J8J9l6l6k2k1k1k2Q6Q7nmj08j08K0J9N9N9l2l2K7K8K7K7k8k8k9k8M9M9M9M9%
842B481jj%j6j5j6j5r8r7K9K9J59J59O8O8p3p2p3p3onM9M8m4m4Q3Q2qqqqkklkK1K2K1K1j3
836B637j3J50J50m7m7m7m7R3R4p0p0L5L6R0R0r8r7m4m3J9J9J9K0k0k0L4L5Q6Q5j50j50l2l2
831B665R6R5J11J11q8q9KKN6N6k8k8K7K7p9p8J22J21j32j31O8O8rqrrQ1Q1Q1Q2MMMMk6k7K8
825C255K8L2L3L2L3n1n0M0M0L2L1k3k4r0r0L7L7O0N9O0O0MMN8N9j4j5j05j05M9N0M9M9NMJ8
$$ plain form
820 3651 3669 3613 3775 3855 3826 3799 3882 3928 3756 3795 3835 3916 3996 4026 4055 4084 4114 4118 4122 4180 4238 4299 4361 4449 4537 4432 4327 4313 4299 4326 4353 4471 4589
815 4589 4733 4877 4894 4911 4914 4918 4922 4926 4838 4750 4716 4683 4598 4513 4592 4670 4790 4910 5003 5096 5171 5246 5267 5287 5333 5380 5426 5472 5523 5574 5570 5566 5539 5511 5574 5637
809 5637 5675 5712 5824 5718 5621 5633 5709 5894 6098 6302 6350 6397 6515 6633 6660 6687 6740 6793 6791 6789 6935 7081 7020 6959 7036 7003 7066 7347 7594 7732
805 7732 7853 7975 8097 8219 8215 8103 7880 7874 7989 8104 8162 8438 8646 8491 8649 9025 9240 9346 9694 9679 8877 8438 8661 8885 9056
801 9056 9445 9810 10066 10449 10941 11331 11504 11670 12053 12514 12758 12792 13335 13744 13644 13467 13508 13228 12948 14116 16228 17592 18737
798 18737 20158 21469 22389 22945 23604 24480 25458 26436 27452 28832 30177 31413 32406 33908 35486 37283 39461 42292 45396
795 45396 48863 52857 57940 63967 71374 80578 92615 108047 128346 155235 192654 245924 324541 440015 611627
792 611627 855370 1109933 1190523 1040382 782187 546287 379881 271792 203343 158206 127912 106405
$$ packed form
820C651J8n6J62Q0k9k7Q3M6j72L9M0Q1Q0L0K9K9L0MMN8N8O1O2Q8Q8j05j05j4j4K7K7J18J18
815D589J44J44J7J7LMMMq8q8l4l3q5q5P9P8J20J20R3R3P5P5K1K0M6M7M6M6N1N1mmk7k8O3O3
809E637L8L7J12j06r7J2P6J85K04K04M8M7J18J18K7K7N3N3kkJ46J46o1o1P7l3O3K81K47J38
805G732J21J22J22J22mj12k23oJ15J15N8K76K08j55J58L76K15J06L48j5q02m39K23K24J71
801I056L89L65K56L83M92L90J73J66L83M61K44L4N43M09j00j77M1k80k80J168K112J364J145
798A8737J421J311R20N56O59Q76R78R78J016J380J345J236R93J502J578J797K178K831L104
795D5396L467L994N083O027P407R204J2037J5432K0299K6889L7419N3270P8617J15474J71612
792F11627K43743K54563Q0590j50141k58195k35900j66406j08089o8449m5137l0294k1507
$$ plain form
791 106405 90854 78861 69638 62084 56140 51140 47057 43482 40665 38066 35858 33431 31205 29197 27484 25771 24428
788 24428 23303 22402 21393 20542 19910 19429 18730 18229 18237 19111 19985 20698 21193 21701 20975 19164 17571 16445 15320 14452 14092 13673
785 13673 13037 12802 12785 12634 12265 12036 11915 12015 11787 11562 11664 11959 11709 11345 10982 10069 9156 8923 8872 8657 8551 8613 8675 8712 8567
781 8567 8444 8212 8036 7752 7536 7319 7230 7141 6941 6849 6892 6607 6451 6476 6440 6294 6292 6290 6149 6118 6269 6166 6012 5859 5841 5823 5667 5401
776 5401 5387 5373 5413 5345 5344 5344 5277 5102 4977 4960 4930 4791 4816 4731 4763 4685 4610 4536 4570 4495 4392 4289 4165 4150 4131 4003 4052 4210 4374 4648 4815
772 4815 4655 4612 4568 4468 4259 4182 3997 3993 3990 3888 3786 3691 3596 3504 3521 3641 3760 3757 3753 3761 3587 3594 3602 3605 3499 3495 3491 3457 3314 3174 3142 3304 3356
767 3356 3307 3257 3344 3431 3546 3334 3204 3255 3264 3272 3201 3130 3162 3194 3165 3245 3203 3161 3126 3091 3028 2966 2995 3023 2981 2939 2843 2746 2785 2823 2944 2846 2787 2946
762 2946 2956 2965 3015 2847 2802 2757 2789 2821 2703 2585 2449 2531 2581 2631 2614 2597 2580 2562 2578 2594 2610 2625 2621 2616 2611 2607 2503 2400 2424 2447 2490 2533 2576 2619
$$ packed form
791A06405j5551j1993r223p554n944n000m083l575k817k599k208k427k226k008j713j713j343
788B4428j125r01j009q51o32m81o99n01QQ74Q74P13M95N08p26j811j593j126j125q68l60m19
785A3673o36k35j7j51l69k29j21J00k28k25J02K95k50l64l63r13r13k33n1k15j06O2O2L7j45
781H567j23k32j76k84k16k17q9q9k00r2M3k85j56K5l6j46kkj41l1J51j03j54j53j8j8j56k66
776E401j4j4M0o8j%o7j75j25j7l0j39K5q5L2p8p5p4L4p5j03j03j24j5j9j28M9J58J64K74J67
772D815j60m3m4j00k09p7j85mlj02j02r5r5r2J7J20J19lmQj74PQLj06mml4j43j40l2J62N2
767C356m9n0Q7Q7J15k12j30N1RQp1p1L2L2k9Q0m2m2l5l5o3o2K9K8m2m2r6r7L9L8J21r8n9J59
762B946J0RN0j68m5m5L2L2j18j18j36Q2N0N0j7j7j7j8J6J6J6J5mnnmj04j03K4K3M3M3M3M3
$$ plain form
756 2619 2509 2399 2452 2505 2539 2572 2379 2404 2534 2446 2440 2434 2437 2440 2443 2446 2509 2573 2582 2590 2505 2420 2426 2431 2477 2522 2513 2504 2471 2438 2405 2372 2441 2509 2450 2391 2357 2324 2504
750 2504 2467 2445 2423 2442 2461 2390 2320 2412 2505 2418 2332 2372 2413 2415 2418 2330 2242 2205 2168 2258 2349 2344 2339 2334 2330 2336 2343 2349 2356 2304 2252 2254 2256 2306 2356 2316 2275 2285 2295 2304 2314
744 2314 2269 2223 2177 2131 2170 2209 2249 2288 2234 2180 2180 2181 2173 2166 2104 2042 2143 2245 2147 2048 2132 2215 2208 2200 2154 2108 2117 2125 2194 2263 2255 2247 2188 2347 2328 2310 2327 2344
738 2344 2361 2378 2323 2268 2214 2159 2129 2100 2070 2041 2012 1983 2009 2035 2068 2101 2134 2166 2158 2150 2197 2243 2220 2198 2175 2152 2204 2256 2309 2361 2309 2256 2259 2261 2127 1993
733 1993 2022 2052 2014 1976 1952 1927 1854 1999 2076 2153 2077 2002 2054 2105 2108 2111 2169 2226 2168 2110 2051 1993 1988 1983 2033 2082 2038 1994 1882 1988 2057 2127 2119 2111 2112 2113 2154
727 2154 2196 2252 2090 2051 2012 2042 2072 2048 2024 1972 1921 1996 2072 2012 1952 1831 1820 1907 1995 2090 2185 2168 2152 2051 1951 1901 1961 2027 1984 1959 2043 2127 2101
722 2101 2035 2078 2114 2042 2039 2037 2028 2019 1959 1899 1941 1983 1935 2068 2161 2144 2088 2032 2128 2115 1971 1937 2023 2000 1993 1986 2001 2126 2132 2138 1988 1838 1829 1821 1903 1986 1996
717 1996 2006 2017 2027 2024 2020 2017 2014 1964 1914 1918 1922 1964 2006 2048 2089 2023 1956 1889 1822 1779 1737 1821 1905 1904 1902 1908 1913 1927 2049 1983 1917 1947 1978 1947 1917 1919 1812 1767 1721
$$ packed form
756B619j10j10N3N3L4L3j93K5J30q8ooLLLLO3O4RQq5q5ONM6M5rrl3l3l3l3O9O8n9n9l4l3J80
750B504l7k2k2J9J9p1p0R2R3q7q6M0M1KLq8q8l7l7R0R1nnnmOPOPn2n2KKN0N0m0m1J0J0RJ0
744B314m5m6m6m6L9L9M0L9n4n4%Jqpo2o2J01J02r8r9Q4Q3pqm6m6RQO9O9qqn9J59j9j8J7J7
738B344J7J7n5n5n4n5l0k9l0k9k9k9K6K6L3L3L3L2qqM7M6k3k2k3k3N2N2N3N2n2n3LKj34j34
733A993K9L0l8l8k4k5p3J45P7P7p6p5N2N1LLN8N7n8n8n9n8nnN0M9m4m4j12J06O9P0qqJJM1
727B154M2N6j62l9l9L0L0k4k4n2n1P5P6o0o0j21j1Q7Q8R5R5j7j6j01j00n0O0O6m3k5Q4Q4k6
722B101o6M3L6p2lkrro0o0M2M2m8J33R3j7n6n6R6j3j44l4Q6k3ppJ5J25OOj50j50rqQ2Q3J0
717A996J0J1J0lmlln0n0MMM2M2M2M1o6o7o7o7m3m2Q4Q4jkONJ4J22o6o6L0L1l1l0Kj07m5m6
$$ plain form
711 1721 1756 1790 1884 2086 2130 2065 1954 2025 2015 1824 1728 1813 1918 1913 1982 2050 2028 2005 1922 1947 1962 1977 1915 1853 1851 1958 2004 2050 2014 1979 1943 1907 1922
706 1922 1938 2007 2077 1941 1806 1833 1861 1902 1944 1894 1845 1895 1945 1869 1792 1776 1760 1871 1982 1908 1834 1712 1772 1803 1834 1876 1918 1902 1885 1923 1961 1934
701 1934 1908 1882 1855 1940 2025 2056 2086 2038 1991 1943 1895 1942 1990 2037 2085 2046 2006 2022 2037 1990 1943 1896 1848 1852 1855 1859 1862 1888 1914 1940 1966 1952 1938 1925 1911 1901 1892
695 1892 1974 2055 1955 1856 1858 1861 1737 1794 1839 1885 1917 1949 1890 1831 1852 1872 1984 2095 2115 2134 2100 2065 1994 1922 1978 2034 1948 1862 1867 1872 1883 1895 1852 1809 1778
690 1778 1748 1808 1868 1893 1918 1943 1968 1880 1792 1795 1798 1766 1734 1756 1779 1802 1826 1795 1763 1710 1656 1729 1803 1851 1900 1822 1743 1774 1805 1781 1757 1680 1603 1726 1849
684 1849 1791 1734 1767 1800 1797 1793 1789 1785 1817 1848 1825 1802 1776 1750 1814 1879 1900 1921 1888 1855 1780 1705 1830 1955 2015 2074 1933 1793 1809 1826 1788 1750 1813 1876 1939
679 1939 2002 1985 1967 1895 1823 1809 1796 1783 1770 1774 1778 1727 1677 1692 1707 1723 1738 1647 1555 1663 1772 1874 1977 1916 1855 1781 1707 1760 1813 1950 2088 2025 1962
674 1962 1920 1879 1891 1904 1903 1902 1992 2082 1994 1907 1875 1842 1848 1853 1805 1756 1850 1943 1910 1876 1846 1816 1786 1755 1785 1814 1753 1691 1698 1705 1802 1900 1873 1845 1818 1791 1854 1918
$$ packed form
711A721L5L4R4K02M4o5j11P1j0j91r6Q5J05nO9O8k2k3q3K5J5J5o2o2kJ07M6M6l6l5l6l6J5
706A922J6O9P0j36j35K7K8M1M2n0m9N0N0p6p7j6j6J11J11p4p4j22O0L1L1M2M2j6j7L8L8k7
701A934k6k6k7Q5Q5L1L0m8m7m8m8M7M8M7M8l9m0J6J5m7m7m7m8MLMLK6K6K6K6j4j4j3j4j0r
695A892Q2Q1j00r9KLj24N7M5M6L2L2n9n9K1K0J12J11K0J9l4l5p1p2N6N6q6q6NNJ1J2m3m3l1
690A778l0O0O0K5K5K5K5q8q8LLl2l2K2K3K3K4l1l2n3n4P3P4M8M9p8p9L1L1k4k4p7p7J23J23
684A849n8n7L3L3lmmmL2L1k3k3k6k6O4O5K1K1l3l3p5p5J25J25O0N9j41j40J6J7l8l8O3O3O3
679A939O3j7j8p2p2j4j3j3j3MMn1n0J5J5J6J5r1r2J08J09J02J03o1o1p4p4N3N3J37J38o3o3
674A962m2m1J2J3jjR0R0q8q7l2l3ONm8m9R4R3l3l4l0l0l0l1L0K9o1o2PPR7R8k7k8k7k7O3O4
$$ plain form
668 1918 1854 1791 1777 1763 1750 1736 1737 1738 1739 1740 1789 1838 1941 1936 2041 2038 1962 1886 1850 1814 1833 1852 1855 1858 1854 1850 1939 1919 1892 1975 2018 1953 1840 1836 1794 1752 1845 1937 1879
662 1879 1822 1891 1961 1931 1901 1756 1720 1688 1656 1624 1701 1796 1890 1864 1838 1921 2004 1960 1916 1867 1817 1822 1827 1733 1638 1566 1602 1757 1802 1922 1934 1953 1972 1930
657 1930 1888 1904 1920 1997 1966 1915 1864 1807 1749 1748 1747 1819 1781 1717 1834 1897 1959 1950 1940 1978 2016 2024 1924 1837 1750 1658 1676 1795 1914 1914 1915 1963 2010 2031 1943 1905
652 1905 1867 1971 1893 1802 1819 1898 1977 2038 1918 1926 1935 1932 1930 1960 1991 2076 2052 2050 1939 1882 1934 1906 1987 2007 2027 1927 1719 1729 1738 1825 1803 1679 1736 1817 1788
646 1788 1759 1839 1901 1781 1710 1747 1862 1977 1936 1895 1893 1892 2000 1926 1776 1735 1828 1921 1938 2065 2105 1963 1912 1860 1924 1988 2017 2047 2076 2106 2144 2183
641 2183 2131 2079 2065 2051 2031 2010 1998 1877 1837 2051 2081 2111 2102 2093 2087 2082 2076 2071 2019 1966 1969 1971 1935 1899 1863 1827 1812 1798 1875 1951 1893 1834 1830 1826 1857 1889 1865 1842 1843
635 1843 1843 1934 2026 2031 2037 2043 2048 1992 1935 1878 1821 1806 1791 1776 1761 1776 1792 1753 1714 1738 1761 1785 1808 1842 1876 1909 1943 1877 1810 1744 1678 1664 1651 1638 1625 1699 1772
630 1772 1755 1738 1677 1617 1672 1728 1822 1734 1688 1750 1769 1787 1757 1728 1843 1957 1909 1860 1804 1749 1693 1638 1682 1726 1763 1801 1835 1759 1746 1732 1732 1733 1849 1856 1828
$$ packed form
668A918o4o3j4j4j3j4JJJJM9M9J03nJ05lp6p6l6l6J9J9LLmmQ9k0k7Q3M3o5j13mm2m2R3R2n8
662A879n7O9P0l0l0j45l6l2l2l2P7R5R4k6k6Q3Q3m4m4m9n0NNr4r5p2L6J55M5J20J2J9J9m2
657A930m2J6J6P7l1n1n1n7n8jjP2l8o4J17O3O2rj0L8L8Qj00q7q7r2J8J19J19%JM8M7K1q8l8
652A905l8J04p8r1J7P9P9O1j20QRlkL0L1Q5k4kj11n7N2k8Q1K0K0j00k08J0RQ7k2j24N7Q1k9
646A788k9Q0O2j20p1L7J15J15m1m1kjJ08p4j50m1R3R3J7J27M0j42n1n2O4O4K9L0K9L0L8L9
641B183n2n2j4j4k0k1j2j21m0K14L0L0rrononn2n3LKl6l6l6l6j5j4P7P6n8n9mmL1L2k4k3J
635A843%R1R2NOONn6n7n7n7j5j5j5j5J5J6l9l9K4K3K4K3L4L4L3L4o6o7o6o6j4j3j3j3P4P3
630A772j7j7o1o0N5N6R4q8m6O2J9J8l0k9J15J14m8m9n6n5n6n5M4M4L7L8L4p6j3j4%JJ16Pk8
$$ plain form
624 1828 1800 1832 1972 2105 2239 2257 2094 1920 1928 1890 1744 1737 1838 1811 1783 1842 1791 1687 1691 1685 1679 1673 1666 1750 1725 1761 1797 1815 1833 1912 1882 1862 1841 1753
619 1753 1773 1752 1732 1718 1704 1699 1693 1778 1863 1917 1970 2024 2078 2110 2142 2251 2470 2659 2449 2100 1861 1815 1770 1858 1946 1974 2001 2028 2056 2069 2083 1981
614 1981 1988 1982 1975 1976 1976 1894 1811 1849 1887 1934 1873 1746 1619 1569 1519 1458 1578 1643 1707 1760 1704 1670 1745 1751 1758 1717 1677 1727 1777 1962 2146 2162 2069 1956 1952 1952
609 1952 1843 1655 1649 1661 1672 1706 1741 1775 1809 1807 1805 1735 1773 1860 1838 1728 1617 1602 1696 1790 1775 1825 1875 1791 1707 1738 1770 1748 1725 1716 1708 1693 1677 1695 1604
603 1604 1639 1675 1686 1879 1842 1805 1772 1739 1706 1672 1638 1605 1625 1646 1671 1696 1721 1747 1730 1713 1812 1802 1683 1564 1500 1617 1648 1680 1723 1766 1814 1861 1684
598 1684 1616 1656 1695 1742 1788 1765 1743 1804 1865 1908 1842 1710 1578 1514 1450 1452 1562 1640 1718 1773 1719 1776 1832 1881 1931 1847 1763 1733 1704 1706 1708 1718 1727 1653 1689
593 1689 1779 1760 1692 1625 1634 1643 1731 1709 1695 1680 1663 1646 1629 1612 1637 1662 1680 1698 1774 1741 1770 1798 1816 1835 1860 1776 1738 1700 1593 1596 1646 1697 1707 1717 1668 1727
588 1727 1726 1724 1676 1627 1572 1625 1639 1653 1721 1789 1798 1697 1694 1800 1780 1869 1951 1852 1808 1765 1711 1656 1716 1776 1709 1642 1658 1674 1704 1625 1595 1674 1678 1681 1819 1848
$$ packed form
624A828k8L2J40J33J34J8j63j74Ql8j46pJ01k7k8N9n1j04MooopQ4k5L6L6J8J8P9l0k0k1q8
619A753K0k1k0j4j4noQ5Q5N4N3N4N4L2L2J09K19J89k10l49k39m6m5Q8Q8K8K7K7K8J3J4j02
614A981PopJ%q2q3L8L8M7o1j27j27n0n0o1J20O5O4N3n6l4P5OPm1m0N0N0J85J84J6r3j13m%
609A952j09j88oJ2J1L4L5L4L4kkp0L8Q7k2j10j11j5R4R4j5N0N0q4q4L1L2k2k3rqj5j6J8r1
603A604L5L6J1J93l7l7l3l3l3l4l4l3K0K1K5K5K5K6j7j7R9j0j19j19o4J17L1L2M3M3M8M7j77
598A684o8M0L9M7M6k3k2O1O1M3o6j32j32o4o4KJ10P8P8N5n4N7N6M9N0q4q4l0k9KKJ0Rp4L6
593A689R0j9o8o7RRQ8k2j4j5j7j7j7j7K5K5J8J8P6l3K9K8J8J9K5q4l8l8j07LN0N1J0J0m9N9
588A727jkm8m9n5N3J4J4O8O8Rj01lJ06k0Q9Q2r9m4m3n4n5O0O0o7o7J6J6L0p9l0P9MLJ38K9
$$ plain form
582 1848 1847 1846 1819 1791 1817 1844 1801 1758 1653 1658 1746 1835 1803 1881 1906 1750 1710 1670 1627 1694 1692 1690 1768 1736 1650 1672 1608 1543 1546 1550 1537 1633 1783 1824 1764 1703 1762
576 1762 1822 1796 1770 1628 1596 1710 1825 1820 1814 1737 1660 1649 1638 1519 1581 1669 1756 1722 1687 1646 1605 1771 1829 1795 1762 1690 1799 1752 1705 1725 1746 1720 1693
571 1693 1593 1602 1703 1694 1713 1733 1814 1786 1669 1662 1714 1765 1666 1567 1667 1768 1812 1857 1811 1765 1772 1780 1773 1876 1916 1846 1784 1830 1771 1712 1617 1521 1469 1599
566 1599 1715 1577 1610 1643 1606 1568 1576 1584 1531 1586 1596 1607 1624 1640 1613 1586 1650 1713 1680 1647 1705 1763 1742 1722 1792 1862 1837 1811 1847 1883 1785 1797 1910 1841
561 1841 1808 1884 1826 1877 1856 1836 1805 1664 1543 1604 1791 1797 1746 1803 1726 1650 1741 1724 1622 1630 1628 1734 1630 1526 1483 1548 1608 1667 1721 1776 1650 1632
556 1632 1605 1687 1871 1874 1746 1619 1608 1705 1717 1548 1542 1536 1591 1646 1700 1755 1679 1604 1612 1620 1624 1519 1456 1503 1639 1592 1564 1536 1596 1656 1662 1668 1667 1665 1664 1663 1670 1677 1678
550 1678 1678 1791 1794 1768 1743 1741 1740 1739 1738 1796 1853 1820 1787 1752 1718 1683 1648 1716 1784 1725 1667 1599 1531 1553 1576 1535 1495 1508 1522 1630 1738 1755 1772 1705 1638 1626
545 1626 1613 1675 1737 1744 1752 1691 1630 1624 1618 1681 1744 1752 1761 1783 1805 1743 1681 1589 1605 1787 1751 1624 1715 1670 1625 1595 1565 1535 1505 1608 1711 1651 1591 1622 1653 1684
$$ packed form
582A848jjk7k8K6K7m3m3j05NQ8Q9l2P8K5j56m0m0m3O7kkP8l2q6K2o4o5LMj3R6J50M1o0o1N9
576A762O0k6k6j42l2J14J15nop7p7j1j1j19O2Q8Q7l4l5m1m1J66N8l4l3p2J09m7m7K0K1k6k7
571A693j00RJ01rJ9K0Q1k8j17pN2N1r9r9J00J01M4M5m6m6PQpJ03M0p0o2M6n9n9r5r6n2J30
566A599J16j38L3L3l7l8QQn3N5J0J1J7J6k7k7O4O3l3l3N8N8k1k0P0P0k5k6L6L6r8J2J13o9
561A841l3P6n8N1k1k0l1j41j21O1J87On1N7p7p6R1j7j02QkJ06j04j04m3O5O0N9N4N5j26j8
556A632k7Q2J84Lj28j27j1R7J2j69ooN5N5N4N5p6p5QQMj05o3M7J36m7k8k8O0O0OOjkjjPPJ
550A678%J13Lk6k5kjjjN8N7l3l3l5l4l5l5O8O8n9n8o8o8K2K3m1m0J3J4J08J08J7J7o7o7j2
545A626j3O2O2PQo1o1ooO3O3QRK2K2o2o2r2J6J82l6j27R1m5m5l0l0l0l0J03J03o0o0L1L1L1
$$ plain form
539 1684 1715 1650 1584 1669 1753 1858 1745 1628 1510 1504 1498 1546 1594 1595 1597 1551 1505 1555 1714 1844 1756 1706 1655 1592 1528 1586 1643 1574 1504 1475 1445 1506 1567 1575
534 1575 1583 1591 1599 1648 1698 1621 1543 1620 1698 1684 1670 1684 1699 1713 1727 1697 1667 1692 1717 1587 1457 1563 1669 1675 1680 1685 1690 1635 1579 1615 1650 1704 1759 1650 1541
529 1541 1610 1680 1608 1537 1628 1501 1435 1478 1530 1583 1551 1519 1570 1622 1673 1724 1686 1647 1609 1571 1554 1538 1528 1518 1556 1703 1761 1601 1476 1568 1577 1694 1765
524 1765 1619 1540 1571 1677 1784 1734 1684 1593 1502 1574 1647 1617 1587 1558 1528 1548 1568 1588 1608 1600 1591 1583 1575 1539 1502 1521 1539 1687 1834 1819 1803 1722 1641 1560
518 1560 1479 1486 1494 1501 1509 1459 1408 1413 1417 1513 1609 1615 1620 1660 1700 1648 1597 1564 1532 1553 1575 1557 1539 1576 1613 1625 1637 1594 1551 1484 1416 1403 1390 1447 1504 1562 1619 1602 1584
513 1584 1567 1550 1594 1638 1591 1545 1484 1423 1525 1628 1652 1676 1603 1529 1605 1571 1592 1613 1652 1582 1628 1674 1717 1761 1865 1861 1787 1714 1761 1807 1801 1794 1740 1686 1622
507 1622 1668 1666 1555 1487 1528 1555 1583 1592 1601 1588 1466 1478 1600 1660 1611 1648 1686 1662 1638 1561 1484 1400 1425 1475 1525 1520 1516 1552 1479 1372 1519 1656 1684 1651
502 1651 1618 1684 1570 1489 1517 1607 1589 1584 1579 1507 1435 1526 1617 1637 1656 1676 1696 1732 1769 1679 1589 1636 1683 1758 1651 1517 1637 1657 1677 1591 1506 1523 1648
$$ packed form
539A684L1o5o6Q5Q4J05j13j17j18ooM8M8JKm6m6N0J59J30q8n0n1o3o4N8N7o9p0k9l0O1O1Q
534A575QQQM9N0p7p8P7P8j4j4J4J5J4J4l0l0K5K5j30j30J06J06ONNNn5n6L6L5N4N5j09j09
529A541O9P0p2p1R1j27o6M3N2N3l2l2N1N2N1N1l8l9l8l8j7j6j0j0L8J47N8j60j25R2RJ17P1
524A765j46p9L1J06J07n0n0r1r1P2P3l0l0k9l0K0K0K0K0qrqql6l7J9J8J48J47j5j6q1q1q1
518A560q1PQPQn0n1NMR6R6ONM0M0n2n1l3l2K1K2j8j8L7L7J2J2m3m3o7o8j3j3N7N7N8N7j7j8
513A584j7j7M4M4m7m6o1o1J02J03K4K4p3p4P6l4K1K1L9p0M6M6M3M4J04mp4p3M7M6opn4n4o4
507A622M6kj11o8M1K7K8RRj3j22J2J22O0m9L7L8k4k4p7p7q4K5N0N0nmL6p3j07J47J37K8l3
502A651l3O6j14q1K8R0j8nnp2p2R1R1K0J9K0K0L6L7r0r0M7M7P5j07j34J20K0K0q6q5J7J25
$$ plain form
497 1648 1631 1613 1602 1591 1586 1582 1578 1574 1634 1694 1809 1743 1603 1573 1629 1576 1573 1679 1778 1769 1703 1638 1621 1603 1644 1686 1666 1646 1708 1660 1681 1702 1660 1726 1738 1750
491 1750 1617 1594 1564 1534 1551 1569 1587 1604 1563 1521 1534 1547 1555 1563 1571 1579 1621 1663 1651 1638 1651 1663 1675 1688 1702 1717 1731 1746 1721 1695 1761 1826 1750 1673 1651 1629
486 1629 1572 1515 1585 1655 1698 1741 1693 1645 1693 1741 1626 1511 1566 1621 1585 1550 1624 1698 1645 1592 1532 1472 1648 1824 1830 1836 1715 1594 1528 1463 1524 1586 1562
481 1562 1538 1514 1490 1524 1558 1592 1626 1606 1585 1637 1581 1556 1712 1730 1639 1644 1649 1737 1826 1759 1692 1535 1377 1419 1461 1510 1558 1548 1646 1786 1744 1699 1654 1790
476 1790 1745 1659 1573 1639 1705 1670 1635 1600 1564 1541 1517 1547 1578 1568 1558 1548 1538 1539 1540 1487 1433 1491 1549 1607 1665 1690 1714 1732 1749 1758 1657 1645 1633 1665 1698 1708
470 1708 1609 1509 1517 1458 1399 1439 1479 1492 1504 1517 1530 1488 1446 1450 1454 1585 1715 1682 1650 1757 1684 1593 1684 1688 1693 1693 1692 1772 1851 1854 1675 1653 1630 1645 1660 1627
465 1627 1595 1503 1520 1555 1591 1734 1696 1706 1716 1666 1616 1523 1431 1416 1583 1620 1658 1660 1663 1638 1613 1601 1590 1626 1661 1686 1602 1544 1596 1614 1632 1724 1708 1649 1699
459 1699 1681 1663 1751 1839 1789 1629 1642 1655 1600 1545 1634 1614 1656 1697 1673 1650 1535 1420 1450 1479 1482 1484 1491 1499 1560 1622 1595 1567 1593 1620 1722 1823 1802 1890
$$ packed form
497A648j7j8j1j1nmmmO0O0J15o6j40l0N6n3lJ06R9ro6o5j7j8M1M2k0k0O2m8K1K1m2O6J2J2
491A750j33k3l0l0J7J8J8J7m1m2J3J3QQQQM2M2j2j3J3J2J2J3J4J5J4J5k5k6O6O5p6p7k2k2
486A629n7n7P0P0M3M3m8m8M8M8j15j15N5N5l6l5P4P4n3n3o0o0J76J76OOj21j21o6o5O1O2k4
481A562k4k4k4L4L4L4L4k0k1N2n6k5J56J8r1NNQ8Q9o7o7j57j58M2M2M9M8j0R8J40m2m5m5J36
476A790m5q6q6O6O6l5l5l5l6k3k4L0L1j0j0j0j0JJn3n4N8N8N8N8K5K4J8J7Rj01j2j2L2L3J0
470A708r9j00Qn9n9M0M0J3J2J3J3m2m2MMJ31J30l3l2J07p3r1R1MN%jQ0P9Lj79k2k3J5J5l3
465A627l2r2J7L5L6J43l8J0J0n0n0r3r2j5J67L7L8KLk5k5j2j1L6L5K5q4n8N2J8J8R2j6n9N0
459A699j8j8Q8Q8n0j60J3J3n5n5Q9k0M2M1k4k3j15j15L0K9LKPQO1O2k7k8K6K7J02J01k1Q8
$$ plain form
454 1890 2003 2008 1953 1789 1664 1721 1821 1811 1714 1617 1506 1504 1563 1623 1748 1692 1571 1632 1731 1722 1731 1740 1765 1609 1543 1659 1791 1741 1663 1586 1624 1662
449 1662 1720 1777 1708 1639 1604 1570 1590 1610 1622 1633 1644 1655 1674 1693 1767 1840 1795 1751 1760 1770 1783 1796 1809 1822 1756 1689 1750 1811 1841 1871 1846 1822 1802 1782 1708
444 1708 1634 1644 1655 1639 1622 1598 1573 1576 1578 1566 1554 1632 1711 1665 1620 1629 1637 1589 1540 1547 1553 1574 1595 1589 1583 1627 1670 1659 1648 1653 1657 1662 1666 1623 1580 1591 1602 1581 1559 1537 1515
438 1515 1547 1579 1584 1588 1483 1377 1471 1566 1550 1534 1545 1557 1538 1520 1592 1664 1679 1694 1764 1833 1806 1779 1751 1724 1739 1753 1725 1696 1540 1566 1617 1668 1647 1625
433 1625 1549 1473 1540 1608 1651 1513 1523 1534 1561 1587 1638 1690 1650 1610 1590 1570 1550 1529 1537 1545 1525 1505 1553 1600 1593 1586 1580 1574 1541 1508 1500 1492 1485 1477 1508 1539 1570 1601 1530
427 1530 1459 1443 1426 1403 1380 1448 1516 1517 1518 1519 1520 1581 1642 1612 1581 1568 1554 1579 1604 1468 1513 1510 1508 1533 1558 1556 1554 1569 1583 1570 1557 1399 1241 1355 1469 1521
421 1521 1573 1535 1496 1541 1586 1577 1568 1694 1819 1709 1599 1568 1538 1598 1659 1629 1599 1596 1593 1575 1557 1538 1520 1585 1649 1623 1596 1631 1666 1610 1554 1566 1577 1588 1600
416 1600 1502 1404 1434 1463 1454 1445 1436 1427 1463 1500 1536 1572 1595 1618 1586 1554 1558 1561 1474 1386 1368 1350 1387 1423 1507 1591 1610 1519 1592 1665 1676 1688 1699 1711 1668 1625 1644 1663
$$ packed form
454A890J13Nn5j64j25N7J00j0r7r7j11kN9O0J25n6j21O1R9rRRK5j56o6J16J32n0p8p7L8L8
449A662N8N7o9o9l5l4K0K0J2J1J1J1J9J9P4P3m5m4RJ0J3J3J3J3o6o7O1O1L0L0k5k4k0k0p4
444A708p4J0J1j6j7k4k5LKj2j2P8P9m6m5RQm8m9POK1K1ooM4M3j1j1NMNMm3m3J1J1k1k2k2k2
438A515L2L2NMj05j06R4R5j6j6J1J2j9j8P2P2J5J5P0O9k7k7k8k7J5J4k8k9j56K6N1N1k1k2
433A625p6p6O7O8M3j38J0J1K7K6N1N2m0m0k0k0k0k1QQk0k0M8M7ppool3l3qqpqL1L1L1L1p1
427A530p1j6j7k3k3O8O8JJJJO1O1l0l1j3j4K5K5j36M5lkK5K5kkJ5J4j3j3j58j58J14J14N2
421A521N2l8l9M5M5rrJ26J25j10j10l1l0O0O1l0l0llj8j8j9j8O5O4k6k7L5L5n6n6J2J1J1J2
416A600r8r8L0K9rrrrL6L7L6L6K3K3l2l2MLq7q8j8j8L7L6Q4Q4J9r1P3P3J1J2J1J2m3m3J9J9
$$ plain form
410 1663 1690 1607 1552 1496 1463 1540 1575 1610 1598 1585 1560 1535 1600 1665 1654 1643 1665 1688 1570 1561 1625 1688 1600 1622 1677 1623 1460 1406 1484 1561 1589 1617 1700 1782
405 1782 1770 1758 1719 1679 1600 1520 1545 1461 1552 1461 1445 1429 1355 1389 1453 1517 1521 1525 1645 1656 1536 1415 1450 1486 1506 1526 1568 1720 1789 1749 1687 1625 1578 1532
400 1532 1540 1547 1564 1580 1541 1503 1543 1583 1616 1650 1632 1505 1432 1469 1525 1582 1562 1542 1483 1533 1583 1524 1568 1612 1676 1740 1714 1688 1608 1528 1561 1595 1724 1599
394 1599 1423 1356 1400 1336 1413 1490 1534 1577 1545 1513 1509 1504 1540 1577 1486 1395 1396 1398 1412 1427 1314 1419 1589 1651 1617 1584 1598 1613 1577 1540 1531 1522 1653 1783 1714
389 1714 1644 1681 1717 1712 1707 1521 1552 1488 1423 1494 1564 1607 1650 1634 1619 1630 1642 1593 1544 1522 1500 1576 1652 1637 1622 1626 1630 1689 1747 1784 1820 1802 1785 1778 1772 1674 1577
383 1577 1586 1595 1513 1431 1503 1576 1595 1613 1584 1555 1566 1578 1532 1705 1761 1709 1735 1761 1654 1546 1540 1533 1527 1520 1580 1639 1496 1462 1677 1674 1637 1600 1532 1464 1560 1655
378 1655 1663 1671 1662 1545 1429 1531 1531 1530 1526 1521 1570 1620 1623 1625 1655 1685 1676 1668 1604 1541 1553 1566 1605 1645 1670 1695 1666 1637 1651 1664 1623 1583 1589 1595 1547 1680 1727 1664 1647
372 1647 1630 1612 1593 1629 1664 1655 1645 1690 1734 1691 1648 1659 1671 1663 1656 1784 1732 1621 1620 1540 1568 1548 1528 1605 1682 1604 1526 1503 1479 1498 1517 1536 1555 1621 1686 1661
$$ packed form
410A663K7q3n5n6l3P7L5L5j2j3k5k5O5O5j1j1K2K3j18rO4O3q8K2N5n4j63n4P8P7K8K8Q3Q2
405A782j2j2l9m0p9q0K5q4R1r1j6j6p4L4O4O4MMJ20J1j20j21L5L6K0K0M2J52O9m0o2o2m7m6
400A532QPJ7J6l9l8M0M0L3L4j8j27p3L7N6N7k0k0n9N0N0n9M4M4O4O4k6k6q0q0L3L4J29j25
394A599j76o7M4o4P7P7M4M3l2l2mnL6L7r1r1JKJ4J5j13J05J70O2l4l3J4J5l6l7rrJ31J30o9
389A714p0L7L6nnj86L1o4o5P1P0M3M3j6j5J1J2m9m9k2k2P6P6j5j5MMN9N8L7L6j8j7por8r7
383A577RRq2q2P2P3J9J8k9k9J1J2m6J73N6n2K6K6j07j08opopO0N9j43l4K15ll7l7o8o8R6R5
378A655QQrj17j16J02%jmnM9N0LKL0L0rqo4o3J2J3L9M0K5K5k9k9J4J3m1m0OOm8J33M7o3j7
372A647j7j8j9L6L5rj0M5M4m3m3J1J2qpJ28n2j11jq0K8k0k0P7P7p8p8k3k4J9J9J9J9O6O5k5
$$ plain form
366 1661 1636 1585 1534 1574 1613 1622 1631 1640 1650 1623 1596 1624 1652 1693 1735 1722 1709 1705 1702 1699 1695 1563 1431 1462 1494 1533 1572 1584 1596 1540 1485 1520 1555 1606 1657 1544 1431
361 1431 1487 1543 1572 1600 1645 1689 1679 1669 1618 1566 1606 1645 1667 1689 1620 1551 1552 1553 1503 1563 1775 1733 1677 1621 1619 1616 1614 1611 1626 1640 1628 1615 1547 1480 1503 1526 1493
355 1493 1460 1481 1503 1493 1484 1475 1466 1517 1568 1529 1489 1470 1451 1487 1522 1528 1534 1540 1547 1645 1743 1677 1612 1650 1689 1661 1633 1678 1542 1508 1473 1493 1513 1532 1552 1556 1560 1510 1459
349 1459 1419 1379 1540 1700 1697 1695 1638 1581 1613 1645 1670 1695 1701 1597 1580 1745 1726 1707 1645 1583 1484 1386 1451 1516 1571 1626 1591 1555 1549 1543 1628 1713 1711 1709 1652 1595
344 1595 1457 1319 1344 1369 1399 1429 1405 1380 1353 1325 1352 1378 1452 1525 1598 1671 1626 1580 1534 1488 1529 1571 1612 1654 1681 1707 1607 1507 1508 1509 1510 1511 1590 1669 1585
338 1585 1501 1453 1405 1485 1564 1625 1686 1627 1568 1475 1491 1645 1618 1444 1378 1548 1719 1720 1721 1668 1615 1561 1506 1543 1579 1561 1543 1526 1508 1501 1495 1488 1482 1461 1441 1498
333 1498 1555 1631 1488 1468 1448 1496 1545 1539 1533 1526 1519 1511 1504 1471 1439 1406 1373 1462 1552 1551 1550 1531 1512 1548 1583 1617 1650 1629 1608 1573 1538 1557 1576 1565 1553 1542 1530 1511
327 1511 1491 1526 1561 1570 1578 1532 1487 1518 1550 1527 1505 1559 1613 1668 1722 1715 1708 1701 1694 1610 1525 1446 1584 1576 1569 1630 1690 1579 1467 1482 1498 1431 1364 1424 1485 1512 1540
$$ packed form
366A661k5n1n1M0L9RRRJ0k7k7K8K8M1M2j3j3mllmj32j32L1L2L9L9J2J2n6n5L5L5N1N1j13j13
361A431N6N6K9K8M5M4j0j0n1n2M0L9K2K2o9o9JJn0O0K12m2n6n6klklJ5J4j2j3o8o7K3K3l3
355A493l3K1K2j0rrrN1N1l9m0j9j9L6L5OOOPR8R8o6o5L8L9k8k8M5j36l4l5K0K0J9K0MMn0n1
349A459m0m0J61J60lkn7n7L2L2K5K5Oj04j7J65j9j9o2o2r9r8O5O5N5N5l5l6ooQ5Q5kkn7n7
344A595j38j38K5K5L0L0k4k5k7k8K7K6P4P3P3P3m5m6m6m6M1M2M1M2K7K6j00j00JJJJP9P9q4
338A585q4m8m8Q0P9O1O1n9n9r3J6J54k7j74o6J70J71JJn3n3n4n5L7L6j8j8j7j8popok1k0N7
333A498N7P6j43k0k0M8M9ooppqpl3l2l3l3Q9R0jjj9j9L6L5L4L3k1k1l5l5J9J9j1j2j1j2j9
327A511k0L5L5RQm6m5L1L2k3k2N4N4N5N4ppppq4q5p9J38qpO1O0j11j12J5J6o7o7O0O1K7K8
$$ plain form
321 1540 1513 1486 1519 1552 1586 1619 1628 1636 1645 1653 1542 1431 1483 1536 1586 1636 1686 1736 1735 1734 1642 1550 1634 1719 1676 1633 1643 1653 1572 1491 1510 1529 1603 1676 1620 1565 1672
316 1672 1780 1718 1657 1595 1534 1575 1616 1602 1588 1579 1570 1470 1370 1365 1359 1353 1348 1359 1370 1382 1393 1448 1502 1557 1611 1643 1675 1730 1602 1470 1519 1545 1571 1535 1499
310 1499 1469 1440 1435 1540 1678 1562 1488 1522 1479 1436 1417 1399 1501 1603 1623 1534 1405 1457 1424 1391 1412 1433 1527 1440 1393 1456 1487 1519 1467 1415 1454 1493
306 1493 1404 1316 1378 1441 1503 1566 1568 1571 1627 1684 1716 1748 1653 1557 1523 1489 1510 1530 1514 1498 1427 1538 1653 1659 1575 1490 1436 1382 1383 1384 1376 1369 1489 1609 1586 1564
300 1564 1541 1519 1609 1699 1698 1697 1662 1626 1645 1664 1691 1718 1745 1772 1723 1675 1546 1418 1369 1502 1655 1700 1648 1706 1696 1686 1597 1509 1511 1513 1441 1368 1350 1332 1412
295 1412 1491 1444 1396 1455 1513 1445 1376 1439 1502 1565 1629 1567 1505 1443 1381 1433 1484 1590 1696 1663 1630 1651 1672 1612 1551 1618 1685 1637 1589 1595 1602 1610 1619 1573 1528 1588
289 1588 1649 1619 1589 1583 1578 1573 1568 1544 1521 1497 1474 1506 1538 1570 1602 1671 1739 1607 1476 1501 1526 1374 1440 1500 1561 1622 1682 1778 1656 1480 1521 1471 1422 1440
284 1440 1459 1517 1575 1633 1691 1712 1732 1698 1664 1644 1624 1603 1583 1563 1542 1613 1683 1602 1520 1529 1538 1499 1460 1421 1381 1428 1475 1468 1460 1456 1452 1447 1443 1452 1462 1471 1480 1453 1426 1453
$$ packed form
321A540k7k7L3L3L4L3RQRQj11j11N2N3N0N0N0N0jjr2r2Q4Q5m3m3J0J0q1q1J9J9P4P3n6n5J07
316A672J08o2o1o2o1M1M1j4j4rrj00j00noonJ1J1J2J1N5N4N5N4L2L2N5j28j32M9K6K6l6l6
310A499l0k9nJ05J38j16p4L4m3m3j9j8J02J02K0q9j29N2l3l3K1K1R4q7m7O3L1L2n2n2L9L9
306A493q9q8O2O3O2O3KLN6N7L2L2r5r6l4l4K1K0j6j6p1J11J15Oq4q5n4n4JJqpJ20J20k3k2
300A564k3k2R0R0jjl5l6J9J9K7K7K7K7m9m8j29j28m9J33J53M5n2N8j0j0q9q8KKp2p3j8j8Q0
295A412P9m7m8N9N8o8o9O3O3O3O4o2o2o2o2N2N1J06J06l3l3K1K1o0o1O7O7m8m8OPQRm6m5O0
289A588O1l0l0onnnk4k3k4k3L2L2L2L2O9O8j32j31K5K5j52O6O0O1O1O0R6j22j76M1n0m9J8
284A440J9N8N8N8N8K1K0l4l4k0k0k1k0k0k1P1P0q1q2RRl9l9l9m0M7M7pqmmnmRJ0RRk7k7K7
$$ plain form
278 1453 1480 1507 1534 1507 1480 1521 1563 1604 1646 1673 1700 1636 1572 1561 1549 1381 1395 1472 1549 1584 1618 1550 1482 1511 1541 1507 1582 1657 1623 1636 1649 1541 1615 1681
273 1681 1564 1446 1436 1404 1372 1401 1430 1470 1511 1563 1433 1465 1497 1609 1721 1690 1658 1638 1618 1535 1632 1730 1646 1563 1479 1450 1529 1465 1400 1506 1612
268 1612 1596 1580 1572 1563 1491 1529 1560 1591 1543 1496 1503 1510 1464 1418 1499 1580 1617 1654 1568 1591 1649 1598 1560 1632 1611 1700 1740 1672 1637 1601 1545 1598 1719 1731 1684 1637
263 1637 1549 1462 1509 1555 1547 1648 1783 1664 1583 1611 1684 1648 1547 1555 1586 1617 1606 1595 1590 1586 1468 1459 1547 1527 1506 1594 1614 1635 1618 1602 1586 1570 1507 1445 1539
257 1539 1633 1675 1608 1602 1596 1674 1752 1703 1654 1614 1574 1589 1603 1587 1570 1554 1537 1525 1513 1574 1526 1414 1484 1573 1661 1621 1581 1595 1610 1532 1454 1431 1408 1435 1461
252 1461 1488 1515 1508 1502 1496 1490 1593 1696 1671 1647 1533 1418 1394 1371 1402 1434 1466 1498 1573 1648 1596 1544 1659 1773 1761 1749 1614 1479 1507 1536 1554 1572 1590
247 1590 1609 1650 1692 1643 1594 1564 1534 1505 1475 1476 1477 1477 1478 1426 1373 1375 1377 1390 1402 1415 1427 1547 1668 1697 1727 1620 1513 1461 1409 1401 1393 1476 1559 1591 1622 1654 1686
241 1686 1579 1473 1566 1659 1619 1578 1538 1498 1451 1404 1448 1491 1504 1516 1528 1540 1501 1463 1515 1566 1538 1510 1609 1708 1694 1680 1720 1760 1802 1844 1832 1820 1762 1703
$$ packed form
278A453K7K7K7k7k7M1M2M1M2K7K7o4o4j1j2j68J4P7P7L5L4o8o8K9L0l4P5P5l4J3J3j08P4O6
273A681j17j18j0l2l2K9K9M0M1N2j30L2L2J12J12l1l2k0k0q3R7R8q4q3q4k9P9o4o5J06J06
268A612j6j6qrp2L8L1L1m8m7PPm6m6Q1Q1L7L7q6K3N8n1l8P2k1Q9M0o8l5l6n6N3J21J2m7m7
263A637q8q7M7M6qJ01J35j19q1K8P3l6j01QL1L1j1j1nmj18rQ8k0k1Q8K0K1j7j6j6j6o3o2R4
257A539R4M2o7ooP8P8m9m9m0m0J5J4j6j7j6j7j2j2O1m8j12P0Q9Q8m0m0J4J5p8p8k3k3K7K6
252A461K7K7poooJ03J03k5k4j14j15k4k3L1L2L2L2P5P5n2n2J15J14j2j2j35j35K8K9J8J8J8
247A590J9M1M2m9m9l0l0k9l0JJ%Jn2n3KKJ3J2J3J2J20J21K9L0j07j07n2n2qqQ3Q3L2L1L2L2
241A686j07j06R3R3m0m1m0m0m7m7M4M3J3J2J2J2l9l8N2N1k8k8R9R9j4j4M0M0M2M2j2j2n8n9
$$ plain form
236 1703 1699 1695 1713 1730 1748 1766 1736 1706 1767 1828 1773 1719 1664 1609 1596 1582 1568 1554 1603 1652 1610 1568 1659 1750 1714 1678 1680 1682 1629 1576 1587 1598 1609 1620 1581 1542 1503
230 1503 1464 1529 1595 1569 1544 1528 1511 1550 1588 1588 1589 1535 1482 1533 1585 1637 1689 1672 1656 1640 1623 1683 1743 1712 1681 1651 1621 1591 1561 1578 1594 1611 1627 1621 1615 1609 1603 1585
225 1585 1567 1549 1531 1477 1422 1422 1423 1423 1424 1552 1680 1675 1670 1610 1551 1563 1575 1587 1599 1725 1852 1742 1633 1599 1565 1658 1752 1800 1848 1805 1762 1804 1846 1724
219 1724 1603 1600 1596 1593 1589 1606 1623 1640 1656 1638 1620 1601 1583 1590 1597 1683 1770 1842 1734 1659 1693 1758 1714 1683 1652 1615 1577 1594 1611 1649 1686 1785 1775 1697 1619 1593 1676
214 1676 1731 1677 1691 1705 1636 1566 1623 1680 1703 1726 1750 1773 1772 1771 1716 1661 1710 1759 1754 1749 1731 1713 1628 1651 1716 1673 1614 1555 1569 1693 1762 1722 1675 1628 1701 1774
208 1774 1733 1693 1805 1807 1857 1906 1887 1868 1864 1751 1784 1816 1846 1767 1688 1718 1751 1785 1927 1888 1874 1859 1834 1808 1836 1864 1891 1919 1960 2002 1952 1903 1945 1988
203 1988 2085 2182 2201 2220 2287 2354 2580 2697 2998 3553 4252 4842 5042 4842 4397 3626 2963 2627 2413 2308 2278 2139 2092 2045 2053 1951 1974
199 1974 1997 1983 1861 1862 1863 1900 1938 2093 2066 2015 1963 1953 1942 1945 1839 1766 1802 1824 1846 1899 1952 1998 2044 2005 1857 1897 1938 2079 2220 2155 2090 2052 1904
$$ packed form
236A703mmJ8J7J8J8l0l0O1O1n5n4n5n5j3j4j4j4M9M9m2m2R1R1l6l6KKn3n3J1J1J1J1l9l9l9
230A503l9O5O6k6k5j6j7L9L8%Jn4n3N1N2N2N2j7j6j6j7O0O0l1l1l0l0l0l0J7J6J7J6ooooj8
225A585j8j8j8n4n5%J%JJ28J28nno0n9J2J2J2J2J26J27j10j09l4l4R3R4M8M8m3m3M2M2j22
219A724j21lmlmJ7J7J7J6j8j8j9j8PPQ6Q7P2j08p5L4O5m4l1l1l7l8J7J7L8L7R9j0p8p8k6Q3
214A676N5n4J4J4o9p0N7N7K3K3K4K3jjn5n5M9M9nnj8j8q5K3O5m3n9n9J4J24O9m0m7m7P3P3
208A774m1m0J12KN0M9j9j9mj13L3L2L0p9p9L0L3L4J42l9j4j5k5k6K8K8K7K8M1M2n0m9M2M3
203A988R7R7J9J9O7O7K26J17L01N55O99N90K00k00m45p71o63l36k14j05l0j39m7m7Qj02K3
199A974K3j4j22JJL7L8J55k7n1n2j0j1Lj06p3L6K2K2N3N3M6M6l9j48M0M1J41J41o5o5l8j48
$$ plain form
194 1904 1938 1973 2018 1955 1898 1841 1868 1894 1873 1852 1807 1871 1866 1862 1946 1921 1895 1870 1967 1956 1999 2042 2126 2101 2083 2064 2079 2094 2163 2233 2109 1986 1922 1967 2057
189 2057 2039 2040 2042 2050 2166 2268 2190 2087 1984 1929 1983 2078 2063 2117 2171 2141 2111 2020 2037 2058 2079 2118 1976 1955 1934 2053 2064 2056 2049 2082 2115 2180 2136 2099
183 2099 2061 2106 2150 2133 2116 2188 2150 2168 2185 2225 2157 2143 2129 2198 2158 2180 2201 2164 2127 2181 2234 2173 2112 2106 2100 2167 2234 2199 2056 2088 2120 2138 2157 2248 2231
178 2231 2227 2224 2117 2119 2180 2241 2341 2332 2258 2183 2143 2104 2058 2121 2166 2211 2263 2315 2293 2271 2377 2482 2385 2287 2317 2347 2345 2343 2335 2326 2365 2296 2287 2279 2316 2353 2445 2427
172 2427 2463 2390 2379 2367 2414 2571 2643 2606 2465 2433 2431 2429 2434 2549 2595 2641 2684 2618 2571 2523 2498 2654 2715 2776 2705 2742 2808 2875 2793 2711 2793 2874 2811 2747
167 2747 2841 2934 2921 2799 2724 2758 2828 2788 2660 2713 2742 2770 2810 2850 2889 2927 3027 3018 3098 3177 3256 3227 3174 3121 3006 2892 2951 3010 3076 3142 3068 3102 3028
162 3028 2953 3042 3240 3311 3272 3323 3374 3424 3475 3424 3481 3484 3487 3421 3464 3641 3708 3584 3569 3649 3730 3715 3701 3646 3591 3398 3422 3499 3684 3802 3919 3917 3914
157 3914 3986 4058 4003 3948 4039 4131 4131 4131 4248 4364 4244 4124 4330 4536 4434 4331 4468 4605 4688 4770 4767 4763 4760 4757 4641 4525 4595 4666 4714 5126 5288
$$ packed form
194A904L4L5M5o3n7n7K7K6k1k1m5O4nmQ4k5k6k5R7j1M3M3Q4k5j8j9J5J5O9P0j24j23o4M5R0
189B057j8JKQJ16J02p8j03j03n5N4R5j5N4N4l0l0r1J7K1K1L9j42k1k1J19J1qpL3L3O5m4l7
183B099l8M5M4j7j7P2l8J8J7M0o8j4j4O9m0K2K1l7l7N4N3o1o1ooO7O7l5j43L2L2J8J9R1j7
178B231mlj07KO1O1J00rp4p5m0l9m6O3M5M5N2N2k2k2J06J05r7r8L0L0kkqrL9o9rqL7L7R2j8
172B427L6p3j1j2M7J57P2l7j41l2kkNJ15M6M6M3o6m7m8k5J56O1O1p1L7O6O7q2q2Q2Q1o3o4
167B747R4R3j3j22p5L4P0m0j28N3K9K8M0M0L9L8J00rQ0P9P9k9n3n3j15j14N9N9O6O6p4L4p4
162C028p5Q9J98P1l9N1N1N0N1n1N7LLo6M3J77O7j24j5Q0Q1j5j4n5n5j93K4P7J85J18J17kl
157C914P2P2n5n5R1R2%%J17J16j20j20K06K06j02j03J37J37Q3Q2lmllj16j16P0P1M8M12J62
$$ plain form
152 5288 5087 5063 5402 5364 5326 5845 6001 4963 4724 5076 5066 5119 5535 5763 5774 5984 6557 6677 6580 6600 6983 7434 7523 7248 7627 7847
148 7847 7704 7533 7726 7421 6898 7391 9119 9910 10483 11362 12459 12964 13361 13723 14593 15552 16729 18133 20626 23830 28850
145 28850 34297 35604 31729 27491 24942 24645 25013 26180 27611 29985 32737 36578 41154 48127 56361 66992 79566
142 79566 97587 122181 160355 217630 312888 474660 693878 772467 626862 420306 265677 174877 123657
141 123657 95034 76070 63732 54227 47282 40555 35515 31273 28388 25975 24473 23151 22563 22157 22858 24176 27559
138 27559 31559 31846 26722 21104 17192 14978 13236 12344 11635 11274 10660 10307 10062 10610 11157 11886 12288 12792 12097 10615 9533
135 9533 9040 8221 7613 7549 7599 7105 6983 6971 6972 6792 6782 6881 7021 6834 6648 6789 7039 6672 6527 6710 5984 5077 5214 5242 5042 4952
131 4952 5184 5162 5006 4849 4936 4841 4703 4456 4384 4203 4179 4155 4006 4039 4246 3981 3891 3983 4004 3916 3938 3959 3973 3879 3961 3935 3867 3691 3627 3673
$$ packed form
152E288k01k4L39l8l8N19J56j038k39L52j0N3M16K28J1K10N73J20r7K0L83M51Q9k75L79K20
148G847j43j71J93l05n23M93J728P91N73Q79J097N05L97L62Q70R59J177J404K493L204N020
145B8850N447J307l875m238k549k97L68J167J431K374K752L841M576O973Q234J0631J2574
142G9566J8021K4594L8174N7275R5258J61772K19218P8589j45605k06556j54629r0800n1220
141A23657k8623j8964j2338r505o945o727n040m242k885k413j502j322n88m06P01J318L383
138B7559M000K87n124n618l912k214j742q92p09l61o14l53k45N48N47P29M02N04o95j482j082
135I533m93q19o08o4N0m94j22j2Jj80j0R9J40j87j86J41K50l67j45J83p26r07J37K8k00r0
131D952K32k2j56j57Q7r5j38k47p2j81k4k4j49L3K07k65r0R2K1q8K2K1J4r4Q2k6o8j76o4M6
$$ plain form
126 3673 3698 3542 3468 3395 3393 3208 3141 3182 3342 3175 3131 3195 3212 3121 3130 3140 3113 2978 2876 2774 2756 2738 2808 2878 2851 2824 2809 2685 2688 2800 2964
121 2964 3128 3124 3011 3030 3049 2970 2892 2876 2861 2792 2722 2678 2633 2541 2449 2361 2382 2431 2370 2441 2512 2583 2544 2567 2590 2544 2499 2494 2380 2320 2260 2344 2318 2354
116 2354 2389 2459 2529 2532 2427 2346 2265 2163 2170 2246 2213 2084 2137 2310 2373 2382 2392 2387 2382 2356 2331 2298 2374 2451 2418 2296 2174 2282 2208 2116 2132 2167 2202 2212
111 2212 2222 2225 2228 2235 2132 2091 2050 2063 2076 2089 2102 2139 2176 2122 2069 2057 2045 2033 2021 1994 1968 2109 2069 1908 1930 1928 1927 1855 1783 1874 1966 1993 2020 1956 1892 2023
106 2023 2154 2097 2040 1955 2052 2065 1896 1812 1836 1909 1981 2059 2028 2093 2157 2075 2102 2304 2506 2432 2359 2258 2157 2122 2087 1937 1895 1935 1975 1994 2014
101 2014 2011 2008 2032 2056 1960 1864 1902 1940 1879 1928 1927 1925 1792 1841 1946 1943 1811 1788 1756 1833 1823 1703 1712 1722 1779 1945 1989 2033 2156 2171 2161 2041 1822 1856
96 1856 1966 1966 1971 1977 1941 1905 1984 1953 1991 2029 1978 2037 2034 2031 2038 2045 1993 1832 1801 1878 1914 1951 1898 1844 1925 2006 1978 2060 2114 2059 2156 2254 2182 2109 2115 2120 2071 2022 2048
90 2048 2074 1912 1858 1878 1899 1919 2048 2043 2037 1991 1945 1913 1989 1977 1964 1907 1850 1805 1759 1708 1839 1929 1910 1936 1962 1989 2015 1980 2054 2061 2067 2084 1993 1901 1919 1962
$$ packed form
126C673K5j56p4p3kj85o7M1J60j67m4O4J7r1RJ0k7j35j02j02j8j8P0P0k7k7j5j24LJ12J64
121B964J64mj13J9J9p9p8j6j5o9p0m4m5r2r2q8K1M9o1P1P1P1l9K3K3m6m5nj14o0o0Q4k6L6
116B354L5P0P0Lj05q1q1j02PP6l3j29N3J73O3RJ0nnk6k5l3P6P7l3j22j22J08p4r2J6L5L5J0
111B212J0LLPj03m1m1J3J3J3J3L7L7n4n3j2j2j2j2k7k6J41m0j61K2kjp2p2R1R2K7K7o4o4J31
106B023J31n7n7q5R7J3j69q4K4P3P2P8l1O5O4q2K7K02K02p4p3j01j01l5l5j50m2M0M0J9K0
101B014llK4K4r6r6L8L8o1M9jkj33M9J05lj32k3l2P7j0j20RJ0N7J66M4M4J23J5j0j20k19L4
96A856J10%NOl6l6P9l1L8L8n1N9llPPn2j61l1P7L6L7n3n4Q1Q1k8Q2N4n5R7R8p2p3ONm9m9K6
90B048K6j62n4K0K1K0J29nom6m6l2P6j2j3n7n7m5m6n1J31R0j9K6K6K7K6l5P4POJ7r1r2J8M3
$$ plain form
84 1962 2006 2056 2106 2093 2080 2067 2054 2067 2080 2093 2106 2093 2081 2068 2056 2092 2129 2193 2257 2273 2290 2332 2555 2980 3405 4118 4722 5007 4964 4545 3871
79 3871 3278 2867 2621 2484 2388 2292 2294 2296 2218 2140 2189 2239 2212 2185 2158 2132 2140 2149 2212 2275 2266 2256 2247 2237 2167 2097 2070 2043 2177 2129 1991 2034 2030 2025 2032 2039 2173
74 2173 2307 2339 2371 2391 2230 2110 2099 2050 2001 2086 2171 2256 2342 2336 2330 2328 2326 2396 2358 2370 2564 2783 3183 3598 4014 4367 4540 4421 4120 3685 3250
69 3250 2750 2431 2391 2351 2239 2126 1996 1975 2103 2050 2051 2052 2033 2014 2038 2062 2091 1938 1887 1836 1876 1916 1956 1996 2021 2046 2017 1988 2044 2100 2155 2211 2221
64 2221 2230 2112 1995 1982 1970 2013 2055 2075 2094 1987 1879 1840 1801 1888 1976 2024 2072 2120 2168 2158 2147 2107 1959 1899 1840 1969 2280 2285 2108 2099 2091 2074 2057
59 2057 2095 2133 2121 2108 2096 2084 2083 2082 2081 2080 2001 1922 1964 2005 2154 2193 2160 2126 2127 2019 1972 1925 1959 1992 2039 1978 2052 2236 2120 2112 2245 2268 2239 2211 2138 2174
54 2174 2142 2110 2136 2053 1968 2137 2297 2274 2232 2080 2066 2051 2078 2105 2151 2088 2080 2071 2154 2127 2209 2292 2285 2170 2115 2061 2072 2084 2143 2202 2269 2226 2245 2263 2319
48 2319 2374 2338 2193 2124 2237 2384 2277 2331 2385 2416 2447 2619 2682 2705 2618 2477 2336 2253 2280 2274 2268 2371 2292 2293 2293 2428 2454 2455 2348 2234 2229 2296 2362
$$ packed form
84A962M4N0N0j3j3j3j3J3J3J3J3j3j2j3j2L6L7O4O4J6J7M2K23M25M25P13O04K85m3m19o74
79C871n93m11k46j37r6r6KKp8p8M9N0k7k7k7k6QRO3O3rj0rj0p0p0k7k7J34m8j38M3mnPPJ34
74B173J34L2L2K0j61j20j1m9m9Q5Q5Q5Q6ookkP0l8J2J94K19M00M15M16L53J73j19l01m35m35
69C250n00l19m0m0j12j13j30k1J28n3JJj9j9K4K4K9j53n1n1M0M0M0M0K5K5k9k9N6N6N5N6J0
64B221Rj18j17j3j2M3M2K0J9j07j08l9l9Q7Q8M8M8M8M8j0j1m0j48o0n9J29L11Nj77rqj7j7
59B057L8L8j2j3j2j2jjjjp9p9M2M1J49L9l3l4Jj08m7m7L4L3M7o1P4J84j16qJ33K3k9k8p3L6
54B174l2l2K6q3q5J69J60k3m2j52j4j5K7K7M6o3qrQ3k7Q2Q3pj15n5n4J1J2N9N9O7m3J9J8N6
48B319N5l6j45o9J13J47j07N4N4L1L1J72O3K3q7j41j41q3K7ooJ03p9J%J35K6Jj07j14nO7O6
$$ plain form
43 2362 2442 2414 2363 2312 2345 2487 2550 2432 2417 2401 2526 2543 2559 2394 2343 2291 2326 2360 2329 2407 2485 2453 2480 2507 2642 2669 2554 2439 2506 2463 2485 2506
38 2506 2575 2534 2603 2563 2632 2592 2704 2707 2669 2522 2444 2475 2585 2695 2840 2730 2763 2796 2798 2799 2790 2780 2865 2768 2773 2670 2807 2836 2980 3015 2996 2977 3012
33 3012 2939 2879 2819 2832 2845 2935 2844 2836 2938 3022 2925 2937 2949 3019 3089 3145 3020 2905 2973 3167 3107 3113 3228 3318 3154 3134 3114 3230 3346 3456 3383 3323
28 3323 3262 3259 3257 3334 3411 3505 3418 3426 3433 3575 3607 3671 3626 3681 3736 3754 3664 3707 3750 3774 3799 3957 3934 3891 3956 4087 4110 4350 4336 4279 4331 4358 4131 4167 4204
23 4204 4292 4272 4368 4574 4618 4408 4622 4836 4839 4841 5409 4888 3953 4108 4374 4133 4381 4847 5041 5017 5424 5832 5891 5733 5901 6070 6365
19 6365 6152 6162 6534 6598 6298 6452 6389 5599 5027 6724 8204 8624 9261 10147 10523 10575 10736 11390 12043 12795 13329 14194 15423 16914
15 16914 18914 22975 29142 32512 29564 25417 22796 21899 21947 23111 24929 27314 29917 34236 39644 47342 57292 70573
12 70573 87268 111670 148346 208034 311952 504674 705313 671825 470937 289689 178961 119242 87775
$$ packed form
43B362Q0k8n1n1L3J42O3j18j5j6J25J7J6j65n1n2L5L4l1P8P8l2K7K7J35K7j15j15O7m3K2K1
38B506O9m1O9m0O9m0J12Ll8j47p8L1J10J10J45j10L3L3KJrj0Q5r7Nj03J37K9J44L5j9j9L5
33C012p3o0o0J3J3R0r1qJ02Q4r7J2J2P0P0N6j25j15O8J94o0OJ15R0j64k0k0J16J16J10p3o0
28C323o1lkP7P7R4q7QPJ42L2O4m5N5N5J8r0M3M3K4K5J58k3m3O5J31K3K40j4n7N2K7k27L6L7
23D204Q8k0R6K06M4k10K14K14LKN68n21r35J55K66k41K48M66J94k4M07M08N9j58J68J69K95
19F365k13J0L72O4l00J54o3p90n72J697J480M20O37Q86L76N2J61O54O53P52N34Q65J229J491
15A6914K000M061O167L370k948m147k621q97M8J164J818K385K603M319N408P698R950J3281
12G0573J6695K4402L6676N9688J03918J92722K00639l3488k00888j81248j10728n9719l1467
$$ plain form
11 87775 69666 57585 48137 40359 34101 29368 26232 23895 22298 21065 20494 20286 20675 22590 26747 30105 27546 22010
8 22010 17391 14297 12381 11409 10651 9893 9513 9352 8952 8443 8290 8500 9265 10031 10803 11358 11391 10043 8647 8050 7552 6837
4 6837 6736 6999 6676 6135 6281 6427 6262 5988 5904 6184 6296 5899 5808 6189 6132 5675 5902 5801 4612 4257 4762 4723 4565 4734 4799
1 4799 4537 4425 4313 4271 4229 4132 4035 3947 3858 3937 3835 3676 3699 3826 3553 3603 3544 3444 3453 3605 3504 3352 3310 3454 3418 3381 3235 3321 3298 3203
-4 3203 3108 3081 3053 2972 2890 2923 2957 2997 2928 2880 2831 2776 2721 2741 2761 2843 2816 2738 2661 2686 2602 2621 2532 2545 2558 2670 2672 2729 2787 2887 2878 2901 2814 2784 2753
-9 2753 2723 2583 2519 2454 2437 2420 2342 2263 2240 2216 2175 2135 2149 2162 2266 2370 2364 2250 2275 2191 2162 2132 2166 2201 2235 2269 2296 2322 2465 2499 2368 2237
-14 2237 2251 2156 2162 2168 2214 2261 2288 2206 2138 2070 2029 2096 2204 2131 2112 2093 2153 2214 2242 2270 2287 2304 2379 2272 2177 2082 2078 2074 2227 2198 2070 1941 1994 2047
-19 2047 2138 2120 2098 2075 2173 2089 1980 1872 1916 1961 1951 1941 1994 2048 2094 2141 2153 2056 2130 2021 1997 2082 2094 1997 2006 1907 1916 1925 1907 1889 2016 2035 1964 1784
$$ packed form
11H7775j8109j2081r448p778o258m733l136k337j597j233n71k08L89J915M157L358k559n536
8B2010m619l094j916r72p58p58l80j61m00n09j53K10P65P66P72N55L3j348j396n97m98p15
4F837j01K63l23n41J46J46j65k74q4K80J12l97r1L81n7m57K27j01j189l55N05l9j58J69O5
1D799k62j12j12m2m2r7r7q8q9P9j02j59K3J27k73N0n9j00RJ52j01j52m2J44l6l7j46Q6k3r5
-4C203r5k7k8q1q2L3L4M0o9m8m9n5n5K0K0Q2k7p8p7K5q4J9q9J3J3J12KN7N8J00rK3q7l0l1
-9B753l0j40o4o5j7j7p8p9k3k4m1m0J4J3J04J04oj14K5q4k9l0L4L5L4L4K7K6J43L4j31j31
-14B237J4r5OOM6M7K7q2o8o8m1O7J08p3j9j9O0O1K8K8J7J7P5j07r5r5mmJ53k9j28j29N3N3
-19B047R1j8k2k3R8q4j09j08M4M5j0j0N3N4M6M7J2r7P4j09k4Q5J2r7Rr9RRj8j8J27J9p1j80
$$ plain form
-25 1784 1858 1932 1948 1964 1987 1901 1877 1854 1884 1806 1816 1827 1775 1724 1732 1739 1808 1767 1847 1927 2091 2073 1978 1701 1683 1774 1889 1895 1871 1848 1927 1897 1838 1779 1795
-30 1795 1812 1836 1750 1770 1790 1802 1815 1906 1997 1925 1853 1845 1837 1945 1944 1881 1817 1740 1663 1837 1902 1937 1972 1898 1823 1864 1796 1819 1842 1797 1751 1780 1700 1710 1829
-35 1829 1816 1803 1851 1791 1827 1755 1724 1693 1836 1762 1683 1604 1641 1678 1715 1752 1788 1824 1769 1714 1689 1665 1695 1725 1719 1713 1652 1592 1682 1773 1736 1700 1736 1773 1810
-41 1810 1847 1947 2047 2021 1994 1905 1816 1728 1639 1727 1815 1849 1883 1850 1816 1783 1750 1710 1670 1684 1699 1702 1706 1709 1712 1764 1816 1868 1921 1899 1877 1855 1834 1845 1856 1868
-46 1868 1879 1883 1887 1982 2077 2069 2062 2055 2048 2285 2523 2954 3385 3876 4258 4408 4195 3737 3170 2787 2513 2239 2073 2090 2106 2046 1987 1872 1758 1771
-51 1771 1784 1797 1810 1804 1799 1793 1788 1756 1725 1820 1916 1861 1807 1753 1699 1649 1599 1611 1622 1619 1724 1884 1826 1723 1512 1487 1571 1590 1609 1689 1770 1856 1942 1937 1932 1904
-56 1904 1875 1847 1818 1849 1879 1746 1613 1592 1570 1621 1563 1445 1508 1662 1635 1524 1521 1574 1626 1640 1655 1670 1685 1713 1741 1679 1617 1571 1526 1535 1653 1882
-61 1882 1930 1851 1771 1776 1781 1785 1790 1782 1774 1766 1759 1759 1759 1759 1759 1693 1628 1689 1750 1768 1785 1747 1710 1683 1656 1574 1493 1509 1525 1656 1788 1829 1689 1639 1771 1880 1989 1910
$$ packed form
-25A784P4P4J6J6K3q6k4k3L0p8J0J1n2n1QPO9m1Q0Q0J64j8r5k77j8R1J15Ok4k3P9l0n9n9J6
-30A795J7K4q6K0K0J2J3R1R1p2p2qqJ08jo3o4p7p7J74O5L5L5p4p5M1o8K3K3m5m6K9q0J0J19
-35A829j3j3M8o0L6p2l1l1J43p4p9p9L7L7L7L7L6L6n5n5k5k4L0L0ooo1o0R0R1l7l6L6L7L7
-41A810L7J00J00k6k7q9q9q8q9Q8Q8L4L4l3l4l3l3m0m0J4J5LMLLN2N2N2N3k2k2k2k1J1J1J2
-46A868J1MMR5R5qpppK37K38M31M31M91L82J50k13m58n67l83k74k74j66J7J6o0n9j15j14J3
-51A771J3J3J3ononl2l1R5R6n5n4n4n4n0n0J2J1lJ05J60n8j03k11k5Q4J9J9Q0Q1Q6Q6nnk8
-56A904k9k8k9L1L0j33j33k1k2N1n8j18O3J54k7j11lN3N2J4J5J5J5K8K8o2o2m6m5RJ18K29
-61A882M8p9q0NNMNqqqp%%%%o6o5O1O1J8J7l8l7k7k7q2q1J6J6J31J32M1j40n0J32J09J09p9
$$ plain form
-67 1910 1830 1779 1728 1586 1444 1492 1539 1587 1634 1665 1695 1671 1646 1614 1582 1616 1649 1531 1594 1764 1752 1526 1554 1591 1628 1627 1625 1624 1623 1624 1625 1626 1627 1589 1552 1605
-72 1605 1659 1631 1602 1574 1546 1552 1558 1509 1460 1515 1570 1570 1570 1609 1648 1632 1617 1559 1502 1444 1386 1515 1643 1681 1718 1714 1709 1644 1687 1646 1606 1572 1538 1507 1477 1440 1511
-78 1511 1562 1612 1738 1754 1536 1426 1485 1543 1561 1580 1507 1434 1434 1434 1464 1602 1558 1514 1499 1594 1666 1630 1571 1512 1525 1538 1550 1563 1578 1592 1614 1636 1518
-83 1518 1509 1627 1636 1642 1648 1647 1646 1618 1590 1569 1547 1520 1602 1623 1643 1637 1632 1505 1379 1353 1436 1457 1479 1607 1735 1699 1664 1636 1609 1636 1663 1634 1604 1669 1844 1776
-89 1776 1599 1551 1684 1773 1861 1870 1770 1617 1645 1655 1665 1693 1722 1750 1779 1775 1770 1705 1748 1710 1672 1641 1610 1603 1596 1588 1581 1618 1654 1643 1631 1581 1640 1638 1636 1661 1686
-94 1686 1590 1495 1492 1597 1642 1686 1689 1691 1694 1697 1730 1763 1742 1721 1697 1673 1649 1625 1625 1624 1624 1624 1650 1675 1701 1726 1682 1639 1540 1442 1461 1481 1500 1519 1529 1540 1550 1560 1563
-100 1563 1566 1478 1390 1395 1400 1405 1410 1503 1596 1634 1673 1617 1561 1494 1608 1622 1636 1607 1578 1599 1620 1587 1553 1599 1644 1635 1627 1590 1554 1573 1591 1578 1564 1503 1624 1678 1733
-106 1733 1738 1742 1737 1622 1558 1675 1652 1630 1619 1608 1672 1736 1739 1742 1720 1589 1460 1586 1665 1635 1682 1730 1767 1804 1743 1682 1715 1639 1569 1681 1733 1676 1692 1707
$$ packed form
-67A910q0n1n1j42j42M8M7M8M7L1L0k4k5l2l2L4L3j18O3J70j2k26K8L7L7jkjjJJJJl8l7N3
-72A605N4k8k9k8k8OOm9m9N5N5%%L9L9j6j5n8n7n8n8J29J28L8L7mno5M3m1m0l4l4l1l0l7P1
-78A511N1N0J26J6k18j10N9N8J8J9p3p3%%L0J38m4m4j5R5P2l6n9n9J3J3J2J3J5J4K2K2j18
-83A518rJ18ROOjjk8k8k1k2k7Q2K1K0onj27j26k6Q3K1K2J28J28l6l5k8k7K7K7k9l0O5J75o8
-89A776j77m8J33Q9Q8Rj00j53K8J0J0K8K9K8K9mno5M3l8l8l1l1ppqpL7L6j1j2n0N9kkK5K5
-94A686r6r5lJ05M5M4LKLLL3L3k1k1k4k4k4k4%j%%K6K5K6K5m4m3r9r8J9K0J9J9J0J1J0J0L
-100A563Lq8q8NNNNR3R3L8L9n6n6o7J14J4J4k9k9K1K1l3l4M6M5rql7l6J9J8j3j4o1J21N4N5
-106A733NMnj15o4J17k3k2j1j1O4O4LLk2j31j29J26P9l0M7M8L7L7o1o1L3p6p0J12N2n7J6J5
$$ plain form
-111 1707 1743 1779 1761 1742 1731 1719 1707 1696 1637 1579 1575 1572 1552 1532 1567 1602 1588 1574 1560 1546 1539 1532 1525 1517 1593 1668 1580 1492 1558 1623 1597 1572 1557 1541 1472 1402 1403 1404
-117 1404 1495 1587 1620 1654 1560 1467 1508 1550 1501 1451 1472 1492 1512 1533 1515 1496 1478 1460 1413 1366 1446 1526 1619 1713 1679 1646 1625 1603 1582 1561 1512 1462 1540 1618
-122 1618 1677 1736 1668 1599 1536 1472 1536 1599 1506 1414 1484 1555 1515 1474 1488 1502 1512 1522 1478 1434 1453 1472 1546 1620 1650 1680 1583 1486 1517 1548 1525 1502 1487 1472
-127 1472 1457 1442 1522 1601 1553 1505 1487 1469 1505 1541 1503 1465 1518 1570 1594 1618 1670 1721 1688 1655 1650 1644 1585 1526 1466 1407 1482 1557 1632 1707 1763 1818 1746 1674 1612
-132 1612 1550 1579 1608 1603 1598 1648 1697 1644 1592 1593 1595 1588 1581 1628 1675 1633 1592 1577 1562 1623 1684 1654 1624 1528 1431 1461 1491 1450 1408 1394 1380 1429 1479 1529 1579 1588 1598 1662
-138 1662 1726 1655 1584 1604 1623 1559 1494 1520 1545 1585 1624 1610 1595 1539 1483 1518 1553 1569 1584 1600 1616 1573 1531 1544 1556 1508 1460 1411 1363 1368 1373 1405 1438 1530 1621
-144 1621 1659 1696 1712 1728 1653 1578 1577 1577 1603 1630 1682 1733 1658 1582 1596 1609 1568 1528 1494 1461 1555 1649 1573 1496 1511 1525 1609 1692 1649 1497 1342 1369 1409 1559
-149 1559 1695 1577 1416 1436 1491 1547 1559 1572 1606 1640 1674 1708 1693 1678 1572 1467 1422 1376 1458 1540 1577 1614 1623 1633 1600 1568 1590 1611 1686 1760 1665 1569
$$ packed form
-111A707L6L6j8j9j1j2j2j1n9n8mlk0k0L5L5j4j4j4j4pppqP6P5q8q8O6O5k6k5j5j6o9p0JJ
-117A404R1R2L3L4r4r3M1M2m9n0K1K0K0K1j8j9j8j8m7m7Q0Q0R3R4l4l3k1k2k1k1m9n0P8P8
-122A618N9N9o8o9o3o4O4O3r3r2P0P1m0m1J4J4J0J0m4m4J9J9P4P4L0L0r7r7L1L1k3k3j5j5
-127A472j5j5Q0P9m8m8j8j8L6L6l8l8N3N2K4K4N2N1l3l3non9n9o0n9P5P5P5P5N6N5p2p2o2
-132A612o2K9K9nnN0M9n3n2JKppM7M7m2m1j5j5O1O1l0l0r6r7L0L0m1m2j4j4M9N0N0N0RJ0O4
-138A662O4p1p1K0J9o4o5K6K5M0L9j4j5n6n6L5L5J6J5J6J6m3m2J3J2m8m8m9m8NNL2L3R2R1
-144A621L8L7J6J6p5p5j%K6K7N2N1p5p6J4J3m1m0l4l3R4R4p6p7J5J4Q4Q3m3j52j55K7M0J50
-149A559J36j18j61K0N5N6J2J3L4L4L4L4j5j5j06j05m5m6Q2Q2L7L7RJ0l3l2K2K1P5P4r5r6
$$ plain form
-154 1569 1613 1548 1544 1540 1489 1438 1513 1589 1597 1606 1615 1623 1623 1622 1640 1549 1492 1616 1632 1648 1585 1522 1550 1579 1569 1559 1495 1430 1384 1338 1419 1391 1363 1517 1575 1524 1445
-159 1445 1475 1430 1385 1491 1488 1462 1437 1329 1331 1391 1452 1507 1453 1467 1481 1461 1550 1572 1593 1640 1578 1639 1699 1699 1807 1800 1793 1727 1662 1596 1531 1494 1457 1510 1564
-165 1564 1527 1490 1544 1598 1516 1435 1354 1273 1374 1476 1522 1569 1566 1563 1567 1462 1476 1490 1558 1518 1512 1507 1440 1374 1415 1455 1441 1428 1488 1548 1614 1572 1568 1565 1615 1557
-170 1557 1538 1518 1492 1465 1447 1428 1457 1487 1512 1429 1394 1467 1582 1587 1534 1589 1650 1530 1427 1325 1341 1356 1372 1387 1539 1690 1679 1667 1634 1601 1496
-175 1496 1500 1648 1616 1569 1632 1654 1568 1611 1545 1562 1578 1588 1598 1595 1591 1587 1584 1624 1665 1651 1637 1620 1603 1585 1568 1589 1609 1629 1649 1597 1545 1492 1440 1393 1346 1427
-180 1427 1507 1501 1496 1490 1484 1480 1475 1525 1575 1615 1655 1569 1482 1502 1521 1541 1561 1603 1645 1688 1730 1644 1558 1563 1567 1549 1530 1511 1493 1483 1474 1464 1454 1508 1562 1550 1538 1719
-186 1719 1720 1731 1743 1751 1759 1712 1666 1652 1638 1625 1611 1631 1652 1581 1511 1575 1638 1611 1583 1595 1607 1619 1631 1546 1462 1395 1438 1518 1417 1480 1542 1571 1599 1536 1474
-192 1474 1412 1349 1450 1551 1499 1447 1394 1342 1356 1370 1438 1507 1522 1537 1461 1386 1490 1595 1602 1610 1655 1592 1590 1588 1590 1592 1656 1610 1526 1441 1471 1500 1641 1673 1737
$$ packed form
-154A569M4o5mmn1n1P5P6QRRQ%jJ8r1n7J24J6J6o3o3K8K9j0j0o4o5m6m6Q1k8k8J54N8n1p9
-159A445L0m5m5J06lk6k5j08KO0O1N5n4J4J4k0Q9K2K1M7o2O1O0%J08ppo6o5o6o5l7l7N3N4
-165A564l7l7N4N4q2q1q1q1J01J02M6M7llMj05J4J4O8m0ono7o6M1M0j4j3O0O0O6m2mlN0n8
-170A557j9k0k6k7j8j9K9L0K5q3l5P3J15Nn3N5O1j20j03j02J6J5J6J5J52J51j1j2l3l3j05
-175A496MJ48l2m7O3K2q6M3o6J7J6J0J0lmmlM0M1j4j4j7j7j8j7K1K0K0K0n2n2n3n2m7m7Q1
-180A427Q0onoomnN0N0M0M0q6q7K0J9K0K0M2M2M3M2q6q6NMj8j9j9j8j0rj0j0N4N4j2j2J81
-186A719JJ1J2QQm7m6j4j4j3j4K0K1p1p0O4O3k7k8J2J2J2J2q5q4o7M3Q0j01O3O2K9K8o3o2
-192A474o2o3J01J01n2n2n3n2J4J4O8O9J5J5p6p5J04J05PQM5o3kkKKO4m6q4q5L0K9J41L2O4
$$ plain form
-197 1737 1692 1608 1524 1524 1525 1565 1604 1547 1489 1581 1564 1456 1457 1458 1459 1411 1364 1463 1561 1557 1444 1382 1320 1244 1278 1352 1426 1568 1601 1564 1526 1482 1437 1462 1487 1511
-202 1511 1536 1629 1721 1795 1688 1546 1512 1504 1496 1376 1366 1429 1491 1473 1564 1593 1623 1527 1431 1462 1493 1597 1701 1709 1609 1511 1522 1403 1393 1396 1399 1408 1418 1408
-208 1408 1398 1387 1377 1469 1561 1598 1635 1571 1506 1496 1485 1550 1615 1552 1490 1525 1561 1542 1523 1501 1479 1439 1580 1615 1542 1541 1540 1537 1533 1591 1541 1499 1457 1500 1542 1556
-213 1556 1570 1584 1598 1537 1477 1423 1369 1320 1379 1493 1499 1416 1333 1432 1422 1485 1549 1551 1554 1549 1545 1472 1509 1548 1479 1533 1586 1613 1639 1604 1569 1581 1484 1387 1399 1397 1396
-219 1396 1457 1517 1581 1644 1581 1517 1488 1459 1484 1509 1526 1543 1506 1468 1440 1412 1452 1384 1349 1423 1436 1449 1399 1459 1505 1369 1343 1318 1262 1389 1495 1492 1507
-224 1507 1522 1445 1367 1380 1393 1436 1479 1467 1456 1428 1399 1425 1451 1452 1452 1453 1453 1485 1516 1456 1397 1495 1593 1600 1499 1394 1471 1566 1660 1623 1586 1548 1511 1484 1457 1520
-229 1520 1584 1579 1573 1484 1395 1369 1453 1475 1497 1503 1508 1514 1519 1520 1521 1468 1415 1460 1506 1497 1488 1459 1429 1454 1480 1498 1517 1482 1446 1500 1554 1608 1662 1509 1355 1437 1519 1519 1518
-235 1518 1517 1517 1539 1562 1596 1630 1514 1580 1557 1425 1311 1305 1321 1338 1465 1592 1592 1591 1558 1525 1492 1459 1506 1554 1547 1540 1456 1372 1313 1436 1504 1572 1573 1573 1446
$$ packed form
-197A737m5q4q4%JM0L9n7n8R2j7j08JJJm8m7R9R8mj13o2o2p6L4P4P4J42L3l7l8m4m5K5K5K4
-202A511K5R3R2P4j07j42l4qqj20j0O3O2j8R1K9L0r6r6L1L1J04J04Qj00r8J1j19j0LLRJ0j0
-208A408j0j1j0R2R2L7L7o4o5j0j1O5O5o3o2L5L6j9j9k2k2m0J41L5p3jjlmN8n0m2m2M3M2J4
-213A556J4J4J4o1o0n4n4m9N9J14Oq3q3R9j0O3O4KLnmp3L7L9o9N4N3K7K6l5l5J2r7r7J2kj
-219A396O1O0O4O3o3o4k9k9K5K5J7J7l7l8k8k8M0o8l5P4J3J3n0O0M6j36k6k5n6J27J06lJ5
-224A507J5p7p8J3J3M3M3j2j1k8k9K6K6J%J%L2L1o0n9R8R8Pj01j05P7R5R4l7l7l8l7k7k7O3
-229A520O4noq9q9k6Q4K2K2ONONJJn3n3M5M6rrk9l0K5K6J8J9l5l6N4N4N4N4j53j54Q2Q2%j
-235A518j%K2K3L4L4j16O6k3j32j14oJ6J7J27J27%jl3l3l3l3M7M8ppq4q4n9J23O8O8J%j27
$$ plain form
-241 1446 1500 1507 1514 1478 1442 1490 1538 1647 1647 1479 1493 1533 1573 1497 1421 1485 1550 1614 1679 1555 1431 1507 1583 1560 1537 1521 1505 1479 1563 1603 1462 1440 1526
-246 1526 1540 1553 1487 1422 1356 1290 1317 1344 1317 1289 1279 1269 1313 1357 1362 1367 1318 1450 1578 1598 1600 1601 1563 1525 1486 1448 1460 1473 1431 1389 1398 1407 1470 1533 1444 1355
-251 1355 1394 1432 1513 1595 1593 1591 1557 1632 1652 1564 1638 1713 1654 1485 1331 1358 1439 1521 1523 1525 1472 1420 1465 1510 1465 1419 1416 1413 1494 1575 1554 1425 1215 1258 1368
-256 1368 1478 1483 1488 1510 1640 1709 1778 1698 1618 1635 1653 1620 1695 1723 1642 1514 1495 1498 1502 1524 1546 1513 1480 1460 1440 1474 1508 1457 1406 1445 1485 1513 1541 1569 1597
-262 1597 1576 1554 1532 1510 1493 1476 1507 1537 1628 1610 1587 1456 1469 1483 1435 1387 1423 1458 1432 1515 1558 1602 1616 1521 1526 1423 1366 1419 1431 1443 1462 1481 1527 1573
-267 1573 1680 1679 1501 1324 1344 1473 1575 1569 1504 1439 1458 1477 1453 1429 1336 1424 1563 1592 1546 1500 1447 1394 1424 1454 1429 1404 1422 1440 1403 1367 1420 1473
-272 1473 1471 1470 1460 1450 1440 1430 1406 1382 1359 1335 1316 1296 1331 1366 1338 1310 1260 1391 1514 1455 1419 1383 1419 1454 1489 1525 1509 1494 1533 1572 1546 1519 1492 1466
-277 1466 1497 1528 1505 1482 1412 1342 1436 1420 1327 1416 1511 1498 1518 1538 1498 1457 1483 1510 1482 1454 1415 1376 1464 1552 1546 1540 1418 1296 1305 1495 1529 1562 1576 1590
$$ packed form
-241A446N4PPl6l6M8M8J09%j68J4M0M0p6p6O4O5O4O5j24j24P6P6k3k3j6j6k6Q4M0j41k2Q6
-246A526J4J3o6o5o6o6K7K7k7k8j0j0M4M4NNm9J32J28K0KJl8l8l9l8J2J3m2m2RRO3O3q9q9
-251A355L9L8Q1Q2kkl4P5K0q8P4P5n9j69j54K7Q1Q2KKn3n2M5M5m5m6llQ1Q1k1j29k10M3J10
-256A368J10NNK2J30O9O9q0q0J7J8l3P5K8q1j28j9LMK2K2l3l3k0k0L4L4n1n1L9M0K8K8K8K8
-262A597k1k2k2k2j7j7L1L0R1j8k3j31J3J4m8m8L6L5k6Q3M3M4J4r5Nj03n7N3J2J2J9J9M6M6
-267A573J07jj78j77K0J29J02oo5o5J9J9k4k4r3Q8J39K9m6m6n3n3L0L0k5k5J8J8l7l6N3N3
-272A473kjj0j0j0j0k4k4k3k4j9k0L5L5k8k8n0J31J23n9l6l6L6L5L5L6j6j5L9L9k6k7k7k6
-277A466L1L1k3k3p0p0R4j6r3Q9R5j3K0K0m0m1K6K7k8k8l9l9Q8Q8ooj22j22RJ90L4L3J4J4
$$ plain form
-282 1590 1603 1617 1512 1406 1392 1377 1364 1352 1393 1435 1417 1398 1380 1361 1398 1435 1417 1399 1400 1402 1458 1513 1495 1476 1403 1330 1366 1403 1513 1513 1450 1569 1524 1479
-287 1479 1403 1328 1415 1503 1534 1564 1540 1516 1515 1514 1615 1534 1511 1488 1454 1419 1385 1351 1316 1282 1287 1292 1296 1301 1329 1356 1384 1411 1454 1496 1539 1581 1477 1372 1321 1271
-293 1271 1382 1494 1551 1609 1550 1492 1560 1629 1513 1396 1406 1417 1414 1411 1408 1404 1394 1383 1372 1361 1333 1304 1329 1355 1334 1313 1492 1671 1664 1657 1595 1533 1545 1557
-298 1557 1514 1471 1476 1481 1431 1381 1407 1433 1404 1375 1435 1495 1428 1360 1327 1294 1315 1337 1325 1314 1309 1304 1235 1274 1457 1458 1345 1413 1519 1517 1466 1415 1520 1625 1613
-303 1613 1600 1642 1684 1574 1464 1445 1426 1367 1308 1340 1372 1399 1427 1455 1482 1435 1388 1395 1402 1469 1536 1602 1669 1629 1589 1549 1509 1550 1592 1542 1493 1427 1360 1385
-309 1385 1409 1499 1589 1516 1443 1396 1349 1429 1509 1500 1491 1482 1473 1482 1491 1500 1509 1513 1517 1575 1633 1566 1499 1546 1593 1670 1529 1442 1464 1534 1495 1470 1445 1443 1441 1439 1437 1430 1423 1362 1301 1332
-315 1332 1364 1395 1426 1375 1323 1262 1420 1588 1538 1497 1457 1454 1450 1393 1335 1343 1351 1359 1366 1408 1450 1438 1425 1411 1396 1382 1367 1420 1472 1434 1396 1417 1437 1404 1370 1367 1364
-321 1364 1488 1612 1594 1576 1557 1539 1478 1417 1446 1476 1467 1458 1462 1467 1391 1533 1675 1599 1591 1582 1561 1539 1500 1461 1477 1492 1533 1573 1613 1653 1662 1670 1679 1687 1653 1619 1531
$$ packed form
-282A590J3J4j05j06j4j5j3j2M1M2j8j9j8j9L7L7j8j8JKN6N5j8j9p3p3L6L7J10%o3J19m5m5
-287A479p6p5Q7Q8L1L0k4k4jjJ01q1k3k3l4l5l4l4l5l4NNMNK8K7K8K7M3M2M3M2j04j05n1n0
-293A271J11J12N7N8n9n8O8O9j16j17J0J1lllmj0j1j1j1k8k9K5K6k1k1J79J79ppo2o2J2J2
-298A557m3m3NNn0n0K6K6k9k9O0O0o7o8l3l3K1K2j2j1nno9L9J83Jj13O8J06kn1n1J05J05j2
-303A613j3M2M2j10j10j9j9n9n9L2L2K7K8K8K7m7m7PPO7O7O6O7m0m0m0m0M1M2n0m9o6o7K5
-309A385K4R0R0p3p3m7m7Q0Q0rrrrRRRRMMN8N8o7o7M7M7P7j41q7K2P0l9k5k5kkkkppo1o1L1
-315A332L2L1L1n1n2o1J58J68n0m1m0lmn7n8QQQPM2M2j2j3j4j5j4j5N3N2l8l8K1K0l3l4ll
-321A364J24J24j8j8j9j8o1o1K9L0rrMNp6J42J42p6qrk1k2l9l9J6J5M1M0M0M0RQRQl4l4q8
$$ plain form
-326 1531 1442 1366 1290 1414 1538 1622 1707 1629 1550 1530 1509 1489 1468 1519 1569 1529 1489 1503 1518 1525 1533 1531 1421 1426 1431 1443 1455 1420 1384 1379 1482 1586 1581 1600 1618
-332 1618 1582 1546 1470 1503 1572 1641 1491 1451 1537 1514 1529 1543 1551 1559 1492 1425 1449 1473 1453 1433 1413 1393 1418 1444 1481 1518 1369 1402 1521 1531 1454 1377 1420 1463
-337 1463 1475 1487 1438 1389 1474 1450 1335 1329 1410 1492 1423 1354 1280 1315 1336 1357 1441 1416 1452 1488 1525 1562 1607 1542 1476 1410 1331 1361 1378 1395 1419 1443 1490 1537
-342 1537 1598 1550 1403 1365 1447 1420 1362 1304 1373 1442 1394 1454 1452 1451 1475 1499 1523 1546 1581 1615 1717 1710 1539 1477 1408 1339 1407 1584 1754 1743 1572 1510 1502
-347 1502 1495 1516 1538 1476 1414 1331 1357 1412 1468 1483 1499 1515 1530 1447 1364 1336 1307 1316 1325 1461 1597 1530 1463 1451 1438 1485 1532 1451 1371 1288 1205 1285 1365 1424 1483
-352 1483 1450 1418 1425 1432 1440 1447 1429 1411 1393 1375 1380 1384 1516 1648 1698 1748 1671 1595 1536 1477 1418 1359 1421 1483 1491 1499 1509 1520 1503 1486 1401 1316 1322 1328 1364 1400 1409 1417 1415 1412
-358 1412 1437 1461 1499 1537 1520 1504 1491 1478 1492 1506 1477 1449 1420 1392 1403 1413 1424 1435 1478 1521 1437 1354 1441 1529 1525 1522 1495 1468 1495 1523 1543 1563 1556 1549 1535 1521
-364 1521 1507 1494 1414 1333 1344 1355 1410 1465 1520 1575 1575 1575 1576 1576 1512 1449 1439 1430 1353 1277 1255 1233 1302 1371 1349 1328 1274 1221 1258 1296 1380 1465 1422 1380 1339 1299 1411
$$ packed form
-326A531q9p6p6J24J24Q4Q5p8p9k0k1k0k1N1N0m0m0J4J5PQkj10NNJ2J2l5l6nJ03J04nJ9J8
-332A618l6l6p6L3O9O9j50m0Q6k3J5J4QQo7o7K4K4k0k0k0k0K5K6L7L7j49L3J19J0p7p7M3M3
-337A463J2J2m9m9Q5k4j15oQ1Q2o9o9p4L5K1K1Q4k5L6L6L7L7M5o5o6o6p9L0J7J7K4K4M7M7
-342A537O1m8j47l8Q2k7n8n8O9O9m8O0kjK4K4K4K3L5L4J02pj71o2o9o9O8J77J70j1j71o2q
-347A502pK1K2o2o2q3K6N5N6J5J6J6J5q3q3k8k9RRJ36J36o7o7j2j3M7M7q1q0q3q3Q0Q0N9N9
-352A483l3l2PPQPj8j8j8j8NMJ32J32N0N0p7p6n9n9n9n9O2O2QQJ0J1j7j7q5q5OOL6L6RQkl
-358A412K5K4L8L8j7j6j3j3J4J4k9k8k9k8J1J0J1J1M3M3q4q3Q7Q8mlk7k7K7K8K0K0ppj4j4
-364A521j4j3q0q1J1J1N5N5N5N5%%J%o4o3j0rp7p6k2k2O9O9k2k1n4n3L7L8Q4Q5m3m2m1m0J12
$$ plain form
-370 1411 1414 1470 1527 1583 1531 1533 1535 1403 1271 1295 1318 1396 1474 1441 1407 1465 1522 1467 1411 1391 1480 1499 1627 1671 1606 1540 1474 1521 1568 1577 1476 1464 1451 1501
-375 1501 1551 1473 1396 1359 1323 1347 1372 1353 1443 1513 1474 1349 1333 1376 1419 1551 1682 1614 1546 1487 1428 1321 1396 1375 1354 1471 1588 1565 1541 1470 1399
-380 1399 1361 1432 1394 1356 1270 1293 1382 1471 1421 1372 1413 1454 1438 1423 1498 1573 1600 1628 1528 1429 1410 1391 1311 1339 1358 1377 1355 1333 1351 1478 1485 1382 1297
-385 1297 1320 1354 1389 1473 1376 1354 1332 1374 1416 1447 1477 1238 1253 1288 1323 1374 1426 1422 1419 1373 1327 1267 1316 1319 1213 1222 1232 1314 1287 1322 1357 1383 1410 1505 1490
-390 1490 1446 1510 1567 1515 1476 1437 1377 1426 1499 1463 1332 1201 1178 1155 1266 1377 1355 1443 1468 1494 1399 1304 1372 1441 1468 1496 1516 1537 1509 1373 1320 1377
-395 1377 1421 1356 1359 1362 1352 1342 1339 1336 1332 1436 1480 1523 1529 1534 1485 1436 1354 1272 1318 1363 1351 1339 1447 1555 1511 1359 1297 1344 1413 1483 1407 1441 1473 1505 1544 1583
-400 1583 1560 1536 1628 1611 1531 1452 1493 1534 1493 1453 1504 1554 1462 1369 1338 1307 1332 1467 1511 1445 1357 1269 1331 1393 1358 1213 1221 1338 1468 1416 1383 1350 1413
-405 1413 1476 1484 1493 1452 1410 1489 1568 1612 1547 1496 1444 1345 1355 1358 1361 1294 1226 1358 1489 1508 1526 1418 1309 1289 1269 1339 1410 1421 1433 1445 1456 1404 1352 1300
$$ packed form
-370A411LN6N7N6n2KKj32j32K4K3P8P8l3l4N8N7n5n6k0Q9J9J28M4o5o6o6M7M7Rj01j2j3N0
-375A501N0p8p7l7l6K4K5j9R0P0l9j25j6M3M3J32J31o8o8n9n9j07P5k1k1J17J17k3k4p1p1
-380A399l8P1l8l8q6K3Q9Q9n0m9M1M1j6j5P5P5K7K8j00r9j9j9q0K8J9J9k2k2J8J27Pj03q5
-385A297K3L4L5Q4r7k2k2M2M2L1L0k39J5L5L5N1N2mlm6m6o0M9Lj06RJ0Q2k7L5L5K6K7R5j5
-390A490m4O4N7n2l9l9o0M9P3l6j31j31k3k3J11J11k2Q8K5K6r5r5O8O9K7K8K0K1k8j36n3N7
-395A377M4o5LLj0j0llmJ04M4M3ONm9m9q2q2M6M5j2j2J08J08m4j52o2M7O9P0p6L4L2L2L9L9
-400A583k3k4R2j7q0p9M1M1m1m0N1N0r2r3l1l1K5J35M4o6q8q8O2O2l5j45QJ17J30n2l3l3O3
-405A413O3QRm1m2P9P9M4o5n1n2r9J0LLo7o8J32J31J9J8j08j09k0k0P0P1J1J2J2J1n2n2n2
$$ plain form
-410 1300 1248 1233 1218 1204 1189 1148 1107 1229 1352 1321 1290 1350 1410 1353 1296 1294 1292 1315 1339 1417 1496 1454 1413 1372 1331 1389 1448 1416 1383 1429 1475 1521 1567 1579
-416 1579 1591 1476 1361 1362 1362 1363 1363 1347 1331 1369 1407 1426 1446 1375 1303 1336 1368 1400 1432 1387 1343 1353 1362 1367 1371 1321 1271 1351 1430 1420 1409 1400 1392 1383 1375 1371 1367 1363 1359 1388 1416
-422 1416 1445 1474 1418 1361 1395 1429 1322 1214 1233 1253 1257 1261 1393 1524 1543 1563 1491 1419 1435 1451 1468 1484 1484 1484 1484 1484 1396 1307 1272 1238 1324 1410 1405 1400 1407 1415 1433
-428 1433 1452 1333 1396 1498 1490 1566 1460 1292 1306 1312 1317 1206 1095 1201 1307 1358 1409 1372 1335 1352 1369 1364 1359 1433 1507 1447 1206 1019 1014 1172 1329
-432 1329 1335 1341 1395 1450 1450 1450 1421 1393 1365 1337 1296 1256 1233 1320 1433 1364 1314 1264 1259 1254 1249 1244 1294 1345 1395 1446 1398 1350 1356 1362 1362 1361 1360 1359 1398 1437 1422 1406 1371 1336 1392
-439 1392 1448 1405 1362 1373 1385 1409 1432 1456 1480 1501 1521 1487 1454 1390 1326 1316 1306 1393 1480 1440 1400 1376 1353 1329 1306 1333 1361 1443 1525 1545 1565 1494 1424 1400
-444 1400 1376 1351 1327 1309 1292 1365 1438 1380 1322 1433 1362 1273 1366 1461 1447 1477 1508 1477 1446 1382 1318 1255 1191 1228 1265 1387 1508 1614 1612 1616 1620 1542 1463 1414
-449 1414 1474 1513 1552 1597 1643 1620 1598 1575 1553 1504 1455 1461 1466 1441 1416 1398 1379 1325 1379 1433 1378 1363 1348 1326 1304 1320 1336 1399 1463 1519 1467 1415 1471 1471 1472 1424
$$ packed form
-410A300n2j5j5j4j5m1m1J22J23l1l1O0O0n7n7kkK3K4P8P9m2m1m1m1N8N9l2l3M6M6M6M6J2
-416A579J2j15j15J%J%j6j6L8L8J9K0p1p2L3L2L2L2m5m4J0RNMn0n0Q0P9j0j1rqrqmmmmK9K8
-422A416K9K9n6n7L4L4j07j08J9K0MMJ32J31J9K0p2p2J6J6J7J6%%%%q8q9l5l4Q6Q6nnPQJ8
-428A433J9j19O3J02qP6j06j68J4ONj11j11J06J06N1N1l7l7J7J7nnP4P4o0k41j87nJ58J57
-432A329OON4N5%%k9k8k8k8m1m0k3Q7J13o9n0n0nnnnN0N1N0N1m8m8OO%jjjL9L9j5j6l5l5N6
-439A392N6m3m3J1J2K4K3K4K4K1K0l4l3o4o4j0j0Q7Q7m0m0k4k3k4k3K7K8Q2Q2K0K0p1p0k4
-444A400k4k5k4j8j7P3P3n8n8J11p1q9R3R5j4L0L1l1l1o4o4o3o4L7L7J22J21J06kMMp8p9m9
-449A414O0L9L9M5M6k3k2k3k2m9m9ONk5k5j8j9n4N4N4n5j5j5k2k2J6J6O3O4N6n2n2N6%Jm8
$$ plain form
-454 1424 1376 1317 1259 1265 1381 1397 1413 1436 1459 1452 1445 1438 1432 1376 1321 1320 1319 1320 1321 1345 1478 1551 1514 1608 1592 1604 1617 1568 1520 1528 1537 1430 1432 1444 1456 1475 1494 1428 1361
-460 1361 1356 1350 1271 1301 1360 1419 1488 1556 1491 1426 1360 1186 1139 1200 1310 1419 1445 1470 1393 1317 1324 1331 1383 1325 1444 1455 1439 1424 1401 1379 1307 1235 1109 1164
-466 1164 1209 1145 1184 1331 1398 1465 1520 1394 1268 1251 1332 1412 1379 1456 1525 1412 1306 1308 1322 1335 1382 1320 1258 1305 1357 1409 1528 1539 1462 1386 1332 1387
-470 1387 1425 1462 1348 1343 1458 1464 1345 1227 1132 1146 1262 1378 1409 1440 1532 1516 1600 1685 1605 1526 1431 1445 1549 1545 1427 1309 1348 1387 1423 1459 1337
-475 1337 1323 1388 1344 1300 1365 1460 1446 1445 1445 1386 1328 1323 1319 1337 1355 1346 1337 1296 1254 1297 1339 1394 1339 1353 1366 1272 1287 1331 1375 1446 1516 1453 1389 1423 1347 1291 1345
-481 1345 1395 1337 1319 1301 1289 1277 1319 1361 1417 1473 1432 1390 1456 1412 1383 1353 1322 1400 1437 1474 1542 1500 1465 1430 1435 1439 1436 1434 1468 1394 1326 1258 1321 1384 1420 1455
-486 1455 1460 1466 1380 1294 1297 1300 1330 1360 1355 1351 1346 1341 1390 1438 1486 1535 1512 1489 1494 1498 1417 1336 1310 1283 1301 1319 1381 1442 1501 1379 1358 1338 1267 1195 1251 1307 1387 1468 1360
-492 1360 1253 1194 1316 1398 1371 1309 1247 1269 1291 1302 1313 1296 1280 1298 1316 1362 1407 1349 1291 1324 1357 1335 1314 1383 1452 1422 1393 1418 1442 1467 1491 1515 1540
$$ packed form
-454A424m8n9n8OJ16J6J6K3K3pppon6n5jjJJK4J33P3l7R4j6J2J3m9m8QRj07KJ2J2J9J9o6o7
-460A361nop9L0N9N9O9O8o5o5o6j74m7O1J10J09K6K5p7p6PPN2n8J19J1j6j5k3k2p2p2j26N5
-466A164M5o4L9J47O7O7N5j26j26j7Q1Q0l3P7O9j13j06KJ4J3M7o2o2M7N2N2J19J1p7p6n4N5
-470A387L8L7j14nJ15Oj19j18r5J4J16J16L1L1R2j6Q4Q5q0p9r5J4J04mj18j18L9L9L6L6j22
-475A337j4O5m4m4O5R5j4j%n9n8nmJ8J8rrm1m2M3M2N5n5J4J3r4J5M4M4P1P0o3o4L4p6n6N4
-481A345N0n8j8j8j2j2M2M2N6N6m1m2O6m4k9l0l1P8L7L7O8m2l5l5NMlkL4p4o8o8O3O3L6L5
-486A455NOq6q6LLL0L0nmnnM9M8M8M9k3k3NMq1q1k6k7J8J8O2O1N9j22k1k0p1p2N6N6Q0Q1j08
-492A360j07n9J22Q2k7o2o2K2K2J1J1j7j6J8J8M6M5n8n8L3L3k2k1O9O9l0k9K5K4K5K4K4K5
$$ plain form
-497 1540 1553 1566 1579 1592 1496 1400 1431 1463 1538 1614 1635 1656 1557 1458 1486 1514 1449 1383 1345 1307 1387 1468 1494 1520 1462 1405 1438 1472 1419 1365 1367 1368 1349 1330 1365
-503 1365 1400 1384 1368 1363 1176 1168 1160 1257 1353 1504 1472 1516 1560 1516 1471 1452 1614 1609 1603 1482 1361 1441 1522 1440 1357 1326 1295 1391 1487 1487 1488 1489 1490 1479 1468 1457
-508 1457 1446 1396 1345 1422 1499 1470 1441 1412 1383 1439 1495 1551 1608 1570 1533 1495 1458 1360 1262 1328 1394 1356 1318 1291 1264 1150 1217 1364 1402 1426 1340 1468 1486
-513 1486 1433 1488 1590 1584 1582 1579 1443 1307 1346 1386 1425 1465 1491 1518 1490 1463 1469 1475 1475 1474 1441 1299 1164 1210 1427 1534 1442 1350 1347 1344 1340 1337 1295 1254 1339 1424
-519 1424 1419 1415 1410 1405 1387 1370 1407 1444 1430 1417 1348 1280 1341 1402 1409 1416 1486 1557 1573 1590 1513 1436 1450 1464 1564 1665 1602 1539 1475 1412 1440 1468 1420 1372 1378 1384 1407
-524 1407 1429 1361 1292 1276 1259 1298 1336 1283 1230 1268 1307 1373 1439 1451 1462 1479 1495 1421 1346 1315 1284 1308 1331 1420 1508 1505 1503 1450 1397 1344 1291 1409 1528 1482
-530 1482 1437 1370 1303 1363 1423 1418 1413 1354 1295 1327 1358 1390 1421 1354 1287 1220 1153 1229 1305 1381 1458 1444 1431 1417 1404 1339 1274 1300 1326 1330 1333 1336 1340 1340 1341 1432 1524 1537
-535 1537 1550 1617 1685 1591 1497 1458 1419 1377 1335 1348 1361 1387 1412 1384 1355 1374 1393 1412 1431 1441 1451 1460 1470 1457 1444 1431 1418 1420 1422 1425 1427 1472 1517 1472 1426 1510 1595
$$ packed form
-497A540J3J3J3J3r6r6L1L2P5P6K1K1r9r9K8K8o5o6l8l8Q0Q1K6K6n8n7L3L4n3n4KJj9j9L5
-503A365L5j6j6nj87qqR7R6J51l2M4M4m4m5j9J62noj21j21Q0Q1q2q3l1l1R6R6%JJJj1j1j1
-508A457j1n0n1P7P7k9k9k9k9N6N6N6N7l8l7l8l7r8r8O6O6l8l8k7k7j14O7J47L8K4q6J28J8
-513A486n3N5J02oklj36j36L9M0L9M0K6K7k8k7OO%jl3j42j35M6K17J07r2r2llmlm2m1Q5Q5
-519A424nmnnj8j7L7L7j4j3o9o8O1O1PPP0P1J6J7p7p7J4J4J00J01o3o3o4o3K8K8m8m8OOK3
-524A407K2o8o9j6j7L9L8n3n3L8L9O6O6J2J1J7J6p4p5l1l1K4K3Q9Q8lkn3n3n3n3J18J19m6
-530A482m5o7o7O0O0nnn9n9L2L1L2L1o7o7o7o7P6P6P6P7j4j3j4j3o5o5K6K6MLLM%JR1R2J3
-535A537J3O7O8r4r4l9l9m2m2J3J3K6K5k8k9J9J9J9J9J0J0RJ0j3j3j3j3KKLKM5M5m5m6Q4Q5
$$ plain form
-541 1595 1552 1509 1467 1425 1474 1523 1524 1525 1533 1541 1429 1426 1524 1442 1357 1380 1332 1283 1332 1381 1429 1478 1508 1538 1379 1329 1312 1295 1279 1371 1401 1431 1414 1396 1385 1373
-546 1373 1361 1349 1329 1308 1342 1376 1339 1301 1348 1394 1520 1537 1313 1271 1289 1307 1398 1379 1474 1569 1555 1432 1406 1379 1400 1421 1459 1496 1370 1425 1520 1506
-551 1506 1541 1468 1381 1402 1444 1377 1312 1247 1202 1157 1197 1237 1304 1372 1358 1344 1303 1261 1286 1311 1390 1470 1483 1496 1461 1426 1363 1410 1443 1475 1470 1355 1399 1443
-557 1443 1431 1528 1497 1358 1308 1258 1328 1398 1363 1327 1258 1298 1343 1388 1419 1451 1346 1349 1360 1261 1255 1357 1357 1358 1377 1287 1306 1325 1386 1339 1298 1258 1277 1296 1362
-562 1362 1429 1503 1467 1438 1410 1289 1168 1180 1193 1181 1278 1266 1254 1217 1290 1417 1435 1303 1170 1262 1245 1268 1401 1458 1515 1548 1472 1465 1457 1421 1494 1527
-567 1527 1559 1633 1598 1508 1528 1548 1568 1461 1354 1428 1394 1372 1351 1298 1355 1384 1304 1284 1263 1229 1304 1280 1256 1293 1330 1370 1410 1396 1382 1402 1422 1381 1449
-572 1449 1451 1453 1551 1540 1458 1376 1408 1439 1451 1354 1300 1355 1527 1519 1388 1365 1420 1366 1326 1285 1377 1468 1529 1482 1409 1336 1160 1166 1165 1273 1301 1220 1192 1164 1220
-577 1220 1276 1333 1389 1419 1448 1430 1413 1402 1391 1338 1395 1390 1385 1381 1377 1338 1300 1418 1427 1301 1285 1397 1399 1379 1359 1363 1368 1365 1363 1392 1312 1293 1274 1295 1315 1308 1302 1285 1269
$$ packed form
-541A595m3m3m2m2M9M9JJQQj12lR8q2q5K3m8m9M9M9M8M9L0L0j59n0j7j7j6R2L0L0j7j8j1j2
-546A373j2j2k0k1L4L4l7l8M7M6J26J7k24m2J8J8R1j9R5R5j4j23k6k7K1K1L8L7j26N5R5j4
-551A506L5p3q7K1M2o7o5o5m5m5M0M0O7O8j4j4m1m2K5K5P9Q0J3J3l5l5o3M7L3L2nj15M4M4
-557A443j2R7l1j39n0n0P0P0l5l6o9M0M5M5L1L2j05LJ1r9oJ02%JJ9r0J9J9O1m7m1m0J9J9O6
-562A362O7P4l6k9k8j21j21J2J3j2R7j2j2l7P3J27J8j32j33R2j7K3J33N7N7L3p6pql6P3L3
-567A527L2P4l5r0K0K0K0j07j07P4l4k2k1n3N7K9q0k0k1l4P5k4k4L7L7M0M0j4j4K0K0m1O8
-572A449KKR8j1q2q2L2L1J2r7n4N5J72qj31k3N5n4m0m1R2R1O1m7p3p3j76OjJ08K8q1k8k8N6
-577A220N6N7N6L0K9j8j7j1j1n3N7nnmml9l8J18Rj26j6J12Kk0k0MNlkK9q0j9j9K1K0poj7j6
$$ plain form
-583 1269 1307 1345 1302 1259 1314 1369 1306 1352 1371 1281 1349 1417 1423 1430 1368 1306 1244 1291 1323 1464 1561 1478 1404 1330 1311 1292 1228 1345 1428 1403 1317 1340 1422 1504
-588 1504 1507 1509 1464 1418 1330 1350 1425 1391 1447 1502 1460 1418 1395 1373 1378 1383 1368 1354 1325 1406 1494 1473 1361 1359 1473 1478 1424 1370 1328 1285 1225 1273 1481 1508 1481 1453
-594 1453 1395 1337 1401 1357 1305 1363 1414 1356 1410 1464 1518 1463 1422 1381 1394 1407 1400 1502 1452 1402 1403 1404 1433 1461 1432 1403 1402 1400 1398 1397 1361 1435 1416 1398 1386 1374 1405
-599 1405 1436 1412 1388 1338 1287 1236 1185 1229 1273 1191 1108 1140 1171 1258 1344 1325 1306 1438 1462 1409 1356 1386 1417 1317 1218 1281 1345 1266 1186 1271 1355 1354 1353 1334
-605 1334 1424 1515 1425 1471 1517 1498 1478 1404 1330 1271 1212 1180 1149 1248 1348 1421 1493 1444 1394 1345 1295 1270 1244 1246 1248 1314 1380 1325 1271 1193 1224 1430 1454 1333
-610 1333 1321 1290 1260 1368 1475 1347 1218 1329 1440 1424 1408 1407 1405 1404 1403 1405 1408 1411 1413 1371 1330 1261 1192 1226 1261 1350 1440 1396 1352 1399 1446 1434 1421 1436 1450
-615 1450 1426 1401 1430 1460 1476 1492 1465 1438 1346 1436 1396 1356 1332 1307 1337 1367 1350 1333 1316 1298 1353 1407 1407 1407 1308 1210 1203 1195 1243 1290 1310 1331 1415 1500 1420 1341
-621 1341 1307 1273 1402 1532 1454 1376 1389 1402 1375 1348 1376 1403 1374 1344 1314 1285 1272 1259 1247 1234 1209 1184 1159 1134 1213 1292 1281 1269 1258 1246 1289 1332 1445
$$ packed form
-583A269L8L8m3m3N5N5o3M6J9r0O8O8OPo2o2o2M7L2J41R7q3p4p4j9j9o4J17Q3k5q6K3Q2Q2
-588A504LKm5m6q8K0P5l4N6N5m2m2k3k2NNj5j4k9Q1Q8k1j12kJ14Nn4n4m2m3o0M8K08K7k7k8
-594A453n8n8O4m4n2N8N1n8N4N4N4n5m1m1J3J3pJ02n0n0JJK9K8k9k9jkkjl6P4j9j8j2j2L1
-599A405L1k4k4n0n1n1n1M4M4q2q3L2L1Q7Q6j9j9J32K4n3n3L0L1j00r9O3O4p9q0Q5Q4jjj9
-605A334R0R1r0M6M6j9k0p4p4n9n9l2l1R9J00P3P2m9n0m9n0k5k6KKO6O6n5n4p8L1K06K4j21
-610A333j2l1l0J08J07j28j29J11J11j6j6jkjjKLLKm2m1o9o9L4L5Q9R0m4m4M7M7j2j3J5J4
-615A450k4k5K9L0J6J6k7k7r2R0m0m0k4k5L0L0j7j7j7j8N5N4%%r9r8pqM8M7K0K1Q4Q5q0p9
-621A341l4l4J29J30p8p8J3J3k7k7K8K7k9l0l0k9j3j3j2j3k5k5k5k5P9P9j1j2j1j2M3M3J13
$$ plain form
-626 1445 1557 1506 1454 1468 1482 1497 1511 1440 1368 1352 1335 1272 1209 1338 1286 1330 1373 1278 1183 1279 1375 1344 1313 1341 1369 1307 1244 1268 1292 1371 1450 1455 1460 1392
-631 1392 1433 1511 1407 1357 1308 1384 1461 1446 1432 1371 1311 1341 1371 1371 1371 1370 1370 1407 1445 1392 1339 1365 1391 1411 1430 1440 1341 1281 1402 1612 1640 1545 1451 1422 1393
-636 1393 1363 1334 1423 1512 1437 1363 1362 1361 1360 1359 1405 1451 1442 1433 1402 1371 1395 1418 1337 1257 1158 1167 1311 1273 1253 1233 1309 1386 1408 1430 1409 1388 1361 1334 1447 1451 1415
-642 1415 1560 1577 1593 1530 1467 1406 1344 1282 1221 1288 1355 1422 1489 1401 1312 1328 1344 1261 1397 1409 1421 1456 1490 1433 1376 1394 1411 1302 1192 1322 1452
-647 1452 1491 1530 1476 1422 1375 1328 1293 1367 1455 1324 1323 1431 1448 1355 1222 1307 1390 1473 1465 1458 1396 1334 1420 1506 1537 1568 1631 1695 1630 1566 1546 1525 1449 1374
-652 1374 1406 1439 1380 1322 1293 1264 1362 1460 1385 1309 1289 1268 1228 1189 1241 1293 1303 1313 1269 1225 1153 1082 1135 1298 1492 1468 1318 1385 1455 1415 1360 1305 1359
-657 1359 1413 1339 1266 1267 1268 1268 1269 1263 1257 1304 1459 1586 1495 1406 1317 1309 1300 1382 1464 1406 1348 1291 1233 1265 1296 1274 1251 1259 1267 1275 1282 1353 1423 1494 1564 1442 1320 1469
-663 1469 1619 1671 1722 1513 1303 1354 1585 1690 1614 1528 1443 1347 1250 1227 1203 1270 1337 1369 1401 1433 1466 1432 1399 1365 1332 1349 1367 1330 1293 1297 1301 1214 1127
$$ packed form
-626A445J12n1n2J4J4J5J4p1p2j6j7o3o3J29n2M4M3r5r5R6R6l1l1K8K8o2o3K4K4P9P9NNo8
-631A392M1P8j04n0m9P6P7j5j4o1o0L0L0%%j%L7L8n3n3K6K6K0J9J0r9o0J21K10K8r5r4k9k9
-636A393l0k9Q9Q9p5p4jjjjM6M6rrl1l1K4K3q1q0r9RJ44l8k0k0P6P7K2K2k1k1k7k7J13Ml6
-642A415J45J7J6o3o3o1o2o2o1O7O7O7O7q8q9J6J6q3J36J2J2L5L4n7n7J8J7j09j10J30J30
-647A452L9L9n4n4m7m7l5P4Q8j31jJ08J7r3j33Q5Q3Q3qpo2o2Q6Q6L1L1O3O4o5o4k0k1p6p5
-652A374L2L3n9n8k9k9R8R8p5p6k0k1m0l9N2N2J0J0m4m4p2p1N3J63J94k4j50O7P0m0n5n5N4
-657A359N4p4p3JJ%JooM7J55J27r1q9q9qrQ2Q2n8n8n7n8L2L1k2k3QQQPP1P0P1P0j22j22J49
-663A469J50N2N1k09k10N1K31J05p6q6q5r6r7k3k4O7O7L2L2L2L3l4l3l4l3J7J8l7l7MMq7q7
$$ plain form
-668 1127 1210 1294 1377 1460 1421 1382 1343 1303 1304 1305 1390 1474 1500 1417 1293 1350 1378 1406 1392 1377 1398 1420 1441 1462 1339 1215 1182 1149 1265 1381 1369 1358 1309
-673 1309 1259 1301 1342 1355 1368 1327 1286 1319 1353 1386 1420 1410 1401 1391 1382 1419 1456 1366 1276 1274 1272 1348 1425 1576 1546 1454 1362 1319 1276 1323 1371 1335 1299 1264 1228 1224
-678 1224 1220 1307 1394 1362 1330 1298 1267 1339 1412 1285 1158 1185 1212 1240 1267 1281 1295 1254 1213 1207 1201 1195 1188 1216 1244 1217 1191 1203 1215 1228 1240 1260 1281 1356 1430 1461
-684 1461 1491 1462 1324 1317 1419 1441 1463 1551 1457 1349 1350 1380 1410 1356 1301 1312 1323 1352 1272 1218 1345 1419 1310 1226 1250 1202 1154 1183 1212 1247 1283 1307 1439
-689 1439 1456 1473 1415 1357 1306 1255 1252 1358 1275 1193 1279 1366 1423 1372 1328 1285 1265 1353 1381 1408 1351 1294 1347 1399 1229 1240 1258 1385 1462 1431 1424 1308 1240
-694 1240 1281 1312 1343 1387 1323 1300 1278 1248 1219 1279 1339 1352 1365 1410 1565 1628 1583 1441 1300 1285 1270 1261 1361 1454 1438 1421 1294 1211 1310 1315 1320 1282 1244
-699 1244 1356 1468 1498 1347 1137 1181 1270 1359 1347 1334 1389 1336 1294 1361 1360 1359 1239 1119 1198 1278 1288 1298 1362 1317 1348 1271 1339 1406 1289 1172 1230
-703 1230 1397 1419 1442 1417 1392 1425 1459 1492 1526 1503 1481 1405 1328 1282 1235 1182 1238 1300 1361 1339 1317 1296 1275 1261 1248 1253 1367 1420 1473 1459 1445 1492 1430 1367
$$ packed form
-668A127Q3Q4Q3Q3l9l9l9m0JJQ5Q4K6q3j24N7K8K8j4j5K1K2K1K1j23j24l3l3J16J16j2j1m9
-673A309n0M2M1J3J3m1m1L3L4L3L4j0rj0rL7L7r0r0kkP6P7J51l0r2r2m3m3M7M8l6l6l5l6m
-678A224mQ7Q7l2l2l2l1P2P3j27j27K7K7K8K7J4J4m1m1ooopK8K8k7k6J2J2J3J2K0K1P5P4L1
-684A461L0k9j38pJ02K2K2Q8r4j08JL0L0n4n5J1J1K9q0n4J27P4j09q4K4m8m8K9K9L5L6K4J32
-689A439J7J7n8n8n1n1lJ06q3q2Q6Q7N7n1m4m3k0Q8K8K7n7n7N3N2j70J1J8J27P7l1pj16o8
-694A240M1L1L1M4o4k3k2l0k9O0O0J3J3M5J55O3m5j42j41j5j5rJ00R3j6j7j27q3R9NNl8l8
-699A244J12J12L0j51k10M4Q9Q9j2j3N5n3m2O7jjj20j20P9Q0J0J0O4m5L1p7O8O7j17j17N8
-703A230J67K2K3k5k5L3L4L3L4k3k2p6p7m6m7n3N6O2O1k2k2k1k1j4j3NJ14N3N3j4j4M7o2o3
$$ plain form
-709 1367 1304 1235 1165 1236 1307 1323 1340 1337 1334 1331 1328 1309 1290 1278 1265 1269 1381 1341 1302 1274 1247 1335 1315 1356 1398 1342 1286 1300 1313 1266 1327 1352 1376 1347 1317 1372
-714 1372 1317 1324 1331 1406 1480 1428 1376 1349 1322 1295 1268 1326 1385 1490 1415 1409 1403 1393 1273 1274 1275 1270 1264 1295 1326 1357 1389 1473 1558 1547 1427 1300 1282 1128 1082 1185
-720 1185 1180 1256 1223 1147 1179 1167 1263 1383 1395 1274 1154 1174 1195 1223 1250 1139 1137 1201 1265 1314 1363 1411 1460 1472 1483 1513 1433 1271 1290 1315 1341 1424 1325
-725 1325 1219 1222 1250 1386 1371 1356 1379 1293 1323 1353 1353 1353 1299 1426 1610 1685 1560 1435 1375 1315 1310 1305 1320 1335 1327 1210 1068 1035 1159 1173 1232 1290 1252
-730 1252 1213 1261 1309 1425 1433 1363 1402 1373 1344 1368 1391 1367 1343 1275 1316 1343 1370 1404 1329 1163 1107 1186 1265 1260 1256 1291 1325 1269 1213 1267 1321 1310 1189 1264
-735 1264 1339 1401 1463 1504 1436 1375 1314 1283 1252 1221 1190 1214 1239 1311 1383 1493 1493 1465 1436 1408 1381 1353 1326 1369 1413 1367 1320 1286 1253 1220 1187 1286 1386 1395
-740 1395 1404 1489 1574 1460 1345 1257 1170 1210 1249 1355 1460 1439 1417 1486 1556 1498 1440 1402 1363 1325 1286 1240 1193 1237 1281 1322 1363 1313 1263 1319 1375 1376 1378 1389
-745 1389 1400 1356 1312 1326 1341 1410 1479 1500 1522 1517 1511 1415 1319 1278 1237 1261 1286 1283 1280 1245 1210 1266 1321 1285 1248 1211 1174 1302 1429 1430 1430 1319 1208 1334 1459
$$ packed form
-709A367o3o9p0P1P1J6J7llllj9j9j2j3MJ12m0l9k8k7Q8k0M1M2n6n6J4J3m7O1K5K4k9l0N5
-714A372n5PPP5P4n2n2k7k7k7k7N8N9J05p5ooj0j20JJnoL1L1L1L2Q4Q5j1j20j27j8j54m6J03
-720A185nP6l3p6L2j2R6J20J2j21j20K0K1K8K7j11kO4O4M9M9M8M9J2J1L0q0j62J9K5K6Q3r9
-725A325j06LK8J36j5j5K3q6L0L0%%n4J27J84P5j25j25o0o0nnJ5J5qj17j42l3J24J4N9N8l8
-730A252l9M8M8J16Qp0L9k9k9K4K3k4k4o8M1K7K7L4p5j66n6P9P9nmL5L4n6n6N4N4j1j21P5
-735A264P5O2O2M1o8o1o1l1l1l1l1K4K5P2P2J10%k8k9k8k7k8k7M3M4m6m7l4l3l3l3R9J00R
-740A395RQ5Q5j14j15q8q7M0L9J06J05k1k2O9P0n8n8l8l9l8l9m6m7M4M4M1M1n0n0N6N6JKJ1
-745A389J1m4m4J4J5O9O9K1K2nor6r6m1m1K4K5lll5l5N6N5l6l7l7l7J28J27J%j11j11J26J25
$$ [...]
##END=	
##END=	
##END=	
