##TITLE=	kmi-TMSCCdibenzothiophenium.10.fid


##JCAMP-DX=	6.0	$$ MestReNova 14.1.1-24571
##DATA TYPE=	LINK
##BLOCK_ID=	1
##BLOCKS=	1    
##ORIGIN=	Mestrelab Research S.L.
##OWNER=	hrzepa
##$MNOVA/LINK_BLOCK_TYPE=	ITEM	$$ NMR Spectrum
##$MNOVA/ITEM/POLYGON=	(XY..XY)
5321,5835
8722,5835
8722,8208
5321,8208
5321,5835
##$MNOVA/ITEM/Z=	0
##$MNOVA/ITEM/ANGLE=	0
##TITLE=	kmi-TMSCCdibenzothiophenium.10.fid
##JCAMP-DX=	6.0	$$ MestReNova 14.1.1-24571
##BLOCK_ID=	2
##DATA TYPE=	NMR SPECTRUM
##DATA CLASS=	XYDATA
##NUMDIM=	1
##ORIGIN=	Bruker BioSpin GmbH
##OWNER=	root
##.OBSERVE FREQUENCY=	500.13308850747802126
##.OBSERVE NUCLEUS=	^1H
##.SOLVENT NAME=	CDCl3
##.PULSE SEQUENCE=	zg30
##LONGDATE=	2021/07/01 13:05:00.000
##.ACQUISITIONMODE=	SIMULTANEOUS (DQD)
##$ORIGINAL FORMAT=	Bruker XWIN-NMR
##$MNOVA/SCALES_VERSION=	9
##$PARAMETER FILE=	(acqus, ASCII, /Users/hrzepa/Library/Mobile%20Documents/com~apple~CloudDocs/C2/Pure%20samples/kmi-TMSCCdibenzothiophenium/5-((trimethylsilyl)ethynyl)-5H-dibenzo[b,d]thiophen-5-ium/acqus, 0)
$$ ##TITLE= Parameter file, TOPSPIN		Version 3.2
$$ ##JCAMPDX= 5.0
$$ ##DATATYPE= Parameter Values
$$ ##NPOINTS= 1	$$ modification sequence number
$$ ##ORIGIN= Bruker BioSpin GmbH
$$ ##OWNER= root
$$ $$ 2021-07-01 13:05:14.618 +0900  root@CZC31189P3
$$ $$ Z:/miyamoto/kmi-TMS-dibenzo-2/10/acqus
$$ $$ process C:\Bruker\TopSpin3.2\prog\mod\dirdata.exe
$$ ##$ACQT0= -2.52100840336134
$$ ##$AMP= (0..31)
$$ 100 100 100 100 100 100 100 100 100 100 100 100 100 100 100 100 100 100
$$ 100 100 100 100 100 100 100 100 100 100 100 100 100 100
$$ ##$AMPCOIL= (0..19)
$$ 0 0 0 0 0 0 0 0 0 0 0 0 0 0 0 0 0 0 0 0
$$ ##$ANAVPT= -1
$$ ##$AQSEQ= 0
$$ ##$AQ_mod= 3
$$ ##$AUNM= <au_zg>
$$ ##$AUTOPOS= <13 >
$$ ##$BF1= 500.13
$$ ##$BF2= 500.13
$$ ##$BF3= 500.13
$$ ##$BF4= 500.13
$$ ##$BF5= 500.13
$$ ##$BF6= 500.13
$$ ##$BF7= 500.13
$$ ##$BF8= 500.13
$$ ##$BYTORDA= 0
$$ ##$CAGPARS= (0..11)
$$ 0 0 0 0 0 0 0 0 0 0 0 0
$$ ##$CFDGTYP= 0
$$ ##$CFRGTYP= 9
$$ ##$CHEMSTR= <none>
$$ ##$CNST= (0..63)
$$ 1 1 1 1 1 1 1 1 1 1 1 1 1 1 1 1 1 1 1 1 1 1 1 1 1 1 1 1 1 1 1 1 1 1 1 1
$$ 1 1 1 1 1 1 1 1 1 1 1 1 1 1 1 1 1 1 1 1 1 1 1 1 1 1 1 1
$$ ##$CPDPRG= (0..8)
$$ <> <> <> <> <> <> <> <> <>
$$ ##$D= (0..63)
$$ 0 1 0 0 0 0 0 0 0 0 0 0 0 0 0 0 0.0002 0 0 0 0 0 0 0 0 0 0 0 0 0 0 0 0
$$ 0 0 0 0 0 0 0 0 0 0 0 0 0 0 0 0 0 0 0 0 0 0 0 0 0 0 0 0 0 0 0
$$ ##$DATE= 1625112308
$$ ##$DE= 6.5
$$ ##$DECBNUC= <off>
$$ ##$DECIM= 2000
$$ ##$DECNUC= <off>
$$ ##$DECSTAT= 4
$$ ##$DIGMOD= 1
$$ ##$DIGTYP= 12
$$ ##$DQDMODE= 0
$$ ##$DR= 22
$$ ##$DS= 2
$$ ##$DSPFIRM= 0
$$ ##$DSPFVS= 20
$$ ##$DTYPA= 0
$$ ##$EXP= <A.Proton>
$$ ##$F1LIST= <>
$$ ##$F2LIST= <>
$$ ##$F3LIST= <>
$$ ##$FCUCHAN= (0..9)
$$ 0 2 0 0 0 0 0 0 0 0
$$ ##$FL1= 90
$$ ##$FL2= 90
$$ ##$FL3= 90
$$ ##$FL4= 90
$$ ##$FOV= 20
$$ ##$FQ1LIST= <>
$$ ##$FQ2LIST= <>
$$ ##$FQ3LIST= <>
$$ ##$FQ4LIST= <>
$$ ##$FQ5LIST= <>
$$ ##$FQ6LIST= <>
$$ ##$FQ7LIST= <>
$$ ##$FQ8LIST= <>
$$ ##$FRQLO3= 23161.4925220013
$$ ##$FRQLO3N= 2
$$ ##$FS= (0..7)
$$ [...]
$$ 130000 130000 130000 130000 130000 130000 130000 130000 130000 130000 130000
$$ 130000 130000 130000 130000 130000 130000 130000 130000 130000 130000 130000
$$ 130000 130000 130000 130000 130000 130000 130000 0 0 0 0 0 0 0 0 0 0 0
$$ 0 0 0 0 0 0 0 0 0 0 0 0 0
$$ ##$ShimPowMaxUC= (0..63)
$$ 130000 130000 130000 130000 130000 130000 130000 130000 130000 130000 130000
$$ 130000 130000 130000 130000 130000 130000 130000 130000 130000 130000 130000
$$ 130000 130000 130000 130000 130000 130000 130000 130000 130000 130000 130000
$$ 130000 130000 130000 130000 130000 130000 130000 0 0 0 0 0 0 0 0 0 0 0
$$ 0 0 0 0 0 0 0 0 0 0 0 0 0
$$ ##$ShimPowMaxUG= (0..63)
$$ 524287 524287 524287 524287 524287 524287 524287 524287 524287 524287 524287
$$ 524287 524287 524287 524287 524287 524287 524287 524287 524287 524287 524287
$$ 524287 524287 524287 524287 524287 524287 524287 524287 524287 524287 524287
$$ 524287 524287 524287 524287 524287 524287 0 0 0 0 0 0 0 0 0 0 0 0 0 0 0
$$ 0 0 0 0 0 0 0 0 0 0
$$ ##$ShimPowRcbType= 3
$$ ##$ShimPowRes= (0..63)
$$ 1e-020 1e-020 1e-020 1e-020 1e-020 1e-020 1e-020 1e-020 1e-020 1e-020 1e-020
$$ 1e-020 1e-020 1e-020 1e-020 1e-020 1e-020 1e-020 1e-020 1e-020 1e-020 1e-020
$$ 1e-020 1e-020 1e-020 1e-020 1e-020 1e-020 1e-020 1e-020 1e-020 1e-020 1e-020
$$ 1e-020 1e-020 1e-020 1e-020 1e-020 1e-020 1e-020 0 0 0 0 0 0 0 0 0 0 0
$$ 0 0 0 0 0 0 0 0 0 0 0 0 0
$$ ##$ShimPowRng0= (0..63)
$$ 1 1 1 1 1 1 1 1 1 1 1 1 1 1 1 1 1 1 1 1 1 1 1 1 1 1 1 1 1 1 1 1 1 1 1 1
$$ 1 1 1 1 0 0 0 0 0 0 0 0 0 0 0 0 0 0 0 0 0 0 0 0 0 0 0 0
$$ ##$ShimPowRng1= (0..63)
$$ 1 1 1 1 1 1 1 1 1 1 1 1 1 1 1 1 1 1 1 1 1 1 1 1 1 1 1 1 1 1 1 1 1 1 1 1
$$ 1 1 1 1 0 0 0 0 0 0 0 0 0 0 0 0 0 0 0 0 0 0 0 0 0 0 0 0
$$ ##$ShimPowRng2= (0..63)
$$ 1 1 1 1 1 1 1 1 1 1 1 1 1 1 1 1 1 1 1 1 1 1 1 1 1 1 1 1 1 1 1 1 1 1 1 1
$$ 1 1 1 1 0 0 0 0 0 0 0 0 0 0 0 0 0 0 0 0 0 0 0 0 0 0 0 0
$$ ##$ShimPowRng3= (0..63)
$$ 1 1 1 1 1 1 1 1 1 1 1 1 1 1 1 1 1 1 1 1 1 1 1 1 1 1 1 1 1 1 1 1 1 1 1 1
$$ 1 1 1 1 0 0 0 0 0 0 0 0 0 0 0 0 0 0 0 0 0 0 0 0 0 0 0 0
$$ ##$ShimSysFunc= (0..63)
$$ 1 2 3 4 5 6 7 8 9 10 0 37 38 35 16 15 14 13 12 11 28 27 26 25 24 23 36
$$ 22 30 29 20 21 34 33 32 31 17 18 19 0 0 0 0 0 0 0 0 0 0 0 0 0 0 0 0 0 0
$$ 0 0 0 0 0 0 0
$$ ##$ShimSysMatrix= 0
$$ ##$ShimSysType= 4
$$ ##$TFXNUM= 0
$$ ##$TRIPLO2= 0
$$ ##$VTU= 2
$$ ##$VTUETH= <149.236.99.20>
$$ ##$VTUTY= <no>
$$ ##$WBREFAM= (0..15)
$$ 100 100 100 100 100 100 100 100 100 100 100 100 100 100 100 100
$$ ##$WBREFLM= (0..15)
$$ 1 0 0 0 0 0 0 0 0 0 0 0 0 0 0 0
$$ ##$WBREFPH= (0..15)
$$ 0.03 0 0 0 0 0 0 0 0 0 0 0 0 0 0 0
$$ ##$WBSGU= (0..15)
$$ 0 0 0 0 0 0 0 0 0 0 0 0 0 0 0 0
$$ ##$XFAC= 2
$$ ##END=
$$ 
##$DECIM=	2000
##$DSPFVS=	20
##XUNITS=	HZ
##YUNITS=	ARBITRARY UNITS
##FIRSTX=	8077.1931150184100261
##LASTX=	-1922.6542970909649739
##DELTAX=	-0.152587890625
##XFACTOR=	1
##YFACTOR=	0.0099099996031065899077
##FIRSTY=	12.390412330627441406
##MINY=	6.3612456321716308594
##MAXY=	8928.19921875
##NPOINTS=	65536
##XYDATA=	(X++(Y..Y))
$$ [...]
2351A628L3L3rqj2j2K9L0m1m0JJJ8J8J11n5m7m7j50J4O4O3P4P4JJm0m0N6N6j3j2j2j2j1j2
$$ 1628 1661 1694 1685 1677 1665 1653 1682 1712 1671 1631 1632 1633 1651 1669 1780 1725 1678 1631 1481 1495 1559 1622 1696 1770 1771 1772 1732 1692 1748 1804 1791 1779 1767 1755 1744 1732
2345A732k3k4k4k3j4j3K7K8l5l5OOj2j2N7N6N6N6o8o8j9j9j9k0L7L7nmllj7j81k11O4J06J05
$$ 1732 1709 1685 1661 1638 1624 1611 1638 1666 1631 1596 1602 1608 1596 1584 1641 1697 1753 1809 1741 1673 1654 1635 1616 1596 1633 1670 1665 1661 1658 1655 1638 1457 1246 1310 1416 1521
2340A521O4O3m3m3r2J83J21m3j10j10pJ58O2O2L0L1m4m5m4m4m6m5P8P9PPo2o1p3p3k1k1m4
$$ 1521 1585 1648 1605 1562 1470 1653 1774 1731 1621 1511 1504 1662 1724 1786 1816 1847 1803 1758 1714 1670 1624 1579 1657 1736 1743 1750 1688 1627 1554 1481 1460 1439 1395
2335A395J21J21m4m0m0M5M6%%J%KLn5K8J47j8p2p1N2N1N2N1KLKKr1r0k2k2O2O2l4l4P4P4k2
$$ 1395 1516 1637 1593 1553 1513 1558 1604 1604 1604 1605 1605 1607 1610 1555 1583 1730 1712 1640 1569 1621 1672 1724 1775 1777 1780 1782 1784 1693 1603 1581 1559 1621 1683 1649 1615 1689 1763 1741
2329A741k2j51j51J10J11PPl4l4RJ0J05J06J6J7j37n4R4p1o1K1M4M4k0j9k0j9K2K2K2K2j29
$$ 1741 1719 1568 1417 1527 1638 1645 1652 1618 1584 1593 1603 1708 1814 1830 1847 1710 1656 1750 1679 1618 1639 1683 1727 1707 1688 1668 1649 1671 1693 1715 1737 1608
2324A608j29llO6O6l4l4N4J36J86q9j18M6LKN3N4m7m6K3K2MLl8l7n1n1J8J8LKl4l3m0M3J31
$$ 1608 1479 1476 1473 1539 1605 1571 1537 1591 1727 1913 1824 1706 1752 1755 1757 1810 1864 1817 1771 1794 1816 1820 1823 1785 1748 1697 1646 1664 1682 1685 1687 1653 1620 1580 1623 1754
2319A754l4r4r5p4R2J43J44k5k4K4K5l3N0O4j01r0rj1j2poL1L1J8o5j66k8M1M0K6K6j5j6N3
$$ 1754 1720 1626 1531 1457 1549 1692 1836 1811 1787 1811 1836 1803 1853 1917 1816 1726 1717 1706 1694 1687 1681 1712 1743 1761 1696 1530 1502 1543 1583 1609 1635 1620 1604 1657
2313A657N4J2J2o6o5k5k4P9Q0j7j7L1L1L1L0j2j2k1k1M9r0n3n3L9M0L1L1M4r3n2Q5KKl0l1
$$ 1657 1711 1723 1735 1669 1604 1579 1555 1634 1714 1697 1680 1711 1742 1773 1803 1791 1779 1758 1737 1786 1696 1643 1590 1629 1669 1700 1731 1775 1682 1630 1715 1717 1719 1689 1658
2308A658p5p5l4l4K5K5K5K5L5L5l3l4m1m1K7K8N9O0J00J01m2m2PQp0O8P7mn5n4RRm6m6nnm0
$$ 1658 1583 1508 1474 1440 1465 1490 1515 1540 1575 1610 1577 1543 1502 1461 1488 1516 1575 1635 1735 1836 1794 1752 1759 1767 1697 1765 1842 1838 1783 1729 1738 1747 1701 1655 1650 1645 1605
2303A605m0m0m0O0N9l1l1N8J39K4j70j5j5J9K0j4O8J04l3q5lO6O6JKJK%J%JJ3J3J4J3RJ0l7
$$ 1605 1565 1525 1485 1545 1604 1573 1542 1600 1739 1763 1593 1578 1563 1582 1602 1588 1656 1760 1727 1642 1639 1705 1771 1772 1774 1775 1777 1777 1778 1778 1779 1792 1805 1819 1832 1841 1851 1814
2297A814j74M4M5o0o0M2M2R4p1r7r6M4M4P7P8L6L7o7o7KKl9l8M7M7R0p5k4k3j9j9j53J2PQ
$$ 1814 1640 1684 1729 1669 1609 1651 1693 1787 1716 1619 1523 1567 1611 1688 1766 1802 1839 1772 1705 1707 1709 1670 1632 1679 1726 1816 1741 1717 1694 1675 1656 1503 1515 1522 1530
2291A530J8J8j8j8O8O8O1j04j1j1m5m5j5j4J08n6l3l2J33J33M8M7j17M7mmk9k9L9M0R1R1O0
$$ 1530 1548 1566 1548 1530 1598 1666 1727 1623 1612 1601 1556 1511 1496 1482 1590 1534 1501 1469 1602 1735 1783 1830 1713 1760 1756 1752 1723 1694 1733 1773 1864 1955 2015
2286B015j04j22j22rqqqLLm0J25P4P4O1O1r0r0p0o9j%nnnnM5M5k4k4K1K1p6p5k3k3j2j3o3
$$ 2015 1911 1789 1667 1658 1650 1642 1634 1637 1640 1600 1725 1799 1873 1934 1995 1905 1815 1745 1676 1675 1675 1670 1665 1660 1655 1700 1745 1721 1697 1718 1739 1663 1588 1565 1542 1530 1517 1454
2281A454J02RRJ7J7J7J7M5M5J3J4j17M8J17m8q6q6K7K8j9j8M0M0M4j22k5J40QRn1n0qqL3L4
$$ 1454 1556 1565 1574 1591 1608 1625 1642 1687 1732 1745 1759 1642 1690 1807 1759 1673 1587 1614 1642 1623 1605 1645 1685 1729 1607 1582 1722 1730 1739 1688 1638 1630 1622 1655 1689
2275A689L6L6L7L6p1p1l0k9l6l5J1J0n1L2Rj56O7O7J5J5m1m1N6N5L3L3L2L3m2m2K6K7j9j9
$$ 1689 1725 1761 1798 1834 1763 1692 1662 1633 1597 1562 1573 1583 1532 1564 1573 1417 1484 1551 1566 1581 1540 1499 1555 1610 1643 1676 1708 1741 1699 1657 1683 1710 1691 1672
2270A672P7P8p0o9p0o9n5n5M1M2O9P0K8K9q2q2Q6Q7J08n6j5j5L4j32n3K22O6r9k9j11r3P2
$$ 1672 1749 1827 1757 1688 1618 1549 1494 1439 1480 1522 1591 1661 1689 1718 1636 1554 1640 1727 1835 1779 1764 1749 1783 1651 1598 1820 1886 1787 1758 1647 1554 1626
2265A626N7k6K0o3j14N1nnK9j36m8m9R2R2PPR8R8lq4j01O5P4r0J2J3K2K3Q0lr5P0N9k3n5n4
$$ 1626 1683 1657 1677 1614 1500 1551 1546 1541 1570 1434 1386 1337 1429 1521 1528 1535 1633 1731 1728 1644 1543 1608 1682 1592 1604 1617 1639 1662 1742 1739 1644 1714 1773 1750 1695 1641
2260A641j9j8m2m2J57pj24M2K4K5P9q4l9M4q3q4O3O3J79J5q5q5M3M3JKk4k3n5n4l8J28L4L5
$$ 1641 1622 1604 1562 1520 1677 1670 1546 1588 1612 1637 1716 1632 1593 1637 1554 1470 1533 1596 1775 1790 1705 1620 1663 1706 1707 1709 1685 1662 1607 1553 1515 1643 1677 1712
2254A712RRRQj6j7j7j7q1q0N7N7p2p2J20J21j3j3j05j05J47j7r9O5L9L9QQJ6J5n6n7j16M8
$$ 1712 1721 1730 1739 1747 1731 1714 1697 1680 1599 1519 1576 1633 1561 1489 1609 1730 1717 1704 1599 1494 1641 1624 1525 1590 1629 1668 1676 1684 1700 1715 1659 1602 1486 1534
2249A534L8L8K1K2N2N3Q1q4QRQQp5p4j17j17L0L1k9J36Q5Q5M0M0l2l3j28L7j5j5m0m0M2M3
$$ 1534 1572 1610 1631 1653 1705 1758 1839 1755 1763 1772 1780 1788 1713 1639 1522 1405 1435 1466 1437 1573 1658 1743 1783 1823 1791 1758 1630 1667 1652 1637 1597 1557 1599 1642
2244A642N5N5O6r9JJrrJ1J2p1p1L8L9L8L9QPJ8j47K2K1K1K1j39K7J6J6M9N0l3l3J3J4J3J4
$$ 1642 1697 1752 1818 1719 1720 1721 1712 1703 1714 1726 1655 1584 1622 1661 1699 1738 1746 1753 1771 1624 1646 1667 1688 1709 1570 1597 1613 1629 1678 1728 1695 1662 1675 1689 1702 1716
2239A716J0Rp2p3l1l2l1l2Q6Q5qpQ9p5p6PK3n9P4P5j4j4j4j4LMLMl9m0l9l9Q6Q7n0n1QQr5
$$ 1716 1726 1735 1663 1590 1559 1527 1496 1464 1550 1635 1627 1620 1709 1634 1558 1565 1588 1529 1603 1678 1664 1650 1636 1622 1625 1629 1632 1636 1597 1557 1518 1479 1565 1652 1602 1551 1559 1567 1472
2233A472P0J89K5rrl7l7K0o3q7P8K6n6l8l8lkL6L5m7m7L8L8qqJ02J9NJ69Q1q4j09k6N3N3k4
$$ 1472 1542 1731 1756 1747 1738 1701 1664 1684 1621 1534 1612 1638 1582 1544 1506 1503 1501 1537 1572 1525 1478 1516 1554 1546 1538 1640 1659 1664 1833 1914 1830 1721 1695 1748 1801 1777
2227A777k5p2p2NNk7j09p3R2Q8Q9J1J1Lq0j31L4R9J7j0rK9K9L0K9K6K7K6K7o7o7j6j5j0J55
$$ 1777 1752 1680 1608 1613 1618 1591 1482 1409 1501 1589 1678 1689 1700 1703 1623 1492 1526 1625 1642 1632 1623 1652 1681 1711 1740 1766 1793 1819 1846 1779 1712 1696 1681 1671 1826
2222A826j9k0p0p0p0p0Q5Q5LLQPl4l4J5J5o8o7J1J0J91K6%Q2n7n7j5j4j11j11J6J5N7N7K9
$$ 1826 1807 1787 1717 1647 1577 1507 1592 1677 1680 1683 1691 1698 1664 1630 1645 1660 1592 1525 1536 1546 1737 1763 1763 1845 1788 1731 1716 1702 1591 1480 1496 1511 1568 1625 1654
2216A654K9Q6p9kQ1Q0kp8Q6Q2q4o6o5l5l5j3j4j4j4N1N0j8j8j4j4K7K7J7J8n1n1K5K5K6K5
$$ 1654 1683 1769 1690 1688 1769 1849 1847 1769 1855 1937 1853 1787 1722 1687 1652 1639 1625 1611 1597 1648 1698 1680 1662 1648 1634 1661 1688 1705 1723 1672 1621 1646 1671 1697 1722
2211A722L0L1j21j20RRQRJ8J7J8J7J8J9L3m9o1J04O3j9j54J1K0K0p5R1J31l3m5m6n5n6NNR7
$$ 1722 1752 1783 1662 1542 1551 1560 1568 1577 1595 1612 1630 1647 1665 1684 1717 1668 1607 1711 1774 1755 1601 1612 1632 1652 1577 1668 1799 1766 1721 1675 1620 1564 1569 1574 1671
2206A671o7m2m2M3M4m8m8M9M8M6M7n9K5p8Q6M6j19L2n0j4j3m0m0K9K9R3R2R2R3q8q8QQpop
$$ 1671 1604 1562 1520 1563 1607 1559 1511 1560 1608 1654 1701 1642 1667 1589 1675 1721 1602 1634 1584 1570 1557 1517 1477 1506 1535 1628 1720 1812 1905 1817 1729 1737 1745 1738 1732 1725
2200A725pJ0J0l2l2J7J6k5k5J5J4k7k6K6K6l2l2j26L8M2M2OPo3o2M2M1q2q2P9P9O9O8R5p1
$$ 1725 1718 1728 1738 1706 1674 1691 1707 1682 1657 1672 1686 1659 1633 1659 1685 1653 1621 1495 1533 1575 1617 1623 1630 1567 1505 1547 1588 1506 1424 1503 1582 1651 1719 1814 1743
2195A743K2K3l5l4PPmlm5m5m4m5m4m5P1P2N0j14j35K9J04J05l2l2L7L7opoon7n6M0M0M3M3
$$ 1743 1765 1788 1753 1719 1726 1733 1729 1726 1681 1636 1592 1547 1503 1458 1529 1601 1651 1537 1402 1431 1535 1640 1608 1576 1613 1650 1644 1637 1631 1625 1568 1512 1552 1592 1635 1678
2189A678M2M3m3m2jjp5p4N0M9N0M9kkP5r1j13l0j19j19R3R2K2K2K1K2mmmmM4M4k5k4O5O5l
$$ 1678 1720 1763 1720 1678 1677 1676 1601 1527 1577 1626 1676 1725 1723 1721 1796 1705 1592 1562 1443 1324 1417 1509 1531 1553 1574 1596 1592 1588 1584 1580 1624 1668 1643 1619 1684 1749 1746
2184A746ll1l1q3Q3MMm2M0N1j14p3R2M0m3jQ0N8j07j39K7O6J48Qp5Q7Q7j5j5k2k2P8q5j13
$$ 1746 1743 1712 1681 1598 1681 1685 1689 1647 1687 1738 1624 1551 1643 1683 1640 1639 1719 1777 1670 1531 1558 1624 1772 1780 1705 1792 1879 1864 1849 1827 1805 1883 1798 1685
2179A685K5L3L3p1p2klJ7J7J7J7n8n7J1J1j7j8J62P9q4N3J2J2q6q7j8j8JJJ24J25qqj04j04
$$ 1685 1710 1743 1776 1705 1633 1631 1628 1645 1662 1679 1696 1638 1581 1592 1603 1586 1568 1730 1809 1725 1778 1790 1802 1716 1629 1611 1593 1594 1595 1719 1844 1836 1828 1724 1620
2173A620N2N2k5k5Q0n7j27m5J23M1NNm5R3N1q6p6p6m8m8J06K4j40jJ64K7K1J03N4k7m5m5m4
$$ 1620 1672 1724 1699 1674 1754 1697 1570 1525 1648 1689 1694 1699 1654 1747 1798 1712 1636 1560 1512 1464 1570 1594 1454 1453 1617 1644 1665 1768 1822 1795 1750 1705 1661
2168A661m4m3m4J8J9k6J67L4m8J0J0m8m8ppK7K8J09k7p7NK0J9l2l1J0Rn2n2M4M4L0K9L0K9
$$ 1661 1617 1574 1530 1548 1567 1541 1708 1742 1694 1704 1714 1666 1618 1611 1604 1631 1659 1768 1741 1664 1669 1689 1708 1676 1645 1655 1664 1612 1560 1604 1648 1678 1707 1737 1766
2163A766o1o1k0k0k4k4M5M4M1M0K7n5j38jL6L5Q0mj02L4M1M1M9M9J9J9p8p7k2k1J9K0l9m0
$$ 1766 1705 1644 1624 1604 1580 1556 1601 1645 1686 1726 1753 1698 1560 1559 1595 1630 1710 1706 1604 1638 1679 1720 1769 1818 1837 1856 1778 1701 1679 1658 1677 1697 1658 1618
2158A618L0K9j3j3j2j3%%O3O3O0k4j28J0M1m2N5N4k7k7j23j23K9K9K9K9Q4Q5o6o7q9q8Q9R0
$$ 1618 1648 1677 1664 1651 1639 1626 1626 1626 1689 1752 1812 1788 1660 1670 1711 1669 1724 1778 1751 1724 1601 1478 1507 1536 1565 1594 1678 1763 1697 1630 1541 1453 1542 1632
2153A632J%J%J8J8J8J7j1j2m4m4l2J06M2r5k0O3mmJ09q3P2j1k7k7l8l7l8j20K7J65L4L4Q4
$$ 1632 1633 1633 1634 1634 1652 1670 1688 1705 1694 1682 1638 1594 1562 1668 1710 1615 1595 1658 1654 1650 1759 1676 1748 1737 1710 1683 1645 1608 1570 1450 1477 1642 1676 1710 1794
2147A794Q4p9p9q0p9O8O7K6K7n1n1J7J8k6k6J5J5L0L0L0L1POK1j17r4j2k2O0P3rp7O1J8J8
$$ 1794 1878 1799 1720 1640 1561 1629 1696 1722 1749 1698 1647 1664 1682 1656 1630 1645 1660 1690 1720 1750 1781 1788 1794 1815 1698 1604 1592 1570 1630 1703 1694 1617 1678 1696 1714
2142A714K6K6L6L5q8q8NNJ9J00M3r5ppj19l6Q5n2l1J06o2o2P1P1j2j1Q1Q1kjL4L3m8m9o6o6
$$ 1714 1740 1766 1802 1837 1749 1661 1666 1671 1690 1790 1833 1738 1731 1724 1605 1569 1654 1602 1571 1677 1615 1553 1624 1695 1683 1672 1753 1834 1832 1831 1865 1898 1850 1801 1735 1669
2136A669J6J7p4p5O3O3j4j4K7K7L5L5oon7n6J35J36j0rn1n0m2m1M1M2k5k4k4k5k0k0O3O2%
$$ 1669 1685 1702 1628 1553 1616 1679 1665 1651 1678 1705 1740 1775 1769 1763 1706 1650 1785 1921 1911 1902 1851 1801 1759 1718 1759 1801 1776 1752 1728 1703 1683 1663 1726 1788 1788
2131A788Jm1m0k5k4N8N8o7o8o8o7J23J22j4j4k4k4N8N9l2l1RJ0j13j13K5K5j4j4K7K7K9K8
$$ 1788 1789 1748 1708 1683 1659 1717 1775 1708 1640 1572 1505 1628 1750 1736 1722 1698 1674 1732 1791 1759 1728 1737 1747 1634 1521 1546 1571 1557 1543 1570 1597 1626 1654
2126A654j3j2L2L1O3j29o7J6K8K8J36n7p7OO0O0j7j8n1n2L1L1J6J5j22j21M6M7l6l6k2k2O0
$$ 1654 1641 1629 1661 1692 1755 1626 1559 1575 1603 1631 1767 1710 1633 1639 1699 1759 1742 1724 1673 1621 1652 1683 1699 1714 1592 1471 1517 1564 1528 1492 1470 1448 1508
2121A508O0JKM2M2M4M3l8l9n8n9J34J34m9m8L4L4J4J4o8o9J3J3N4N4K6K5K1K0j3r6j42K3k7
$$ 1508 1568 1569 1571 1613 1655 1699 1742 1704 1665 1607 1548 1682 1816 1767 1719 1753 1787 1801 1815 1747 1678 1691 1704 1758 1812 1838 1863 1884 1904 1891 1795 1653 1676 1649
2116A649k7O5O6j12j12q6mK26O1l3l3kllkJ1J1q1q2P9q5r1P5O6j6q2jk7N5N5N5k9k9r0P4R2
$$ 1649 1622 1687 1753 1641 1529 1443 1439 1665 1726 1693 1660 1658 1655 1652 1650 1661 1672 1591 1509 1588 1503 1412 1487 1553 1537 1455 1454 1427 1482 1537 1592 1563 1534 1444 1518 1610
2110A610p3L0L0J42J43M8j17j51o9k0J44o2K0O7O7o0o0J33l2j66J09M6j18l0J34P8mo7o6j65
$$ 1610 1537 1567 1597 1739 1882 1930 1813 1662 1593 1573 1717 1655 1675 1742 1809 1749 1689 1822 1790 1624 1733 1779 1661 1631 1765 1843 1839 1772 1706 1541
2106A541JJ35J36N7j08m4J21K4n9l1l1l6l6j4j5P8q6QPklnoP6P7j08j07L0L1J8J8k3k3L3L4
$$ 1541 1542 1677 1813 1870 1762 1718 1839 1863 1804 1773 1742 1706 1670 1656 1641 1719 1633 1641 1648 1646 1643 1638 1632 1708 1785 1677 1570 1600 1631 1649 1667 1644 1621 1654 1688
2100A688P5P5l1l1l1l0q0q0P2P1N9N8j85k0kkl3l2K5K6Q8p8j17M8J14J13J00o6j51J4m5J21
$$ 1688 1763 1838 1807 1776 1745 1715 1635 1555 1627 1698 1757 1815 1630 1610 1608 1606 1573 1541 1566 1592 1680 1602 1485 1533 1647 1760 1860 1794 1643 1657 1612 1733
2095A733mlj6j6j6j7L1L0o6o6rj0n0n1O8O7O7O8l2l3J40k6q1Q4j9j9o4o4J08n7j10N4m8m9
$$ 1733 1729 1726 1710 1694 1678 1661 1692 1722 1656 1590 1581 1571 1521 1470 1538 1605 1672 1740 1708 1675 1815 1789 1708 1792 1773 1754 1690 1626 1734 1677 1567 1621 1573 1524
2090A524O7O6klj9k0j9k0J8J8J52j3RQjkj07j06p6Q9L4L5J27l8N5j09j60MO7O7J28l6j9j9
$$ 1524 1591 1657 1655 1652 1633 1613 1594 1574 1592 1610 1762 1749 1758 1766 1765 1763 1656 1550 1474 1563 1597 1632 1759 1721 1776 1667 1507 1511 1578 1645 1773 1737 1718 1699
2085A699p0p1llm4m4J00J00N2j13j80j5J05J06J12n3n6n6J16J15l5l5n3n3jjq6P9K7K8j6j6
$$ 1699 1629 1558 1555 1552 1508 1464 1564 1664 1716 1603 1423 1408 1513 1619 1731 1678 1622 1566 1682 1797 1762 1727 1674 1621 1620 1619 1533 1612 1639 1667 1651 1635
2080A635K6K6P1P2q0p9m2m2%jN7N7m0l9M4M4M3M4n9n9o6R9N6j08j01j01J7J7J13J14l4l3l4
$$ 1635 1661 1687 1758 1830 1750 1671 1629 1587 1587 1586 1643 1700 1660 1621 1665 1709 1752 1796 1737 1678 1612 1711 1767 1659 1558 1457 1474 1491 1604 1718 1684 1651 1617
2075A617l3R0R1q8q8M2M3L2L2R7o8j36K8l2l2k2k1l7l7L2L2N0N0j8j9j4j4n5n5N0N0J43k1
$$ 1617 1584 1674 1765 1677 1589 1631 1674 1706 1738 1835 1767 1631 1659 1627 1595 1573 1552 1515 1478 1510 1542 1592 1642 1624 1605 1591 1577 1522 1467 1517 1567 1710 1689
2070A689j08j08OOK8K9NJ70m7m7L2L2j43j43O3O3J1J0m7m8j4J52N9N8j0j0j0j0QPQQO5O4K4
$$ 1689 1581 1473 1479 1485 1513 1542 1547 1717 1670 1623 1655 1687 1544 1401 1464 1527 1538 1548 1501 1453 1439 1591 1650 1708 1698 1688 1678 1668 1676 1683 1691 1699 1764 1828 1852
2065A852K3m7m7m7m7J1J1n7n7qpL3L4j7j6j7j6j4j4j4j4K8K9K8K9J2J3k9k9j2j2J25J25j74
$$ 1852 1875 1828 1781 1734 1687 1698 1709 1652 1595 1587 1580 1613 1647 1630 1614 1597 1581 1567 1553 1539 1525 1553 1582 1610 1639 1651 1664 1635 1606 1594 1582 1707 1832 1658
2060A658j74P2P3k2k2r4r5l0J35Q4Q3R4R5r8r8l0l1J0J1N0N0N0N0J0J0RJ0m9n0L3L3j6j6n7
$$ 1658 1484 1556 1629 1607 1585 1491 1396 1366 1501 1585 1668 1762 1857 1759 1661 1631 1600 1610 1621 1671 1721 1771 1821 1831 1841 1850 1860 1811 1761 1794 1827 1811 1795 1738
2054A738n7M9N0l3l2j6j5q8q8q1Q3L2L2L2L2j0rj7j6O5O6l6l6l7l6M5M6l7l8K4K4J4J78l4
$$ 1738 1681 1730 1780 1747 1715 1699 1684 1596 1508 1427 1510 1542 1574 1606 1638 1628 1619 1602 1586 1651 1717 1681 1645 1608 1572 1617 1663 1626 1588 1612 1636 1650 1828 1794
2049A794l5q6P9J25m0J8j46j2j2n3n3p0R4J36k9n0n0K3K2j9j9n0m9o6R9PO%jL1L0L5j29PJ73
$$ 1794 1759 1673 1752 1877 1837 1855 1709 1697 1685 1632 1579 1509 1603 1739 1710 1660 1610 1633 1655 1636 1617 1567 1518 1452 1551 1558 1564 1564 1563 1594 1624 1659 1530 1537 1710
2044A710k6k6r7r8J19J19L7L7k0j9j02j03L1L0L6L5J8J00P4r1r4P0p4p4o6o7J7J6J7J7M3J25
$$ 1710 1684 1658 1561 1463 1582 1701 1738 1775 1755 1736 1634 1531 1562 1592 1628 1663 1681 1781 1855 1764 1670 1740 1666 1592 1526 1459 1476 1492 1509 1526 1569 1694
2039A694J34l1p2J0N9j06qqL6L5m6m7nmL6L7OPp6p6K9K9K9L0m9m8R1Ro1J05J66j09q8nJ3J4
$$ 1694 1828 1797 1725 1735 1794 1688 1680 1672 1708 1743 1697 1650 1645 1641 1677 1714 1720 1727 1651 1575 1604 1633 1662 1692 1643 1595 1686 1695 1634 1739 1905 1796 1708 1703 1716 1730
2033A730m7m7L5L6n1n1n7n6N7k5l0J34N8N8j4j4o3o3P4P4KJl9l9K8K8j11N4J00J8qqN6N6K2
$$ 1730 1683 1636 1671 1707 1656 1605 1548 1492 1549 1524 1494 1628 1686 1744 1730 1716 1653 1590 1664 1738 1740 1741 1702 1663 1691 1719 1608 1662 1762 1780 1772 1764 1820 1876 1898
2028A898j43j47J9k8j11m7J18R8R7Jq2j27L7K3K3J26l9n4n5J8J8lklkJ8J8J8J8q7q7J60J61
$$ 1898 1755 1608 1627 1599 1488 1441 1559 1657 1754 1755 1673 1546 1583 1606 1629 1755 1716 1662 1607 1625 1643 1640 1638 1635 1633 1651 1669 1687 1705 1618 1531 1691 1852
2023A852L9L9kkj06j06k4k4l0l0l0l0o7o8j7J47n3K9R5o9j07N7J35l0j02k0O1O1j9j9PQ9P8
$$ 1852 1891 1930 1928 1926 1820 1714 1690 1666 1636 1606 1576 1546 1479 1411 1394 1541 1488 1517 1612 1543 1436 1493 1628 1598 1496 1476 1537 1598 1579 1560 1567 1656 1734
2018A734q8m1M1N2l1j08k6O5O6K9K9RRl3l2RQp3p4l9m0R8R8ooL5L6N0N0q7q8n1n1L1L1j3j3
$$ 1734 1646 1605 1646 1698 1667 1559 1533 1598 1664 1693 1722 1731 1740 1707 1675 1684 1692 1619 1545 1506 1466 1564 1662 1656 1650 1685 1721 1771 1821 1734 1646 1595 1544 1575 1606 1593 1580
2012A580K8K8N5N6q2q2L7L6P7P8l0l0l0l0L5L4J37k7j61LL8L8O5O6p2p2j00r9j7j7P6P6R7
$$ 1580 1608 1636 1691 1747 1665 1583 1620 1656 1733 1811 1781 1751 1721 1691 1726 1760 1897 1870 1709 1712 1750 1788 1853 1919 1847 1775 1675 1576 1559 1542 1618 1694 1791
2007A791o7j06N9m4m4L8L8L8L7k4k4k4k4j8j7j7j8R1R1QQm1m2m1m2K3K3Q5q0r3P3J07J06l4
$$ 1791 1724 1618 1677 1633 1589 1627 1665 1703 1740 1716 1692 1668 1644 1626 1609 1592 1574 1665 1756 1764 1772 1731 1689 1648 1606 1629 1652 1737 1657 1564 1637 1744 1850 1816
2002A816l4p5p5O5O5j8j7qqr1r0N5N4k7k8J10J10k8k7r3r2L5L5J33l2o8J4L4L5m1j23j15N0
$$ 1816 1782 1707 1632 1697 1762 1744 1727 1719 1711 1620 1530 1585 1639 1612 1584 1694 1804 1776 1749 1656 1564 1599 1634 1767 1735 1667 1681 1715 1750 1709 1586 1471 1521
1997A521Q1jj7j7k2k2K4K3R6R5P6r0r0qJ04K1j4r6q0Kmq5NN%%jjjjj7j6j7j6J12J12L0K9J5
$$ 1521 1602 1601 1584 1567 1545 1523 1547 1570 1666 1761 1837 1747 1657 1649 1753 1774 1760 1664 1584 1586 1582 1497 1502 1507 1507 1507 1506 1505 1504 1503 1486 1470 1453 1437 1549 1661 1691 1720 1735
1991A735J4J4J5j0j0j0j0k1k0k0k1J7J7J7J7k7k6k6k6M2M3l9j21j15M9J35N2K8K7o0o0j8j8
$$ 1735 1749 1763 1778 1768 1758 1748 1738 1717 1697 1677 1656 1673 1690 1707 1724 1697 1671 1645 1619 1661 1704 1665 1544 1429 1478 1613 1665 1693 1720 1660 1600 1582 1564
1986A564l3M8J29l7o8J5Q9Q9r7r8l1l1J06J07K4K5j12j13O6O6n7n8lkllN5N4m3m2j9j9K3K2
$$ 1564 1531 1579 1708 1671 1603 1618 1707 1796 1699 1601 1570 1539 1645 1752 1776 1801 1689 1576 1642 1708 1651 1593 1590 1588 1585 1582 1637 1691 1648 1606 1587 1568 1591 1613
1981A613N3N3p1p0O5O5J16m8K5K5N6N6k7k6j23j22o9o9K7K8m2m1K7K7N1N0j8j8L8L9l0l0N1
$$ 1613 1666 1719 1648 1578 1643 1708 1824 1776 1801 1826 1882 1938 1911 1885 1762 1640 1571 1502 1529 1557 1515 1474 1501 1528 1579 1629 1611 1593 1631 1670 1640 1610 1661
1976A661N1ppj16M9m4m4L7L7nml0k9p1p0kkP7P7o0J06J05o0O5O4j35j35j14J61J41k5J%M9
$$ 1661 1712 1705 1698 1582 1631 1587 1543 1580 1617 1612 1608 1578 1549 1478 1408 1406 1404 1481 1558 1498 1604 1709 1649 1714 1778 1643 1508 1394 1555 1696 1671 1672 1672 1721
1971A721M8R8o6j36L0M1M2j65%K8K7l0l1lkQ3Q3M0j26l2l3L8L8Q9p5j06j05K5J90n4n5j12
$$ 1721 1769 1867 1801 1665 1695 1736 1778 1613 1613 1641 1668 1638 1607 1604 1602 1685 1768 1808 1682 1650 1617 1655 1693 1782 1707 1601 1496 1521 1711 1657 1602 1490
1966A490j13J35J34L9L8p4p4P7P8k1k1p7Q7P7oj10N4P8P7l5l6nmnnj30j30poM2M1J40k5o4
$$ 1490 1377 1512 1646 1685 1723 1649 1575 1652 1730 1709 1688 1611 1698 1775 1769 1659 1713 1791 1868 1833 1797 1792 1788 1783 1778 1648 1518 1511 1505 1547 1588 1728 1703 1639
1961A639J9J01o4r7j5l1l0K7K8K7K7l6l7J42J42o1o1o2o1NMNMJ3J2J2J2J5J4k7k7l2l2l2l2
$$ 1639 1658 1759 1695 1598 1583 1552 1522 1549 1577 1604 1631 1595 1558 1700 1842 1781 1720 1658 1597 1602 1606 1611 1615 1628 1640 1652 1664 1679 1693 1666 1639 1607 1575 1543 1511
1955A511M8M8j9j01j0J54J03K1onN1j13l2J33L5m8q2q3RQN0N0j4j3m4L9N5j11p3R1j1j2j4
$$ 1511 1559 1607 1588 1487 1477 1631 1734 1755 1749 1744 1795 1682 1650 1783 1818 1770 1688 1605 1614 1622 1672 1722 1708 1695 1651 1690 1745 1634 1561 1652 1641 1629 1615
1950A615j4K6K7l7l6l7l7k5k6R8R8n1n0j0rNNJ02J01k1k2k1k2MMP3P3q0q0J4R7M4j20k3k3
$$ 1615 1601 1627 1654 1617 1581 1544 1507 1482 1456 1554 1652 1601 1551 1541 1532 1537 1542 1644 1745 1724 1702 1681 1659 1663 1667 1740 1813 1733 1653 1667 1764 1808 1688 1665 1642
1945A642n4n4J24J24K0J9p6p7J1J1n8n7J6J6Q5Q5j33j32J9J8L7L7L7L7l2l2l2l1M3M3KKKL
$$ 1642 1588 1534 1658 1782 1802 1821 1745 1668 1679 1690 1632 1575 1591 1607 1692 1777 1644 1512 1531 1549 1586 1623 1660 1697 1665 1633 1601 1570 1613 1656 1658 1660 1662 1665
1940A665M3M3k3k4k3k3J7J8N9N9onoor2r1MNn0n0n0n0P8P8j9j8QRJ04J05o4o4L3L2r8r8K5
$$ 1665 1708 1751 1728 1704 1681 1658 1675 1693 1752 1811 1805 1800 1794 1788 1696 1605 1609 1614 1564 1514 1464 1414 1492 1570 1551 1533 1541 1550 1654 1759 1695 1631 1664 1696 1598 1500 1525
1934A525K5L8L7mmM2M2j09j09OOo2o3J06J06J1J0onO3O4N9O0l7l6l3l3L5L6K2K2p4p4l8l8
$$ 1525 1550 1588 1625 1621 1617 1659 1701 1592 1483 1489 1495 1433 1370 1476 1582 1593 1603 1597 1592 1655 1719 1778 1838 1801 1765 1732 1699 1734 1770 1792 1814 1740 1666 1628 1590
1929A590L1L0J5J5n4n3%%J%R2R2n9n9QQQQo8o8k6k7Q0P9L8L8o3o2k1k1L9L8M9M8j42K3J84
$$ 1590 1621 1651 1666 1681 1627 1574 1574 1574 1575 1575 1667 1759 1700 1641 1649 1657 1665 1673 1605 1537 1511 1484 1564 1643 1681 1719 1656 1594 1573 1552 1591 1629 1678 1726 1584 1607 1791
1923A791K0j01O4l9l9m7m7ooP6P7P8q7j27m4m4j27k9J35J06J06K1K1k0k0l1l1L7L8N3N2N3
$$ 1791 1811 1710 1774 1735 1696 1649 1602 1596 1590 1666 1743 1821 1734 1607 1563 1519 1392 1363 1498 1604 1710 1731 1752 1732 1712 1681 1650 1687 1725 1778 1830 1883
1918A883N2r4r4n3n4noL5L6j4j3j4j3o2o1L5L4kkr9r8J26J26Q5Q6m2m2m2m2PPOPooL5L5j6
$$ 1883 1935 1841 1747 1694 1640 1635 1629 1664 1700 1686 1673 1659 1646 1584 1523 1558 1592 1590 1588 1489 1391 1517 1643 1728 1814 1772 1730 1688 1646 1653 1660 1666 1673 1667 1661 1696 1731 1715
1912A715j6j6j6M8M8k0k1p2p1l1l1N2N1j7j7M7M7k1k2QPm9L4Q8p6K1K2j9j9j9j9K0J9J24M1
$$ 1715 1699 1683 1667 1715 1763 1743 1722 1650 1579 1548 1517 1569 1620 1603 1586 1633 1680 1659 1637 1645 1652 1603 1637 1725 1649 1670 1692 1673 1654 1635 1616 1636 1655 1779 1820
1907A820O8r7j05j05k9k9K3K2k2J43N5k7q0q0mJ61J07K5r5j78j26L8RRJ30J31L5L5p8p7M6
$$ 1820 1888 1791 1686 1581 1552 1523 1546 1568 1546 1689 1744 1717 1637 1557 1553 1714 1821 1846 1751 1573 1447 1485 1494 1503 1633 1764 1799 1834 1756 1679 1725
1902A725M6j9j9j9j9k6k6k6k6K2K2K2K2K8K7K8K7k8k8k9k8n1n2M5M5J2J3n5n6RRO8O8P1r4
$$ 1725 1771 1752 1733 1714 1695 1669 1643 1617 1591 1613 1635 1657 1679 1707 1734 1762 1789 1761 1733 1704 1676 1625 1573 1618 1663 1675 1688 1633 1577 1586 1595 1663 1731 1802 1708
1897A708j57Pj1P1rr2k7N5NMJ6J6J7J6M4M4KLJ7J7o9o8q5Q0K8K8J4J5LMM2j23j34L2J73QJ5
$$ 1708 1551 1558 1547 1618 1609 1517 1490 1545 1550 1554 1570 1586 1603 1619 1663 1707 1709 1712 1729 1746 1677 1609 1524 1604 1632 1660 1674 1689 1692 1696 1738 1615 1481 1513 1686 1694 1709
1891A709J5k1k1l7M6L6j28p7Nj0j0M7M7r1P5j8j9l1l1J0J1N9O0J9J9n9n8%jJ14n1m6L6L0L1
$$ 1709 1724 1703 1682 1645 1691 1727 1599 1522 1527 1517 1507 1554 1601 1510 1585 1567 1548 1517 1486 1496 1507 1566 1626 1645 1664 1605 1547 1547 1546 1660 1609 1563 1599 1629 1660
1886A660L5L6k0j9K2K2P6P6PQq7q6j7j8QRM9M9n7n8j7j7llllqqrqO9O9n5n4K9L0j1j2L3L4
$$ 1660 1695 1731 1711 1692 1714 1736 1812 1888 1895 1903 1816 1730 1713 1695 1703 1712 1761 1810 1753 1695 1678 1661 1658 1655 1652 1649 1641 1633 1624 1616 1685 1754 1699 1645 1674 1704 1693 1681 1714 1748
1880A748j18j18O6O7n8n7N1N1m5m5Q4Q5j1j2O6O6l1l0K5K5m4m3R5R5k8k8p1p2l0l0j3j3j3
$$ 1748 1630 1512 1578 1645 1587 1530 1581 1632 1587 1542 1626 1711 1700 1688 1754 1820 1789 1759 1784 1809 1765 1722 1817 1912 1884 1856 1785 1713 1683 1653 1640 1627 1614
1875A614j3K2K2K2K2o6o6L0K9l1l1l0l1J5J5J6J5J07J08j7j6l0l0l0l0n0n0M7M6J7J8J7J7
$$ 1614 1601 1623 1645 1667 1689 1623 1557 1587 1616 1585 1554 1524 1493 1508 1523 1539 1554 1661 1769 1752 1736 1706 1676 1646 1616 1566 1516 1563 1609 1626 1644 1661 1678
1870A678j6j7N3N2j2j2N6N7n7n7j6j6O1O2l5l5p3p3N0N1RRRRJ6J5J5J5n4n3j2j3k3k4J8J8
$$ 1678 1662 1645 1698 1750 1738 1726 1782 1839 1782 1725 1709 1693 1754 1816 1781 1746 1673 1600 1650 1701 1710 1719 1728 1737 1753 1768 1783 1798 1744 1691 1679 1666 1643 1619 1637 1655
1864A655M8M9J00o5r3r2l5l4j8j7N2N1m6m6P7P8M3M4k6k5Q3Q3m0m0r0r0L5m7r0P4Q6Mk1j03
$$ 1655 1703 1752 1852 1787 1694 1602 1567 1533 1515 1498 1550 1601 1555 1509 1586 1664 1707 1751 1725 1700 1783 1866 1826 1786 1696 1606 1641 1594 1504 1578 1664 1668 1647 1544
1859A544m1J23M1j25k1k1R5R5K6K6rqMQ6J3j51p8Q7MNJ4J5j1j0K4j41j02O3P5qO8O7l1j14
$$ 1544 1503 1626 1667 1542 1521 1500 1595 1690 1716 1742 1733 1725 1729 1815 1828 1677 1599 1686 1690 1695 1709 1724 1713 1703 1727 1586 1484 1547 1622 1614 1682 1749 1718 1604
1854A604r1P3O4j9M6M7PJ71Q5q0K5j40j49o7J0J1l6J30K6K6M8j17pP5k3j06M2M1o7o7O7r8
$$ 1604 1513 1586 1650 1631 1677 1724 1731 1902 1987 1907 1932 1792 1643 1576 1586 1597 1561 1691 1717 1743 1791 1674 1667 1742 1719 1613 1655 1696 1629 1562 1629 1531
1849A531L1L2K1K1L4L4o2o2m8m8p3R3L7L7M7M7N9N9o5o4l5l4O1O2mmO5O4j31j31K1K0M0M1
$$ 1531 1562 1594 1615 1636 1670 1704 1642 1580 1532 1484 1411 1504 1541 1578 1625 1672 1731 1790 1725 1661 1626 1592 1653 1715 1711 1707 1772 1836 1705 1574 1595 1615 1655 1696
1844A696jjklK9K8nj69k4J41K5n8j10k8NQ8J40k5n1n1o2o1K2K2j4j4J1R4Q2q2p3R2M1m2QR0
$$ 1696 1695 1694 1692 1689 1718 1746 1741 1572 1548 1689 1714 1656 1546 1518 1523 1611 1751 1726 1675 1624 1562 1501 1523 1545 1531 1517 1528 1622 1704 1622 1549 1641 1682 1640 1648 1738
1838A738J32l3q3q2MMp6p7M8M7NNo3o4n3n2P1P1K2K2K3K2M0M1jjQQl3l4M9N0QQl7l7L1L2j
$$ 1738 1870 1837 1754 1672 1676 1680 1604 1527 1575 1622 1627 1632 1569 1505 1452 1400 1471 1542 1564 1586 1609 1631 1671 1712 1711 1710 1718 1726 1693 1659 1708 1758 1766 1774 1737 1700 1731 1763 1762
1833A762jo9p0N3N3q8q8mJ61K8K7OPl5l5j0j1L0L1L3L4r0r0q7q7O5O4L0L1l4l3o3K0J35l0
$$ 1762 1761 1692 1622 1675 1728 1640 1552 1548 1709 1737 1764 1770 1777 1742 1707 1697 1686 1716 1747 1780 1814 1724 1634 1547 1460 1525 1589 1619 1650 1616 1583 1520 1540 1675 1645
1827A645j2j2o3o3MLj0P3J22j5jkl1l2o2P5k4N8O6j5n9n9rr1m1R7K8n4m5R2J34mq8oJ18k0
$$ 1645 1633 1621 1558 1495 1499 1502 1492 1565 1687 1672 1671 1669 1638 1606 1544 1619 1595 1653 1719 1704 1645 1586 1577 1486 1445 1542 1570 1516 1471 1563 1697 1693 1605 1599 1717 1697
1822A697q6ln8n8J02J03R9J6J5j23n5K7J1J2P2j1o0P8m6m6qqO0O1l3l2L7L6m6m6l1J61M2M1
$$ 1697 1611 1608 1550 1492 1594 1697 1796 1812 1827 1704 1649 1676 1687 1699 1771 1760 1700 1778 1732 1686 1678 1670 1730 1791 1758 1726 1763 1799 1753 1707 1676 1837 1879 1920
1817A920q9q9j27J0K1o2l6l6L3L3O9J51J22p1j26m5M0m3p1p2M8M7pqK8K9O5j6r8M0Pj30ll
$$ 1920 1831 1742 1615 1625 1646 1584 1548 1512 1545 1578 1647 1798 1920 1849 1723 1678 1718 1675 1604 1532 1580 1627 1620 1612 1640 1669 1734 1718 1620 1660 1667 1537 1534 1531
1811A531R6R6n6n5l0k9J1J2P6P6PPj4j3J9J9j4j51L0J13k1k2r4M4N3N3O3j02j28m6J00J8o5
$$ 1531 1627 1723 1667 1612 1582 1553 1564 1576 1652 1728 1735 1742 1728 1715 1734 1753 1739 1588 1618 1731 1710 1688 1594 1638 1691 1744 1807 1705 1577 1531 1631 1649 1584
1806A584J8k8j11OOP0P0j01j01N0N0k0j9K2K1QQQQJ1J0J1J0J%J0J0j23M1J20m5j19M5J12L0
$$ 1584 1602 1574 1463 1469 1475 1545 1615 1514 1413 1463 1513 1493 1474 1496 1517 1525 1533 1541 1549 1560 1570 1581 1591 1592 1592 1602 1612 1489 1530 1650 1605 1486 1531 1643 1673
1801A673l3l2L2L1n7n6L9L9O4O3o0o0m5m5j2O9l4J30O6r8n3n2NOl0l1L9L8RQl3l3j4j4M4M5
$$ 1673 1640 1608 1640 1671 1614 1558 1597 1636 1700 1763 1703 1643 1598 1553 1541 1610 1576 1706 1772 1674 1621 1569 1574 1580 1550 1519 1558 1596 1605 1613 1580 1547 1533 1519 1563 1608
1795A608J24m1j15N0l4j17R1R2L2L2o3o4l9l9L0L0lkQQp7Q7m6J19J80r5j8O5l2l3k8k8L7L8
$$ 1608 1732 1691 1576 1626 1592 1475 1566 1658 1690 1722 1659 1595 1556 1517 1547 1577 1574 1572 1580 1588 1511 1598 1552 1671 1851 1756 1738 1803 1771 1738 1710 1682 1719 1757
1790A757L7L7n7n7j6j6P5P5p5p6k2k2K0J9j9j9j9j9JKo8o7L9L8K8K8J40k5n5n5R7R7q2q1O0
$$ 1757 1794 1831 1774 1717 1701 1685 1760 1835 1760 1684 1662 1640 1660 1679 1660 1641 1622 1603 1604 1606 1538 1471 1510 1548 1576 1604 1744 1719 1664 1609 1706 1803 1721 1640 1700
1785A700O0R4p0j01O3l9m0L4L5L4L4J6J6j09j08J0J0RJ0j7j6j6j6L4L5M4M5r9O6J5J4J1J0
$$ 1700 1760 1854 1784 1683 1746 1707 1667 1701 1736 1770 1804 1820 1836 1727 1619 1629 1639 1648 1658 1641 1625 1609 1593 1627 1662 1706 1751 1652 1718 1733 1747 1758 1768
1780A768l1l1m9m8M8M8j7j7m8m9j03O1J0J0J7J6o2o2O3j01l3J32M4M5R6R6n4n3n0J15l9l9
$$ 1768 1737 1706 1657 1609 1657 1705 1688 1671 1623 1574 1471 1532 1542 1552 1569 1585 1523 1461 1524 1423 1390 1522 1566 1611 1707 1803 1749 1696 1646 1761 1722 1683
1775A683JKM1j24J0J0qqqqQ9Q9N8j07j15j15K6K6l3l3L5L6K0K0m9m9J00R9L1L1p9p8QPR6o9
$$ 1683 1684 1686 1727 1603 1613 1623 1615 1607 1599 1591 1680 1769 1827 1720 1605 1490 1516 1542 1509 1476 1511 1547 1567 1587 1538 1489 1589 1688 1719 1750 1671 1593 1601 1608 1704 1635
1770A635p0R6rj0KJk2k2J9J9J2J3PPoq8l9J26L1L1J37J37j50j51k6k7Q6Q7rj0o4o3J35k9j60
$$ 1635 1565 1661 1652 1642 1644 1645 1623 1601 1620 1639 1651 1664 1671 1678 1672 1584 1545 1671 1702 1733 1870 2007 1857 1706 1680 1653 1739 1826 1817 1807 1743 1680 1815 1786 1626
1764A626NQ1Q0j14j15L6L6K8K7j8j9R7J6N8j07k7k7l7l7m4m4j3j3O5j01m9L4k7N5N5N6Q6Q6
$$ 1626 1631 1712 1792 1678 1563 1599 1635 1663 1690 1672 1653 1750 1766 1824 1717 1690 1663 1626 1589 1545 1501 1488 1475 1540 1439 1390 1424 1397 1452 1507 1563 1649 1735
1759A735l7l8ooopP3P3MMm8m9Rp4q0Q4L4j32Rp3R5J78j0j0m5m6m0l9N7N6L5L4l4l5L7L7l2
$$ 1735 1698 1660 1654 1648 1642 1635 1708 1781 1785 1789 1741 1692 1701 1627 1547 1631 1665 1533 1542 1469 1564 1742 1732 1722 1677 1631 1591 1552 1609 1665 1700 1734 1700 1665 1702 1739 1707
1753A707l1qqqpj3j3j4j3J6J7N7N7J20J21O1j03l9m0m9n0PPLKP4qo5J00R4p1m0l9p0R6J4j52
$$ 1707 1676 1668 1660 1652 1645 1632 1619 1605 1592 1608 1625 1682 1739 1859 1980 2041 1938 1899 1859 1810 1760 1767 1774 1777 1779 1853 1845 1780 1880 1974 1903 1863 1824 1754 1850 1864 1712
1748A712R4R3n4n4m7m7R0R0J14J13P9q6j63Kj9j9M3M2n1J14O8O8J50J51L0j35k78k79r9O5
$$ 1712 1806 1899 1845 1791 1744 1697 1787 1877 1991 2104 2183 2097 1934 1936 1917 1898 1941 1983 1932 2046 2114 2182 2332 2483 2513 2378 2100 1821 1722 1787
1743A787J07n8k5k5k4k5k5J39l6l5O6O7j6j6k3k2k3k3j1j1j1j1m6m5m6m5K8K9K8K9L1L1L1
$$ 1787 1894 1836 1811 1786 1762 1737 1712 1851 1815 1780 1846 1913 1897 1881 1858 1836 1813 1790 1779 1768 1757 1746 1700 1655 1609 1564 1592 1621 1649 1678 1709 1740 1771
1738A771L1O5O5m9K27J48J48J1j54j43j42q1q1P1r4M1M0n2n2n2n1l7l6M6M6L2L2rqo1o0k7
$$ 1771 1802 1867 1932 1883 2110 2258 2406 2417 2263 2120 1978 1897 1816 1887 1793 1834 1874 1822 1770 1718 1667 1630 1594 1640 1686 1718 1750 1741 1733 1672 1612 1585
1733A585J39K1j45q2q3O4O4O5O4p4p3O4O3M3M2R4p1P5P5j8j8%jl6l7j28m5LJ68L8m3N4N5j26
$$ 1585 1724 1745 1600 1518 1435 1499 1563 1628 1692 1618 1545 1609 1672 1715 1757 1851 1780 1855 1930 1912 1894 1894 1893 1857 1820 1692 1647 1650 1818 1856 1813 1867 1922 1796
1728A796j25O6O7o2o2k1k0j5j5j6j5j2j3L3J97l0l0n4k18RJ74P0P1JJN8j07q4kK4K4o4o3o4
$$ 1796 1671 1737 1804 1742 1680 1659 1639 1624 1609 1593 1578 1566 1553 1586 1783 1753 1723 1669 1451 1460 1634 1704 1775 1776 1777 1835 1728 1644 1642 1666 1690 1626 1563 1499
1723A499o4J7J7R9R9l2l2N0N0m5m5R4p1j7O6O1k2l2N0l8j19n0n0j4j4NNM6M6O5O4j8j9p5p6
$$ 1499 1435 1452 1469 1568 1667 1635 1603 1653 1703 1658 1613 1707 1636 1619 1685 1746 1724 1692 1742 1704 1585 1535 1485 1471 1457 1462 1467 1513 1559 1624 1688 1670 1651 1576 1500
1718A500O2O1j3j4O9O9l6l5M6M7k0j9k5k4R7J5J59oj35n3P6q9j59NM0M0J7J6J15n0r4j0P0
$$ 1500 1562 1623 1610 1596 1665 1734 1698 1663 1709 1756 1736 1717 1692 1668 1765 1780 1939 1933 1798 1745 1821 1732 1573 1578 1618 1658 1675 1691 1806 1756 1662 1652 1722
1713A722P0kkjkp6p6OOJ5J5k7k6O9O8k3k4M7j17j17M8R0R0l8l7RQl3l2n2n2j0j0L4L4J27l8
$$ 1722 1792 1790 1788 1787 1785 1709 1633 1639 1645 1660 1675 1648 1622 1691 1759 1736 1712 1759 1642 1525 1573 1663 1753 1715 1678 1687 1695 1662 1630 1578 1526 1516 1506 1540 1574 1701 1663
1707A663J0RjjK2K2K1K2l1l1J1J0n4n3K8K9O7O7p0p0m4m4L9L8n1n1P7P6L6j29j18j19Q3Q2
$$ 1663 1673 1682 1681 1680 1702 1724 1745 1767 1736 1705 1716 1726 1672 1619 1647 1676 1743 1810 1740 1670 1626 1582 1621 1659 1608 1557 1634 1710 1746 1617 1499 1380 1463 1545
1702A545L1L1Q0q5M9M9k8k7j10j10kkL9L9k8k8J3J3J1J1R3R3M0M0N0j15j1j2J9J9l2l1p3p3
$$ 1545 1576 1607 1687 1602 1651 1700 1672 1645 1535 1425 1423 1421 1460 1499 1471 1443 1456 1469 1480 1491 1584 1677 1717 1757 1807 1692 1681 1669 1688 1707 1675 1644 1571 1498
1697A498K7K7O8O8LKLLO2O2k1k0n8n9p8Q6M0j24k1k2J2J1R4R3L2L2M2j23n0n0j9j9L7L7K7
$$ 1498 1525 1552 1620 1688 1691 1693 1696 1699 1761 1823 1802 1782 1724 1665 1587 1673 1713 1589 1568 1546 1558 1569 1663 1756 1788 1820 1862 1739 1689 1639 1620 1601 1638 1675 1702
1691A702K6P4r1KJk6k7j6j6q3Q3L6m6L8L9pqo0o0K2K3l9l9L9L8L4m8j46J9J46j8n2n3N6N6
$$ 1702 1728 1802 1711 1713 1714 1688 1661 1645 1629 1546 1629 1665 1619 1657 1696 1689 1681 1621 1561 1583 1606 1567 1528 1567 1605 1639 1591 1445 1464 1610 1592 1540 1487 1543 1599
1686A599J4J5j7j6n2L0q6P9J21L8P7P7k12m8M4M5k7k8m1m1M1M2Q2Q3j10j10n3n3K9L0Q7Q8
$$ 1599 1613 1628 1611 1595 1543 1573 1487 1566 1687 1725 1802 1879 1667 1619 1663 1708 1681 1653 1612 1571 1612 1654 1736 1819 1709 1599 1546 1493 1522 1552 1639 1727
1681A727NNQPp5p5nmj5j5R0p6j62KO7j5R4J0q1%K2K1O6r9k7J38R7o8l7l8j27L7P9mn0L3O8
$$ 1727 1732 1737 1745 1752 1677 1602 1597 1593 1578 1563 1653 1577 1415 1417 1484 1469 1563 1573 1492 1492 1514 1535 1601 1502 1475 1613 1710 1642 1605 1567 1440 1477 1556 1552 1502 1535 1603
1675A603j4l2l1J00J00m6m6L6L6q6q5nP7mj68K0J03LLQQK7K8OJ72M5j20n8n8K9K8K9K8k2k2
$$ 1603 1589 1557 1526 1626 1726 1680 1634 1670 1706 1620 1535 1530 1607 1603 1435 1455 1558 1561 1564 1572 1580 1607 1635 1641 1813 1858 1738 1680 1622 1651 1679 1708 1736 1714 1692
1670A692n3n4o6R9J68LOOp3p3q6q5J1J0R0Q9L9L8O2j03n1n1RJ0J0J0O7O7j11j11M4M4k5k5
$$ 1692 1639 1585 1519 1618 1786 1789 1795 1801 1728 1655 1569 1484 1495 1505 1595 1684 1723 1761 1823 1720 1669 1618 1627 1637 1647 1657 1724 1791 1680 1569 1613 1657 1632 1607
1665A607N6N7Q0q5R6R7j20j20j5j5j5j5j4j4K7K7k3k2J11n4m7m6j6j6Q5Q6l8l9m8m9pqLLM5
$$ 1607 1663 1720 1800 1715 1811 1908 1788 1668 1653 1638 1623 1608 1594 1580 1607 1634 1611 1589 1700 1646 1599 1553 1537 1521 1606 1692 1654 1615 1567 1518 1511 1503 1506 1509 1554
1659A554M4n2n2j1j1Q6Q5J7J6m4m4O2O3p5R1R6p0p4QM5j21o9p0j1j1M3M2M2M3J0J0m1J24j09
$$ 1554 1598 1546 1494 1483 1472 1558 1643 1660 1676 1632 1588 1650 1713 1638 1729 1825 1755 1681 1689 1734 1613 1544 1474 1463 1452 1495 1537 1579 1622 1632 1642 1601 1725 1616
1654A616j09N2N2K3K2O4O4L7L7P3rrj73j27L8j34L1L6m6L1L0K6K5N0N0RRj04j04L7L7J9j45
$$ 1616 1507 1559 1611 1634 1656 1720 1784 1821 1858 1931 1922 1913 1740 1613 1651 1517 1548 1584 1538 1569 1599 1625 1650 1700 1750 1759 1768 1664 1560 1597 1634 1653 1508
1649A508M3M4LLl8l9rrK2K2L1j33r3P3N1N1l5l5P0O9O0N9J24m0m4m3nmOOj30L4P6P6j56RR6
$$ 1508 1551 1595 1598 1601 1563 1524 1515 1506 1528 1550 1581 1448 1355 1428 1479 1530 1495 1460 1530 1599 1659 1718 1842 1802 1758 1715 1710 1706 1712 1718 1588 1622 1698 1774 1618 1627 1723
1644A723R5m4m4j13j12QRJ32J32o2o2k1k0l3l4J56rMLopN5N4o9o9n1n2j0j0k5k5k2J43jjN1
$$ 1723 1818 1774 1730 1617 1505 1513 1522 1654 1786 1724 1662 1641 1621 1588 1554 1710 1701 1705 1708 1702 1695 1750 1804 1735 1666 1615 1563 1553 1543 1518 1493 1471 1614 1613 1612 1663
1638A663N0m7m7nok0k0k1k0M5M5k4k4ooooK5K5K5K5rrrrJ3J3J3J3o4o4R7R7m7J18p8k43o4
$$ 1663 1713 1666 1619 1614 1608 1588 1568 1547 1527 1572 1617 1593 1569 1563 1557 1551 1545 1570 1595 1620 1645 1636 1627 1618 1609 1622 1635 1648 1661 1597 1533 1630 1727 1680 1798 1720 1477 1413
1632A413J01R4R3k7k7j23j24R7R6N6N5L9M0q5q4j7j7j8j7j8j7j8j8POJ02J03j3j4J8J7M2j22
$$ 1413 1514 1608 1701 1674 1647 1524 1400 1497 1593 1649 1704 1743 1783 1698 1614 1597 1580 1562 1545 1527 1510 1492 1474 1481 1487 1589 1692 1679 1665 1683 1700 1742 1620
1627A620l0k9J36J36o9j51j53J2Q7Q7M8l3j21M3L1L1M1M1k5k5J6J7j%J2R5Jj63j6O7M5M4p4
$$ 1620 1590 1561 1697 1833 1764 1613 1460 1472 1559 1646 1694 1661 1540 1583 1614 1645 1686 1727 1702 1677 1693 1710 1709 1709 1721 1816 1817 1654 1638 1705 1750 1794 1720
1622A720p4J0J0q7q6M5M5MLnnmnR4R5jko2o3o3o2N6N7j37K7J60P7r9j00j3j4j4j3j0j0j0j1
$$ 1720 1646 1656 1666 1579 1493 1538 1583 1587 1590 1585 1580 1576 1571 1665 1760 1759 1757 1695 1632 1569 1507 1563 1620 1483 1510 1670 1747 1648 1548 1535 1521 1507 1494 1484 1474 1464 1453
1617A453P9P8K2J04%j65%Q2Q5q0n1n1ONl6l6J7J7J7J8N4N5N4N5r4r4j04j05J65%k3O0j3j2
$$ 1453 1532 1610 1632 1736 1736 1571 1571 1653 1738 1658 1607 1556 1562 1567 1531 1495 1512 1529 1546 1564 1618 1673 1727 1782 1688 1594 1490 1385 1550 1550 1527 1587 1574 1562
1611A562pqM3M4n3n3l3l4k3k3n5J09J2J1K5n7m5J19J52j3l6M7N8j07n5K7Q6Q6q8q7o2o1L4
$$ 1562 1555 1547 1590 1634 1581 1528 1495 1461 1438 1415 1360 1469 1481 1492 1517 1460 1415 1534 1686 1673 1637 1684 1742 1635 1580 1607 1693 1779 1691 1604 1542 1481 1515
1606A515L4JJJJK9K8l3J31M2j24j08N7n6K7N9N9M3M2n6K7K6j39j34L1O8O7p3p3O9O8%%RRl2
$$ 1515 1549 1550 1551 1552 1553 1582 1610 1577 1708 1750 1626 1518 1575 1519 1546 1605 1664 1707 1749 1693 1720 1746 1607 1473 1504 1572 1639 1566 1493 1562 1630 1630 1630 1639 1648 1616
1601A616l2j9j9P7P8k7k7k7k7KKL2L2J12n3j00O6L5m7m2M0j3r6N1N2M2M1J29l6j10j92j37
$$ 1616 1584 1565 1546 1623 1701 1674 1647 1620 1593 1595 1597 1629 1661 1773 1720 1620 1686 1721 1674 1632 1672 1659 1563 1614 1666 1708 1749 1878 1842 1732 1540 1403
1596A403J37J10K7l2l3K4K5l3N0L2j33m0M2K4K4m0m0N2N2N2N2k8k9J3J4l3l2RQR7R6n5n5j6
$$ 1403 1540 1650 1677 1645 1612 1636 1661 1628 1678 1710 1577 1537 1579 1603 1627 1587 1547 1599 1651 1703 1755 1727 1698 1711 1725 1692 1660 1669 1677 1774 1870 1815 1760 1744
1591A744j5q4q4J0J0N1N1n1n1M6M5k3k2k3k3K5K5O6O5r0r1m9m9P3P2L2L1l7l8MMJ1J2l0l0
$$ 1744 1729 1645 1561 1571 1581 1632 1683 1632 1581 1627 1672 1649 1627 1604 1581 1606 1631 1697 1762 1672 1581 1532 1483 1556 1628 1660 1691 1654 1616 1620 1624 1635 1647 1617 1587
1585A587k4k5k4k5J26J26k6k5m3m2N4N4l5l4p6p6K3K3K3K3j3j4j4j4j7j7j7j8k4k4J00R9j60
$$ 1587 1563 1538 1514 1489 1615 1741 1715 1690 1647 1605 1659 1713 1678 1644 1568 1492 1515 1538 1561 1584 1571 1557 1543 1529 1512 1495 1478 1460 1436 1412 1512 1611 1451
1580A451j61P3P3J07J08j7j6j00j01J06J05n3n3P0P1j1j1j1j1M7M7NOq6q5J0J1J1J2J1J2N3
$$ 1451 1290 1363 1436 1543 1651 1634 1618 1518 1417 1523 1628 1575 1522 1592 1663 1652 1641 1630 1619 1666 1713 1718 1724 1638 1553 1563 1574 1585 1597 1608 1620 1673
1576A673N3j6j5r1r0OOJ1J1N2N2PPOPrqP7P7L3j31j08j07M7M8j1j0p8Q7L6L6j0j0N9N9J5J5
$$ 1673 1726 1710 1695 1604 1514 1520 1526 1537 1548 1600 1652 1659 1666 1672 1679 1670 1662 1739 1816 1849 1718 1610 1503 1550 1598 1587 1577 1499 1586 1622 1658 1648 1638 1697 1756 1771 1786
1570A786q1q1l3l2k2k2k6J38n0n1M2M3q2q1j8j8j8j8K6K5K6K5K1K0m8m9L1L0R9R9p2p1K5K5
$$ 1786 1705 1624 1591 1559 1537 1515 1489 1627 1577 1526 1568 1611 1529 1448 1430 1412 1394 1376 1402 1427 1453 1478 1499 1519 1471 1422 1453 1483 1582 1681 1609 1538 1563 1588
1565A588Q5Q4r4r4L0L0L0L0j1j1n2n2Q1Q1j6j5M0L9n7n6m3m3m3m3%JJ03o1l3J32m0l9K1K2
$$ 1588 1673 1757 1663 1569 1599 1629 1659 1689 1678 1667 1615 1563 1644 1725 1709 1694 1734 1773 1716 1660 1617 1574 1531 1488 1488 1489 1592 1531 1498 1630 1590 1551 1572 1594
1560A594K1K1K3K4K3K3o6o7L0L0j3j3j3j3p0p0J08J09m0m0N6N6RRn9o0k7k7L1L2O5j00j4J51
$$ 1594 1615 1636 1659 1683 1706 1729 1663 1596 1626 1656 1643 1630 1617 1604 1534 1464 1572 1681 1641 1601 1657 1713 1722 1731 1672 1612 1585 1558 1589 1621 1686 1586 1572 1723
1554A723J42k2m4m3l3l3QQK6K6r8r7RJ0J0J0nnm6m6kkN9N8n1j89j2P0R4J1q8M9N1l0m5m5N7
$$ 1723 1865 1843 1799 1756 1723 1690 1698 1706 1732 1758 1660 1563 1572 1582 1592 1602 1597 1592 1546 1500 1498 1496 1555 1613 1562 1373 1361 1431 1525 1536 1448 1497 1548 1518 1473 1428 1485
1549A485N6R5J2K4j14m6L6OPJ2J2L3L2L3L2k4k4o5o5J0J1N1N2RQQRn8n7p2J1Q2n5o0K2M5M5
$$ 1485 1541 1636 1648 1672 1558 1512 1548 1554 1561 1573 1585 1618 1650 1683 1715 1691 1667 1602 1537 1547 1558 1609 1661 1670 1678 1686 1695 1637 1580 1508 1519 1601 1546 1486 1508 1553 1598
1543A598j32OJ06l0N5N5j8j9j9j8j3j2K8K9m6m6N0N0o7o8N2q6L1L2K3K3P1P1LKo7o7j44pM8
$$ 1598 1466 1472 1578 1548 1603 1658 1640 1621 1602 1584 1571 1559 1587 1616 1570 1524 1574 1624 1557 1489 1541 1455 1486 1518 1541 1564 1635 1706 1709 1711 1644 1577 1433 1426 1474
1538A474M8N7N6M6M5NMm6m5m6m6N5N5lq6J51J3q4kMNj10K9kjPPq4q5J11J11J09n6q7q8m9n0
$$ 1474 1522 1579 1635 1681 1726 1731 1735 1689 1644 1598 1552 1607 1662 1659 1573 1724 1737 1653 1651 1655 1660 1550 1579 1577 1576 1583 1590 1506 1421 1532 1643 1752 1696 1609 1521 1472 1422
1532A422J02J02J1J2N2N3l4l4l4l4JJM2M3J8J8p4R0r1r1P1P0r8r9Q0Q0j1j1p9q0M1M1Q2Q1
$$ 1422 1524 1626 1637 1649 1701 1754 1720 1686 1652 1618 1619 1620 1662 1705 1723 1741 1667 1757 1666 1575 1646 1716 1618 1519 1599 1679 1668 1657 1578 1498 1539 1580 1662 1743
1527A743N2N1q9r0r7O8O7r7M5M4pqm9m9J9J9J1J1r6r6J40k6jjK4K4P5q9j4j4M5M4m4m4lkO6
$$ 1743 1795 1846 1757 1667 1570 1638 1705 1608 1653 1697 1690 1682 1633 1584 1603 1622 1633 1644 1548 1452 1592 1566 1565 1564 1588 1612 1687 1598 1584 1570 1615 1659 1615 1571 1568 1566 1632
1521A632O7l0k9j%jjJ4J4m4m5j45K0l2l2J06J06jjQ3q1j33L2P0r4KJ66N5j09j7j7J06n9M4
$$ 1632 1699 1669 1640 1639 1639 1638 1637 1651 1665 1621 1576 1431 1451 1419 1387 1493 1599 1598 1597 1680 1599 1466 1498 1568 1474 1476 1642 1697 1588 1571 1554 1660 1601 1645
1516A645M4j19M5m7m7k5k5M4M4k1k1K0K0r0q9O6O7k6N6j4J51%%J0J0m5m5J2p1k6J39%%k8k7
$$ 1645 1689 1570 1615 1568 1521 1496 1471 1515 1559 1538 1517 1537 1557 1467 1378 1444 1511 1485 1541 1527 1678 1678 1678 1688 1698 1653 1608 1620 1549 1523 1662 1662 1662 1634 1607
1511A607O8O8lmm5m5K3K2m7m6J0J0J1J0M6M7M7M6j13j13O6O6m9m8qpj0j0j0j0J2J3J63J63
$$ 1607 1675 1743 1740 1736 1691 1646 1669 1691 1644 1598 1608 1618 1629 1639 1685 1732 1779 1825 1712 1599 1665 1731 1682 1634 1626 1619 1609 1599 1589 1579 1591 1604 1767 1930
1506A930j62j61o5o6J3J2J2J2k9k9q5P9P2j0R3J1K5K5k1k2O4O3nnl1l1l1l1J7J7J8J7l6l6
$$ 1930 1768 1607 1542 1476 1489 1501 1513 1525 1496 1467 1382 1461 1533 1523 1616 1627 1652 1677 1656 1634 1698 1761 1756 1751 1720 1689 1658 1627 1644 1661 1679 1696 1660 1624
1500A624L3L2K0K0m8m9p6p7K0K0l8l9L5L5m1M2J89K5j20l7N3k9q5kLq0n1J14O7O8r4P2Lj62
$$ 1624 1657 1689 1709 1729 1681 1632 1556 1479 1499 1519 1481 1442 1477 1512 1471 1513 1702 1727 1607 1570 1623 1594 1509 1507 1510 1430 1379 1493 1560 1628 1534 1606 1609 1447
1495A447l6l6N0M9K6K6K5K6N6N7N7N6o7o7k6k6m2m2%jm0l9K9L0L4L5L9M0m8L4P1o7QR0nok3
$$ 1447 1411 1375 1425 1474 1500 1526 1551 1577 1633 1690 1747 1803 1736 1669 1643 1617 1575 1533 1533 1532 1492 1453 1482 1512 1546 1581 1620 1660 1612 1646 1717 1650 1658 1748 1743 1737 1714
1490A714k3p8NO4p4K0o4J2R4JJj3j3K7K8O3O2j16j17N2N2m4m4m3m2kjL1L1O7O7k2j05p2O6
$$ 1714 1691 1613 1618 1682 1608 1628 1564 1576 1670 1671 1672 1659 1646 1673 1701 1764 1826 1710 1593 1645 1697 1653 1609 1566 1524 1522 1521 1552 1583 1650 1717 1695 1590 1518 1584
1484A584j2r4K9K9J1J0J0J1K1K1K1K1m7m7m7m7M7M6m5m4%Q4N0q7j16l5Q1kN4N4M9M9m7m8o
$$ 1584 1572 1478 1507 1536 1547 1557 1567 1578 1599 1620 1641 1662 1615 1568 1521 1474 1521 1567 1522 1478 1478 1562 1612 1525 1409 1374 1455 1453 1507 1561 1610 1659 1612 1564 1558
1479A558pJ3J2J2J3q0q0M4M3M6M5MMK8K8K9K8n2n2j0j0O4O4l2l2LKl9l9l3l3QQm3m2J36J35
$$ 1558 1551 1564 1576 1588 1601 1521 1441 1485 1528 1574 1619 1623 1627 1655 1683 1712 1740 1688 1636 1626 1616 1680 1744 1712 1680 1683 1685 1646 1607 1574 1541 1549 1557 1514 1472 1608 1743
1473A743l2l3L1n1j73J03Q1q3r4j2Q3Q3j0ro7J6J29l6J5R8q3q3p8p8k1k0P5P6k1k0k1k0m3
$$ 1743 1711 1678 1709 1658 1485 1588 1669 1586 1492 1480 1563 1646 1636 1627 1560 1576 1705 1669 1684 1782 1699 1616 1538 1460 1439 1419 1494 1570 1549 1529 1508 1488 1445
1468A445m2N4N4K0K1Q4Q4N7k5j18M7j3r5N7N8KKm0l9kjo3J01J21m3j47j46J24J25K9K8q9q9
$$ 1445 1403 1457 1511 1531 1552 1636 1720 1777 1752 1634 1681 1668 1573 1630 1688 1690 1692 1652 1613 1611 1610 1547 1648 1769 1726 1579 1433 1557 1682 1711 1739 1650 1561
1463A561OPrj0o6J7J67Kn1n1r6r6N6N5K3K2K3K3K9L0K9L0K4K4j7j8j4j5j4j5m5m6m5m5M9M9
$$ 1561 1567 1574 1565 1555 1489 1506 1673 1675 1624 1573 1477 1381 1437 1492 1515 1537 1560 1583 1612 1642 1671 1701 1725 1749 1732 1714 1700 1685 1671 1656 1611 1565 1520 1475 1524 1573
1458A573R0R0L1L0j76j76O3O3ool3l3O3O3l0l0k9l0RRRQK7K6K2j42R5R5j2j2J3J2q1Q5klQ
$$ 1573 1663 1753 1784 1814 1638 1462 1525 1588 1582 1576 1543 1510 1573 1636 1606 1576 1547 1517 1526 1535 1544 1552 1579 1605 1627 1485 1580 1675 1663 1651 1664 1676 1595 1680 1678 1675 1683
1452A683Rlkj26j26R4R3K4K5MMl0J34J05o1KJj24j25k9k8O1O0O1O1m5m6m5m6O5O5q7q6KKO6
$$ 1683 1692 1689 1687 1561 1435 1529 1622 1646 1671 1675 1679 1649 1783 1888 1827 1829 1830 1706 1581 1552 1524 1585 1645 1706 1767 1722 1676 1631 1585 1650 1715 1628 1542 1544 1546 1612
1446A612O5m3j27n9J06N9j06r0qN9O0OOl2J32M0L9j15j15QQM4M3LKl6l6O0O0n2n3n2n3J3J2
$$ 1612 1677 1634 1507 1448 1554 1613 1507 1417 1409 1468 1528 1534 1540 1508 1640 1680 1719 1604 1489 1497 1505 1549 1592 1595 1597 1561 1525 1585 1645 1593 1540 1488 1435 1448 1460
1441A460M5J27J35j41q4Q1J32l4q2q1j8j7j7j8mmnmL5L5ooPPJJ65J5j50r4j0Q2Q2o3o4k9k8
$$ 1460 1505 1632 1767 1626 1542 1623 1755 1721 1639 1558 1540 1523 1506 1488 1484 1480 1475 1471 1506 1541 1535 1529 1536 1543 1544 1709 1724 1574 1480 1470 1552 1634 1571 1507 1478 1450
1436A450J3J3N3N3l3l3m5J19K7K6p1p0l0k9P5P6OPoopoo7o7N6N7N0N0p3p3P1P1p0p0p8Q7L5
$$ 1450 1463 1476 1529 1582 1549 1516 1471 1590 1617 1643 1572 1502 1472 1443 1518 1594 1600 1607 1601 1595 1588 1582 1515 1448 1504 1561 1611 1661 1588 1515 1586 1657 1587 1517 1439 1526 1561
1430A561L5J7J8J7J7k0k0M8M9j7j6j7j7J4J4q3q2N9N9l7l7R5R4j40j39KJJ25J25POo3o2po
$$ 1561 1596 1613 1631 1648 1665 1645 1625 1673 1722 1705 1689 1672 1655 1669 1683 1600 1518 1577 1636 1599 1562 1657 1751 1611 1472 1474 1475 1600 1725 1732 1738 1675 1613 1606 1600
1425A600ppq6q6O5O5jjL0L0J07n7n1n1n8J06J4J4m0l9p4R1J27l8q6q6poppJ2J1N3N2PPM8M9
$$ 1600 1593 1586 1500 1414 1479 1544 1543 1542 1572 1602 1709 1652 1601 1550 1492 1598 1612 1626 1586 1547 1473 1564 1691 1653 1567 1481 1474 1468 1461 1454 1466 1477 1530 1582 1589 1596 1644 1693
1419A693j2j2j08j08M6M7k2k2k1k0O5O5J83J8j66jL9m4n5n5K8K8K8K8m5m5L4L4M7K13J4o7
$$ 1693 1681 1669 1561 1453 1499 1546 1524 1502 1481 1461 1526 1591 1774 1792 1626 1625 1664 1620 1565 1510 1538 1566 1594 1622 1577 1532 1566 1600 1647 1860 1874 1807
1414A807MMm2m2q5q6J0J1KJM3M3M8M7l2l2O4j00p0R5P1r4n9o0j6j5j6j6K7K6O8O7lmlmK8K7
$$ 1807 1811 1815 1773 1731 1646 1560 1570 1581 1583 1584 1627 1670 1718 1765 1733 1701 1765 1665 1595 1690 1761 1667 1608 1548 1532 1517 1501 1485 1512 1538 1606 1673 1670 1666 1663 1659 1687 1714
1408A714K8K8j33j33J8J8O8O8O8O8n3n3n3n3J1J1J2J1m2m2NMn1L1m9J15J12n3Q1Q1J3j52j11
$$ 1714 1742 1770 1637 1504 1522 1540 1608 1676 1744 1812 1759 1706 1653 1600 1611 1622 1634 1645 1603 1561 1566 1570 1519 1550 1501 1616 1728 1675 1756 1837 1850 1698 1587
1403A587N4L9L9N0M9q1q0J5J5k5k6k6k6k8k9J3J2k8k9M0M0j5j5p2J0R6o8k7N5R9o6q9nJ30
$$ 1587 1641 1680 1719 1769 1818 1737 1657 1672 1687 1662 1636 1610 1584 1556 1527 1540 1552 1524 1495 1535 1575 1560 1545 1473 1483 1579 1511 1484 1539 1638 1572 1483 1478 1608
1398A608M8m1m1j11N4qqM2j22j22M2k8k7n2J13J63jL3L3k3k3J8J8j12j13J21J21P6P6k1k0
$$ 1608 1656 1615 1574 1463 1517 1509 1501 1543 1421 1299 1341 1313 1286 1234 1347 1510 1509 1542 1575 1552 1529 1547 1565 1453 1340 1461 1582 1658 1734 1713 1693
1393A693j24j24J10J10O1O0l5l6o1o2QPn1n1M5M5k7k7M1M2Q5Q4J6J6r1r0k2k2m0m0N6N7n1
$$ 1693 1569 1445 1555 1665 1726 1786 1751 1715 1654 1592 1600 1607 1556 1505 1550 1595 1568 1541 1582 1624 1709 1793 1809 1825 1734 1644 1622 1600 1560 1520 1576 1633 1582
1388A582n1j0j0L4L3L4L4j2j2L0K9j3j3q2q2R4R4R4R4p5p5LMr4P0o3o3NMNNkkj3j2R9o6m1
$$ 1582 1531 1521 1511 1545 1578 1612 1646 1634 1622 1652 1681 1668 1655 1573 1491 1585 1679 1773 1867 1792 1717 1720 1724 1630 1700 1637 1574 1579 1583 1588 1593 1591 1589 1576 1564 1663 1597 1556
1382A556m2kkL9L9KKJ2J3j01O4J2J2K0K0J23m2j22M2M2j22j15M9j2j2l0k9L9L9L4L3L3L4p3
$$ 1556 1514 1512 1510 1549 1588 1590 1592 1604 1617 1516 1580 1592 1604 1624 1644 1767 1725 1603 1645 1687 1565 1450 1499 1487 1475 1445 1416 1455 1494 1528 1561 1594 1628 1555
1377A555p2mll8l7L2L1O5O6O5O5M5M6p2p3j18l6p8Q6Q5Q6K7K7l2l1l1l2k8k8k8k8K0K1K0K0
$$ 1555 1483 1479 1476 1438 1401 1433 1464 1529 1595 1660 1725 1770 1816 1744 1671 1553 1517 1439 1525 1610 1696 1723 1750 1718 1687 1656 1624 1596 1568 1540 1512 1532 1553 1573 1593
1372A593K0K0K5K6k9N3O4j01qP5k9N4n2n2J2J2P3r2q1Jp2J0q7nJ60o%Q2O0k2o7o7k0j9k0j9
$$ 1593 1613 1633 1658 1684 1655 1708 1772 1671 1663 1738 1709 1763 1711 1659 1671 1683 1756 1664 1583 1584 1512 1522 1435 1430 1590 1584 1584 1666 1726 1704 1637 1570 1550 1531 1511 1492
1366A492K4K4j7j6O4O5n9n8J48J48M0j25q3%oq7m1M1P3j0l1j14MQ7J9J9K4K4opL5L4o7o7o6
$$ 1492 1516 1540 1523 1507 1571 1636 1577 1519 1667 1815 1855 1730 1647 1647 1641 1554 1513 1554 1627 1617 1586 1472 1476 1563 1582 1601 1625 1649 1643 1636 1671 1705 1638 1571 1505
1361A505o7O8O7K7K6P2P1n3n2J1J1J1J1J1J0l0l0K0K0o2o3j3j4j3j3l2l2N0N1M0M0m2m2O6
$$ 1505 1438 1506 1573 1600 1626 1698 1769 1716 1664 1675 1686 1697 1708 1719 1729 1699 1669 1689 1709 1647 1584 1571 1557 1544 1531 1499 1467 1517 1568 1608 1648 1606 1564 1630
1356A630O6O6O6j25j24J3J2KJp1p0k2J43O6r9p5QqpR0R0J06K3j48J7J2j53K4K5j23j23Q6Q6
$$ 1630 1696 1762 1828 1703 1579 1592 1604 1606 1607 1536 1466 1444 1587 1653 1554 1479 1487 1479 1472 1562 1652 1758 1781 1633 1650 1662 1509 1533 1558 1435 1312 1398 1484
1351A484L0J12R4p2n6n6k9k9k8k9J19J19L8m4j17M7L2L1n9n9K3K3m7m6J0p2k9J35L8L8L5L5
$$ 1484 1514 1626 1720 1648 1592 1536 1507 1478 1450 1421 1540 1659 1697 1653 1536 1583 1615 1646 1587 1528 1551 1574 1527 1481 1491 1419 1390 1525 1563 1601 1636 1671
1346A671m8m8K2K2j9j9NOJ%M9l3q9P5R4p1n0n1KJJJO3O3k0k0m9m9K8K9j8j01o4J00M3M2l0
$$ 1671 1623 1575 1597 1619 1600 1581 1586 1592 1593 1593 1642 1609 1520 1595 1689 1618 1568 1517 1519 1520 1521 1522 1585 1648 1628 1608 1559 1510 1538 1567 1549 1448 1384 1484 1527 1569 1539
1340A539l0j7j6j6j6N5N5J3J4M3M2m3j26q7nJ58K1j02j02M8J85Q6j06l6l5m6j28lJ90J29M6
$$ 1539 1509 1492 1476 1460 1444 1499 1554 1567 1581 1624 1666 1623 1497 1410 1405 1563 1584 1482 1380 1428 1613 1699 1593 1557 1522 1476 1348 1345 1535 1664 1710
1336A710J4J3P1o6j17l6Q2Q1n1n0j01j00k3k3Q0jm3L9O1O1j6j6K7K8O4O3o8j51n8n8K1J03
$$ 1710 1724 1737 1808 1742 1625 1589 1671 1752 1701 1651 1550 1450 1427 1404 1484 1483 1440 1479 1540 1601 1585 1569 1596 1624 1688 1751 1683 1532 1474 1416 1437 1540
1331A540K1K1oP7j1j0J3J3J9J8j48o7P1j1J4J3RQj7j6J9J9Q9Pl5l5K0o3j6j6J4J5o8o8P2P3
$$ 1540 1561 1582 1576 1653 1642 1632 1645 1658 1677 1695 1547 1480 1551 1540 1554 1567 1576 1584 1567 1551 1570 1589 1678 1685 1650 1615 1635 1572 1556 1540 1554 1569 1501 1433 1505 1578
1325A578r7M2J04l2p6PL5L5m2j25j07L0L8J21J6J7P3ro8J5Q7MJq3mP7L4L3m3m4m5m5n1L2J0
$$ 1578 1481 1523 1627 1595 1519 1526 1561 1596 1554 1429 1322 1352 1390 1511 1527 1544 1617 1608 1540 1555 1642 1646 1647 1564 1560 1637 1671 1704 1661 1617 1572 1527 1476 1508 1518
1320A518J0J9o2K3K3J7J8k8k7M0M1P5P5OOj27j27N2N2J9J9RRJ49j5p3p4J7J7OOM6j19k6k7
$$ 1518 1528 1547 1485 1508 1531 1548 1566 1538 1511 1551 1592 1667 1742 1748 1754 1627 1500 1552 1604 1623 1642 1651 1660 1809 1794 1721 1647 1664 1681 1687 1693 1739 1620 1594 1567
1314A567K8K7J88K4p2p2N9N9n9k24m5J20J3J2K3K2k0k0o2o1K7K8J7J8K3j41K0K0jj%jN0N0
$$ 1567 1595 1622 1810 1834 1762 1690 1749 1808 1749 1525 1480 1600 1613 1625 1648 1670 1650 1630 1568 1507 1534 1562 1579 1597 1620 1479 1499 1519 1518 1517 1517 1516 1566 1616
1309A616m6m6Q0Q0r8r9j6j7j3J52ooM5M5n3n3Q1q4o2o1K4K4k4k4M4M4O5O5p6p5l6J30O8O8
$$ 1616 1570 1524 1604 1684 1586 1487 1471 1454 1441 1593 1587 1581 1626 1671 1618 1565 1646 1562 1500 1439 1463 1487 1463 1439 1483 1527 1592 1657 1581 1506 1470 1600 1668 1736
1304A736J0j54PPONq7P8L9L8k0j9K6K7K7K7K2K3m7m6j17j16n9J07O9P0m4m4j3j2j3j3J9J8
$$ 1736 1746 1592 1599 1606 1612 1617 1530 1608 1647 1685 1665 1646 1672 1699 1726 1753 1775 1798 1751 1705 1588 1472 1413 1520 1589 1659 1615 1571 1558 1546 1533 1520 1539 1557
1299A557n0n1MLJ3J4p3R2J14L1l4l5N7N6r8r8kkL6L7onj3j4L8L8n3J13m9m8j8j8j8j8K2K3
$$ 1557 1507 1456 1460 1463 1476 1490 1417 1509 1623 1654 1620 1585 1642 1698 1600 1502 1500 1498 1534 1571 1565 1560 1547 1533 1571 1609 1556 1669 1620 1572 1554 1536 1518 1500 1522 1545
1293A545l5M8J05o0mll8l7Q7Q6p5p5poL3L3KKj15N0jkl0l0O6O6M2M3k6k5l3l3k2k2l1J34R3
$$ 1545 1510 1558 1663 1603 1599 1596 1558 1521 1608 1694 1619 1544 1537 1531 1564 1597 1599 1601 1486 1536 1535 1533 1503 1473 1539 1605 1647 1690 1664 1639 1606 1573 1551 1529 1498 1632 1725
1288A725p2m8m8m8m8o1J03J0J1R7R7k6k7n6n7J3J2J07J08r8r9K4K5j7j7k2k2k2k2K9L0K9L0
$$ 1725 1653 1605 1557 1509 1461 1400 1503 1513 1524 1621 1718 1692 1665 1609 1552 1565 1577 1684 1792 1694 1595 1619 1644 1627 1610 1588 1566 1544 1522 1551 1581 1610 1640
1283A640nmj39j38J65jlmJ6J6k5k5PPQPN1N0l2l2p3p3O4O5J2J2J2J2l0l0l0l0K3K2j9j9Q3
$$ 1640 1635 1631 1492 1354 1519 1518 1515 1511 1527 1543 1518 1493 1500 1507 1515 1522 1573 1623 1591 1559 1486 1413 1477 1542 1554 1566 1578 1590 1560 1530 1500 1470 1493 1515 1496 1477 1560
1277A560Q3JJn7n7J36J35l9m0M3r5j20l8M5M5l0l0o3o3qJ30K4n7j6J22kkJ5J5k7k6l3l3M9
$$ 1560 1643 1644 1645 1588 1531 1667 1802 1763 1723 1766 1671 1551 1513 1558 1603 1573 1543 1480 1417 1409 1539 1563 1506 1490 1612 1610 1608 1623 1638 1611 1585 1552 1519 1568
1272A568M9o5o6P2P2k6k6j09K9M9l3k9N3j4r5q1N7P2P1n8j39n3Q5J23M0J06l3p8N8m7m8M3
$$ 1568 1617 1552 1486 1558 1630 1604 1578 1469 1498 1547 1514 1485 1538 1524 1429 1348 1405 1477 1548 1490 1351 1298 1383 1506 1546 1652 1619 1541 1599 1552 1504 1547
1267A547M3l6l7p7p8M1M2Q3Q2J3J3k9k8L5L5L0j07NMn8K3R9l9q5lK6K6j0rL9L9m3m3NOp7p7
$$ 1547 1590 1554 1517 1440 1362 1403 1445 1528 1610 1623 1636 1607 1579 1614 1649 1679 1572 1577 1581 1523 1546 1645 1606 1521 1518 1544 1570 1560 1551 1590 1629 1586 1543 1548 1554 1477 1400
1261A400l4l4M8M8N6N5N6N6M0M0r8r7l3l3N0M9N2N3J0J1k2k3j15M9M7M6k6k6mmm5m5n1n1K2
$$ 1400 1366 1332 1380 1428 1484 1539 1595 1651 1691 1731 1633 1536 1503 1470 1520 1569 1621 1674 1684 1695 1673 1650 1535 1584 1631 1677 1651 1625 1621 1617 1572 1527 1476 1425 1447
1256A447K1J94L0p0p0LLO5j00q7P7N7N6l3l3N9N9p5Q9q6q6l5l5OOJ30J29qqq9q9j7j6O9r5
$$ 1447 1468 1662 1692 1622 1552 1555 1558 1623 1523 1436 1513 1570 1626 1593 1560 1619 1678 1603 1692 1606 1520 1485 1450 1456 1462 1592 1721 1713 1705 1616 1527 1510 1494 1563 1468
1251A468L9L9p4p5l3l3R0R1R0R1m3m3M0M0j2j1j2j1m1m1m1m0M3M4M3M3RJ0RRj7j6j7j6m2m3
$$ 1468 1507 1546 1472 1397 1364 1331 1421 1512 1602 1693 1650 1607 1647 1687 1675 1664 1652 1641 1600 1559 1518 1478 1521 1565 1608 1651 1660 1670 1679 1688 1671 1655 1638 1622 1580 1537
1245A537M0M1onj08N6J34l1j1j0j7j6N5N5P9q6OPn4n3j3j2n3n3L0L0M9N0l3l2MMQ7Q6MLl8
$$ 1537 1577 1618 1612 1607 1499 1555 1689 1658 1647 1637 1620 1604 1659 1714 1793 1707 1713 1720 1666 1613 1600 1588 1535 1482 1512 1542 1591 1641 1608 1576 1580 1584 1671 1757 1761 1764 1726
1240A726l8rqq1q1o2J03J44k1l5l5L7L6p4p5QQJ8J8o4o4kkQ0Q0L7L7R3p2j41n9K3n8l3J33
$$ 1726 1688 1679 1671 1590 1509 1447 1550 1694 1673 1638 1603 1640 1676 1602 1527 1535 1543 1561 1579 1515 1451 1449 1447 1527 1607 1644 1681 1774 1702 1561 1502 1525 1467 1434 1567
1234A567Q1kj06j06k9k9Q6Q5j06j06K7K8J00R9M6j19o8o8RQR1R0j9j9o1o0j3j4j8J46J1R4
$$ 1567 1648 1646 1540 1434 1405 1376 1462 1547 1441 1335 1362 1390 1490 1589 1635 1516 1448 1380 1389 1397 1488 1578 1559 1540 1479 1419 1406 1392 1374 1520 1531 1625
1229A625J2R4m2m1l6l6l7l8l8l7m7m7R0R1J1J2p1p1K4K4K4K4ppP0P0Np8j24M1l2l1k1k1K8
$$ 1625 1637 1731 1689 1648 1612 1576 1539 1501 1463 1426 1379 1332 1422 1513 1524 1536 1465 1394 1418 1442 1466 1490 1483 1476 1546 1616 1621 1543 1419 1460 1428 1397 1376 1355 1383
1224A383K9K8K9L5L5R2J0j94l0O5O5O8O9K7K7j4j5K6K6p5p6l5l4N4N4k9k9J0Rl2l2k5k4l6
$$ 1383 1412 1440 1469 1504 1539 1631 1641 1447 1417 1482 1547 1615 1684 1711 1738 1724 1709 1735 1761 1686 1610 1575 1541 1595 1649 1620 1591 1601 1610 1578 1546 1521 1497 1461
1219A461l5J3j53P7P8M5M5M5M5J9J9K0J9j7j8j7j7ppppJ0J0J0J0J8J8k4k3n4n4o4J01J03J04
$$ 1461 1426 1439 1286 1363 1441 1486 1531 1576 1621 1640 1659 1679 1698 1681 1663 1646 1629 1622 1615 1608 1601 1611 1621 1631 1641 1659 1677 1653 1630 1576 1522 1458 1559 1662 1766
1213A766j34j34J0Rp3p3j6j6J11J11P8q7OOL7L6r1r1j19M5ooL4L4L4L5LLLLJ2J1q1Q4o8o9
$$ 1766 1632 1498 1508 1517 1444 1371 1355 1339 1450 1561 1639 1552 1558 1564 1601 1637 1546 1455 1336 1381 1375 1369 1403 1437 1471 1506 1509 1512 1515 1518 1530 1541 1460 1544 1476 1407
1208A407P9P9qrqrRRRRl0l0l1l0p6p5O2O2J20J21L8L8l4l3l4l4NMj33j34L2L2L1L2N9N9k3
$$ 1407 1486 1565 1557 1548 1540 1531 1540 1549 1558 1567 1537 1507 1476 1446 1370 1295 1357 1419 1539 1660 1698 1736 1702 1669 1635 1601 1606 1610 1477 1343 1375 1407 1438 1470 1529 1588 1565
1202A565k3j1j1j14N1J80J5p4p5L4L3m9m9onL5L6M2M3m1m0p1p2O7O6QQl3l4m7m7noJ00J00
$$ 1565 1542 1531 1520 1406 1457 1637 1652 1578 1503 1537 1570 1521 1472 1466 1461 1496 1532 1574 1617 1576 1536 1465 1393 1460 1526 1534 1542 1509 1475 1428 1381 1376 1370 1470 1570
1197A570J7J8pqppm7m8L6L5J9J9m2J22J03o2r6r6k6k7k6k7M3M2M3M2onq8q8R4R4m3m4k7k7
$$ 1570 1587 1605 1598 1590 1583 1576 1529 1481 1517 1552 1571 1590 1548 1670 1773 1711 1615 1519 1493 1466 1440 1413 1456 1498 1541 1583 1577 1572 1484 1396 1490 1584 1541 1497 1470 1443
1192A443J5J4J32J32nnk2k2QRk4j89j4j4L8L9llL7L7nmO2O3k0k0nnnnj0j0j0j0j6j5j5j6j7
$$ 1443 1458 1472 1604 1736 1731 1726 1704 1682 1690 1699 1675 1486 1472 1458 1496 1535 1532 1529 1566 1603 1598 1594 1656 1719 1699 1679 1674 1669 1664 1659 1649 1639 1629 1619 1603 1588 1573 1557 1540
1186A540j7j7j7J30J30L0j34l5l4llK7K8n4n5NMr8O7J07n7M6M6M4M5l9l8opjjn8K4P6q9n3
$$ 1540 1523 1506 1489 1619 1749 1779 1645 1610 1576 1573 1570 1597 1625 1571 1516 1521 1525 1427 1494 1601 1544 1590 1636 1680 1725 1686 1648 1642 1635 1634 1633 1575 1599 1675 1586 1533
1180A533K9N5N4P1P0j22j23ONONj5j6j5j5M3M4r4r5R8R7J5J5jjM0M0q6q6m5m5L4L4qpN6N6
$$ 1533 1562 1617 1671 1742 1812 1690 1567 1573 1578 1584 1589 1574 1558 1543 1528 1571 1615 1521 1426 1524 1621 1636 1651 1650 1649 1689 1729 1643 1557 1512 1467 1501 1535 1527 1520 1576 1632
1174A632k7k6o5o5P2P3M6M7r2j0J07n7m1m2k4k3J7J8M4M4n5J11q7j70l1l1L3L4J15J16m2m2
$$ 1632 1605 1579 1514 1449 1521 1594 1640 1687 1595 1585 1692 1635 1594 1552 1528 1505 1522 1540 1584 1628 1573 1684 1597 1427 1396 1365 1398 1432 1547 1663 1621 1579
1170A579M0M0J7J7o6o6m7m7N1j14K6J08p7NR9R9K3K2o9o9J4J3m0l9L2L3N0j15o9J4J4J5p8
$$ 1579 1619 1659 1676 1693 1627 1561 1514 1467 1518 1404 1430 1538 1461 1466 1565 1664 1687 1709 1640 1571 1585 1598 1558 1519 1551 1584 1634 1519 1450 1464 1478 1493 1415
1165A415Q7N1l1j5j5n1n1Q7Q7M7M7L9L9j02k40l3J03P0P0j9j8J8J9J8J8l5l5l5l5RJ0l2l1
$$ 1415 1502 1553 1522 1507 1492 1441 1390 1477 1564 1611 1658 1697 1736 1634 1394 1361 1464 1534 1604 1585 1567 1585 1604 1622 1640 1605 1570 1535 1500 1509 1519 1487 1456
1159A456LKl8l8k0j9r6R8J46Qp7NJ47O6n4n3p4O4K8K7n4n5L6L6M1m1j19J9J09K7m1R6M5l7
$$ 1456 1459 1461 1423 1385 1365 1346 1250 1348 1494 1502 1425 1430 1577 1643 1589 1536 1462 1526 1554 1581 1527 1472 1508 1544 1585 1544 1425 1444 1553 1580 1539 1635 1680 1643
1154A643j19l7j9O4Qp4JJ38J70k3j39n7RQQ4Q4j23j22O3O3o1o1MMM4M5J30J30p2p1p3RM0r7
$$ 1643 1524 1487 1468 1532 1540 1466 1467 1605 1775 1752 1613 1556 1565 1573 1657 1741 1618 1496 1559 1622 1561 1500 1504 1508 1552 1597 1727 1857 1785 1714 1641 1650 1690 1593
1149A593n7n7k5k4Q0P9j6j6J30J30m8m8L4L4L4L4k0j9o0o1j8j9j8j9MLo6j48j4J24rqJ04l4
$$ 1593 1536 1479 1454 1430 1510 1589 1573 1557 1687 1817 1769 1721 1755 1789 1823 1857 1837 1818 1758 1697 1679 1660 1642 1623 1627 1630 1564 1416 1402 1526 1517 1509 1613 1579
1144A579p9q0MNR7o7j5j5P0P1J3J3k1J44M2j22q8q8q8q9J08J08R4p1p5p4Q0P9J49J48k7k8
$$ 1579 1500 1420 1424 1429 1526 1459 1444 1429 1499 1570 1583 1596 1575 1719 1761 1639 1551 1463 1375 1286 1394 1502 1596 1525 1450 1376 1456 1535 1684 1832 1805 1777
1139A777k7k8O0O1j08j09q3Q2j1j1j9j9j9j9J7J8o2o2Q3q2l0l0J6J7J6J6kkkkj6j7N2N2j6
$$ 1777 1750 1722 1782 1843 1735 1626 1543 1625 1614 1603 1584 1565 1546 1527 1544 1562 1500 1438 1521 1439 1409 1379 1395 1412 1428 1444 1442 1440 1438 1436 1420 1403 1455 1507 1491
1134A491j7j7j7J4J3N5N4m2m2K7K7poppppL4L4KKk9k9j05N9J55j0l4l3q5q6L1L0J26J27n1
$$ 1491 1474 1457 1440 1454 1467 1522 1576 1534 1492 1519 1546 1539 1533 1526 1519 1512 1505 1539 1573 1575 1577 1548 1519 1414 1473 1628 1618 1584 1551 1466 1380 1411 1441 1567 1694 1643
1128A643n0J8J8K9K9j2j2J3J4M8j17j47J8L9L9pqqpL3L4L3L4j1j1j2j1qro7J5J33o1r2r3q6
$$ 1643 1593 1611 1629 1658 1687 1675 1663 1676 1690 1738 1621 1474 1492 1531 1570 1563 1555 1547 1540 1573 1607 1640 1674 1663 1652 1640 1629 1621 1612 1545 1560 1693 1632 1540 1447 1361
1123A361lJ01l6N6J37J1p2p1J3Q0jj27m5N9J41J24M1l1l0r7r7j%L9L9M0L9klo7j51r5R7OQ8
$$ 1361 1358 1459 1423 1479 1616 1627 1555 1484 1497 1577 1576 1449 1404 1463 1604 1728 1769 1738 1708 1611 1514 1513 1513 1552 1591 1631 1670 1668 1665 1598 1447 1352 1449 1455 1543
1117A543K8K7o3o4J6J6J7J6j5j5P1o6n1Q6P0O9k0k0k0k0n5n6m9L4j31O2R7J4P2j0j0j1j2j3
$$ 1543 1571 1598 1535 1471 1487 1503 1520 1536 1521 1506 1577 1511 1460 1546 1616 1685 1665 1645 1625 1605 1550 1494 1445 1479 1348 1410 1507 1521 1593 1583 1573 1562 1550 1537
1112A537j3j3M7M6m2m1r3M6J10K8r9r8P4P5N5N5m2m1oonoJ9J9k2k3M9M9QQj3j2j2j2m0m1Q3
$$ 1537 1524 1511 1558 1604 1562 1521 1428 1474 1584 1612 1513 1415 1489 1564 1619 1674 1632 1591 1585 1579 1574 1568 1587 1606 1584 1561 1610 1659 1667 1675 1662 1650 1638 1626 1586 1545 1628
1107A628Q3j04j04J9K0k0k0k0k0O3O3N3N3N7j07j5j4nmnmllklk7k7Q7Q6N7j08n7n7M3M3j5
$$ 1628 1711 1607 1503 1522 1542 1522 1502 1482 1462 1525 1588 1641 1694 1751 1644 1629 1615 1610 1606 1601 1597 1594 1591 1589 1586 1559 1532 1619 1705 1762 1654 1597 1540 1583 1626 1611
1101A611j6q0Q4Q7Q8j6j5K5K6q8q9m7m7k5k5J91K7p5p4J2J1J7J6p9p9K5K6j6j6K0K0J9K0P
$$ 1611 1595 1515 1599 1686 1774 1758 1743 1768 1794 1706 1617 1570 1523 1498 1473 1664 1691 1616 1542 1554 1565 1582 1598 1519 1440 1465 1491 1475 1459 1479 1499 1518 1538 1545
1096A545Pl4l4k6k7J5J5O1O1j35j35l3J31J90J89q2q3m1m1lkL8L9j1j1j1j0M9M9QQj3j3j4
$$ 1545 1552 1518 1484 1458 1431 1446 1461 1522 1583 1448 1313 1280 1411 1601 1790 1708 1625 1584 1543 1540 1538 1576 1615 1604 1593 1582 1572 1621 1670 1678 1686 1673 1660 1646
1091A646j3Q8Q8l6l6o0o0o1o0M2M2%JK7K7j4j4L8L7J06J07J75J75J71Pk21k22j36j35r9r9
$$ 1646 1633 1721 1809 1773 1737 1677 1617 1556 1496 1538 1580 1580 1581 1608 1635 1621 1607 1645 1682 1788 1895 2070 2245 2416 2423 2202 1980 1844 1709 1610 1511
1086A511P9Q0nmnmj9j9j8j9j9j8O7O7R6o8j47o3J2J3k3k4K0K0K0J9K8K7K7K8%%%Jl5l4L5L4
$$ 1511 1590 1670 1665 1661 1656 1652 1633 1614 1596 1577 1558 1540 1607 1674 1770 1702 1555 1492 1504 1517 1494 1470 1490 1510 1530 1549 1577 1604 1631 1659 1659 1659 1659 1660 1625 1591 1626 1660
1080A660k5k5o0J06M7j18j08N7j7j8qpk1k0k1k0j0rJ04J04J3j52n9n9K4K5N5N5J06o0o0J06
$$ 1660 1635 1610 1550 1656 1703 1585 1477 1534 1517 1499 1491 1484 1463 1443 1422 1402 1392 1383 1487 1591 1604 1452 1393 1334 1358 1383 1438 1493 1599 1539 1479 1585
1075A585j9j9O0O1K4K4K4K4n6n6k5k5J04o0n5K7JJm6m5J72Pk4k4m7m8m7m7LKLLP2P2LMrqp8
$$ 1585 1566 1547 1607 1668 1692 1716 1740 1764 1708 1652 1627 1602 1706 1646 1591 1618 1619 1620 1574 1529 1701 1708 1684 1660 1613 1565 1518 1471 1474 1476 1479 1482 1554 1626 1629 1633 1624 1616 1538
1069A538p7j9j9L8m5n2J12O1k1k2k3k7k8k1k1K1K0O2O2ppn7n7M0L9K2K2k0j9MNM6M5%jm2m1
$$ 1538 1461 1442 1423 1461 1416 1364 1476 1537 1516 1494 1471 1444 1416 1395 1374 1395 1415 1477 1539 1532 1525 1468 1411 1451 1490 1512 1534 1514 1495 1499 1504 1550 1595 1595 1594 1552 1511
1064A511o8o8k6k6R1R2O0j04j1j0j14N1P0P0j6j5k6k5M3M4O0O0rrL6L6j70j70%jJ34l1onJ08
$$ 1511 1443 1375 1349 1323 1414 1506 1566 1462 1451 1441 1327 1378 1448 1518 1502 1487 1461 1436 1479 1523 1583 1643 1634 1625 1661 1697 1527 1357 1357 1356 1490 1459 1453 1448 1556
1058A556J08m1m2K8K8K5K5m4m4j4j4j5j4o3o3Q8Q7m5m6N0N1m3m2m3m2L6L6n7J08P7P7l6l6
$$ 1556 1664 1623 1581 1609 1637 1662 1687 1643 1599 1585 1571 1556 1542 1479 1416 1504 1591 1546 1500 1550 1601 1558 1516 1473 1431 1467 1503 1446 1554 1631 1708 1672 1636
1053A636QRM9N0qpj03j03j0rp8p7J12J13R2p2j87k2K7K6QRP6P7RQQQm5m4m5m5n4n3J5J6M1
$$ 1636 1644 1653 1702 1752 1744 1737 1634 1531 1521 1512 1434 1357 1469 1582 1674 1602 1415 1393 1420 1446 1454 1463 1539 1616 1625 1633 1641 1649 1604 1560 1515 1470 1416 1363 1378 1394 1435
1048A435M1M1M1ppL4L5j6j6j08N7K2K2rrP6P7p5p5j0rn1n1M3M2M3M3J02J03m8m8n5n6j13j14
$$ 1435 1476 1517 1558 1551 1544 1578 1613 1597 1581 1473 1530 1552 1574 1565 1556 1632 1709 1634 1559 1549 1540 1489 1438 1481 1523 1566 1609 1711 1814 1766 1718 1663 1607 1494 1380
1042A380m1J23L1L1p0p0jjL9L9n7n7l1l1R2R2m1m1j%J0RN0N1KLLKM8M9P2r3k6k7J25m0NOJ50
$$ 1380 1339 1462 1493 1524 1454 1384 1383 1382 1421 1460 1403 1346 1315 1284 1376 1468 1427 1386 1385 1385 1395 1404 1454 1505 1507 1510 1513 1515 1563 1612 1684 1591 1565 1538 1663 1623 1628 1634 1784
1036A784j26j49j49L9M0L0L0k2k1J34l0l4l4l0l0L8L9q5q5R3R4K2K2K3K2p1p0QQq4Q0j2j2
$$ 1784 1658 1509 1360 1399 1439 1469 1499 1477 1456 1590 1560 1526 1492 1462 1432 1470 1509 1424 1339 1432 1526 1548 1570 1593 1615 1544 1474 1482 1490 1406 1486 1474 1462
1031A462j0rN9O0J9J9k3k2J3J3j49J7L1L1M1M1m8m8j07j07PJ72P9P8r8r9N2N2L0L0N4j11N
$$ 1462 1452 1443 1502 1562 1581 1600 1577 1555 1568 1581 1432 1449 1480 1511 1552 1593 1545 1497 1390 1283 1290 1462 1541 1619 1521 1422 1474 1526 1556 1586 1640 1529 1534
1026A534Mr8O7k3k3Q4Q4m6m5m6m5OOOOL5L4j09N5N8j07L7L7RJ0N1N0j3j2K8K8L2L1j20j20
$$ 1534 1538 1440 1507 1484 1461 1545 1629 1583 1538 1492 1447 1453 1459 1465 1471 1506 1540 1431 1486 1544 1437 1474 1511 1520 1530 1581 1631 1618 1606 1634 1662 1694 1725 1605 1485
1021A485PPl4l4P9Q0J0J0K2K2j0rr1P4j8j9M3M2R4p1m1m2M5M4q4q4L9M0L0L1j1j0n7n7J04
$$ 1485 1492 1499 1465 1431 1510 1590 1600 1610 1632 1654 1644 1635 1544 1618 1600 1581 1624 1666 1760 1689 1648 1606 1651 1695 1611 1527 1566 1606 1636 1667 1656 1646 1589 1532 1636
1016A636o0poJ72Po0o1J08J07o6o6o5o6l6l6O0O0klm4m4n6n6R6R5n0n0j08j08K5J90M9j16
$$ 1636 1576 1569 1563 1735 1742 1682 1621 1729 1836 1770 1704 1639 1573 1537 1501 1561 1621 1619 1616 1572 1528 1472 1416 1512 1607 1557 1507 1399 1291 1316 1506 1555 1439
1011A439n5J10PPk6k5J18m6r0P6k8k8m0m1JJM2M2%JK7K6j5j5m6m6J32J33QRRQN1N1oP7J31
$$ 1439 1384 1494 1501 1508 1482 1457 1575 1529 1439 1515 1487 1459 1419 1378 1379 1380 1422 1464 1464 1465 1492 1518 1503 1488 1442 1396 1528 1661 1669 1678 1687 1695 1746 1797 1791 1868 1999
1005A999l3j32j31j87k3L6L6m8m8K0K1N0N1m6m6k0k0M8M9K6K6m3m2M0L9J09J08j29j29q8q8
$$ 1999 1966 1834 1703 1516 1493 1529 1565 1517 1469 1489 1510 1560 1611 1565 1519 1499 1479 1527 1576 1602 1628 1585 1543 1583 1622 1731 1839 1710 1581 1493 1405
1000A405Q0Q1j16j15pJ58R0p5N1N2q2q2J21J22K6n5j05N9J3o9n4K8K8n5k0O2O3k0l4M9llM
$$ 1405 1485 1566 1450 1335 1328 1486 1576 1501 1552 1604 1522 1440 1561 1683 1709 1654 1549 1608 1621 1552 1498 1526 1554 1499 1479 1541 1604 1584 1550 1599 1596 1593 1597
995A597Mo5o5r8r9Q1Q0L4L5l4l4L9L9L9L9J6J5n2n3n9n9J0J0Q9Q9o2o2OPM8M7l2l3QQK9K9
$$ 1597 1601 1536 1471 1373 1274 1355 1435 1469 1504 1470 1436 1475 1514 1553 1592 1608 1623 1571 1518 1459 1400 1410 1420 1509 1598 1536 1474 1480 1487 1535 1582 1550 1517 1525 1533 1562 1591
989A591l9m0l1l1p2p2MMJ05J06O8J50l7k02m7m7L8L9PPP6P5o8o9o8o9j2j2j2j2LLP2P1l0l1
$$ 1591 1552 1512 1481 1450 1378 1306 1310 1314 1419 1525 1593 1743 1706 1504 1457 1410 1448 1487 1494 1501 1577 1652 1584 1515 1447 1378 1366 1354 1342 1330 1333 1336 1408 1479 1449 1418
984A418J1J1ooj02j02J08J08J1J2K3K4m5m5L9M0klM6M5n1n1m6m6mnP8P9L7L7j6j7j7j7P1P0
$$ 1418 1429 1440 1434 1428 1326 1224 1332 1440 1451 1463 1486 1510 1465 1420 1459 1499 1497 1494 1540 1585 1534 1483 1437 1391 1387 1382 1460 1539 1576 1613 1597 1580 1563 1546 1617 1687
978A687KLooK7K7L5j02j5r7jQ1o6o6k2k2M7M7K2K2J6J7m9j31nJ31L0J12n0m9r6r5K8K9N9N9
$$ 1687 1689 1692 1686 1680 1707 1734 1769 1667 1652 1555 1554 1635 1569 1503 1481 1459 1506 1553 1575 1597 1613 1630 1581 1450 1445 1576 1606 1718 1668 1619 1523 1428 1456 1485 1544 1603
973A603l6l7n0n1J32nj36Jj2P0J32N0NNl3l4l3l4k4k5R9R9q1q0M3M3r5r5K9K8J07J07p2p1
$$ 1603 1567 1530 1480 1429 1561 1556 1420 1421 1409 1479 1611 1661 1666 1671 1638 1604 1571 1537 1513 1488 1587 1686 1605 1525 1568 1611 1516 1421 1450 1478 1585 1692 1620 1549
968A549m8m8L5L5m3m3Q4Q3O2j03Q2Q2j31L4K4K3N1N0q7q7N9O0J5j50L5L6j6j6K1K0o1o2RQ
$$ 1549 1501 1453 1488 1523 1480 1437 1521 1604 1666 1563 1645 1727 1596 1630 1654 1677 1728 1778 1691 1604 1663 1723 1738 1588 1623 1659 1643 1627 1648 1668 1607 1545 1554 1562
963A562RQk1k0O1O2O5O5p2p2j00r9L7L8M0M1J22J23n6n6J19m5j37j36j03O3J5J6j6j6R1R1
$$ 1562 1571 1579 1558 1538 1599 1661 1726 1791 1719 1647 1547 1448 1485 1523 1563 1604 1726 1849 1793 1737 1856 1811 1674 1538 1435 1498 1513 1529 1513 1497 1588 1679
958A679j02j02k7k7l8J28J6J6L7j28O2O2K0K1j81j7Q3Q4P9P9mlm5m4L8L8n8n8n8n8L7L6J30
$$ 1679 1577 1475 1448 1421 1383 1511 1527 1543 1580 1452 1514 1576 1596 1617 1436 1419 1502 1586 1665 1744 1740 1737 1692 1648 1686 1724 1666 1608 1550 1492 1529 1565 1695
953A695l6n6n6o7o6O8O8N8N8N8j07j4j4mmr7O8m1m0l0l0OOp6p7N0N0RQJ9K0J01J02j9k0k9
$$ 1695 1659 1603 1547 1480 1414 1482 1550 1608 1666 1724 1617 1603 1589 1585 1581 1484 1552 1511 1471 1441 1411 1417 1423 1347 1270 1320 1370 1379 1387 1406 1426 1527 1629 1610 1590 1561
947A561l0P2r4%jJ9J8J9J8n5n4K8K8L7L7mmM9M8O9r5j74rj13j12J9J9J01J01mmlmj0j0rj0
$$ 1561 1531 1603 1509 1509 1508 1527 1545 1564 1582 1527 1473 1501 1529 1566 1603 1599 1595 1644 1692 1761 1666 1492 1483 1370 1258 1277 1296 1397 1498 1494 1490 1487 1483 1473 1463 1454 1444
942A444L9L9K9K9M3j23p1p1J00J01l7l7L3L3P4P4r7r7j4j5J7J6J6J6k7k8k7k8m2m2jjR9R9
$$ 1444 1483 1522 1551 1580 1623 1500 1429 1358 1458 1559 1522 1485 1518 1551 1625 1699 1602 1505 1491 1476 1493 1509 1525 1541 1514 1486 1459 1431 1389 1347 1346 1345 1444 1543
936A543J6J6J5J6k6k6K9L0L0L0n4n3m4m3n5J10J7J6KKq1q1j0j0L0L1J3J2N4N3m3m4m3m3M1
$$ 1543 1559 1575 1590 1606 1580 1554 1583 1613 1643 1673 1619 1566 1522 1479 1424 1534 1551 1567 1569 1571 1490 1409 1399 1389 1419 1450 1463 1475 1529 1582 1539 1495 1452 1409 1450
931A450M1j0J55O0O0n6n7j26L8j3j3P5P6qpr7r7KJ68k0k0j0rJ8J9o4o3k8k8k7k8L9M0L9L9
$$ 1450 1491 1481 1636 1696 1756 1700 1643 1517 1555 1542 1529 1604 1680 1672 1665 1568 1471 1473 1641 1621 1601 1591 1582 1600 1619 1555 1492 1464 1436 1409 1381 1420 1460 1499 1538
926A538j7j7k8k7J18m7j39K6N1j13k6J39R8J6n6K7K1K2K6K7o6o5J7J7rqQ4Q4p9Q5Rj56n5K7
$$ 1538 1521 1504 1476 1449 1567 1520 1381 1407 1458 1345 1319 1458 1556 1572 1516 1543 1564 1586 1612 1639 1573 1508 1525 1542 1533 1525 1609 1693 1614 1699 1708 1552 1497 1524
921A524K7n5j43K1O1O1j2j2K9K9L2L2L2L2l4l4j17j16K0K0M5J29Q8p7L1n2K8J09k7j11o9J4
$$ 1524 1551 1496 1353 1374 1435 1496 1484 1472 1501 1530 1562 1594 1626 1658 1624 1590 1473 1357 1377 1397 1442 1571 1659 1582 1613 1561 1589 1698 1671 1560 1491 1505
916A505M4M5M5M5J4J5j62LR4J2K6K6L1j34m8m9p0R6L4L4LLk7k8pj72o7R9%q2Q0Q1o8o7P1j2
$$ 1505 1549 1594 1639 1684 1698 1713 1551 1554 1648 1660 1686 1712 1743 1609 1561 1512 1442 1538 1572 1606 1609 1612 1585 1557 1550 1378 1311 1410 1410 1328 1408 1489 1421 1354 1425 1413
910A413o9R6J32l4o8o7K5K5O6O6qqj12N4J40k6n9n9L1L2n1n1j%J36J37pqR6o9r6P0k3k3j01
$$ 1413 1344 1440 1572 1538 1470 1403 1428 1453 1519 1585 1577 1569 1457 1511 1651 1625 1566 1507 1538 1570 1519 1468 1467 1467 1603 1740 1733 1725 1821 1752 1656 1726 1703 1680 1579
905A579O5k9k8l4l5L8L7P0r4r5P0k8k8j7j8K0K1K0K0n3n4n3n3P7P7nnm0m0M2M3k0j9j9k0M1
$$ 1579 1644 1615 1587 1553 1518 1556 1593 1663 1569 1474 1544 1516 1488 1471 1453 1473 1494 1514 1534 1481 1427 1374 1321 1398 1475 1470 1465 1425 1385 1427 1470 1450 1431 1412 1392 1433
899A433M0M1M0L3L4m9m9NOnJ59K4K4m8m8m3m4m3m4J2J1J2J1%jq2q3O3O3j9j9P4P5j01O4J19
$$ 1433 1473 1514 1554 1587 1621 1572 1523 1528 1534 1529 1688 1712 1736 1688 1640 1597 1553 1510 1466 1478 1489 1501 1512 1512 1511 1429 1346 1409 1472 1453 1434 1508 1583 1482 1546 1665
894A665J18n3n4n1J14k0k1n0n0L2L2L6L6m7m6m3m3L9M0r2r1M7M6jjjjM5M5m1m1n9J06J3J4
$$ 1665 1783 1730 1676 1625 1739 1719 1698 1648 1598 1630 1662 1698 1734 1687 1641 1598 1555 1594 1634 1542 1451 1498 1544 1543 1542 1541 1540 1585 1630 1589 1548 1489 1595 1608 1622
888A622m5m5m5m5O2O2O3O2o5o6LLn9n8j8j7K7K6K7K7M3M3n3n4m9n0P5P4o7o7j28L6P4r1P1
$$ 1622 1577 1532 1487 1442 1504 1566 1629 1691 1626 1560 1563 1566 1507 1449 1431 1414 1441 1467 1494 1521 1564 1607 1554 1500 1451 1401 1476 1550 1483 1416 1288 1324 1398 1307 1378
883A378K36N7N8n5n6l5l5j27L7Q3Q3llo1o1rrPJ73j6j6L1L1l8l8k2k1k2k1K9L0o7o7m8m8P6
$$ 1378 1614 1671 1729 1674 1618 1583 1548 1421 1458 1541 1624 1621 1618 1557 1496 1487 1478 1485 1658 1642 1626 1657 1688 1650 1612 1590 1569 1547 1526 1555 1585 1518 1451 1403 1355 1431
878A431P6j0j0j0j0K6K6o7R9J7J7j3j4P2P1N8j07k33M1P3P3K5j41K1K2nmO4O5p8p7j19j18
$$ 1431 1507 1497 1487 1477 1467 1493 1519 1452 1551 1568 1585 1572 1558 1630 1701 1759 1652 1419 1460 1533 1606 1631 1490 1511 1533 1528 1524 1588 1653 1575 1498 1379 1261
873A261N8N8N8N8J3J4J3J3N6N5o8o8Q5Q6J37k8j30j30J1J1M7M7J6j49k3k3RQP2P2LLP0P1O7
$$ 1261 1319 1377 1435 1493 1506 1520 1533 1546 1602 1657 1589 1521 1606 1692 1829 1801 1671 1541 1552 1563 1610 1657 1673 1524 1501 1478 1487 1495 1567 1639 1642 1645 1715 1786 1853
867A853r8r6r6j0j0nmJ30l5KJm9n0J0J0J03o2poj7j6j%R2p3K8K8J7J8K5K6P7q7K6K7j5j5j79
$$ 1853 1755 1659 1563 1553 1543 1538 1534 1664 1629 1631 1632 1583 1533 1543 1553 1656 1594 1587 1581 1564 1548 1547 1547 1639 1566 1594 1622 1639 1657 1682 1708 1785 1698 1724 1751 1736 1721 1542
861A542j4M5M4l7l8L2L1lmlmLMLLn5n6j07N8J29J28J5J5l8l8l7l8M1M2j8j7p3R2kjKJm0m0
$$ 1542 1528 1573 1617 1580 1542 1574 1605 1602 1598 1595 1591 1594 1598 1601 1604 1549 1493 1386 1444 1573 1701 1716 1731 1693 1655 1618 1580 1621 1663 1645 1628 1555 1647 1645 1644 1646 1647 1607 1567
856A567M2M2n5n5k9k8J2J2L2L2rrL6L5noLLo6o5j1j0N8N8J9K0m9m9j4j4j4j3J9J9O0O1ooN3
$$ 1567 1609 1651 1596 1541 1512 1484 1496 1508 1540 1572 1563 1554 1590 1625 1620 1614 1617 1620 1554 1489 1478 1468 1526 1584 1603 1623 1574 1525 1511 1497 1483 1470 1489 1508 1568 1629 1623 1617 1670
850A670N3O5j00p6p6O0O0J8J9q7q7j8j8L6L6L6L6j4j4Q2Q3M5M5n0n1n5n4r6r6N1N0J4J4K0
$$ 1670 1723 1788 1688 1612 1536 1596 1656 1674 1693 1606 1519 1501 1483 1519 1555 1591 1627 1613 1599 1681 1764 1809 1854 1804 1753 1698 1644 1548 1452 1503 1553 1567 1581 1601
844A601J03K00L6j71pJ62lopj6j7r0r0POm2m3L2L1n5K7P3r1j4j4J7J7M1M0n6n6Q2Q1J5o8q6
$$ 1601 1704 1904 1940 1769 1762 1924 1921 1915 1908 1892 1875 1785 1695 1702 1708 1666 1623 1655 1686 1631 1658 1731 1640 1626 1612 1629 1646 1687 1727 1671 1615 1697 1778 1793 1725 1639
839A639P9K7j37R4J1KQ3j19j19O5O5K2K1o5R9J6R8Mj61J1J1O9O9j1j0j1j0m6m5mmRQo0o0O6
$$ 1639 1718 1745 1608 1702 1713 1715 1798 1679 1560 1625 1690 1712 1733 1668 1767 1783 1881 1885 1724 1735 1746 1815 1884 1873 1863 1852 1842 1796 1751 1747 1743 1752 1760 1700 1640 1706
833A706O5J9J8Qp5n7J07K7n6J%%%%%K2K1K1K2m2m3J0Rm6J19J40J40M4j21R6R6M1M1N1N2p0
$$ 1706 1771 1790 1808 1816 1741 1684 1791 1818 1762 1763 1763 1763 1763 1763 1763 1785 1806 1827 1849 1807 1764 1774 1783 1737 1856 1996 2136 2180 2059 2155 2251 2292 2333 2384 2436 2366
828B366R5J64jL9L9O0N9J24m2m2J24L6L7L7L7P0r5kkL5L4j45j44j8j8j15j14r4r3j00O4%j66
$$ 2366 2461 2625 2624 2663 2702 2762 2821 2945 2903 2861 2985 3021 3058 3095 3132 3202 3107 3105 3103 3138 3172 3027 2883 2865 2847 2732 2618 2524 2431 2331 2395 2395 2229
823B229q6P8l7l8J5J4J1J1N2N2j3j3O5O6r4P1J12n3k7k8MLk2k2m7J19P6P7r2r2R2R2J16m9
$$ 2229 2143 2221 2184 2146 2161 2175 2186 2197 2249 2301 2288 2275 2340 2406 2312 2383 2495 2442 2415 2387 2391 2394 2372 2350 2303 2422 2498 2575 2483 2391 2483 2575 2691 2642
818B642nnJ5J6N7j09j11j12J13J13P1P2m2m2m2m2onooLLJ16J16J26l8j24j24%jO8O9J9J9N1
$$ 2642 2637 2632 2647 2663 2720 2611 2500 2388 2501 2614 2685 2757 2715 2673 2631 2589 2583 2578 2572 2566 2569 2572 2688 2804 2930 2892 2768 2644 2644 2643 2711 2780 2799 2818 2869
812B869N0J66Jkkn0n0Q7Q7K5K5K4K5Q0P9Q0P9J8J8J8J7%jJ0J0p5Q9l4l3L9K05J84J84L76K11
$$ 2869 2919 3085 3086 3084 3082 3032 2982 3069 3156 3181 3206 3230 3255 3335 3414 3494 3573 3591 3609 3627 3644 3644 3643 3653 3663 3588 3677 3643 3610 3649 3854 4038 4222 4598 4809
807D809J11J11R0R0QQn6n5Q1Q2l5l5m6m5J13n3M1M0R7R6J4J4J96J96J14J14M0M1M1M0O5O5
$$ 4809 4920 5031 5121 5211 5219 5227 5171 5116 5197 5279 5244 5209 5163 5118 5231 5178 5219 5259 5356 5452 5466 5480 5676 5872 5986 6100 6140 6181 6222 6262 6327 6392
802F392O5O4J44J45O1O2J56J56J9J9R0R0J72J73J26J26J67J68K28K28J87J86K23K22J39J40
$$ 6392 6457 6521 6665 6810 6871 6933 7089 7245 7264 7283 7373 7463 7635 7808 7934 8060 8227 8395 8623 8851 9038 9224 9447 9669 9808 9948
798I948K44K44K13K13R2K57K08L74K84K85K95K94L12L12L12L12M13M13N50N51N27N28O83Q47
$$ 9948 10192 10436 10649 10862 10954 11211 11419 11793 12077 12362 12657 12951 13263 13575 13887 14199 14612 15025 15575 16126 16653 17181 17864 18711
794A8711Q43Q43Q91J166J217J218J382J382J294J460J569J570J603J769J988J988K091K256
$$ 18711 19554 20397 21288 22454 23671 24889 26271 27653 28947 30407 31976 33546 35149 36918 38906 40894 42985 45241
792D5241K444K609K946L221L646M031M629N343O105P040Q172R767J1751J4334J7757K2428
$$ 45241 47685 50294 53240 56461 60107 64138 68767 74110 80215 87255 95427 105194 116945 131279 149036 171464
789A71464K8877L7724M9936O6915Q8117J08943J18788J07633P6794L8716P021j5343l2135
$$ 171464 200341 238065 288001 354916 443033 551976 670764 778397 855191 893907 900928 885585 853450
787H53450m4609n0860n2124n2206n2700n3096n2931n1495m8803m5129m1229l7053l2931k8797
$$ 853450 808841 757981 705857 653651 600951 547855 494924 443429 394626 349497 308268 271215 238284 209487
785B09487k4786k1021j7890j5308j3165j1289r696q347p192o266n551m987m382l806l421l197
$$ 209487 184701 163680 145790 130482 117317 106028 96332 87985 80793 74527 68976 63989 59607 55801 52380 49183
783D9183k923k504k230k036j762j741j467j353j189j071j072q76q75p39p38p52p51p17n52
$$ 49183 46260 43756 41526 39490 37728 35987 34520 33167 31978 30907 29835 28959 28084 27345 26607 25855 25104 24387 23835
780B3835n38p03o51m87n06n06m96m96n51n51m13m14m01m02l19l19m05m04l23l22k71k71j88
$$ 23835 23297 22594 21943 21456 20950 20444 19948 19452 18901 18350 17937 17523 17122 16720 16401 16082 15677 15273 14950 14628 14357 14086 13898
776A3898j89k00k01k83k83k99k99l20j55k34l99l57j93j21k85k24k23j76j76l69l68r2r2k29
$$ 13898 13709 13509 13308 13025 12742 12443 12144 11824 11669 11435 11036 10679 10486 10365 10080 9856 9633 9457 9281 8912 8544 8452 8360 8131
773H131k29l0l0j81j81j08j07j07j07n2n2r3r3p8p8j73j74k2k2j2j2j62Ll8l9j45J9L3L2P4
$$ 8131 7902 7872 7842 7661 7480 7372 7265 7158 7051 6999 6947 6854 6761 6683 6605 6432 6258 6236 6214 6202 6190 6028 6031 5993 5954 5809 5828 5861 5893 5967
768E967K38J42k3k2k1l2l1L9M0m7m6k22n7j6j81j47j46j16j16j39j39p1p1l8l8j62j62QQj61
$$ 5967 6205 6347 6324 6302 6281 6249 6218 6257 6297 6250 6204 5982 5925 5909 5728 5581 5435 5319 5203 5064 4925 4854 4783 4745 4707 4545 4383 4391 4399 4238
764D238j60n4J12O0O0m1m1m2m1l0l0p2p1QQo0o1L9L9J9j46j67jl6l5RRo0o0OOr0r0R1R1l3
$$ 4238 4078 4024 4136 4196 4256 4215 4174 4132 4091 4061 4031 3959 3888 3896 3904 3844 3783 3822 3861 3880 3734 3567 3566 3530 3495 3504 3513 3453 3393 3399 3405 3315 3225 3316 3407 3374
758C374l3j1j0j%r0P5OPQ9j85j23M2P7P8qqk8k8j20M4k9k9K2K2J4J3J4J3n5n5j4j4k2k3k3
$$ 3374 3341 3330 3320 3319 3319 3229 3304 3310 3317 3406 3221 3098 3140 3217 3295 3287 3279 3251 3223 3103 3147 3118 3089 3111 3133 3147 3160 3174 3187 3132 3077 3063 3049 3027 3004 2981
753B981k2M4M4N8j07j39J35l0k9M6M6M6M6l7l7MNj7j7N1N2MMJ11J10j31L3R2R1j6j6J8j46
$$ 2981 2959 3003 3047 3105 2998 2859 2994 2964 2935 2981 3027 3073 3119 3082 3045 3049 3054 3037 3020 3071 3123 3127 3131 3242 3352 3221 3254 3346 3437 3421 3405 3423 3277
747C277j53J2NOk3k3k3k2%%M2M1p3p4q0Q4l2j96N8N7p2p2p2p2MMM4M5k3k4k4k3N6N7m0m0N
$$ 3277 3124 3136 3141 3147 3124 3101 3078 3056 3056 3056 3098 3139 3066 2992 2912 2996 2964 2768 2826 2883 2811 2739 2667 2595 2599 2603 2647 2692 2669 2645 2621 2598 2654 2711 2671 2631 2636
742B636MM6M6j6j5q5q4m8m8K0K1P4P4NNL1L2l7l8n2n2P2P2l0l1l0l0n7n7J2J2l5l5L4L4M3
$$ 2636 2640 2686 2732 2716 2701 2616 2532 2484 2436 2456 2477 2551 2625 2630 2635 2666 2698 2661 2623 2571 2519 2591 2663 2633 2602 2572 2542 2485 2428 2440 2452 2417 2382 2416 2450 2493
736B493M4n3n3NMNMm3m4l3l3j31L4J30l4j06j06J64J64J18j9l8l8o4o3J0J47j9k0n2n2r0r0
$$ 2493 2537 2484 2431 2436 2440 2445 2449 2406 2362 2329 2296 2165 2199 2329 2295 2189 2083 2247 2411 2529 2510 2472 2434 2370 2307 2317 2464 2445 2425 2373 2321 2231 2141
731B141O2O1K7K7o9o9l8l8L0L1N3N4j6j5kklkk7k7M2M2NOl6l5k2k2k1k2J5J5k6k6J1J1Jq2
$$ 2141 2203 2264 2291 2318 2249 2180 2142 2104 2134 2165 2218 2272 2256 2241 2239 2237 2234 2232 2205 2178 2220 2262 2267 2273 2237 2202 2180 2158 2137 2115 2130 2145 2119 2093 2104 2115 2116 2034
726B034P5K67L6k10q7mk5k5K5K6K6K5j3j3p6p7P0J53P9j14j42J06J28j0J6J6l3l4j15j15m7
$$ 2034 2109 2376 2412 2202 2115 2111 2086 2061 2086 2112 2138 2163 2150 2137 2061 1984 2054 2207 2286 2172 2030 2136 2264 2254 2270 2286 2253 2219 2104 1989 1942
721A942L6J57J9j36JJ09k9o6o7k4k3N8p8pP6K0K1N8N9n7n7lJ35R3m5o7o7p6p6llR4R4OPl4
$$ 1942 1978 2135 2154 2018 2019 2128 2099 2033 1966 1942 1919 1977 1899 1892 1968 1988 2009 2067 2126 2069 2012 2009 2144 2237 2192 2125 2058 1982 1906 1903 1900 1994 2088 2094 2101 2067
715B067l5L3L3r1r1R7R8P8n9k6k5O4j01n3K9J9o3m6m6j0rP9Q0L8L8J1J1q7P8L5m8J0Rj01j01
$$ 2067 2032 2065 2098 2007 1916 2013 2111 2189 2130 2104 2079 2143 2042 1989 2018 2037 1974 1928 1882 1872 1863 1942 2022 2060 2098 2109 2120 2033 2111 2146 2098 2108 2117 2016 1915
710A915nnN2N3K2j43m3m3J5J6K6K5Q3%n8J07O0k2q8oj04k1M5M5m6m6J9J8J9J8K3K2K3K2m1
$$ 1915 1910 1905 1957 2010 2032 1889 1846 1803 1818 1834 1860 1885 1968 1968 1910 2017 2077 2055 1967 1961 1857 1836 1881 1926 1880 1834 1853 1871 1890 1908 1931 1953 1976 1998 1957
705A957m1J%J4J5q2q1L7L8j9O3J44k0QRm9m9r6P0j6O7P1P2LKKLj63j63l8l9J25J25Q4Q4q6
$$ 1957 1916 1917 1917 1931 1946 1864 1783 1820 1858 1839 1902 2046 2026 2034 2043 1994 1945 1849 1919 1903 1970 2041 2113 2116 2118 2120 2123 1960 1797 1759 1720 1845 1970 2054 2138 2052
699B052q6R3R2j11j12M0L9n1n2J7J7k8k8k9k8mmO5O5m9n0K0J9K2K2k0j9l3l3K5K6P8q6l5l5
$$ 2052 1966 2059 2151 2040 1928 1968 2007 1956 1904 1921 1938 1910 1882 1853 1825 1821 1817 1882 1947 1898 1848 1868 1887 1909 1931 1911 1892 1859 1826 1851 1877 1955 1869 1834 1799
694A799q7q7L6L7M8M8M9M8q6q6L7L7J2J2N3N3m8m7m8m7L2L2J00J01J9J9l8M5K0j44m7m6J5
$$ 1799 1712 1625 1661 1698 1746 1794 1843 1891 1805 1719 1756 1793 1805 1817 1870 1923 1875 1828 1780 1733 1765 1797 1897 1998 2017 2036 1998 2043 2063 1919 1872 1826 1841
689A841J5j08j09L2L2P3P3j1j1L6L5j9O4J85J9j34n1M3M4j05j04j01O4K0K0L1L0r4r4k6k5
$$ 1841 1856 1748 1639 1671 1703 1776 1849 1838 1827 1863 1898 1879 1943 2128 2147 2013 1962 2005 2049 1944 1840 1739 1803 1823 1843 1874 1904 1810 1716 1690 1665
684A665QQM9M9N5N6o9o8o1o1o2J02Q7MO1O1J0Rl1l2nnnmn4n4J5J5j2j2M0L9o3J02J42k2q8
$$ 1665 1673 1681 1730 1779 1834 1890 1821 1753 1692 1631 1569 1671 1758 1762 1823 1884 1894 1903 1872 1840 1835 1830 1825 1821 1767 1713 1728 1743 1731 1719 1759 1798 1735 1837 1979 1957 1869
678A869q8K6K5L0K9j1j2l3l4r0pJ06o0q4q5M8M7M8M8L4L4L4L4M8M9m8m8m6m5N0N1k2k2L0L0
$$ 1869 1781 1807 1832 1862 1891 1880 1868 1835 1801 1711 1704 1810 1750 1666 1581 1629 1676 1724 1772 1806 1840 1874 1908 1956 2005 1957 1909 1863 1818 1868 1919 1897 1875 1905 1935
673A935j47J7M9M8q0q0l9l9L5L5L5L5LKLLoom7m7l9l9KKo0o0L7L6P6P6J38k8j49J6RRm8m8
$$ 1935 1788 1805 1854 1902 1822 1742 1703 1664 1699 1734 1769 1804 1807 1809 1812 1815 1809 1803 1756 1709 1670 1631 1633 1635 1575 1515 1552 1588 1664 1740 1878 1850 1701 1717 1726 1735 1687 1639
667A639M9M8qppqq0q1L3J98P4P4M3M3l1l2l1l2k0k1K1K1k2k1K0K0L0L0r3r4O4O4r7O7K5K4
$$ 1639 1688 1736 1728 1721 1714 1706 1626 1545 1578 1776 1850 1924 1967 2010 1979 1947 1916 1884 1864 1843 1864 1885 1863 1842 1862 1882 1912 1942 1849 1755 1819 1883 1786 1853 1878 1902
662A902j16j17M6M6k2k3j5j5R9R8Q2q4q4Q2P5P5o5o6K3K2p3p4jkM0M0M1M1j28j27k5J40N3
$$ 1902 1786 1669 1715 1761 1739 1716 1701 1686 1785 1883 1965 1881 1797 1879 1954 2029 1964 1898 1921 1943 1870 1796 1795 1793 1833 1873 1914 1955 1827 1700 1675 1815 1868
657A868j11n1J14J1J1j0j0n1n1L1L0L1L0ONl5l6mmL8L7pqm8m9m4m4N3N2k0k0P6P6j8j8N0N1
$$ 1868 1757 1706 1820 1831 1842 1832 1822 1771 1720 1751 1781 1812 1842 1848 1853 1818 1782 1778 1774 1812 1849 1842 1834 1786 1737 1693 1649 1702 1754 1734 1714 1790 1866 1848 1830 1880 1931
651A931pqm8m8K5K4K5K4j4j4K8K7r7r7k8N4O4p4p3O3Rp4K2K2M8M8m8m8l8l7l8l7j0j0J14J13
$$ 1931 1924 1916 1868 1820 1845 1869 1894 1918 1904 1890 1918 1945 1848 1751 1723 1777 1841 1767 1694 1757 1766 1692 1714 1736 1784 1832 1784 1736 1698 1661 1623 1586 1576 1566 1680 1793
646A793K6K5K5K6j16j15N5N4Q4n4j24J23K0j18K4J07l8l7L6L5L1L1j0j1k0j9M8M9j00j01l2
$$ 1793 1819 1844 1869 1895 1779 1664 1719 1773 1857 1803 1679 1802 1822 1704 1728 1835 1797 1760 1796 1831 1862 1893 1883 1872 1852 1833 1881 1930 1830 1729 1697
641A697l2O9O9n4n5JJn3K8J37%M0M1PPl4l4k3k3M6M5j6j6j6j6j9j8j8j9o3o3OOP2P2O8r6L
$$ 1697 1665 1734 1803 1749 1694 1695 1696 1643 1671 1808 1808 1848 1889 1896 1903 1869 1835 1812 1789 1835 1880 1864 1848 1832 1816 1797 1779 1761 1742 1679 1616 1622 1628 1700 1772 1840 1744 1747
635A747Mo9R6R6o9l5l5O7O6l0k9N8N8j1j1p3p2mmR2R2l1l1K6K6K6K6o5o5MML4L5L5L4r1r2
$$ 1747 1751 1682 1778 1874 1805 1770 1735 1802 1868 1838 1809 1867 1925 1914 1903 1830 1758 1754 1750 1842 1934 1903 1872 1898 1924 1950 1976 1911 1846 1850 1854 1888 1923 1958 1992 1901 1809
629A809p8Q7J17j57q4Q0L9L9l6l6n3J13M4j22l5l6K3K3O0O0o4o4J9K0J9K0Q4Q4o8o7J1J0l1
$$ 1809 1731 1818 1935 1778 1694 1774 1813 1852 1816 1780 1727 1840 1884 1762 1727 1691 1714 1737 1797 1857 1793 1729 1748 1768 1787 1807 1891 1975 1907 1840 1851 1861 1830
624A830l1k3k4r3r2Q5Q6J27J26KJj77j2l6J29k2k2J6J7OOO1j04p9q0lllll0k9j22M3M4M5J23
$$ 1830 1799 1776 1752 1659 1567 1652 1738 1865 1991 1993 1994 1817 1805 1769 1898 1876 1854 1870 1887 1893 1899 1960 1856 1777 1697 1694 1691 1688 1685 1655 1626 1504 1547 1591 1636 1759
619A759J24k4k4J8J8pop5p5J4J4Q3Q3p5p5M9M8n3n3j2j1m1m1K7K8j0j0N9N8J8J7N9N9k6k6
$$ 1759 1883 1859 1835 1853 1871 1864 1858 1783 1708 1722 1736 1819 1902 1827 1752 1801 1849 1796 1743 1731 1720 1679 1638 1665 1693 1683 1673 1732 1790 1808 1825 1884 1943 1917 1891
614A891r4r5J10J10M2M1J48J47K55K54N6k19l63j99r2r2q3q2l7l8J42J41k6k5k6k5NOr1r1
$$ 1891 1797 1702 1812 1922 1964 2005 2153 2300 2555 2809 2865 2646 2283 2084 1992 1900 1817 1735 1698 1660 1802 1943 1917 1892 1866 1841 1846 1852 1761 1670
609A670L4L4L4L4q8q7R2R1p1p1o8R8P6P6Q6Q6J6J6k5k5J13J13J55L19L25M90L50k56n28n28
$$ 1670 1704 1738 1772 1806 1718 1631 1723 1814 1743 1672 1604 1702 1778 1854 1940 2026 2042 2058 2033 2008 2121 2234 2389 2708 3033 3523 3873 3617 3089 2561
604B561l22m7j23j23j30L5J0J0K1K0j06j05k0k0J58pl8l8q6q6L8L8R2R2J16m9JJrrN9N9r3
$$ 2561 2239 2192 2069 1946 1816 1851 1861 1871 1892 1912 1806 1701 1681 1661 1819 1812 1774 1736 1650 1564 1602 1640 1732 1824 1940 1891 1892 1893 1884 1875 1934 1993 1900
599A900r2O6O7K6K5K9K9K18K17K28m6k91k90n7n6n6n6n0n0J9J9R8R9j08j07l1l2J0J0K0K1
$$ 1900 1808 1874 1941 1967 1992 2021 2050 2268 2485 2713 2667 2376 2086 2029 1973 1917 1861 1811 1761 1780 1799 1897 1996 1888 1781 1750 1718 1728 1738 1758 1779
595A779p6p6P8P9m5m5L9L9kkJ1J1l0k9J9J9J12n3k8k7o2J04MMn4n3j3j2O6O7j57Qn4n4J42
$$ 1779 1703 1627 1705 1784 1739 1694 1733 1772 1770 1768 1779 1790 1760 1731 1750 1769 1881 1828 1800 1773 1711 1815 1819 1823 1769 1716 1703 1691 1757 1824 1667 1675 1621 1567 1709
589A709k3J9J8K9j35m3m3Q5Q4l9l9l0l0J1J2P2P3L2L1m3m3m3m3l7l7MMM6M5M5M6nnL7L6l1
$$ 1709 1686 1705 1723 1752 1617 1574 1531 1616 1700 1661 1622 1592 1562 1573 1585 1657 1730 1762 1793 1750 1707 1664 1621 1584 1547 1551 1555 1601 1646 1691 1737 1732 1727 1764 1800 1769
584A769l1q3Q2P6P6r2r2J0J1l0l1l4l5p6p6N2N2R4R3nnnnRJ0M3j20j18M8J3J3n8n8K1K1k7
$$ 1769 1738 1655 1737 1813 1889 1797 1705 1715 1726 1696 1665 1631 1596 1520 1444 1496 1548 1642 1735 1730 1725 1720 1715 1724 1734 1777 1657 1539 1587 1600 1613 1555 1497 1518 1539 1512
578A512J38M6M5n3n2n3n2J3J2Q1Q2j%m2m1JKo8o7l7l7N9N8J9J9J9J9l4l5l4l4k6k5J6J7M7
$$ 1512 1650 1696 1741 1688 1636 1583 1531 1544 1556 1637 1719 1718 1718 1676 1635 1636 1638 1570 1503 1466 1429 1488 1546 1565 1584 1603 1622 1588 1553 1519 1485 1459 1434 1450 1467 1514
573A514M8k1k0o3o3L4L3P4P4L3L2l0l1l1l0K8K9j3j3J13J12l9l9OPPOnnm6m6j3j3j05N9J1
$$ 1514 1562 1541 1521 1458 1395 1429 1462 1536 1610 1643 1675 1645 1614 1583 1553 1581 1610 1597 1584 1697 1809 1770 1731 1737 1744 1751 1757 1752 1747 1701 1655 1642 1629 1524 1583 1594
567A594J1J14n1l7l7P6P6j27j28N2N1l6l6r3j1R1p5K4K4O3O3J7J6J4o8q1J95M4M4j18j17N
$$ 1594 1605 1719 1668 1631 1594 1670 1746 1619 1491 1543 1594 1558 1522 1429 1418 1509 1434 1458 1482 1545 1608 1625 1641 1655 1587 1506 1701 1745 1789 1671 1554 1559
562A559NNNPPn0L3Q6p8o8J4K3K3K8K9O1O2O9r6j20M4n8n9J4J4k8k7MNM5M6oom2m2pP5J12k6
$$ 1559 1564 1569 1574 1581 1588 1538 1571 1657 1579 1511 1525 1548 1571 1599 1628 1689 1751 1820 1724 1604 1648 1590 1531 1545 1559 1531 1504 1508 1513 1558 1604 1598 1592 1550 1508 1501 1576 1688 1662
556A662n2L0J6J7M9M9j02j02K9L0K9L0M6M6n0n1p5p6K0K0P8P9JKPj30J6J6n3n4J5J6K2K2K2
$$ 1662 1610 1640 1656 1673 1722 1771 1669 1567 1596 1626 1655 1685 1731 1777 1727 1676 1601 1525 1545 1565 1643 1722 1723 1725 1732 1602 1618 1634 1581 1527 1542 1558 1580 1602 1624
551A624K2l6l5l6l5J2J2o5P2P2P2j5j5l5l5POJ9J8O0O0j6j5J8J7L8r9nP7M0m2p8Lq1q2M6M7
$$ 1624 1646 1610 1575 1539 1504 1516 1528 1463 1535 1607 1679 1664 1649 1614 1579 1586 1592 1611 1629 1689 1749 1733 1718 1736 1753 1791 1692 1687 1764 1804 1762 1684 1687 1606 1524 1570 1617
545A617mnm6m5Q6Q6m5m6Q7n1q7N1L7J19K0j18o8J24L5k13n3J40O4j28j17K2J29M7nnn1n1l3
$$ 1617 1613 1608 1562 1517 1603 1689 1644 1598 1685 1634 1547 1598 1635 1754 1774 1656 1588 1712 1747 1534 1481 1621 1685 1557 1440 1462 1591 1638 1633 1628 1577 1526 1493
540A493l4R1R0M8M8k0j03j9J19K7K8K2j15j51j51m8J16R5R6Q7p7n6n7n3J12J9J9kjj2j2O2
$$ 1493 1459 1550 1640 1688 1736 1716 1613 1594 1713 1740 1768 1790 1675 1524 1373 1325 1441 1536 1632 1719 1642 1586 1529 1476 1588 1607 1626 1624 1623 1611 1599 1661
536A661j03r3r3J4J4R6R6J4J5p9Q7O3O3o4o3J2J3k8k9j9j9j9j9L1L1n2n1Q0Q1M6j19j43K1
$$ 1661 1558 1465 1372 1386 1400 1496 1592 1606 1621 1542 1629 1692 1755 1691 1628 1640 1653 1625 1596 1577 1558 1539 1520 1551 1582 1530 1479 1559 1640 1686 1567 1424 1445
531A445N6N6J4J5o8o8k6k5K04M0j7j8M5M5R4p0K2K2j14j14p0R6L3L3KKo1o0K1K2rqJJj37K7
$$ 1445 1501 1557 1571 1586 1518 1450 1424 1399 1603 1643 1626 1608 1653 1698 1792 1722 1744 1766 1652 1538 1468 1564 1597 1630 1632 1634 1573 1513 1534 1556 1547 1539 1540 1541 1404 1431
525A431J7J7N9N8k3k4K9K8m3m3q0Q5L3L4M8M9QQK8K8J8J7Q2q4k21n6m5m6OOJ20J20K1j45L
$$ 1431 1448 1465 1524 1582 1559 1535 1564 1592 1549 1506 1426 1511 1544 1578 1626 1675 1683 1691 1719 1747 1765 1782 1864 1780 1559 1503 1458 1412 1418 1424 1544 1664 1685 1540 1543
520A543LqpM5M4M5M5o6o6k5k5p9p9LMkkQ0Q0mmlmk1k0O2O2k3k3J8J8M9M8l5l4l4l5M8M8L3
$$ 1543 1546 1538 1531 1576 1620 1665 1710 1644 1578 1553 1528 1449 1370 1373 1377 1375 1373 1453 1533 1529 1525 1522 1518 1497 1477 1539 1601 1578 1555 1573 1591 1640 1688 1653 1619 1585 1550 1598 1646 1679
514A679L2rrj6j7P6q8j2j2r4r5PJ72J00o5j1J54l2l1l5l5j18j17J23J23K3j42j6j6k6k7M5
$$ 1679 1711 1702 1693 1677 1660 1736 1648 1636 1624 1530 1435 1442 1614 1714 1649 1638 1792 1760 1729 1694 1659 1541 1424 1547 1670 1693 1551 1535 1519 1493 1466 1511
509A511M6r2r2K4K4N4N5Q2q2q3Q2p7p7P0P0OPO8r7p4R2J63jooj6j6q0q1KKJ14J14P2P3q0q0
$$ 1511 1557 1465 1373 1397 1421 1475 1530 1612 1530 1447 1529 1452 1375 1445 1515 1521 1528 1596 1499 1425 1517 1680 1679 1673 1667 1651 1635 1555 1474 1476 1478 1592 1706 1778 1851 1771 1691
503A691l9l9N0N0m2J22m8m9l8l8M7M7l5l6J2J2p1p0n8n8j6j6N7N7Q8Q9R1p5o3o4L1L2L1L2
$$ 1691 1652 1613 1663 1713 1671 1793 1745 1696 1658 1620 1667 1714 1679 1643 1655 1667 1596 1526 1468 1410 1394 1378 1435 1492 1580 1669 1760 1685 1622 1558 1589 1621 1652 1684
498A684N5N5k7k8o1o2K1K1j7j7j7j7j1j2j2j1MLMMjkR2p4n2n2K0K0l9l9M4M4J3J2J3J2PPM7
$$ 1684 1739 1794 1767 1739 1678 1616 1637 1658 1641 1624 1607 1590 1579 1567 1555 1544 1548 1551 1555 1559 1558 1556 1648 1574 1522 1470 1490 1510 1471 1432 1476 1520 1533 1545 1558 1570 1577 1584 1631
492A631M8O3O3p4p5j5j5j5j5oonoj8j7O4O5o1o2o1o2J14J13p8p9PPQPP6P6ppk6k6k6k6m8m9
$$ 1631 1679 1742 1805 1731 1656 1641 1626 1611 1596 1590 1584 1579 1573 1555 1538 1602 1667 1606 1544 1483 1421 1535 1648 1570 1491 1498 1505 1513 1520 1596 1672 1665 1658 1632 1606 1580 1554 1506 1457
486A457N2K16n5n4j71j72K6J90J90K6l2l2p3p4l1J34r7r6jjjkR7R7m1m0M5M5k6k7j10N5M4
$$ 1457 1509 1725 1670 1616 1445 1273 1299 1489 1679 1705 1673 1641 1568 1494 1463 1597 1500 1404 1403 1402 1401 1399 1496 1593 1552 1512 1557 1602 1576 1549 1439 1494 1538
481A538M5j4j4n5n5LKLKO4O3qrj54J0M7l6%%nnN7N6q0q1K6K5K5K5RRN0N1M3M3l9l9p9q0LL
$$ 1538 1583 1569 1555 1500 1445 1448 1450 1453 1455 1519 1582 1574 1565 1411 1421 1468 1432 1432 1432 1427 1422 1479 1535 1455 1374 1400 1425 1450 1475 1484 1493 1543 1594 1637 1680 1641 1602 1523 1443 1446 1449
475A449JKQ4Q4j12j12j9j9m3J22pq9J27J27p0p0%J%%OPQ8Q9k0k0J1J1O6r9j45K0J20L9q0Q4
$$ 1449 1450 1452 1536 1620 1508 1396 1377 1358 1315 1437 1430 1341 1468 1595 1525 1455 1455 1456 1456 1456 1462 1469 1557 1646 1626 1606 1617 1628 1694 1595 1450 1470 1590 1629 1549 1633
469A633m3m3QRK0K0j13N1Q0Q1M6j19q3q4M4M4L4L4ppn8n7J18m8n5n4J7J7k9k9M2M3J33l2K0
$$ 1633 1590 1547 1555 1564 1584 1604 1491 1542 1622 1703 1749 1630 1547 1463 1507 1551 1585 1619 1612 1605 1547 1490 1608 1560 1505 1451 1468 1485 1456 1427 1469 1512 1645 1613 1633
464A633K0J1J0p2p1N9O0p8p8M0L9M0L9m9m9qpk4k3O9O9j49J5J06K4j9j9k5k4k9l0K15M9r9
$$ 1633 1653 1664 1674 1602 1531 1590 1650 1572 1494 1534 1573 1613 1652 1603 1554 1546 1539 1515 1492 1561 1630 1481 1496 1602 1626 1607 1588 1563 1539 1510 1480 1695 1744 1645
459A645r9j4j3K6K7j4j5N5N5N5N5j16j16j9k0k3k2J9J8J2J2J2J1k6k6k7k6jkjkJ21J21l0l0
$$ 1645 1546 1532 1519 1545 1572 1558 1543 1598 1653 1708 1763 1647 1531 1512 1492 1469 1447 1466 1484 1496 1508 1520 1531 1505 1479 1452 1426 1425 1423 1422 1420 1541 1662 1632 1602
453A602m8m9O4O5P7q8ONNNNOo9o8k7k8NMm6J17n1n1M5M5J29l5l8l8MMMNk8k7J4J3K1K0k1k1
$$ 1602 1554 1505 1569 1634 1711 1623 1629 1634 1639 1644 1649 1655 1586 1518 1491 1463 1468 1472 1426 1543 1492 1441 1486 1531 1660 1625 1587 1549 1553 1557 1561 1566 1538 1511 1525 1538 1559 1579 1558 1537
447A537R6R6K8K7j20j20n1n2J16J15j18j19M2M2Q3Q3J1J1l1l0j2j3M7M6L2j33p4R1O3j03m1
$$ 1537 1633 1729 1757 1784 1664 1544 1493 1441 1557 1672 1554 1435 1477 1519 1602 1685 1696 1707 1676 1646 1634 1621 1668 1714 1746 1613 1539 1630 1693 1590 1549
442A549m0K1K1O3O2o0o0L6L7j8j8k8k8N3j12n0n0m8J18O6O5l1l1J0J0ppL4L4k3k3l0J35O3
$$ 1549 1509 1530 1551 1614 1676 1616 1556 1592 1629 1611 1593 1565 1537 1590 1478 1428 1378 1330 1448 1514 1579 1548 1517 1527 1537 1530 1523 1557 1591 1568 1545 1515 1650 1713
437A713j03M2M3m4m3r5P0K4K5L5L4m4m5N2N2p4p4l2l3j9k0j9k0K4K5j7j7N2N3J1J2K1K0k0
$$ 1713 1610 1652 1695 1651 1608 1513 1583 1607 1632 1667 1701 1657 1612 1664 1716 1642 1568 1536 1503 1484 1464 1445 1425 1449 1474 1457 1440 1492 1545 1556 1568 1589 1609 1589
432A589k0k1k0k0k1L5L5L4L5K8K9m0m1JJm0m0K9L0K9L0p4p4nnJ8J9J8J8%jo9o9K8K9K8K9O2
$$ 1589 1569 1548 1528 1508 1487 1522 1557 1591 1626 1654 1683 1643 1602 1603 1604 1564 1524 1553 1583 1612 1642 1568 1494 1489 1484 1502 1521 1539 1557 1557 1556 1487 1418 1446 1475 1503 1532 1594
426A594O2o1o2J0J0N2N1o8o8K8K8l9m0m0l9M8M9k0k0n9n9R2R2k1k1k0k1M7M6NNqrp7p7L0L0
$$ 1594 1656 1595 1533 1543 1553 1605 1656 1588 1520 1548 1576 1537 1497 1457 1418 1466 1515 1495 1475 1416 1357 1449 1541 1520 1499 1479 1458 1505 1551 1556 1561 1553 1544 1467 1390 1420 1450
421A450L0L0N1N2m5m4l5l5O1O1p4p5J04J04n8n8J0J1K1K0k0k1K7K7R5R5j42j41RRJ16J16q
$$ 1450 1480 1510 1561 1613 1568 1524 1489 1454 1515 1576 1502 1427 1531 1635 1577 1519 1529 1540 1561 1581 1561 1540 1567 1594 1689 1784 1642 1501 1510 1519 1635 1751 1743
416A743qj1j2q0q0RQo0o1LKLKR1R1onl0l0K8K8J24m1r1qmmJKq1q0l8l9QQk0J44P4rk5k6N1
$$ 1743 1735 1724 1712 1632 1552 1561 1569 1509 1448 1451 1453 1456 1458 1549 1640 1634 1629 1599 1569 1597 1625 1749 1708 1617 1609 1605 1601 1602 1604 1523 1443 1405 1366 1374 1382 1362 1506 1580 1571 1546 1520 1571
409A571l1j5J51j5r8l1l0j18M8J21m3p4QP5P5nnj28j29MNMMR0Q9M8M8n4n5N9N9jj66%JJ9J02
$$ 1571 1540 1525 1676 1661 1563 1532 1502 1384 1432 1553 1510 1436 1444 1519 1594 1589 1584 1456 1327 1331 1336 1340 1344 1434 1523 1571 1619 1565 1510 1569 1628 1627 1461 1461 1462 1481 1583
404A583L0j35n4K9Q8NL5L5L0L1m5m4mlj24j24j20M4J41J40O5O5M8k27j86Q9L0K9OOk8k8k8
$$ 1583 1613 1478 1424 1453 1541 1546 1581 1616 1646 1677 1632 1588 1584 1581 1457 1333 1213 1257 1398 1538 1603 1668 1716 1489 1303 1392 1422 1451 1457 1463 1435 1407 1379
399A379k7Q2Q3J35l0ppn8n9j4j4n6n6K9K8K9K8K1K1J72J72r4r3k5k4MNj85j9Q9R0LMm9n0P4
$$ 1379 1352 1434 1517 1652 1622 1615 1608 1550 1491 1477 1463 1407 1351 1380 1408 1437 1465 1486 1507 1679 1851 1757 1664 1639 1615 1619 1624 1439 1420 1509 1599 1602 1606 1557 1507 1581
393A581P4p1p2l0l0M5M5n1n1lmL8L8o7o6L0L0ooooP8P7RRO0O0r0r1m9n0M7M7LLP2P1J%m0m1
$$ 1581 1655 1584 1512 1482 1452 1497 1542 1491 1440 1437 1433 1471 1509 1442 1376 1406 1436 1430 1424 1418 1412 1490 1567 1576 1585 1645 1705 1615 1524 1475 1425 1472 1519 1522 1525 1597 1668 1669 1669 1629 1588
387A588k0k0j24M2%j64PPJJJJJ73J73nnq8q7RR%%M1M2m8m8K1K0k4k3J7J7J6J6q0q1P3P2k3
$$ 1588 1568 1548 1424 1466 1466 1302 1309 1316 1317 1318 1319 1320 1493 1666 1661 1656 1568 1481 1490 1499 1499 1499 1540 1582 1534 1486 1507 1527 1503 1480 1497 1514 1530 1546 1466 1385 1458 1530 1507
381A507k4l4l4R0Q9J1J1j24M2N2N2J1J1N4j12n9o0p4p4O7O6J08n7J5j49qJ58J3J3J5J5p8Q7
$$ 1507 1483 1449 1415 1505 1594 1605 1616 1492 1534 1586 1638 1649 1660 1714 1602 1543 1483 1409 1335 1402 1468 1576 1519 1534 1385 1377 1535 1548 1561 1576 1591 1513 1600
376A600j1j0jjm8m9m8m9M9M8M9M9o7o6k5k5J45J44j16j16j3j3K8K8L3L3qql9l9J77J3k8k7
$$ 1600 1589 1579 1578 1577 1529 1480 1432 1383 1432 1480 1529 1578 1511 1445 1420 1395 1540 1684 1568 1452 1439 1426 1454 1482 1515 1548 1540 1532 1493 1454 1631 1644 1616 1589
371A589MLo6o6L0L0PPQPp7p7M6M7J3J3J3J3KLLKl5l6R8o6O5O5m2m1llm5m4K8K9L9L9j71pK5
$$ 1589 1593 1596 1530 1464 1494 1524 1531 1538 1546 1553 1476 1399 1445 1492 1505 1518 1531 1544 1546 1549 1552 1554 1519 1483 1581 1515 1580 1645 1603 1562 1559 1556 1511 1467 1495 1524 1563 1602 1431 1424 1449
364A449K5K7K7m2m1ooL6L5J3J2J2J3J7J7p9q0L7L7l2l2m9m9pqJ33J33K7K7M7j18j59Oonj9
$$ 1449 1474 1501 1528 1486 1445 1439 1433 1469 1504 1517 1529 1541 1554 1571 1588 1509 1429 1466 1503 1471 1439 1390 1341 1334 1326 1459 1592 1619 1646 1693 1575 1416 1422 1416 1411 1392
359A392J46j4j4mlJ3J2J38N6m7J17K7j39j50J4J06n9p9NJ6J6J0J0m6L6R2p2j35K9Q0Q1non2
$$ 1392 1538 1524 1510 1506 1503 1516 1528 1666 1722 1675 1792 1819 1680 1530 1544 1650 1591 1512 1517 1533 1549 1559 1569 1523 1559 1651 1579 1444 1473 1553 1634 1629 1623 1571
354A571n3n2n3K7K6j4j5M2M1M2M2j00j00K3K4N5N4o9o9JKJ69J70l8k03q8oj7j8K9K9m8m8L8
$$ 1571 1518 1466 1413 1440 1466 1452 1437 1479 1520 1562 1604 1504 1404 1427 1451 1506 1560 1491 1422 1423 1425 1594 1764 1726 1523 1435 1429 1412 1394 1423 1452 1404 1356 1394
348A394L8pj72J7J8K1K1O3O3OOJ40k5L3L3p4p3%Jr6r6j7j6J05J87N8j07j43K2J8J7K8K8m3
$$ 1394 1432 1425 1253 1270 1288 1309 1330 1393 1456 1462 1468 1608 1583 1616 1649 1575 1502 1502 1503 1407 1311 1294 1278 1383 1570 1628 1521 1378 1400 1418 1435 1463 1491 1448
343A448m4kkP2P2j07j07J04J05O5j8j65jJ17L3M3j23J5R8r7r8k3k3KLM3M4R4R4K6n5j02O4
$$ 1448 1404 1402 1400 1472 1544 1437 1330 1434 1539 1604 1586 1421 1420 1537 1570 1613 1490 1505 1603 1506 1408 1385 1362 1364 1367 1410 1454 1548 1642 1668 1613 1511 1575
338A575PPl0l0j23M2M4M5m2m1MMP3P3K0J9p8MO2j03m6m7K7K6J6J6p2R2M1M1J2J1N3N3q0q0
$$ 1575 1582 1589 1559 1529 1406 1448 1492 1537 1495 1454 1458 1462 1535 1608 1628 1647 1569 1573 1635 1532 1486 1439 1466 1492 1508 1524 1452 1544 1585 1626 1638 1649 1702 1755 1675 1595
333A595j21j21p2p3K4K4M9M9J73Qj35K9J07K5j27L9k8j11lP9M8M9j8j7j7j7R4R4k9l0o1o2
$$ 1595 1474 1353 1281 1208 1232 1256 1305 1354 1527 1535 1400 1429 1536 1561 1434 1473 1445 1334 1331 1410 1458 1507 1489 1472 1455 1438 1532 1626 1597 1567 1506 1444
328A444L4L4J9J9k3k2k2k2K0J9M5M5k3k4l9m0n5K8J39k6j53p1k2k3J06J06Q2Q2j4j4l8l8L
$$ 1444 1478 1512 1531 1550 1527 1505 1483 1461 1481 1500 1545 1590 1567 1543 1504 1464 1409 1437 1576 1550 1397 1326 1304 1281 1387 1493 1575 1657 1643 1629 1591 1553 1556
323A556LJ1J2P3r1j12N3J9J9l8l8N8N9p1p1n1J14Q2q3p3R2k1k1j0j1l0k9l0l0rrK2K3j89k4
$$ 1556 1559 1570 1582 1655 1564 1452 1505 1524 1543 1505 1467 1525 1584 1513 1442 1391 1505 1587 1504 1431 1523 1502 1481 1471 1460 1430 1401 1371 1341 1332 1323 1345 1368 1179 1155
317A155N2N2J31l3k7k6l2J32jjMNj6j6R7R6m5k09K9K9N9O0J1J1l0l0P4P5P5P4j04j05o4o3
$$ 1155 1207 1259 1390 1357 1330 1304 1272 1404 1403 1402 1406 1411 1395 1379 1476 1572 1527 1318 1347 1376 1435 1495 1506 1517 1487 1457 1531 1606 1681 1755 1651 1546 1482 1419
312A419R6R5n5n6j0j0l1l1P5P6P1r3non8n7N5N5m2m1onp8Q7N0N0qqj02j01r8O6J9J8K8K8O1
$$ 1419 1515 1610 1555 1499 1489 1479 1448 1417 1492 1568 1639 1546 1541 1535 1477 1420 1475 1530 1488 1447 1441 1436 1358 1445 1495 1545 1537 1529 1427 1326 1228 1294 1313 1331 1359 1387 1448
307A448O0J9J9l4l4llO2j03q0J96L0j35k4k5lmR3R3l3l2L6L5j7j7j7j8l1l1l1l1O0O0J9J8
$$ 1448 1508 1527 1546 1512 1478 1475 1472 1534 1431 1351 1547 1577 1442 1418 1393 1390 1386 1479 1572 1539 1507 1543 1578 1561 1544 1527 1509 1478 1447 1416 1385 1445 1505 1524 1542
301A542M2M2q2q2l1l2k6k6m3L9J64%o9R6pqJ24J23j00r9p8Q7J1p3o2J03n2L1J18m6m5m5m7
$$ 1542 1584 1626 1544 1462 1431 1399 1373 1347 1304 1343 1507 1507 1438 1534 1527 1519 1643 1766 1666 1567 1489 1576 1587 1514 1452 1555 1503 1534 1652 1606 1561 1516 1469
296A469m7m7m7M7M8k1k2J2J2J2J2K1K1J0J0M6j19p7Q7Q1Q2nnn6n6J05o0n3n3ONO1O1K0K0k1
$$ 1469 1422 1375 1328 1375 1423 1402 1380 1392 1404 1416 1428 1449 1470 1480 1490 1536 1417 1340 1427 1508 1590 1585 1580 1524 1468 1573 1513 1460 1407 1413 1418 1479 1540 1560 1580 1559
291A559k0k1k0rrm8j31r1P3Q6LK9n2n8K4K4K4j3j2PQJ05K3j18M6Q0jO3j01j17M8J79J4l1N2
$$ 1559 1539 1518 1498 1489 1480 1432 1301 1210 1283 1369 1372 1401 1349 1291 1315 1339 1363 1350 1338 1345 1353 1458 1481 1363 1409 1489 1488 1551 1450 1333 1381 1560 1574 1543 1595
285A595K0o2n2L1o8J4o7o8M5M5Q6Q6n2n2n2n2R4R4n8n7j8j8j9j8J1J1N2N2O5O4lml3l3j66
$$ 1595 1615 1553 1501 1532 1464 1478 1411 1343 1388 1433 1519 1605 1553 1501 1449 1397 1491 1585 1527 1470 1452 1434 1415 1397 1408 1419 1471 1523 1588 1652 1649 1645 1612 1579 1413
280A413kkjN0M9N9N8l7l8M6M6M5M6r4r3LLm2m2K6K7k7k7k7k7m3m2N3N4LLLMM7M7n0m9KJkj67
$$ 1413 1411 1409 1408 1458 1507 1566 1624 1587 1549 1595 1641 1686 1732 1638 1545 1548 1551 1509 1467 1493 1520 1493 1466 1439 1412 1369 1327 1380 1434 1437 1440 1443 1447 1494 1541 1491 1442 1444 1445 1443 1276
274A276N5N6M5M5o1o2L5L5j0j0N8N9LKLKj8j8o0n9mmmmNMM6M6OPr7O8R1p3j2j2nom6m7nnm7
$$ 1276 1331 1387 1432 1477 1416 1354 1389 1424 1414 1404 1462 1521 1524 1526 1529 1531 1513 1495 1435 1376 1372 1368 1364 1360 1365 1369 1415 1461 1467 1474 1377 1445 1536 1463 1451 1439 1434 1428 1382 1335 1330 1325 1278
267A278m6M9N0QQO2O2qpj0j0j07j06Q7Q8J8J9k5k5J6J6L6L6nol8l7l8l8Q0Q0J1J1l7l7MML
$$ 1278 1232 1281 1331 1339 1347 1409 1471 1463 1456 1446 1436 1329 1223 1310 1398 1416 1435 1410 1385 1401 1417 1453 1489 1484 1478 1440 1403 1365 1327 1407 1487 1498 1509 1472 1435 1439 1443 1446
261A446Kj02j02N5q2K6K18Q5j08n6n7k5k5P2P1RJ0N0N1j9j9K2K2p4p5LKp6O2j6j6l9l8qK39
$$ 1446 1448 1346 1244 1299 1217 1243 1461 1546 1438 1382 1325 1300 1275 1347 1418 1427 1437 1487 1538 1519 1500 1522 1544 1470 1395 1398 1400 1324 1386 1370 1354 1315 1277 1269 1508
256A508K6j11k7J11O6O7J2J2p5PM7r0r0M8L1L1j4j4j10j11N5N5rrJ08J91P8j13q7no2o3l4
$$ 1508 1534 1423 1396 1507 1573 1640 1652 1664 1589 1596 1643 1553 1463 1511 1542 1573 1559 1545 1435 1324 1379 1434 1425 1416 1524 1715 1793 1680 1593 1588 1526 1463 1429
251A429l4R0Pj47j0N9N8K6K6L1L1l6M7M1r6q8on2n2n9P7J19j8j9j8O9O9L2L3P3P4o8o8o8o7
$$ 1429 1395 1485 1492 1345 1335 1394 1452 1478 1504 1535 1566 1530 1577 1618 1522 1434 1428 1376 1324 1265 1342 1461 1443 1424 1406 1475 1544 1576 1609 1682 1756 1688 1620 1552 1485
246A485J4J3J4J4ONONk1k1P2r3L5L4p1p2k2k2R2R1O2j03j0j0pqK4K3N5j09n8n8P2P2k3k4J7
$$ 1485 1499 1512 1526 1540 1546 1551 1557 1562 1541 1520 1592 1499 1534 1568 1497 1425 1403 1381 1473 1564 1626 1523 1513 1503 1496 1488 1512 1535 1590 1481 1423 1365 1437 1509 1486 1462 1479
240A479J6n2n2J2J1N3N3j7j8q6q6K7K7K8K7POPOk0k1M8M7r8r8R0R1o2J02P9P8j37j37J4J4
$$ 1479 1495 1443 1391 1403 1414 1467 1520 1503 1485 1399 1313 1340 1367 1395 1422 1429 1435 1442 1448 1428 1407 1455 1502 1404 1306 1396 1487 1425 1527 1606 1684 1547 1410 1424 1438
235A438O9O9k7k7PPo2o2l3l3l4l3Q5Q5J6J6k1k2k2k1l7l7NMM7M6M3j22J5J5j29L5J05J05n3
$$ 1438 1507 1576 1549 1522 1529 1536 1474 1412 1379 1346 1312 1279 1364 1449 1465 1481 1460 1438 1416 1395 1358 1321 1326 1330 1377 1423 1466 1344 1359 1374 1245 1280 1385 1490 1437
229A437n2r2P2P3r2nnQ0Q1%jm1m2N2N2m4m4l3l4l3l3n8n7R4R3l9l9R8R8l5l5POJ3J2N4N4j64
$$ 1437 1385 1293 1365 1438 1346 1341 1336 1416 1497 1497 1496 1455 1413 1465 1517 1473 1429 1396 1362 1329 1296 1238 1181 1275 1368 1329 1290 1388 1486 1451 1416 1423 1429 1442 1454 1508 1562 1398
224A398j64o5J01K5K5L6L6QQQRp1p1J2J1P5P6qpl4l4M8M9j9j9O4O4k5k6k5k6j13j13K4K5J18
$$ 1398 1234 1169 1270 1295 1320 1356 1392 1400 1408 1416 1425 1354 1283 1295 1306 1381 1457 1449 1442 1408 1374 1422 1471 1452 1433 1497 1561 1536 1510 1485 1459 1346 1233 1257 1282 1400
218A400J18k6j91o2J04M2M1m3m3M0M0p7p6O1O1P1P1j9j83o6R8O8O7J01o5n4n3k6k6N7N7p0
$$ 1400 1518 1492 1301 1239 1343 1385 1426 1383 1340 1380 1420 1343 1267 1328 1389 1460 1531 1512 1329 1263 1361 1429 1496 1597 1532 1478 1425 1399 1373 1430 1487 1417
213A417p0m0l9J46k0rrO7O7L2j32j07N9J30l4k3k2l2l3kjP0P1M9j15k3k2NOONPPM9M8m8m8
$$ 1417 1347 1307 1268 1414 1394 1385 1376 1443 1510 1542 1410 1303 1362 1492 1458 1435 1413 1381 1348 1346 1345 1415 1486 1535 1420 1397 1375 1380 1386 1392 1397 1404 1411 1460 1508 1460 1412
208A412L4L5L2L2JJj60NL9L9J04n9n5K7m3m4j3P0Q9p6o1o0RRRRK0K0k2k1rrP3P3%%m1m2J09
$$ 1412 1446 1481 1513 1545 1546 1547 1387 1392 1431 1470 1574 1515 1460 1487 1444 1400 1387 1457 1546 1470 1409 1349 1358 1367 1376 1385 1405 1425 1403 1382 1373 1364 1437 1510 1510 1510 1469 1427 1536
202A536J09k8k9n9o0n9o0R0R0l7l7m4J22L8j26opj7j7K4K4O5O4o8o8J4J5L3L4m9m9pqqpj8
$$ 1536 1645 1617 1588 1529 1469 1410 1350 1440 1530 1493 1456 1412 1534 1572 1446 1440 1433 1416 1399 1423 1447 1512 1576 1508 1440 1454 1469 1502 1536 1487 1438 1431 1423 1415 1408 1390
196A390j8j8j8Q5Q5m2m2n9J05K8j37q4kj7j7l6l5M7M7Q3Q3n4n4L4L4P5P5J3J2k9k8N1N1J0
$$ 1390 1372 1354 1336 1421 1506 1464 1422 1363 1468 1496 1359 1275 1273 1256 1239 1203 1168 1215 1262 1345 1428 1374 1320 1354 1388 1463 1538 1551 1563 1534 1506 1557 1608 1618
191A618J0NNp7p8LKKLN5N6N6N5N0M9O0O0J51L16M51L69l2j96l57l56k47k47j10j10mnj00j00
$$ 1618 1628 1633 1638 1561 1483 1486 1488 1490 1493 1548 1604 1660 1715 1765 1814 1874 1934 2085 2401 2852 3221 3189 2993 2636 2280 2033 1786 1676 1566 1562 1557 1457 1357
186A357Q6Q6Q2q2q9q9k0k1m0J25P9mo4o3K8K8O1O1o2o2J6J7k5k4L2L2l0J35J09n5p7p6m5m6
$$ 1357 1443 1529 1611 1529 1440 1351 1331 1310 1270 1395 1474 1470 1406 1343 1371 1399 1460 1521 1459 1397 1413 1430 1405 1381 1413 1445 1415 1550 1659 1604 1527 1451 1406 1360
181A360N1N1l4l4J11n5r2P3N2l1m6j30M6M6j42K2Q1Q1j7j7j7j8J4J3J10J10o2o1o2o1R5R6
$$ 1360 1411 1462 1428 1394 1505 1450 1358 1431 1483 1452 1406 1276 1322 1368 1226 1248 1329 1410 1393 1376 1359 1341 1355 1368 1478 1588 1526 1465 1403 1342 1437 1533
176A533q3q3J11J11o7o8M8M7k1k1m9m9p9q0j8J47j5j5M1M1n5n5l1l1O5O5K3K3p3p4J11J11
$$ 1533 1450 1367 1478 1589 1522 1454 1502 1549 1528 1507 1458 1409 1330 1250 1232 1379 1364 1349 1390 1431 1376 1321 1290 1259 1324 1389 1412 1435 1362 1288 1399 1510
171A510o9o8LLM4M4J6J5J6J6k0j9P7P7j03j02nq7m8J18K76Jr2j0J23J23J20m5j14j13K6j39
$$ 1510 1441 1373 1376 1379 1423 1467 1483 1498 1514 1530 1510 1491 1568 1645 1542 1440 1435 1348 1300 1418 1694 1695 1603 1593 1716 1839 1959 1914 1800 1687 1713 1574
166A574m5m6q2q2n1J14P3P3P2P3J0j55OPNONOj5j5j5j6RRm9m9p8Q8Q1Q0J34l2o3o2N0N1N1
$$ 1574 1529 1483 1401 1319 1268 1382 1455 1528 1600 1673 1683 1528 1534 1541 1546 1552 1557 1563 1548 1533 1518 1502 1511 1520 1471 1422 1344 1432 1513 1593 1727 1695 1632 1570 1620 1671 1722
160A722N0j01j01l3l2rrn0n1N9N9M8M9P2r2k26o1J70Oj5j5qqQ5q0k0j9j0J56P3r2J2J1mmm
$$ 1722 1772 1671 1570 1537 1505 1496 1487 1437 1386 1445 1504 1552 1601 1673 1581 1355 1294 1464 1470 1455 1440 1432 1424 1509 1429 1409 1390 1380 1536 1609 1517 1529 1540 1536 1532 1528
155A528mK2K3j9j8JJj60MQ4Q5K5K6l6l6l2J32J7J7m1m2L8L8K7K7O3j01j0rN5N4o9o9k7k6L2
$$ 1528 1524 1546 1569 1550 1532 1533 1534 1374 1378 1462 1547 1572 1598 1562 1526 1494 1626 1643 1660 1619 1577 1615 1653 1680 1707 1770 1669 1659 1650 1705 1759 1690 1621 1594 1568 1600
149A600L2K66J01m0m0p9p8M5M5k9k8k9k9L6L6L5L6N1N1O2j04l9l9Qp5m2J22M0j24n5K8o5J8
$$ 1600 1632 1898 1999 1959 1919 1840 1762 1807 1852 1823 1795 1766 1737 1773 1809 1844 1880 1931 1982 2044 1940 1901 1862 1870 1795 1753 1875 1915 1791 1736 1764 1699 1717
144A717nJ60P3P2j5j6j0j0j6O7L6j28pP6J94L0m6m6n1n2j01j9J70Nj3O9J32M8J01o5j9j8J6
$$ 1717 1712 1872 1945 2017 2002 1986 1976 1966 1950 2017 2053 1925 1918 1994 2188 2218 2172 2126 2075 2023 1922 1903 2073 2078 2065 2134 2266 2314 2415 2350 2331 2313 2329
139B329J6N7N7J7J6R9R8Q1Q0jkK5K5J23m2J5R8j1P1R0QN9N9O3O3J04J05M1M1K28K29J67Q5
$$ 2329 2345 2402 2459 2476 2492 2591 2689 2770 2850 2849 2847 2872 2897 3020 2978 2993 3091 3080 3151 3241 3249 3308 3367 3430 3493 3597 3702 3743 3784 4012 4241 4408 4493
134D493L3J98M75L93K62K63L84M68M62K97N01L35K89O73Q23R04J308J693K518K684N54j588
$$ 4493 4526 4724 5199 5592 5854 6117 6501 6969 7431 7728 8229 8564 8853 9526 10349 11253 12561 14254 16772 19456 20010 18422
131A8422j534o00K59Q63R91J266J541K035K766L371M408N562O879Q473J1178J4641K0379K9335
$$ 18422 16888 16288 16547 17410 18401 19667 21208 23243 26009 29380 33788 39350 46229 54702 65880 80521 100900 130235
128A30235M5215P0106R1867M7085n9464r6665p3181m6092k8062j7677j1726q594o458n084
$$ 130235 175450 245556 337423 384508 325044 228379 155198 109106 81044 63367 51641 43047 36589 31505
126C1505m081l477k694k199j696j311q93o17k71NM23J027J848Q03j868k693j686p53k30l95
$$ 31505 27424 23947 21253 19054 17358 16047 15154 14537 14266 14271 14694 15721 17569 18372 16504 13811 12125 11372 11142 10747
123A0747r01j065r90p16m68l03j86j87j6j6k18k19l8k03k03l8mlj31j31j36j36rrn0k15m0
$$ 10747 9846 8781 7791 7075 6607 6304 6118 5931 5915 5899 5681 5462 5424 5221 5018 4980 4976 4973 4842 4711 4575 4439 4430 4421 4371 4156 4116
119D116m0j55j55k8k8n0k16k15n1P8P8OOj08j08k6k5j0j1j0j0l9l8M4M3M1M2%jm1m1N1j13
$$ 4116 4076 3921 3766 3738 3710 3660 3444 3229 3178 3256 3334 3340 3346 3238 3130 3104 3079 3069 3058 3048 3038 2999 2961 3005 3048 3089 3131 3131 3130 3089 3048 3099 2986
114B986k05k05j34j33K5K5n8n7k7k7k7k6J2J2J1J2O7O7k6k6J64jj01j01j00j00j7j8J7J7N8
$$ 2986 2781 2576 2442 2309 2334 2359 2301 2244 2217 2190 2163 2137 2149 2161 2172 2184 2251 2318 2292 2266 2430 2429 2328 2227 2127 2027 2010 1992 2009 2026 2084
109B084N8L7L6mnK8K8j61Mj15j15k8J36J06n8p8p9RRN0N0o8o9K7K8M4M5n2n1J6J6q0p9k3k2
$$ 2084 2142 2179 2215 2211 2206 2234 2262 2101 2105 1990 1875 1847 1983 2089 2031 1953 1874 1883 1892 1942 1992 1924 1855 1882 1910 1954 1999 1947 1896 1912 1928 1848 1769 1746 1724
104A724L6L6L8j27l5l4JJO9P0o3o3OOOOJ68KO2O1m6m5p2p2p2p2j1j2N7N7p0o9N4N5OOM7M7
$$ 1724 1760 1796 1834 1707 1672 1638 1639 1640 1709 1779 1716 1653 1659 1665 1671 1677 1845 1847 1909 1970 1924 1879 1807 1735 1663 1591 1580 1568 1625 1682 1612 1543 1597 1652 1658 1664 1711 1758
98A758PPl5l4n3n3n4n3M5M4j3j4m3J22J12n3Q5p9n6n5o0J05O3j01POmmjjR5R6q5q5m4m4j3
$$ 1758 1765 1772 1737 1703 1650 1597 1543 1490 1535 1579 1566 1552 1509 1631 1743 1690 1775 1696 1640 1585 1525 1630 1693 1592 1599 1605 1601 1597 1596 1595 1690 1786 1701 1616 1572 1528 1515
92A515j4j4j3PPOPQ8Q8M7M6K7K7o9o9J5J6J12J12l4l4p6p5q3q3M1M1k1k0k0k0J15J16l6l6
$$ 1515 1501 1487 1474 1481 1488 1494 1501 1589 1677 1724 1770 1797 1824 1755 1686 1701 1717 1829 1941 1907 1873 1797 1722 1639 1556 1597 1638 1617 1597 1577 1557 1672 1788 1752 1716
87A716o4o4p1R4J49j6l7l7j8j7K3K3K3K3j8j9n0n0rqqqqqL1L0l8l8N4N3J2J3k9k9J2J2L3L2
$$ 1716 1652 1588 1517 1611 1760 1744 1707 1670 1652 1635 1658 1681 1704 1727 1709 1690 1640 1590 1581 1573 1565 1557 1549 1541 1572 1602 1564 1526 1580 1633 1645 1658 1629 1600 1612 1624 1657 1689
81A689qro2o1L4L4n6n5R5R5J16J16J02K67M23J49l60l60j42j41j39K7J5J5j5j6o7o7k6k6l5
$$ 1689 1681 1672 1610 1549 1583 1617 1561 1506 1601 1696 1812 1928 2030 2297 2720 2869 2509 2149 2007 1866 1727 1754 1769 1784 1769 1753 1686 1619 1593 1567 1532
77A532l6o0J05m2m2L8L7NONOj7j7j7j7OOJ29J30mnQ9p7p8p8L6L5j7j7n8n8o0n9RJ0L5L5l3
$$ 1532 1496 1436 1541 1499 1457 1495 1532 1537 1543 1548 1554 1537 1520 1503 1486 1492 1498 1627 1757 1753 1748 1837 1760 1682 1604 1640 1675 1658 1641 1583 1525 1465 1406 1415 1425 1460 1495 1462
71A462l4N1N1m5m5O1O1l5l5k7k7J4J5K8K8N9N9J35l0q8q9N6N6J52J53J97J98K56K57J39k5
$$ 1462 1428 1479 1530 1485 1440 1501 1562 1527 1492 1465 1438 1452 1467 1495 1523 1582 1641 1776 1746 1658 1569 1625 1681 1833 1986 2183 2381 2637 2894 3033 3008
66C008j39j39k63k63l15j50k9l0L2L2j44K1llk6k7j39K5K8K9N9O0j4j3J7J8J24m0J1J1L2L1
$$ 3008 2869 2730 2467 2204 1889 1739 1710 1680 1712 1744 1600 1621 1618 1615 1589 1562 1423 1448 1476 1505 1564 1624 1610 1597 1614 1632 1756 1716 1727 1738 1770 1801
61A801rj0j1j1L0K9M4M4KLJ82J83J14J14K05K05K91K91k1j86m26m26k27o2r2k58j22M2m0m0
$$ 1801 1792 1782 1771 1760 1790 1819 1863 1907 1909 1912 2094 2277 2391 2505 2710 2915 3206 3497 3476 3290 2864 2438 2211 2149 2057 1799 1677 1719 1679 1639
57A639l5l5m6m5j00O5R6R5j1j1q0q0k1k1M8M8k2k2k2k2o4o4O0N9L4L4ppm2m2m1m2L7L7J6J7
$$ 1639 1604 1569 1523 1478 1378 1443 1539 1634 1623 1612 1532 1452 1431 1410 1458 1506 1484 1462 1440 1418 1354 1290 1350 1409 1443 1477 1470 1463 1421 1379 1338 1296 1333 1370 1386 1403
51A403P3P3k2k3P8P8j28j28Q9Q9pqm6m7M9N0P4P4k2k2p4p5ooJ8J8n3J11M1M2m4m4J2J1l0l0
$$ 1403 1476 1549 1527 1504 1582 1660 1532 1404 1493 1582 1575 1567 1521 1474 1523 1573 1647 1721 1699 1677 1603 1528 1522 1516 1534 1552 1499 1610 1651 1693 1649 1605 1617 1628 1598 1568
46A568k1k1K0K0M0M1m5m5j07N8O1O2q8q7n6J08P4P3r5r5J5J4J5J4Q5Q5Q5Q5l5l6k52q7P9P8
$$ 1568 1547 1526 1546 1566 1606 1647 1602 1557 1450 1508 1569 1631 1543 1456 1400 1508 1582 1655 1560 1465 1480 1494 1509 1523 1608 1693 1778 1863 1828 1792 1540 1453 1532 1610
40A610O9O9J12J13j%m1J24J28j47k74j10m0m1M7M7p7p6R3R3J4J4Q4q1j77j2M2M1L1L0P1P1
$$ 1610 1679 1748 1860 1973 1972 1972 1931 2055 2183 2036 1762 1652 1612 1571 1618 1665 1588 1512 1605 1698 1712 1726 1810 1729 1552 1540 1582 1623 1654 1684 1755 1826
36A826R5p0j06j06k0k0J2J3M3M3P6q9l8l8J15J16n4n3j25L9kko8R6R7o9j4j4m4m5m0m0K8K9
$$ 1826 1921 1851 1745 1639 1619 1599 1611 1624 1667 1710 1786 1697 1659 1621 1736 1852 1798 1745 1620 1659 1657 1655 1587 1683 1780 1711 1697 1683 1639 1594 1554 1514 1542 1571
30A571%%m2m1M3M4M4M3N0N0j9j9NOl5l6o1o2r3r2q6P9Q2Q3J4J4l7J27K8K8n4J10l3l3j05O0
$$ 1571 1571 1571 1529 1488 1531 1575 1619 1662 1712 1762 1743 1724 1729 1735 1700 1664 1603 1541 1448 1356 1270 1349 1431 1514 1528 1542 1505 1632 1660 1688 1634 1744 1711 1678 1573 1633
25A633p5Q9QPJ5J6N6N7m4m3J4J5J12n2j21M4R9R8j08N7MMJ4J4o7o7N7N6Q1Q1J2J2j3j3K8K9
$$ 1633 1558 1647 1655 1662 1677 1693 1749 1806 1762 1719 1733 1748 1860 1808 1687 1731 1830 1928 1820 1877 1881 1885 1899 1913 1846 1779 1836 1892 1973 2054 2066 2078 2065 2052 2080 2109
19B109r3r3r4r3R1R1R0R1K0K0l9l9j22M3M7M6R4R4m6m7j03O3O5O6L4L5n9J06L4L3q0q0J03
$$ 2109 2016 1923 1829 1736 1827 1918 2008 2099 2119 2139 2100 2061 1939 1982 2029 2075 2169 2263 2217 2170 2067 2130 2195 2261 2295 2330 2271 2377 2411 2444 2364 2284 2387
14B387J04j1j0j33L1PPM5M5n1n1J8J8J8J9J46J46ONj9J45ooj10N5l5J30J09J09J19J19j6j6
$$ 2387 2491 2480 2470 2337 2368 2375 2382 2427 2472 2421 2370 2388 2406 2424 2443 2589 2735 2741 2746 2727 2872 2866 2860 2750 2805 2770 2900 3009 3118 3237 3356 3340 3324
9C324L6L6l2J32j1J53K05K05j12N4R6R7l1M64L17J53J90J90J79L45L03L04L67N33N18N19K26
$$ 3324 3360 3396 3364 3496 3485 3638 3843 4048 3936 3990 4086 4183 4152 4616 4933 5086 5276 5466 5645 5990 6293 6597 6964 7497 8015 8534 8760
5H760L92L81N46N20R04Q76J152J101J816K702L746L249k12k595j332k07Q37J304K019K261
$$ 8760 9152 9533 10079 10599 11503 12379 13531 14632 16448 19150 22896 26145 25933 23338 22006 21799 22636 23940 25959 28220
2B8220L416M019N614O975R667J1741J5314J9014K7642M0657O6208J06570J33329K8929j23110
$$ 28220 31636 35655 41269 48244 57911 69652 84966 103980 131622 172279 238487 345057 478386 507315 384205
0C84205j32330q4691m8624k9228j7927j2376r190p926o252m990l505k901k125j741j060o76
$$ 384205 251875 167184 118560 89332 71405 59029 49839 41913 35661 30671 27166 24265 22140 20399 19339 18663
-3A8663O0P75K004K168o04l956l737k583j598j103o92o92m26m26m26m27k22k23p2p2j09j10
$$ 18663 18723 19498 21502 23670 23066 19110 15373 12790 11192 10089 9397 8705 8279 7853 7427 7000 6778 6555 6483 6411 6302 6192
-6F192m7k13k34o9o3k27j13J62Q2j92j15j15r2r1q2q1q2q2j14j14p2p3p7p7j18j18m4m4j13
$$ 6192 6145 5932 5698 5629 5566 5339 5226 5388 5470 5278 5163 5048 4956 4865 4783 4702 4620 4538 4424 4310 4238 4165 4088 4011 3893 3775 3731 3687 3574
-10C574j12M4M3n2n3K9K9R7R7k02k02p9p9n0m9n0n0j04j04J9K0j54j55l0l1K4K4K5K4K2K2
$$ 3574 3462 3506 3549 3497 3444 3473 3502 3599 3696 3494 3292 3213 3134 3084 3035 2985 2935 2831 2727 2746 2766 2612 2457 2427 2396 2420 2444 2469 2493 2515 2537
-15B537K2K2j06j07J7J7opL5L5j5j5j5j5QQRQM2M1n4n5J0RJ0RJ23J23k9k8j16j15j16j15n6
$$ 2537 2559 2581 2475 2368 2385 2402 2396 2389 2424 2459 2444 2429 2414 2399 2407 2415 2424 2432 2474 2515 2461 2406 2416 2425 2435 2444 2567 2690 2661 2633 2517 2402 2286 2171 2115
-20B115n6J2J2m3m3K5K5J4J4k7k7k5k5k5k5L3L3o4o4l6l6O0O0K3K3j8j9K6K6K5K6n3n2j2j1
$$ 2115 2059 2071 2083 2040 1997 2022 2047 2061 2075 2048 2021 1996 1971 1946 1921 1954 1987 1923 1859 1823 1787 1847 1907 1930 1953 1935 1916 1942 1968 1993 2019 1966 1914 1902 1891
-26A891P6P5PPl1l1j38j37j53J21J19J18J6J5n3n4j3j2q2q1L5L5P7P6n2n3j1j2mlmmM3M3N0
$$ 1891 1967 2042 2049 2056 2025 1994 1856 1719 1566 1687 1806 1924 1940 1955 1902 1848 1835 1823 1741 1660 1695 1730 1807 1883 1831 1778 1767 1755 1751 1748 1744 1740 1783 1826 1876
-31A876j14j40K5L6L5J64jn9o0m7m8K2K1L1L0P2P2k2k3k2k3kklkj03j03O6O5N7j08j08N6j6
$$ 1876 1762 1622 1647 1683 1718 1882 1881 1822 1762 1715 1667 1689 1710 1741 1771 1843 1915 1893 1870 1848 1825 1823 1821 1818 1816 1713 1610 1676 1741 1798 1690 1582 1638 1622
-36A622j6L5L5j01j00K2K3O5O5J57pl6l7noj7j8K4K3n5n5n6n5J00J00j3j3n8J07q1q2M9M8
$$ 1622 1606 1641 1676 1575 1475 1497 1520 1585 1650 1807 1800 1764 1727 1722 1716 1699 1681 1705 1728 1673 1618 1562 1507 1607 1707 1694 1681 1623 1730 1649 1567 1616 1664
-41A664R0R0M1M1n6n5j25j24j%N3N3L3j33q6P9M5M5l8l8Q6Q5p0p1jkL9L9l0l0N7N7N4j11m4
$$ 1664 1754 1844 1885 1926 1870 1815 1690 1566 1565 1565 1618 1671 1704 1571 1485 1564 1609 1654 1616 1578 1664 1749 1679 1608 1607 1605 1644 1683 1653 1623 1680 1737 1791 1680 1636
-47A636m4n4n4P5P6k1k1l6l5m3J22J07n7M6M6j24j24l8J27K4K5l4l3m5m5K4K4L5L5o2o1L7
$$ 1636 1592 1538 1484 1559 1635 1614 1593 1557 1522 1479 1601 1708 1651 1697 1743 1619 1495 1457 1584 1608 1633 1599 1566 1521 1476 1500 1524 1559 1594 1532 1471 1508
-52A508L8M7M7j33L1L4L5J15J15rrn9o0j8j8j1j0j1j1qqqqJ1J1J2J1n3n4nJ60J11n4M9N0J5
$$ 1508 1546 1593 1640 1507 1538 1572 1607 1722 1837 1828 1819 1760 1700 1682 1664 1653 1643 1632 1621 1613 1605 1597 1589 1600 1611 1623 1634 1581 1527 1522 1682 1793 1739 1788 1838 1853
-57A853J6k5k6k5k6P1P0p5p6N9N8R9K64L94L94L78K12p6p7j28k94k97k97j62j62j1j1j04j03
$$ 1853 1869 1844 1818 1793 1767 1838 1908 1833 1757 1816 1874 1973 2237 2631 3025 3403 3615 3539 3462 3334 3040 2743 2446 2284 2122 2111 2100 1996 1893
-62A893j04j04K6K6j5j5r7r6K7K7k9k9JKJ4j51J1J1O8O8o7R9O6O7j9j9j6j5k6k6R0p5J8J7
$$ 1893 1789 1685 1711 1737 1722 1707 1610 1514 1541 1568 1539 1510 1511 1513 1527 1376 1387 1398 1466 1534 1467 1566 1632 1699 1680 1661 1645 1630 1604 1578 1668 1593 1611 1628
-67A628o0o0o1o0J18J17K2K1l3l3L6L6p0p0K6K5Q2Q2p0o9j5j5j5j5j6j7M0m2n5J09N4N3m3
$$ 1628 1568 1508 1447 1387 1505 1622 1644 1665 1632 1599 1635 1671 1601 1531 1557 1582 1664 1746 1676 1607 1592 1577 1562 1547 1531 1514 1554 1512 1457 1566 1620 1673 1630
-72A630m3J3o9m6J19k0k0P3P3k3k3m4m4N2N1qqqrj7j8j8j7m6m6J0p2j62LQ4Q4M4M5k3k4o8
$$ 1630 1587 1600 1531 1485 1604 1584 1564 1637 1710 1687 1664 1620 1576 1628 1679 1671 1663 1655 1646 1629 1611 1593 1576 1530 1484 1494 1422 1260 1263 1347 1431 1475 1520 1497 1473 1405
-77A405o8M5K10N5N6j3j4J16m9k88j23J10K8j1j2k8k8O8O8l1l1L8L8J9K0J9K0j2j1M5l7r3
$$ 1405 1337 1382 1592 1647 1703 1690 1676 1792 1743 1455 1332 1442 1470 1459 1447 1419 1391 1459 1527 1496 1465 1503 1541 1560 1580 1599 1619 1607 1596 1641 1604 1511
-82A511P2R0PJ6J5n8n8nnnnk6k7o7o8N5N5m1m1K7K7K7K7P2P2LLNNo4o4qqqqm0m1J%L3L2n0
$$ 1511 1583 1673 1680 1696 1711 1653 1595 1590 1585 1580 1575 1549 1522 1455 1387 1442 1497 1456 1415 1442 1469 1496 1523 1595 1667 1670 1673 1678 1683 1619 1555 1547 1539 1531 1523 1483 1442 1443 1443 1476 1508 1458
-89A458n0m2m3N1N0p1R5Q3Q4L5L5m7m8j3j3n4n5O3O4j9k0l8l8M4M4J3J3j8j7q9P6L5j30l9
$$ 1458 1408 1366 1323 1374 1424 1353 1448 1531 1615 1650 1685 1638 1590 1577 1564 1510 1455 1518 1582 1563 1543 1505 1467 1511 1555 1568 1581 1563 1546 1457 1533 1568 1438 1399
-94A399m0j01O3J01J00J11J11j7j8r9j00J8J9o5o4l9l8l9l8nnP8P7J6J6q7P7J32l3j2j3j04
$$ 1399 1359 1258 1321 1422 1522 1633 1744 1727 1709 1610 1510 1528 1547 1482 1418 1379 1341 1302 1264 1259 1254 1332 1409 1425 1441 1354 1431 1563 1530 1518 1505 1401
-99A401j05L3L3J17J18O5O6L4j31j31L4m6m5M8M7J6J6o6o7NNM7M6j1j1j1j1j0j1P2P3m2m1
$$ 1401 1296 1329 1362 1479 1597 1662 1728 1762 1631 1500 1534 1488 1443 1491 1538 1554 1570 1504 1437 1442 1447 1494 1540 1529 1518 1507 1496 1486 1475 1547 1620 1578 1537
-104A537m1m1P9P9llm2m3M0L9L7L6n6n7O7r7nnl7l6l7l7L1L0L0L1k9k9N3N4%%q2q2NOk1j03
$$ 1537 1496 1455 1534 1613 1610 1607 1565 1522 1562 1601 1638 1674 1618 1561 1628 1531 1526 1521 1484 1448 1411 1374 1405 1435 1465 1496 1467 1438 1491 1545 1545 1545 1463 1381 1386 1392 1371 1268
-109A268J6J82J29l5l8j20N4N3k5k5N8N7n7n8K5K5RJ0RJ0L1L2j05j06k6k6J6J5Q9Q9m8m8J1
$$ 1268 1284 1466 1595 1560 1522 1402 1456 1509 1484 1459 1517 1574 1517 1459 1484 1509 1518 1528 1537 1547 1578 1610 1505 1399 1373 1347 1363 1378 1467 1556 1508 1460 1471
-114A471J1ONR4J1l6J30r1r0q0q0J%q1q2J10J09Q3Jr9O6l1l2ooooJ9J9J9J9L6L6j39K6K1K0
$$ 1471 1482 1488 1493 1587 1598 1562 1692 1601 1511 1431 1351 1352 1352 1271 1189 1299 1408 1491 1492 1393 1459 1428 1396 1390 1384 1378 1372 1391 1410 1429 1448 1484 1520 1381 1407 1428 1448
-120A448n1n2KKKJO0O1K0j44o0K2l4l5Q4Q5N8k4r0P4R9J8j7j00k7N5K4n8opj7j8O6O5JKj36
$$ 1448 1397 1345 1347 1349 1351 1352 1412 1473 1493 1349 1289 1311 1277 1242 1326 1411 1469 1445 1355 1429 1528 1546 1529 1429 1402 1457 1481 1423 1417 1410 1393 1375 1441 1506 1507 1509 1373
-126A373j35Q5Q4LKK4K5n8n7J4J4J5J4kkL9L9R7R6m1m1p1p1J1J1o5o6K4J89J06n9l8l8L1L1
$$ 1373 1238 1323 1407 1410 1412 1436 1461 1403 1346 1360 1374 1389 1403 1401 1399 1438 1477 1574 1670 1629 1588 1517 1446 1457 1468 1403 1337 1361 1550 1656 1597 1559 1521 1552 1583
-131A583M1j23o4o5O3O3n1n1j0j0k6k6J12J11l8l9k8k8j11N3R9R8l7l6MNL8L8r9r9Q8Q8j42
$$ 1583 1624 1501 1437 1372 1435 1498 1447 1396 1386 1376 1350 1324 1436 1547 1509 1470 1442 1414 1303 1356 1455 1553 1516 1480 1484 1489 1527 1565 1466 1367 1455 1543 1401
-136A401K3Q5Q5J2J3r0r0j00O4M2M1Q3Q3L3j32l9l8q8q8noL0K9J12J12J3J3k8k8jjq4q3m4
$$ 1401 1424 1509 1594 1606 1619 1529 1439 1339 1403 1445 1486 1569 1652 1685 1553 1514 1476 1388 1300 1295 1289 1319 1348 1460 1572 1585 1598 1570 1542 1541 1540 1456 1373 1329
-141A329m4R4R3PPj27L7KJN4N3j6j6j6j6l2l1m2J23K0J9j1j2JKJKR1R1Q7n1r9j00j07j08K5
$$ 1329 1285 1379 1472 1479 1486 1359 1396 1398 1399 1453 1506 1490 1474 1458 1442 1410 1379 1337 1460 1480 1499 1488 1476 1477 1479 1480 1482 1573 1664 1751 1700 1601 1501 1394 1286 1311
-147A311K6K5K6J03J03l5l4L6L6L6L7m4m4q4q5R8R7J5J6m2m1m2m1%%M1M1r1r0qqL3L4L3L4
$$ 1311 1337 1362 1388 1491 1594 1559 1525 1561 1597 1633 1670 1626 1582 1498 1413 1511 1608 1623 1639 1597 1556 1514 1473 1473 1473 1514 1555 1464 1374 1366 1358 1391 1425 1458 1492
-152A492RJ0p3p3K4K3K4K4K9K9K9K9k0k1k0k1j26j27O5O6J06J05k2k3j23J5J52J5j01j01n5
$$ 1492 1501 1511 1438 1365 1389 1412 1436 1460 1489 1518 1547 1576 1556 1535 1515 1494 1368 1241 1306 1372 1478 1583 1561 1538 1415 1430 1582 1597 1496 1395 1340
-157A340Q2J1p3K5K4j9j9K2K3m0l9M3M3p8p7MNJ22J21k4k5J4j23m9Q8J33lrr2opm7Q9K0K1
$$ 1340 1422 1433 1360 1385 1409 1390 1371 1393 1416 1376 1337 1380 1423 1345 1268 1272 1277 1399 1520 1496 1471 1485 1362 1313 1401 1534 1531 1522 1430 1424 1417 1370 1459 1479 1500
-162A500J66J66r6r6r7r6M1M0P8mKj34o3K0j51o7J29M7k1k1P0P0n0m9N1N2l2N0M5r3q9oo2
$$ 1500 1666 1832 1736 1640 1543 1447 1488 1528 1606 1602 1604 1470 1407 1427 1276 1209 1338 1385 1364 1343 1413 1483 1433 1384 1435 1487 1455 1505 1550 1457 1368 1362 1300
-167A300o1M5M5M5M5ONo3o3O0N9J9J8K5K4L3L3k19q1J1p1M5M5M4M5n4K9O5p2k8N5M1M0o3o3
$$ 1300 1239 1284 1329 1374 1419 1425 1430 1367 1304 1364 1423 1442 1460 1485 1509 1542 1575 1356 1275 1286 1215 1260 1305 1349 1394 1340 1369 1434 1362 1334 1389 1430 1470 1407 1344
-173A344J15J15j2j2L0K9L7L7n9n9j31j31qpR7R7Nj33n7Q0Q2%J6J6n7n8K2K3K2K2l9l9L0L0
$$ 1344 1459 1574 1562 1550 1580 1609 1646 1683 1624 1565 1434 1303 1295 1288 1385 1482 1487 1354 1297 1377 1459 1459 1475 1491 1434 1376 1398 1421 1443 1465 1426 1387 1417 1447
-178A447K4K5p2p2K1K0R7m0m9m9J1J0Q2Q1l7l7p4RM8r0l8R8J01J00P3o5j29j30p1O6j1j1K1
$$ 1447 1471 1496 1424 1352 1373 1393 1490 1450 1401 1352 1363 1373 1455 1536 1499 1462 1388 1397 1445 1355 1317 1415 1516 1616 1689 1624 1495 1365 1294 1360 1349 1338 1359
-183A359K1O2O2n1n0P3P3M7M7k1k2J7J8n0j32l1J34nnJ7J7k3k4K6K6q7q8l2J32j0r2k9k9O2
$$ 1359 1380 1442 1504 1453 1403 1476 1549 1596 1643 1622 1600 1617 1635 1585 1453 1422 1556 1551 1546 1563 1580 1557 1533 1559 1585 1498 1410 1378 1510 1500 1408 1379 1350 1412
-188A412O2POr0r0JJJ15J14Q1q3q9pK7j38r1P3rj0JJR2R3n8n9l2l3L6L6QRRQJ3J4K3K4j40
$$ 1412 1474 1481 1487 1397 1307 1308 1309 1424 1538 1619 1536 1447 1440 1467 1329 1238 1311 1302 1292 1293 1294 1386 1479 1421 1362 1330 1297 1333 1369 1377 1386 1395 1403 1416 1430 1453 1477 1337
-194A337K5R4p1n9o0J30J31L2n1r7O8m9m9K0J9J15n0j19M6N1N1o2o2K1K0K1K1J0J0l1l2k3
$$ 1337 1362 1456 1385 1326 1266 1396 1527 1559 1508 1411 1479 1430 1381 1401 1420 1535 1485 1366 1412 1463 1514 1452 1390 1411 1431 1452 1473 1483 1493 1462 1430 1407
-199A407k2P0r5Q1Q0KKL1L1l8l7j4j4j5j4l5l6O1O1n3n2j2j1J6J7N7N7k0k1q8j70k4J41J30
$$ 1407 1385 1455 1360 1441 1521 1523 1525 1556 1587 1549 1512 1498 1484 1469 1455 1420 1384 1445 1506 1453 1401 1389 1378 1394 1411 1468 1525 1505 1484 1396 1226 1202 1343 1473
-204A473l4M7l6j54J21onN2N3K1K1o1o1k9k9p0p0P0P0j2j2J03J03J1J1L1j34M1M1n8n8P9P9
$$ 1473 1439 1486 1450 1296 1417 1411 1406 1458 1511 1532 1553 1492 1431 1402 1373 1303 1233 1303 1373 1361 1349 1452 1555 1566 1577 1608 1474 1515 1556 1498 1440 1519 1598
-209A598o5o5J8J7j5j5p1J0Q5q1J7J7j5j5j6j5p7p7J15J15P6P5L5L4k1k1o2o2q3q3%%j1j1
$$ 1598 1533 1468 1486 1503 1488 1473 1402 1412 1497 1416 1433 1450 1435 1420 1404 1389 1312 1235 1350 1465 1541 1616 1651 1685 1664 1643 1581 1519 1436 1353 1353 1353 1342 1331
-214A331P2P1K7K7j10j11m9n0Q8Q8L1L0j1j1j2j3P0P0m6m6m6m6O0O0k3k2P2P2o0o1M9J32M0
$$ 1331 1403 1474 1501 1528 1418 1307 1258 1208 1296 1384 1415 1445 1434 1423 1411 1398 1468 1538 1492 1446 1400 1354 1414 1474 1451 1429 1501 1573 1513 1452 1501 1633 1673
-219A673j24n2n3n2n2qJ58K8n4m5m6k5N8J21m3p5QJ3J3J11n4n0n1o0o0n1n0L3L2N4N5k8k8
$$ 1673 1549 1497 1444 1392 1340 1332 1490 1518 1464 1419 1373 1348 1406 1527 1484 1409 1417 1430 1443 1554 1500 1450 1399 1339 1279 1228 1178 1211 1243 1297 1352 1324 1296
-224A296O7O8j5j6J9J8j4j4p4O4L8m4o9J3M4M5M3M3r4r4O4O4K3K2p0p0k9k8P5P5o3o2Q9R0
$$ 1296 1363 1431 1416 1400 1419 1437 1423 1409 1335 1399 1437 1393 1324 1337 1381 1426 1469 1512 1418 1324 1388 1452 1475 1497 1427 1357 1328 1300 1375 1450 1387 1325 1414 1504
-229A504m8m8O4O4j9j8n3n3Q9R0j36n4j04L4P7o1k1O1KLp5p5J2J2R4R4n2n3n5j39O7p0L7J21
$$ 1504 1456 1408 1472 1536 1517 1499 1446 1393 1482 1572 1436 1382 1278 1312 1389 1328 1307 1368 1370 1373 1298 1223 1235 1247 1341 1435 1383 1330 1275 1136 1203 1133 1170 1291
-235A291N6N6p6p6K4K5j7j7N0N1l2l2n0n0L2L2k1k1O1O1o3o4J9J9K8K8M1m1j09K8J30J30J34
$$ 1291 1347 1403 1327 1251 1275 1300 1283 1266 1316 1367 1335 1303 1253 1203 1235 1267 1246 1225 1286 1347 1284 1220 1239 1258 1286 1314 1355 1314 1205 1233 1363 1493 1627
-240A627mqqj6j5j6j5q3q3jjM7M7M2r5m6m7Q3Q2m3m3m3m3k5k6N6N7J2J3N4N4q1q1KJO6O6j6
$$ 1627 1623 1615 1607 1591 1576 1560 1545 1462 1379 1378 1377 1424 1471 1513 1418 1372 1325 1408 1490 1447 1404 1361 1318 1293 1267 1323 1380 1392 1405 1459 1513 1432 1351 1353 1354 1420 1486 1470
-245A470j7J6J6J6J6n2n1n1n1M0M0M0M0QQQQj4j4K7K7r6r5j4j3O7O7j5j6j7j7j7j7L2L3n0
$$ 1470 1453 1469 1485 1501 1517 1465 1414 1363 1312 1352 1392 1432 1472 1480 1488 1496 1504 1490 1476 1503 1530 1434 1339 1325 1312 1379 1446 1431 1415 1398 1381 1364 1347 1379 1412 1362
-251A362m9mllmJ8J7J8J8KKKLo7o6J6J6K5K4J08J07j81j80J1J2PPQ9Q9%JJ%k5k5N7N8J9K0
$$ 1362 1313 1309 1306 1303 1299 1317 1334 1352 1370 1372 1374 1376 1379 1312 1246 1262 1278 1303 1327 1435 1542 1361 1181 1192 1204 1211 1218 1307 1396 1396 1397 1398 1398 1373 1348 1405 1463 1482 1502
-257A502K3j15m2R5J%N0q8n7K5NOJ34lj67q5nq8n9K3N5N4O5O4l2N1K5j13J1J1n4n4n4n4R2
$$ 1502 1525 1410 1368 1463 1464 1464 1514 1426 1369 1394 1399 1405 1539 1536 1369 1284 1279 1191 1132 1155 1210 1264 1329 1393 1361 1412 1437 1324 1335 1346 1292 1238 1184 1130 1222
-262A222R3J0J1L5L5m8m7J00J01l8l7M0L9m3m3nonnJ6J6J6J6l0l0N2N2n7n6n7n7POJ44J44
$$ 1222 1315 1325 1336 1371 1406 1358 1311 1411 1512 1474 1437 1477 1516 1473 1430 1425 1419 1414 1409 1425 1441 1457 1473 1443 1413 1465 1517 1460 1404 1347 1290 1297 1303 1447 1591
-268A591j06j06k4k3QRR2R1n7n8n7n7K4K4j6j7K7K7J10J10q7q7N0N1p1p0J2J2J5J5k6k6J%
$$ 1591 1485 1379 1355 1332 1340 1349 1441 1532 1475 1417 1360 1303 1327 1351 1335 1318 1345 1372 1482 1592 1505 1418 1468 1519 1448 1378 1390 1402 1417 1432 1406 1380 1381 1381
-273A381m1m0L7L7mlL7L7L8L7n7n7n7n7O8O8K7K7mnq6q6K5K5O6O7m0m0m1m0K1K1k0k1m8m9
$$ 1381 1340 1300 1337 1374 1370 1367 1404 1441 1479 1516 1459 1402 1345 1288 1356 1424 1451 1478 1474 1469 1383 1297 1322 1347 1413 1480 1440 1400 1359 1319 1340 1361 1341 1320 1272 1223
-278A223Q9Q8ppP5P4q3q3%jP9P8j14j14Q2Q2M0M1L3L2qqn5n5K8K8k9k8O4j00LKm9m8M0M0Q2
$$ 1223 1312 1400 1393 1386 1461 1535 1452 1369 1369 1368 1447 1525 1411 1297 1379 1461 1501 1542 1575 1607 1599 1591 1536 1481 1509 1537 1508 1480 1544 1444 1447 1449 1400 1352 1392 1432 1514
-284A514Q2q0q0j1j1m9m9M8M7R1R0l3l3m3m2kjq9q9PPQRl2l3K0K0l2l2J29l6N7N6K4K3K3K3
$$ 1514 1596 1516 1436 1425 1414 1365 1316 1364 1411 1502 1592 1559 1526 1483 1441 1439 1438 1349 1260 1267 1274 1282 1291 1259 1226 1246 1266 1234 1202 1331 1295 1352 1408 1432 1455 1478 1501
-290A501n1n0n1n1J9K0Q8Q8p0p1K5K5l4l5OPPPL8L7J00o5o9o8K8K9kkq1Q5L3L3l5l5l4l5N9
$$ 1501 1450 1400 1349 1298 1317 1337 1425 1513 1443 1372 1397 1422 1388 1353 1359 1366 1373 1380 1418 1455 1555 1490 1421 1353 1381 1410 1408 1406 1325 1410 1443 1476 1441 1406 1372 1337 1396
-295A396N9j47j47L6L6l3l2P9Q0J1J1K0J9J9J9%jM1M1K8K9j3j3q2q2k4J41k9k9j9j9k6k6j5
$$ 1396 1455 1308 1161 1197 1233 1200 1168 1247 1327 1338 1349 1369 1388 1407 1426 1426 1425 1466 1507 1535 1564 1551 1538 1456 1374 1350 1491 1462 1433 1414 1395 1369 1343 1328
-300A328j6j03O3L8L8MMLMM4M4o2o2P9q6M9M8J2J2j32L2J47j8j1j2j8j8j8j8L6L5l4l3k3k3
$$ 1328 1312 1209 1272 1310 1348 1352 1356 1359 1363 1407 1451 1389 1327 1406 1320 1369 1417 1429 1441 1309 1341 1488 1470 1459 1447 1429 1411 1393 1375 1411 1446 1412 1379 1356 1333
-306A333j3j3p3R2jjl3l3RQJ0J0N1N1l1l2l1l1O1O2Q5p9l1l0m1m0l7l6NMM9M9QQm2m2P1P1
$$ 1333 1320 1307 1234 1326 1325 1324 1291 1258 1267 1275 1285 1295 1346 1397 1366 1334 1303 1272 1333 1395 1480 1401 1370 1340 1299 1259 1222 1186 1191 1195 1244 1293 1301 1309 1267 1225 1296 1367
-311A367J05o0o4o4j7j6N2N2J4J4J4J4l6l6l6l6M0M0n6n6O0O0rrNNM6M6qqqqONr0r1J%P0O9
$$ 1367 1472 1412 1348 1284 1267 1251 1303 1355 1369 1383 1397 1411 1375 1339 1303 1267 1307 1347 1291 1235 1295 1355 1346 1337 1342 1347 1393 1439 1431 1423 1415 1407 1413 1418 1328 1237 1238 1238 1308 1377
-318A377M3M4M3M4j9j8o0n9J2J3J3J2m7m8m7m8N7N6J15J15O6r9m8m7m2m1l0N4K06M2l9l8m
$$ 1377 1420 1464 1507 1551 1532 1514 1454 1395 1407 1420 1433 1445 1398 1350 1303 1255 1312 1368 1483 1598 1664 1565 1517 1470 1428 1387 1357 1411 1617 1659 1620 1582 1578
-323A578mlmm1m1J5o7j95l0J30M7j8O4N4k8nq7q8q8O7O6lkl2l2R2R2m7m7K2K1M1M0n6n6N7
$$ 1578 1574 1571 1567 1526 1485 1500 1433 1238 1208 1338 1385 1367 1431 1485 1457 1452 1365 1277 1189 1256 1322 1319 1317 1285 1253 1345 1437 1390 1343 1365 1386 1427 1467 1411 1355 1412
-328A412N8j1j2mmp2p3k8k8o9o9P5P5L4L4n4n3M3M2M0L9n7n7j35j36J80J80L0L1R8R9q8q8
$$ 1412 1470 1459 1447 1443 1439 1367 1294 1266 1238 1169 1100 1175 1250 1284 1318 1264 1211 1254 1296 1336 1375 1318 1261 1126 990 1170 1350 1380 1411 1509 1608 1520 1432
-333A432PQl7l8MMJ7J8k4k4%jm2m2J09J09m2m2PPl4l4N1N2j8j7j09j09NJ69j5j4L7L7l2l1
$$ 1432 1439 1447 1410 1372 1376 1380 1397 1415 1391 1367 1367 1366 1324 1282 1391 1500 1458 1416 1423 1430 1396 1362 1413 1465 1447 1430 1321 1212 1217 1386 1371 1357 1394 1431 1399 1368
-339A368j9O3J02o4rr3JQ4P8nl1l2L2L2LLLLJ6J5J5J5o0n9O3O4j22j21j6j5l7J27L4L5jkm3
$$ 1368 1349 1412 1514 1450 1441 1348 1349 1433 1511 1506 1475 1443 1475 1507 1510 1513 1516 1519 1535 1550 1565 1580 1520 1461 1524 1588 1466 1345 1329 1314 1277 1404 1438 1473 1472 1470 1427
-344A427m2m8m8m8m8pqL4L4J6J7Q5Q6M2M2j08j09J2J2k9l0M7M8m6J19l0l0M9M9M4M5k4k4n
$$ 1427 1385 1337 1289 1241 1193 1186 1178 1212 1246 1262 1279 1364 1450 1492 1534 1426 1317 1329 1341 1312 1282 1329 1377 1331 1450 1420 1390 1439 1488 1532 1577 1553 1529 1524
-349A524np3p4pqppM1M1%%j2j1L9j25LMj7j7lj67ooP6P5n8J06L9M0o4o3j10N4L1L1O9P0k7
$$ 1524 1519 1446 1372 1365 1357 1350 1343 1384 1425 1425 1425 1413 1402 1441 1316 1319 1323 1306 1289 1286 1119 1113 1107 1183 1258 1200 1306 1345 1385 1321 1258 1148 1202 1233 1264 1333 1403 1376
-355A376k7l5l6k5k5l0J34Q3Q3l8l8l8l8o9o9K7K7J3J3J3J3J0J1N1N2L3L2o3o4k4k5M4M4j
$$ 1376 1349 1314 1278 1253 1228 1198 1332 1415 1498 1460 1422 1384 1346 1277 1208 1235 1262 1275 1288 1301 1314 1324 1335 1386 1438 1471 1503 1440 1376 1352 1327 1371 1415 1414
-360A414jR2p2r4r3K0K0K9L0K9K9k2k3n3J13m0j23L1n1j03O2O1j03m4L8J06J05j2j2K9K9M7
$$ 1414 1413 1505 1433 1339 1246 1266 1286 1315 1345 1374 1403 1381 1358 1305 1418 1378 1255 1286 1235 1132 1194 1255 1152 1108 1146 1252 1357 1345 1333 1362 1391 1438
-365A438M7j03j04N3N2j6j6M0M0k9k9l8l8Q7Q6N6N7n6n7j28L6j5j80r4J80J77J2J8J7o1o2
$$ 1438 1485 1382 1278 1331 1383 1367 1351 1391 1431 1402 1373 1335 1297 1384 1470 1526 1583 1527 1470 1342 1378 1363 1183 1089 1269 1446 1458 1476 1493 1432 1370
-370A370m8m8ppm2m2J07J90N2j12j5j4k5k5j18M8LLk8k8L9L9kkRJ0J0Rn5n4O9O9M5M6noP6
$$ 1370 1322 1274 1267 1260 1218 1176 1283 1473 1525 1413 1398 1384 1359 1334 1216 1264 1267 1270 1242 1214 1253 1292 1290 1288 1297 1307 1317 1326 1271 1217 1286 1355 1400 1446 1441 1435 1511
-376A511q9MMr0r0OOO7O7j12j11Q0Q1j6j6Q6Q5j0j1ooj03j03opj6j7J18m7m6J18Q9Q9j07j07
$$ 1511 1422 1426 1430 1340 1250 1256 1262 1329 1396 1284 1173 1253 1334 1318 1302 1388 1473 1463 1452 1446 1440 1337 1234 1228 1221 1205 1188 1306 1259 1213 1331 1420 1509 1402 1295
-381A295J6J6J12J12o5o5k3k4m8m8poO0O0J9J9pqo9R6M8j17n6n5P5P6j0j76J6J5NNM8M8M8
$$ 1295 1311 1327 1439 1551 1486 1421 1398 1374 1326 1278 1271 1265 1325 1385 1404 1423 1416 1408 1339 1435 1483 1366 1310 1255 1330 1406 1396 1220 1236 1251 1256 1261 1309 1357 1405
-386A405M8j8j8n9n9K8K7K8K8j3j4N6N5k4k4k4k3l3l2l3l2K7K7j4j4M9N0L9L9rj74J5J5J7
$$ 1405 1453 1435 1417 1358 1299 1327 1354 1382 1410 1397 1383 1439 1494 1470 1446 1422 1399 1366 1334 1301 1269 1296 1323 1309 1295 1344 1394 1433 1472 1463 1289 1304 1319 1336
-392A336J6N8N8ONmnJ49j6p4p4M7M7m9n0j30j30l3l4J4J5Q3Q3LKLKNNMNk1k1K0K0j4j4m5m5
$$ 1336 1352 1410 1468 1474 1479 1475 1470 1619 1603 1529 1455 1502 1549 1500 1450 1320 1190 1157 1123 1137 1152 1235 1318 1321 1323 1326 1328 1333 1338 1342 1347 1326 1305 1325 1345 1331 1317 1272 1227
-398A227r0P5J06J07rrL3L3n2n1j20j20J05J06L7L7o1o0k0j9NOJ29J30l7l8p8p8N5N5m1m1
$$ 1227 1137 1212 1318 1425 1416 1407 1440 1473 1421 1370 1250 1130 1235 1341 1378 1415 1354 1294 1274 1255 1260 1266 1395 1525 1488 1450 1372 1294 1349 1404 1363 1322
-402A322k7k6M1M2m3m3k2k3k3k3P2P3K1K1JJJ1J1l0l0M9M8j02j03L2L1l7l7R4R5l0k9k8k7
$$ 1322 1295 1269 1310 1352 1309 1266 1244 1221 1198 1175 1247 1320 1341 1362 1363 1364 1375 1386 1356 1326 1375 1423 1321 1218 1250 1281 1244 1207 1301 1396 1366 1337 1309 1282
-408A282J3J4N1N2m5m5K8K7O9O8o8o8%Jk7k7o8o8j6j6Q1Q0n2n2J7J7M1M0%jrj0J1J1K2K1m7
$$ 1282 1295 1309 1360 1412 1367 1322 1350 1377 1446 1514 1446 1378 1378 1379 1352 1325 1257 1189 1173 1157 1238 1318 1266 1214 1231 1248 1289 1329 1329 1328 1319 1309 1320 1331 1353 1374 1327
-413A327m7L2L2L1L2LMP2P2j27j28l2l2M5M5k4k4l7l6MMN1N1N1N1PQQQo3o3k1k2K5K5j6j6
$$ 1327 1280 1312 1344 1375 1407 1410 1414 1486 1558 1431 1303 1271 1239 1284 1329 1305 1281 1244 1208 1212 1216 1267 1318 1369 1420 1427 1435 1443 1451 1388 1325 1304 1282 1307 1332 1316 1300
-419A300PQj3j4O2O1o3o2j0j0j51j4R5J77K22q1j27J1j4O9M9l4J8J8l3l4n3n4M8M9p5p5J56
$$ 1300 1307 1315 1302 1288 1350 1411 1348 1286 1276 1266 1115 1101 1196 1373 1595 1514 1387 1398 1384 1453 1502 1468 1486 1504 1471 1437 1384 1330 1378 1427 1352 1277 1433
-424A433J56n0n1qqn0m9j0j0j0j0n7n7L9L9p2p2P9P9l0k9L9M0q0q0P1P2l4l4O3O3m4m5J07
$$ 1433 1589 1539 1488 1480 1472 1422 1373 1363 1353 1343 1333 1276 1219 1258 1297 1225 1153 1232 1311 1281 1252 1291 1331 1251 1171 1242 1314 1280 1246 1309 1372 1328 1283 1390
-429A390J07j15j16QQM0M0O0O1NNo4o4n3n4p4p4P1P0R1R1jjO7O8o4o4k3k3q4q4j5j6%%R6R6
$$ 1390 1497 1382 1266 1274 1282 1322 1362 1422 1483 1488 1493 1429 1365 1312 1258 1184 1110 1181 1251 1342 1433 1432 1431 1498 1566 1502 1438 1415 1392 1308 1224 1209 1193 1193 1193 1289 1385
-435A385opL4L4j7j7K4K4j17j18L4L4N4N4N5N4k5k4k5k5l7l6L2L2r2r1RJ0n9K4R0m7P3rp2
$$ 1385 1379 1372 1406 1440 1423 1406 1430 1454 1337 1219 1253 1287 1341 1395 1450 1504 1479 1455 1430 1405 1368 1332 1364 1396 1304 1213 1222 1232 1173 1197 1287 1240 1313 1304 1232
-440A232J1R3j00o3P3P5P4o8o9N0M9j9j02l9R8N7N7n7n8j7j7O8O8n5n6J01J00L2j05j19l6
$$ 1232 1243 1336 1236 1173 1246 1321 1395 1327 1258 1308 1357 1338 1236 1197 1295 1352 1409 1352 1294 1277 1260 1328 1396 1341 1285 1386 1486 1518 1413 1294 1258
-445A258P9mk9l0L4L5P7P7m7m6n0n0M6M7j0j0n2n1L1L0m7R1RJ0n1n1M2M3n4n4j8j8j7j8J5
$$ 1258 1337 1333 1304 1274 1308 1343 1420 1497 1450 1404 1354 1304 1350 1397 1387 1377 1325 1274 1305 1335 1288 1379 1388 1398 1347 1296 1338 1381 1327 1273 1255 1237 1220 1202 1217
-450A217J6N6N6ONOOl8l7l7l8K4K4j8J20Q6Mj0rm6m5mmK7K8m1m1J9J9J9J9QQo1o1k6k6J5J6
$$ 1217 1233 1289 1345 1351 1356 1362 1368 1330 1293 1256 1218 1242 1266 1248 1368 1454 1458 1448 1439 1393 1348 1344 1340 1367 1395 1354 1313 1332 1351 1370 1389 1397 1405 1344 1283 1257 1231 1246 1262
-456A262MNO9O8Q1jj33MP1j1n6K6J05q7l8l7K5J08K0K0qqL9m4o5o4M5l7KJm9L2k5k5K2K1o0
$$ 1262 1266 1271 1340 1408 1489 1488 1355 1359 1430 1419 1363 1389 1494 1407 1369 1332 1357 1465 1485 1505 1497 1489 1528 1484 1419 1355 1400 1363 1365 1366 1317 1349 1324 1299 1321 1342 1282
-462A282n9J10K8o5o5k0O2M0M0Q1n6k0k0q0KJ9o4n9K4n0n0Q7J70MNM5r1LKJ7R9J0J0K4j13
$$ 1282 1223 1333 1361 1296 1231 1211 1273 1313 1353 1434 1378 1358 1338 1258 1260 1279 1215 1156 1180 1130 1080 1167 1337 1341 1346 1391 1300 1303 1305 1322 1421 1431 1441 1465 1352
-467A352n5n5QR1K7n5rP4n6n6q7N1L7L7M6M6j07j06M5M5M1M2nj42l0l0L9J21llJ15p7j27m5
$$ 1352 1297 1242 1250 1341 1368 1313 1304 1378 1322 1266 1179 1230 1267 1304 1350 1396 1289 1183 1228 1273 1314 1356 1351 1209 1179 1149 1188 1309 1306 1303 1418 1341 1214 1169
-472A169qJ30J19L7l7l6k0j02o1K1R9J00o9p0j5O8O7j5l1l1m2M1M7M6p5O3P3o4m7m6J7J8P6
$$ 1169 1161 1291 1410 1447 1410 1374 1354 1252 1191 1212 1311 1411 1342 1272 1257 1325 1392 1377 1346 1315 1273 1314 1361 1407 1332 1395 1468 1404 1357 1311 1328 1346 1422
-477A422P6M5j20j31L5J24m0j16j16L6L6l3l3Q3Q3j3j4K0K0K0K0l4l5l4l4K8K9K8K9q0q0p6
$$ 1422 1498 1543 1423 1292 1327 1451 1411 1295 1179 1215 1251 1218 1185 1268 1351 1338 1324 1344 1364 1384 1404 1370 1335 1301 1267 1295 1324 1352 1381 1301 1221 1145
-482A145Q8K6K6noo0o0L6L6j3j4l7J27O9O9m4m4J2J3k8k9L6L6p7p7n0J15K2K2K3K3j8j8K8
$$ 1145 1233 1259 1285 1280 1274 1214 1154 1190 1226 1213 1199 1162 1289 1358 1427 1383 1339 1351 1364 1336 1307 1343 1379 1302 1225 1175 1290 1312 1334 1357 1380 1362 1344 1372
-487A372K8m1m1lkklK8K8P0O9m3m3m3m4k5k6k6k6L2L2L2L2J7J7m1m2r7O7J5J5j0j0j0j0Q4
$$ 1372 1400 1359 1318 1315 1313 1311 1308 1336 1364 1434 1503 1460 1417 1374 1330 1305 1279 1253 1227 1259 1291 1323 1355 1372 1389 1348 1306 1209 1276 1291 1306 1296 1286 1276 1266 1350
-493A350Q3O3j02j41K4Q8Q9k0j86j16M8K7K7L7L7OPPPK8K7J21m5M5M6j43j44j2j2j2j2L6L5
$$ 1350 1433 1496 1394 1253 1277 1365 1454 1434 1248 1132 1180 1207 1234 1271 1308 1314 1321 1328 1335 1363 1390 1511 1466 1511 1557 1414 1270 1258 1246 1234 1222 1258 1293
-498A293q9q8k4k4L4J99n5n6m1m0N6J38O2j04qpK3K4OOOPj13j14nJ60L3n0P5P5j10j10M1M1
$$ 1293 1204 1116 1092 1068 1102 1301 1246 1190 1149 1109 1165 1303 1365 1261 1253 1246 1269 1293 1299 1305 1311 1318 1205 1091 1086 1246 1279 1229 1304 1379 1269 1159 1200 1241
-503A241PQJ03J04L6L6n9j41n0J15J10n4m2m2j6j6l0j13r0P5J18J18k8k9k9j12j28L8J57p
$$ 1241 1248 1256 1359 1463 1499 1535 1476 1335 1285 1400 1510 1456 1414 1372 1356 1340 1310 1197 1107 1182 1300 1418 1390 1361 1332 1220 1092 1130 1287 1280
-508A280K7K7k0k0K1K1J9J8J9J8l2l3L1L0Kq1j32L2J64Q1o8o8q1q0kkp5Q9J07K5P0j1q6lK7
$$ 1280 1307 1334 1314 1294 1315 1336 1355 1373 1392 1410 1378 1345 1376 1406 1408 1327 1195 1227 1391 1472 1404 1336 1255 1175 1173 1171 1096 1185 1292 1317 1387 1376 1290 1287 1314
-513A314K6l7l7k8k8M0M0N9N9o5o5POPOj3j2n4n4K6K7K7K6K9K9J7o5q1Q4M8j17q1Q3P8q7O
$$ 1314 1340 1303 1266 1238 1210 1250 1290 1349 1408 1343 1278 1285 1291 1298 1304 1291 1279 1225 1171 1197 1224 1251 1277 1306 1335 1352 1287 1206 1290 1338 1221 1140 1223 1301 1214 1220
-519A220Q8L2L2L0L1j20j21J6J5Q4Q4K5K6K6K6k9k8O8O8j02j01nor4r5Q5Q4r1r0Q9Q8o1o1
$$ 1220 1308 1340 1372 1402 1433 1313 1192 1208 1223 1307 1391 1416 1442 1468 1494 1465 1437 1505 1573 1471 1370 1365 1359 1265 1170 1255 1339 1248 1158 1247 1335 1274 1213
-524A213L5L5j4j5lQ0Pj58QRRRJ0RK4K5L5L5J8J84M2j22o7R7noK4K3p3p4j6j6n8n8JJJJL2
$$ 1213 1248 1283 1269 1254 1251 1331 1338 1180 1188 1197 1206 1215 1225 1234 1258 1283 1318 1353 1371 1555 1597 1475 1408 1505 1500 1494 1518 1541 1468 1394 1378 1362 1304 1246 1247 1248 1249 1250 1282
-530A282L2j0rKLJ2J3r3P2P6P5M7M7p8MP1r4q9P7l8l8k7k8J3J3J3J3L2L2r1r2QPm4m4J50j4
$$ 1282 1314 1304 1295 1297 1300 1312 1325 1232 1304 1380 1455 1502 1549 1471 1475 1546 1452 1363 1440 1402 1364 1337 1309 1322 1335 1348 1361 1393 1425 1334 1242 1250 1257 1213 1169 1319 1305
-535A305J0RJ3J4k8k9m9n0qqK7K8K8K8L3L3L2L3jkjkK5K4K4K5j20j20o9O9j2P0m6j27M0M1
$$ 1305 1315 1324 1337 1351 1323 1294 1245 1195 1187 1179 1206 1234 1262 1290 1323 1356 1388 1421 1420 1418 1417 1415 1440 1464 1488 1513 1393 1273 1204 1273 1261 1331 1285 1158 1198 1239
-541A239J04J04o5o5j02L7L3L3M3M2l2l2L7L7k5k5k5k5oom8m7KKN8k6j40lM7J30L4L4N3l0
$$ 1239 1343 1447 1382 1317 1215 1252 1285 1318 1361 1403 1371 1339 1376 1413 1388 1363 1338 1313 1307 1301 1253 1206 1208 1210 1268 1242 1102 1099 1146 1276 1310 1344 1397 1367
-546A367j15K2N5k8m0m0K4K4O1O2K0j17JQ4o7o7m6m6P8P8O7O8K6K6LKr4r4k2k2k2k2J4J4J5
$$ 1367 1252 1274 1329 1301 1261 1221 1245 1269 1330 1392 1412 1295 1296 1380 1313 1246 1200 1154 1232 1310 1377 1445 1471 1497 1500 1502 1408 1314 1292 1270 1248 1226 1240 1254 1269
-551A269J4j9k0K2K2j4j5j5j5%J%JqpK5K5O9o7o0n9POOPL9M0jjL2L2o4o4OOP5P5J4J4M9j17
$$ 1269 1283 1264 1244 1266 1288 1274 1259 1244 1229 1229 1230 1230 1231 1223 1216 1241 1266 1335 1268 1208 1149 1156 1162 1168 1175 1214 1254 1253 1252 1284 1316 1252 1188 1194 1200 1275 1350 1364 1378 1427 1310
-557A310p7Q7N2N3rrrrn1n1j85k0Q9Q9L1L0PPM7M8l7l6p8p8P8P9K0j45j4j5R9R9L8L7q7q6
$$ 1310 1233 1320 1372 1425 1416 1407 1398 1389 1338 1287 1102 1082 1171 1260 1291 1321 1328 1335 1382 1430 1393 1357 1279 1201 1279 1358 1378 1233 1219 1204 1303 1402 1440 1477 1390 1304
-563A304K2K2m6m7J6J6J7J6PPl5l4K5K5O6O6M1M0jjq0q0L3J99O6O7p4p5LKKKj72j72p0R6J15
$$ 1304 1326 1348 1302 1255 1271 1287 1304 1320 1327 1334 1299 1265 1290 1315 1381 1447 1488 1528 1527 1526 1446 1366 1399 1598 1664 1731 1657 1582 1585 1587 1589 1591 1419 1247 1177 1273 1388
-569A388m9r8r8M0M0Q1Q1K2K3m6m7qpn0m9P8P8L7L7r2r2N9N9K0J9j1j2r5O8M5M5m3m4m4m3
$$ 1388 1339 1241 1143 1183 1223 1304 1385 1407 1430 1384 1337 1329 1322 1272 1223 1301 1379 1416 1453 1361 1269 1328 1387 1407 1426 1415 1403 1308 1376 1421 1466 1423 1379 1335 1292
-574A292%%O9O9n6n7m6m6m4J21P0P0o9o8J0J1p0R4M3M3n2n2j45K0P5P5l8l8J1J1J1J0l3l4
$$ 1292 1292 1292 1361 1430 1374 1317 1271 1225 1181 1302 1372 1442 1373 1305 1315 1326 1256 1350 1393 1436 1384 1332 1187 1207 1282 1357 1319 1281 1292 1303 1314 1324 1291 1257
-579A257m4m4J44k0m0m1p7Q7R1R1o6o5k5k4N4N4m2m2k2k2p3R2P9P8n5J10J34l1n2n2K3K4R1
$$ 1257 1213 1169 1313 1293 1253 1212 1135 1222 1313 1404 1338 1273 1248 1224 1278 1332 1290 1248 1226 1204 1131 1223 1302 1380 1325 1435 1569 1538 1486 1434 1457 1481 1572
-584A572R2j12j13j12j12k8k8O5j00N3N3n4n4N2N1j7j8O0O0rqQQJ05J04p6p6K0K0K3K2K9j35
$$ 1572 1664 1552 1439 1327 1215 1187 1159 1224 1124 1177 1230 1176 1122 1174 1225 1208 1190 1250 1310 1301 1293 1301 1309 1414 1518 1442 1366 1386 1406 1429 1451 1480 1345
-589A345j24M2j1j0j3J51j0j0L0L0l9m0J0J0l1l2L9L9O4j02NNJ29l6j05j05j39K6N7N7K7K6
$$ 1345 1221 1263 1252 1242 1229 1380 1370 1360 1390 1420 1381 1341 1351 1361 1330 1298 1337 1376 1440 1338 1343 1348 1477 1441 1336 1231 1092 1118 1175 1232 1259 1285
-594A285N0M9j0j1j24J3O5j8j5j4K2K1O2O2p6p5N1N2J0J0m7m7m8m7o7o8P1J52O1p6OPo8o8
$$ 1285 1335 1384 1374 1363 1239 1252 1317 1299 1284 1270 1292 1313 1375 1437 1361 1286 1337 1389 1399 1409 1362 1315 1267 1220 1153 1085 1156 1308 1369 1293 1299 1306 1238 1170
-599A170J5J5L2L1L2L2K4K4j7j8jkq4q5L5L4L4L5llM3M4l5M8mj41n1n2K2K2O8O9j4j4P6P5
$$ 1170 1185 1200 1232 1263 1295 1327 1351 1375 1358 1340 1339 1337 1253 1168 1203 1237 1271 1306 1303 1300 1343 1387 1352 1400 1396 1255 1204 1152 1174 1196 1264 1333 1319 1305 1381 1456
-605A456P6P6j75j75l8l7N2N1N2N2o4o3J9J9L0L0n3n2J17J18p5p5j4j3j4j3J4J4J4J4j6j6
$$ 1456 1532 1608 1433 1258 1220 1183 1235 1286 1338 1390 1326 1263 1282 1301 1331 1361 1308 1256 1373 1491 1416 1341 1327 1314 1300 1287 1301 1315 1329 1343 1327 1311
-610A311r9r8J2J3N4N3K2K2o1o0M5M5M5M5k5k5N8N8p7p6qJ30l0J08j6j53m5L8O5O4l8l8M4
$$ 1311 1212 1114 1126 1139 1193 1246 1268 1290 1229 1169 1214 1259 1304 1349 1324 1299 1357 1415 1338 1262 1254 1384 1354 1462 1446 1293 1248 1286 1351 1415 1377 1339 1383
-615A383M4l3l3l3l3K2K2n5n5l4M8J30l4Pp6KJK1K0l6M6R2p3j08k7pr0JJ66P8mj31m8P2P2
$$ 1383 1427 1394 1361 1328 1295 1317 1339 1284 1229 1195 1243 1373 1339 1346 1270 1272 1273 1294 1314 1278 1324 1416 1343 1235 1208 1201 1111 1112 1278 1356 1352 1221 1173 1245 1317
-620A317L7L6l3l2n4J12J09n6j28L7j1j2p8p8j7O5P6q9p3RJ36N4L6L6n1n2J7J7o6o6qqK3K2
$$ 1317 1354 1390 1357 1325 1271 1383 1492 1436 1308 1345 1334 1322 1244 1166 1149 1214 1290 1201 1128 1137 1273 1327 1363 1399 1348 1296 1313 1330 1264 1198 1190 1182 1205 1227
-625A227J15n1m0m1K3K2K2K3L7L8L7L8k6k6k6k6o3o2P5P5N1N1q7q6J7J8QPQ0q5r0P4P6pq3
$$ 1227 1342 1291 1251 1210 1233 1255 1277 1300 1337 1375 1412 1450 1424 1398 1372 1346 1283 1221 1296 1371 1422 1473 1386 1300 1317 1335 1343 1350 1430 1345 1255 1329 1405 1398 1315
-631A315kL5m8l8l7RJ0M5M6j3r5mJ60o6o6J7J6J54j1m8L6j5j5j0j0m3m3r5P0o5o6j1J55JJ
$$ 1315 1313 1348 1300 1262 1225 1234 1244 1289 1335 1322 1227 1223 1383 1317 1251 1268 1284 1438 1427 1379 1415 1400 1385 1375 1365 1322 1279 1184 1254 1189 1123 1112 1267 1268 1269
-636A269J2J2l0l1p1p1P1P1Q1q3J1J0m1m0M9M9q8q8N2N2J34J34m8m9ppp1p1N6N7M6j18j18
$$ 1269 1281 1293 1263 1232 1161 1090 1161 1232 1313 1230 1241 1251 1210 1170 1219 1268 1180 1092 1144 1196 1330 1464 1416 1367 1360 1353 1282 1211 1267 1324 1370 1252 1134
-641A134M7L3L3M4M3NMQ8Q7k5k4n6n5l0J36M2M3j0rn0n0J2J2j25j25J5J5J4J5J8J8J9J8q6
$$ 1134 1181 1214 1247 1291 1334 1339 1343 1431 1518 1493 1469 1413 1358 1328 1464 1506 1549 1539 1530 1480 1430 1442 1454 1329 1204 1219 1234 1248 1263 1281 1299 1318 1336 1250
-646A250q5J06J07k0k0k1k0j0j0P3P3n1n1m1m1j09N5R0R0P0r4M0M0j2j1K9L0popokjq4q4O4
$$ 1250 1165 1271 1378 1358 1338 1317 1297 1287 1277 1350 1423 1372 1321 1280 1239 1130 1185 1275 1365 1435 1341 1381 1421 1409 1398 1427 1457 1450 1444 1437 1431 1429 1428 1344 1260 1324
-652A324O4p4p3L1L2L2L1o3o2o3o3L6L6L5L6K1K2K1K1l5l4OPo1o0K1K2J7J6N8N7n6n7K6K6
$$ 1324 1388 1314 1241 1272 1304 1336 1367 1304 1242 1179 1116 1152 1188 1223 1259 1280 1302 1323 1344 1309 1275 1281 1288 1227 1167 1188 1210 1227 1243 1301 1358 1302 1245 1271 1297
-657A297K5K6n7n7N1N2N1N2NNj32j32M5M5M5M5m5m4m5m5R7R7J4J4k9l0J1J1q0q1N7k6q3N4
$$ 1297 1322 1348 1291 1234 1285 1337 1388 1440 1445 1450 1318 1186 1231 1276 1321 1366 1321 1277 1232 1187 1284 1381 1395 1409 1380 1350 1361 1372 1292 1211 1268 1242 1159 1213
-662A213J01J8m0m1l7l6n2Q6Q5n1j1j1j9j9J2J1J1J2L7L7r5r5qP4J11k7l0N2llrrrqL5L6L6
$$ 1213 1314 1332 1292 1251 1214 1178 1126 1212 1297 1246 1235 1224 1205 1186 1198 1209 1220 1232 1269 1306 1211 1116 1108 1182 1293 1266 1236 1288 1285 1282 1273 1264 1255 1247 1282 1318 1354
-668A354L6JJJ3J3j45M7rr2m5L8L3n0O5O5O0O1M7M8r0r0K9K9n4n4l9m0m4m5Q0ll3J04K1K0
$$ 1354 1390 1391 1392 1405 1418 1273 1320 1311 1219 1174 1212 1245 1195 1260 1325 1385 1446 1493 1541 1451 1361 1390 1419 1365 1311 1272 1232 1188 1143 1223 1220 1187 1291 1312 1332
-673A332m0l9l5l4l5l4M4M3N9k3l4J30L4j30o3J9M8M9P5q9j25M0M1J22rj0l0k9rj0L0K9L0
$$ 1332 1292 1253 1218 1184 1149 1115 1159 1202 1261 1238 1204 1334 1368 1238 1175 1194 1242 1291 1366 1277 1152 1192 1233 1355 1346 1336 1306 1277 1268 1258 1288 1317 1347
-678A347K9o3o4o3o3QQM5l8o4J00P2P1n8n9j7j8P7P7p4p4M7M6NNL0L1o0o1l5M7L0j35J6R9
$$ 1347 1376 1313 1249 1186 1123 1131 1139 1184 1146 1082 1182 1254 1325 1267 1208 1191 1173 1250 1327 1253 1179 1226 1272 1277 1282 1312 1343 1283 1222 1187 1234 1264 1129 1145 1244
-683A244K2K1J7J7k4k4r1r2L2L2L2L1rj0O0O0rrk2k2k2k2%jN8N8Q6p9j10j10k8k8M1M1K4K5
$$ 1244 1266 1287 1304 1321 1297 1273 1182 1090 1122 1154 1186 1217 1208 1198 1258 1318 1309 1300 1278 1256 1234 1212 1212 1211 1269 1327 1413 1334 1224 1114 1086 1058 1099 1140 1164 1189
-689A189MMm6m5K3K3K3K3j8j8m2m2J37J36ppn4n4L4m8j36K8P2P2M2M1llk4k4j3j3K9K8j15
$$ 1189 1193 1197 1151 1106 1129 1152 1175 1198 1180 1162 1120 1078 1215 1351 1344 1337 1283 1229 1263 1215 1079 1107 1179 1251 1293 1334 1331 1328 1304 1280 1267 1254 1283 1311 1196
-694A196j14J18J19j21j21Q4Q5n8n7J0J1N1N1J0Rj6j6N2N3j1j1L0L0o8o8k7k6m5m5J06J06
$$ 1196 1082 1200 1319 1198 1077 1161 1246 1188 1131 1141 1152 1203 1254 1264 1273 1257 1241 1293 1346 1335 1324 1354 1384 1316 1248 1221 1195 1150 1105 1211 1317
-699A317l7l6L2L2lmL7L8M9M9p4p5RRj2j2MMLMj7j8LMO2O2ppj52j52Q1Q2O2O3l4l4j8j8o0
$$ 1317 1280 1244 1276 1308 1305 1301 1338 1376 1425 1474 1400 1325 1334 1343 1331 1319 1323 1327 1330 1334 1317 1299 1302 1306 1368 1430 1423 1416 1264 1112 1193 1275 1337 1400 1366 1332 1314 1296 1236
-705A236n9k8k8J24J23mnmnm3m3kkJ31J30j03j03J9J9k2k2K4K5m5m4k5k5J6J6J1J2n7n7OP
$$ 1236 1177 1149 1121 1245 1368 1364 1359 1355 1350 1307 1264 1262 1260 1391 1521 1418 1315 1334 1353 1331 1309 1333 1358 1313 1269 1244 1219 1235 1251 1262 1274 1217 1160 1166 1173
-710A173K6K7m6m7J04J05j3j3j2j3N9N8r2r3L9L9kkn6n6M0M1j4j3j4j4K3K3O3O4M1M1j%j42
$$ 1173 1199 1226 1180 1133 1237 1342 1329 1316 1304 1291 1350 1408 1316 1223 1262 1301 1299 1297 1241 1185 1225 1266 1252 1239 1225 1211 1234 1257 1320 1384 1425 1466 1465 1465 1323
-716A323j42j8j9j4j4J37J38m8m8m7m8j1j0Q5Q5M5M6j34j33j%j%L5L6j6j6j34J40J20m5k8
$$ 1323 1181 1163 1144 1130 1116 1253 1391 1343 1295 1248 1200 1189 1179 1264 1349 1394 1440 1306 1173 1172 1172 1171 1171 1206 1242 1226 1210 1076 1216 1336 1291 1263
-721A263k9l8l9J8J8k3k3J9K0J9K0N4N4m3m2L2L3J5J5J24j52q9P5J3J3p3p3K6K6K5K6j%j%
$$ 1263 1234 1196 1157 1175 1193 1170 1147 1166 1186 1205 1225 1279 1333 1290 1248 1280 1313 1328 1343 1467 1315 1226 1301 1314 1327 1254 1181 1207 1233 1258 1284 1283 1283 1282 1282
-726A282N9N9l6l7LMJ00R9l7l7l7l7m7m8J03J03j24j24k8k9j1j1n2J12K04p2K5K5p5p5K0K1
$$ 1282 1341 1400 1364 1327 1330 1334 1434 1533 1496 1459 1422 1385 1338 1290 1393 1496 1372 1248 1220 1191 1180 1169 1117 1229 1433 1361 1386 1411 1336 1261 1281 1302
-731A302j1j1j1j1j0j0L1L1o1o2O2O2k6k5k5k6M8M8L7L7O4j02j01O3m9m9N7N7l5l5l6l5M8
$$ 1302 1291 1280 1269 1258 1248 1238 1269 1300 1239 1177 1239 1301 1275 1250 1225 1199 1247 1295 1332 1369 1433 1331 1230 1293 1244 1195 1252 1309 1274 1239 1203 1168 1216
-736A216M8POl0l0J1J1QQJ12n4r6O8OOk1k1M7M7k3k3k3k3L5L4l4l4OPP6P6lklkkkL9L9p4p3
$$ 1216 1264 1271 1277 1247 1217 1228 1239 1247 1255 1367 1313 1217 1285 1291 1297 1276 1255 1302 1349 1326 1303 1280 1257 1292 1326 1292 1258 1264 1271 1347 1423 1420 1418 1415 1413 1411 1409 1448 1487 1413 1340
-742A340L0j36p7Q8P7q8k6k7l7l7J26J26n2n2m7m6M9N0J9J9k2k2KLLKM1M1k8k8k9k9N7N7L
$$ 1340 1370 1234 1157 1245 1322 1234 1208 1181 1144 1107 1233 1359 1307 1255 1208 1162 1211 1261 1280 1299 1277 1255 1257 1260 1263 1265 1306 1347 1319 1291 1262 1233 1290 1347 1350
-747A350j62%%N8N9J8J8qrqqJ06J06j7j8k7k7q6q6l1J33J23m2nj70j47J29O7O6j2j2k9k9k8
$$ 1350 1188 1188 1188 1246 1305 1323 1341 1333 1324 1316 1308 1414 1520 1503 1485 1458 1431 1345 1259 1228 1361 1484 1442 1437 1267 1120 1249 1316 1382 1370 1358 1329 1300 1272
-753A272k9j%o9o9O9O9J%P0O9n5n4j09j09R7R7p9q0M4M4L0L1l9l8L3L3L3L3M8M8j04j03j3
$$ 1272 1243 1242 1242 1173 1104 1173 1242 1243 1243 1313 1382 1327 1273 1164 1055 1152 1249 1170 1090 1134 1178 1208 1239 1200 1162 1195 1228 1261 1294 1342 1390 1286 1183 1170
-758A170j4J65J66k6k6J5J6r3r3M1M1p3R2q7q7M6K10l4l3l3l2m0J26O7r8j45j46P2P2MML8
$$ 1170 1156 1321 1487 1461 1435 1450 1466 1373 1280 1321 1362 1289 1381 1294 1207 1253 1463 1429 1396 1363 1331 1291 1417 1484 1386 1241 1095 1167 1239 1243 1247 1285
$$ [...]
##END=	
##END=	
