##TITLE=	(1) kmi-TMSCCI-dist-2.10.fid



(2)  #1
##JCAMP-DX=	6.0	$$ MestReNova 14.1.1-24571
##DATA TYPE=	LINK
##BLOCK_ID=	1
##BLOCKS=	2    
##ORIGIN=	Mestrelab Research S.L.
##OWNER=	hrzepa
##$MNOVA/LINK_BLOCK_TYPE=	PAGE
##TITLE=	 #1
##JCAMP-DX=	6.0	$$ MestReNova 14.1.1-24571
##DATA TYPE=	LINK
##BLOCK_ID=	2
##BLOCKS=	1    
##ORIGIN=	Mestrelab Research S.L.
##OWNER=	hrzepa
##$MNOVA/LINK_BLOCK_TYPE=	ITEM	$$ Molecule
##$MNOVA/ITEM/POLYGON=	(XY..XY)
5557,6071
6178.6,6071
6178.6,6525.34
5557,6525.34
5557,6071
##$MNOVA/ITEM/Z=	1
##$MNOVA/ITEM/ANGLE=	0
##TITLE=	
##JCAMP-CS=	3.7	$$ MestReNova 14.1.1-24571
##ORIGIN=	Mestrelab Research S.L.
##OWNER=	hrzepa
##BLOCK_ID=	3
##NAMES=	
##ATOMLIST=	
$$ AN	AS	NH
	1	C	 
	2	C	 
	3	I	 
	4	Si	 
	5	C	3
	6	C	3
	7	C	3
##BONDLIST=	
$$ AN1	AN2	BT
	1	2	T
	1	4	S
	2	3	S
	4	5	S
	4	6	S
	4	7	S
##MAXRASTER=	32768
##XY_RASTER=	
$$ AN	X	Y	Z
	1	0	0	0
	2	16383	0	0
	3	32768	0	0
	4	-16383	0	0
	5	-24575	14188	0
	6	-24575	-14188	0
	7	-32768	0	0
##END=	
##END=	
##TITLE=	kmi-TMSCCI-dist-2.10.fid


##JCAMP-DX=	6.0	$$ MestReNova 14.1.1-24571
##DATA TYPE=	LINK
##BLOCK_ID=	4
##BLOCKS=	1    
##ORIGIN=	Mestrelab Research S.L.
##OWNER=	hrzepa
##$MNOVA/LINK_BLOCK_TYPE=	ITEM	$$ NMR Spectrum
##$MNOVA/ITEM/POLYGON=	(XY..XY)
5321,5835
8722,5835
8722,8208
5321,8208
5321,5835
##$MNOVA/ITEM/Z=	0
##$MNOVA/ITEM/ANGLE=	0
##TITLE=	kmi-TMSCCI-dist-2.10.fid
##JCAMP-DX=	6.0	$$ MestReNova 14.1.1-24571
##BLOCK_ID=	5
##DATA TYPE=	NMR SPECTRUM
##DATA CLASS=	XYDATA
##NUMDIM=	1
##ORIGIN=	Bruker BioSpin GmbH
##OWNER=	root
##.OBSERVE FREQUENCY=	500.13308850747802126
##.OBSERVE NUCLEUS=	^1H
##.SOLVENT NAME=	CDCl3
##.PULSE SEQUENCE=	zg30
##LONGDATE=	2022/03/10 12:55:00.000
##.ACQUISITIONMODE=	SIMULTANEOUS (DQD)
##$ORIGINAL FORMAT=	Bruker XWIN-NMR
##$MNOVA/SCALES_VERSION=	9
##$PARAMETER FILE=	(acqus, ASCII, /Users/hrzepa/Library/Mobile%20Documents/com~apple~CloudDocs/C2/Pure%20samples/kmi-TMSCCI-dist-2/(iodoethynyl)trimethylsilane/acqus, 0)
$$ ##TITLE= Parameter file, TOPSPIN		Version 3.2
$$ ##JCAMPDX= 5.0
$$ ##DATATYPE= Parameter Values
$$ ##NPOINTS= 1	$$ modification sequence number
$$ ##ORIGIN= Bruker BioSpin GmbH
$$ ##OWNER= root
$$ $$ 2022-03-10 12:55:18.185 +0900  root@CZC31189P3
$$ $$ Z:/miyamoto/kmi-TMSCCI-dist-2/10/acqus
$$ $$ process C:\Bruker\TopSpin3.2\prog\mod\dirdata.exe
$$ ##$ACQT0= -2.52100840336134
$$ ##$AMP= (0..31)
$$ 100 100 100 100 100 100 100 100 100 100 100 100 100 100 100 100 100 100
$$ 100 100 100 100 100 100 100 100 100 100 100 100 100 100
$$ ##$AMPCOIL= (0..19)
$$ 0 0 0 0 0 0 0 0 0 0 0 0 0 0 0 0 0 0 0 0
$$ ##$ANAVPT= -1
$$ ##$AQSEQ= 0
$$ ##$AQ_mod= 3
$$ ##$AUNM= <au_zg>
$$ ##$AUTOPOS= <5 >
$$ ##$BF1= 500.13
$$ ##$BF2= 500.13
$$ ##$BF3= 500.13
$$ ##$BF4= 500.13
$$ ##$BF5= 500.13
$$ ##$BF6= 500.13
$$ ##$BF7= 500.13
$$ ##$BF8= 500.13
$$ ##$BYTORDA= 0
$$ ##$CAGPARS= (0..11)
$$ 0 0 0 0 0 0 0 0 0 0 0 0
$$ ##$CFDGTYP= 0
$$ ##$CFRGTYP= 9
$$ ##$CHEMSTR= <none>
$$ ##$CNST= (0..63)
$$ 1 1 1 1 1 1 1 1 1 1 1 1 1 1 1 1 1 1 1 1 1 1 1 1 1 1 1 1 1 1 1 1 1 1 1 1
$$ [...]
$$ 130000 130000 130000 130000 130000 130000 130000 130000 130000 130000 130000
$$ 130000 130000 130000 130000 130000 130000 130000 130000 130000 130000 130000
$$ 130000 130000 130000 130000 130000 130000 130000 0 0 0 0 0 0 0 0 0 0 0
$$ 0 0 0 0 0 0 0 0 0 0 0 0 0
$$ ##$ShimPowMaxUC= (0..63)
$$ 130000 130000 130000 130000 130000 130000 130000 130000 130000 130000 130000
$$ 130000 130000 130000 130000 130000 130000 130000 130000 130000 130000 130000
$$ 130000 130000 130000 130000 130000 130000 130000 130000 130000 130000 130000
$$ 130000 130000 130000 130000 130000 130000 130000 0 0 0 0 0 0 0 0 0 0 0
$$ 0 0 0 0 0 0 0 0 0 0 0 0 0
$$ ##$ShimPowMaxUG= (0..63)
$$ 524287 524287 524287 524287 524287 524287 524287 524287 524287 524287 524287
$$ 524287 524287 524287 524287 524287 524287 524287 524287 524287 524287 524287
$$ 524287 524287 524287 524287 524287 524287 524287 524287 524287 524287 524287
$$ 524287 524287 524287 524287 524287 524287 0 0 0 0 0 0 0 0 0 0 0 0 0 0 0
$$ 0 0 0 0 0 0 0 0 0 0
$$ ##$ShimPowRcbType= 3
$$ ##$ShimPowRes= (0..63)
$$ 1e-020 1e-020 1e-020 1e-020 1e-020 1e-020 1e-020 1e-020 1e-020 1e-020 1e-020
$$ 1e-020 1e-020 1e-020 1e-020 1e-020 1e-020 1e-020 1e-020 1e-020 1e-020 1e-020
$$ 1e-020 1e-020 1e-020 1e-020 1e-020 1e-020 1e-020 1e-020 1e-020 1e-020 1e-020
$$ 1e-020 1e-020 1e-020 1e-020 1e-020 1e-020 1e-020 0 0 0 0 0 0 0 0 0 0 0
$$ 0 0 0 0 0 0 0 0 0 0 0 0 0
$$ ##$ShimPowRng0= (0..63)
$$ 1 1 1 1 1 1 1 1 1 1 1 1 1 1 1 1 1 1 1 1 1 1 1 1 1 1 1 1 1 1 1 1 1 1 1 1
$$ 1 1 1 1 0 0 0 0 0 0 0 0 0 0 0 0 0 0 0 0 0 0 0 0 0 0 0 0
$$ ##$ShimPowRng1= (0..63)
$$ 1 1 1 1 1 1 1 1 1 1 1 1 1 1 1 1 1 1 1 1 1 1 1 1 1 1 1 1 1 1 1 1 1 1 1 1
$$ 1 1 1 1 0 0 0 0 0 0 0 0 0 0 0 0 0 0 0 0 0 0 0 0 0 0 0 0
$$ ##$ShimPowRng2= (0..63)
$$ 1 1 1 1 1 1 1 1 1 1 1 1 1 1 1 1 1 1 1 1 1 1 1 1 1 1 1 1 1 1 1 1 1 1 1 1
$$ 1 1 1 1 0 0 0 0 0 0 0 0 0 0 0 0 0 0 0 0 0 0 0 0 0 0 0 0
$$ ##$ShimPowRng3= (0..63)
$$ 1 1 1 1 1 1 1 1 1 1 1 1 1 1 1 1 1 1 1 1 1 1 1 1 1 1 1 1 1 1 1 1 1 1 1 1
$$ 1 1 1 1 0 0 0 0 0 0 0 0 0 0 0 0 0 0 0 0 0 0 0 0 0 0 0 0
$$ ##$ShimSysFunc= (0..63)
$$ 1 2 3 4 5 6 7 8 9 10 0 37 38 35 16 15 14 13 12 11 28 27 26 25 24 23 36
$$ 22 30 29 20 21 34 33 32 31 17 18 19 0 0 0 0 0 0 0 0 0 0 0 0 0 0 0 0 0 0
$$ 0 0 0 0 0 0 0
$$ ##$ShimSysMatrix= 0
$$ ##$ShimSysType= 4
$$ ##$TFXNUM= 0
$$ ##$TRIPLO2= 0
$$ ##$VTU= 2
$$ ##$VTUETH= <149.236.99.20>
$$ ##$VTUTY= <no>
$$ ##$WBREFAM= (0..15)
$$ 100 100 100 100 100 100 100 100 100 100 100 100 100 100 100 100
$$ ##$WBREFLM= (0..15)
$$ 1 0 0 0 0 0 0 0 0 0 0 0 0 0 0 0
$$ ##$WBREFPH= (0..15)
$$ 0.03 0 0 0 0 0 0 0 0 0 0 0 0 0 0 0
$$ ##$WBSGU= (0..15)
$$ 0 0 0 0 0 0 0 0 0 0 0 0 0 0 0 0
$$ ##$XFAC= 2
$$ ##END=
$$ 
##$DECIM=	2000
##$DSPFVS=	20
##XUNITS=	HZ
##YUNITS=	ARBITRARY UNITS
##FIRSTX=	8076.7503640163304226
##LASTX=	-1923.0970480930450321
##DELTAX=	-0.152587890625
##XFACTOR=	1
##YFACTOR=	0.009282931562834759176
##FIRSTY=	17.268154144287109375
##MINY=	1.5738036632537841797
##MAXY=	4815.45654296875
##NPOINTS=	65536
##XYDATA=	(X++(Y..Y))
$$ [...]
1645A542J6q3P5Q3p5q7q7j12j11J26J26k3k3%JN1N1o0o0KKk2k2j6j5L1L2m6m7JJJ6J7L0L0
1640A344J39j9o6R2N9N9j06j05qpq6q7N2N2J00R9L2L1j6j6n2n1r9r9M3M4l5l6L1L2PQL0L1
1635A397L0L0noool3l4M5M6L8L8m0m1n7n7K3K2N9N8k7k6Lr1j5j4k3k3P8j7P7P8K0p5l8N7K1
1629A486K2j4j4kr7k6O8j4j5j5j4J18K3l8l7L5L6p0o9o3o3K8J24J65Pl9N7ppn6n7n6n7J6J6
1624A371J6J6l3l3k2k3q6P2R4R4L2L1k1k2Jr4n6L8N7j02n5J04Q4j1k2k1l6N9j%R8LRRj3j4
1618A523l8l7K2K1o1L3L4o1lkPPJJK5p1OPn6n6N4N5L3L4K7K8K3p2j8j9m4m5k1k1M1M0pj02
1613A288k7J30M2n4j4j4N7l8LLP7P6J8J8l4j28MR8qqJ1J0ppj03qP0k4J7J7k7k6j27L2J17m1
1607A393j4Q1P1k4q5q6m4N1O6r2k6O8J33J33qj02j45n1J49N5mll9N6j0rq2q3o3o3j5j6L5L6
$$ plain form
1645 1542 1558 1475 1550 1633 1558 1471 1384 1272 1161 1287 1413 1390 1367 1367 1368 1419 1470 1410 1350 1352 1354 1332 1310 1294 1279 1310 1342 1296 1249 1250 1251 1267 1284 1314 1344
1640 1344 1483 1464 1398 1490 1549 1608 1502 1397 1389 1382 1296 1209 1261 1313 1413 1512 1544 1575 1559 1543 1491 1440 1341 1242 1285 1329 1294 1258 1289 1321 1328 1336 1366 1397
1635 1397 1427 1457 1452 1446 1440 1434 1401 1367 1412 1458 1496 1534 1494 1453 1396 1339 1362 1384 1443 1501 1474 1448 1451 1360 1345 1331 1308 1285 1363 1346 1423 1501 1521 1446 1408 1465 1486
1629 1486 1508 1494 1480 1478 1381 1355 1423 1409 1394 1379 1365 1483 1506 1468 1431 1466 1502 1432 1363 1300 1237 1265 1389 1554 1561 1522 1579 1572 1565 1509 1452 1396 1339 1355 1371
1624 1371 1387 1403 1370 1337 1315 1292 1206 1278 1372 1466 1498 1529 1508 1486 1487 1393 1337 1375 1432 1330 1275 1379 1463 1452 1430 1409 1373 1432 1431 1431 1529 1532 1541 1550 1537 1523
1618 1523 1485 1448 1470 1491 1430 1463 1497 1436 1433 1431 1438 1445 1446 1447 1472 1401 1407 1414 1358 1302 1356 1411 1444 1478 1505 1533 1556 1484 1466 1447 1403 1358 1337 1316 1357 1397 1390 1288
1613 1288 1261 1391 1433 1379 1365 1351 1408 1370 1373 1376 1453 1529 1547 1565 1531 1403 1407 1505 1497 1489 1500 1510 1503 1496 1393 1385 1455 1431 1448 1465 1438 1412 1285 1317 1434 1393
1607 1393 1379 1460 1531 1507 1422 1336 1292 1343 1409 1317 1291 1359 1492 1625 1617 1515 1370 1319 1468 1523 1519 1516 1477 1533 1523 1514 1432 1349 1286 1223 1208 1192 1227 1263
1602A263L5L6%JnR0o4o4N4N3J7J8l0l0N2N2N7l7q6q7l5l6m4J13J71J3j05N3O2l4r1Nn5n5K6
1596A313K5P3P3MMq1q1P7j8m1N3M2M2K3K4j9k0k0k0NMMNj1j0M2n2m4m5llK3K4n6n5k7k7QJ99
1591A434l2l1o6o7Q3Q3MMJ6J6m4J46n6n7L4L5r1r0N2N2mnn3n2j1j1L7L6L6L6j2j1k7k6k6k7
1585A305o2o2M9M8O0O0R9r1j12P7L8L8L3L3m7m6%%j%N7N8N7N7o9p0k2k2o9p0P3P3LKKKp8p9
1579A324O5O4l0l1J8J7jj%jJ8J7J8J7k8k9L0L1j13P8P8j12rqP1P0j87LJ13p6n1n1J7J6P8P9
1574A494L1L0jkn0m9k8k9q8PN6m0K0K0m4m5m4m4M8M9n9L7J18K4k3k2J3J07n7n7K6K7K6K6q8
1568A389q7o6R3R0R1K1j36m0N5qrK2K1P5k0q6q7j3j3L9L8k4P0P7q1K6o9j00nm8M6J53mnR0
1563A495QJ03o5j61J7J7J7J7lR2m0m1m7m7ooQ8on4M1L2L2j05j04N2N2M5M6P2k3j13j12J5J4
$$ plain form
1602 1263 1298 1334 1334 1335 1330 1420 1356 1292 1346 1399 1416 1434 1404 1374 1426 1478 1535 1498 1412 1325 1290 1254 1210 1323 1494 1507 1402 1455 1517 1483 1392 1397 1342 1287 1313
1596 1313 1338 1411 1484 1488 1492 1411 1330 1407 1389 1348 1401 1443 1485 1508 1532 1513 1493 1473 1453 1458 1462 1466 1471 1460 1450 1492 1440 1396 1351 1348 1345 1368 1392 1336 1281 1254 1227 1235 1434
1591 1434 1402 1371 1305 1238 1321 1404 1408 1412 1428 1444 1400 1546 1490 1433 1467 1502 1411 1321 1373 1425 1421 1416 1363 1311 1300 1289 1326 1362 1398 1434 1422 1411 1384 1358 1332 1305
1585 1305 1243 1181 1230 1278 1338 1398 1497 1406 1294 1371 1409 1447 1480 1513 1466 1420 1420 1420 1419 1419 1476 1534 1591 1648 1579 1509 1487 1465 1396 1326 1399 1472 1475 1477 1479 1481 1403 1324
1579 1324 1389 1453 1423 1392 1410 1427 1426 1425 1425 1424 1442 1459 1477 1494 1466 1437 1467 1498 1385 1463 1541 1429 1420 1412 1483 1553 1366 1369 1482 1406 1355 1304 1321 1337 1415 1494
1574 1494 1525 1555 1554 1552 1502 1453 1425 1396 1308 1315 1371 1331 1351 1371 1327 1282 1238 1194 1242 1291 1232 1269 1387 1411 1388 1366 1379 1486 1429 1372 1398 1425 1451 1477 1389
1568 1389 1302 1236 1329 1419 1510 1531 1395 1355 1410 1402 1393 1415 1436 1511 1491 1405 1318 1305 1292 1331 1369 1345 1415 1492 1411 1437 1368 1268 1263 1215 1261 1414 1410 1405 1495
1563 1495 1503 1606 1541 1380 1397 1414 1431 1448 1445 1537 1497 1456 1409 1362 1356 1350 1438 1432 1378 1419 1451 1483 1378 1274 1326 1378 1423 1469 1541 1518 1405 1293 1308 1322
1558A322J5J5O5O5qqq6RN7l8n1n1n7n7j3j2j8P7J02J03klj2j3o6K9K7K8r9lKKl9m0K9K9J08
1552A408J08mnmmk2k2k2k2J10J11o4o3j02j02P2P2m4m5r1r2P2P1K4K4K8K8K8K8r3r4J7J8J6
1547A340J6P0P0n7L8J71k0j29j29JKj5j4j5j4J4J4J4J4Q5Q6L8L7j07j08p8J12N2m3m4N2N4
1542A507j35K5K5k6k6K2K2r9j00M4M3N1N1rqJ33n6j99j0K5K4j1j1m2m2L6L7J08J08l4l4J0
1537A429J0o9o9K6K6n3n4ONj3Q2J10q0Q6rl9l8m5m5kjM6M6LLN7N6j17k3R8o0j09j5O5O5m0
1532A338m0m0m0L2L1J21l8n0m9l8J21ooJ12J6j59o4J9J9J9K0J3J4J11J7m1m1N8N9Pq8k4P1
1527A474O6l0l3l4QQOOOOp2p2j20j19O9O9P6P5OJ00J01On8n8O9k6n7n8k2k2Jr4m7M8K5K4L6
1521A363L7l6N9J2q4L2L1q0p9O4J59j2j1M0n4N8l7j27l2P3k2K7K8k0k0o1L5j9j9PQJ08J08
$$ plain form
1558 1322 1337 1352 1417 1482 1474 1466 1380 1389 1446 1408 1357 1306 1249 1192 1179 1167 1149 1226 1328 1431 1429 1426 1414 1401 1335 1364 1391 1419 1320 1317 1319 1321 1282 1242 1271 1300 1408
1552 1408 1516 1512 1507 1503 1499 1477 1455 1433 1411 1521 1632 1568 1505 1403 1301 1373 1445 1401 1356 1265 1173 1245 1316 1340 1364 1392 1420 1448 1476 1383 1289 1306 1324 1340
1547 1340 1356 1426 1496 1439 1477 1648 1628 1499 1370 1371 1373 1358 1344 1329 1315 1329 1343 1357 1371 1456 1542 1580 1617 1510 1402 1324 1436 1488 1445 1401 1453 1507
1542 1507 1372 1397 1422 1396 1370 1392 1414 1315 1215 1259 1302 1353 1404 1395 1387 1520 1464 1265 1255 1280 1304 1293 1282 1240 1198 1234 1271 1379 1487 1453 1419 1429
1537 1429 1439 1370 1301 1327 1353 1300 1246 1252 1257 1244 1326 1436 1356 1442 1433 1394 1356 1311 1266 1264 1263 1309 1355 1358 1361 1418 1474 1357 1334 1432 1372 1263 1248 1313 1378 1338
1532 1338 1298 1258 1218 1250 1281 1402 1364 1314 1265 1227 1348 1342 1336 1448 1464 1305 1241 1260 1279 1298 1318 1331 1345 1456 1473 1432 1391 1449 1508 1515 1427 1403 1474
1527 1474 1540 1510 1477 1443 1451 1459 1465 1471 1477 1483 1411 1339 1219 1100 1169 1238 1314 1389 1395 1495 1596 1602 1544 1486 1555 1529 1472 1414 1392 1370 1371 1277 1230 1278 1303 1327 1363
1521 1363 1400 1364 1423 1435 1351 1383 1414 1334 1255 1319 1478 1466 1455 1495 1441 1499 1462 1335 1303 1376 1354 1381 1409 1389 1369 1308 1343 1324 1305 1312 1320 1428 1536
1516A536O0r9j5j5O2l3K1K1k1k1k1k1n7n7n6n7Q3Q4k7k8M6M5l4l4L3L4j4j4LLN1N1l4l3l3
1511A409l3L9M0qqq0q0L1L1J03J02l9m0l3l3l3l2K9L0P7P7n5n5P6P6K5j66j2j1m0m0PQk0k0
1505A322k0k0O6O7j3j3n1n1mmj2j3O7O6L2L1L1L2o3o2J6J7n8n7J0RR2r8RQJ0J1N7N8nmnnK0
1499A473K1K0K0q5q4K6K6p2p2P1P0K6K5K5K5m5m6m5m6P1P2qqk4k4p1p2N2N3N2N2k8k8J9K0
1494A461qpppn6n5n0m9nQ9J26l3p9p9N4N3o4o5P9P8P5P5o8o7j6j6O3O3q5q6K6K5J03J03p8
1489A493p7N2m4j90l1K3K2L3L3l7l7P4P4n2n3K6K7m4m5m4m5rqP0P0K0K0K0K0j7j7O3O2n6n6
1483A340j03N4R0oPq9l4O0n2M3M3M3JKM3M4k4P1pk29q6J35J00MqqQPm1m0kjkkJ5J5R5R4j2
1477A568j2n9o0j8j9K3K2J01Nl6J22mj00j68p4KLQQP6P5lmnnnnl0l0l0k9M1M2M1M2k1k1J5
$$ plain form
1516 1536 1596 1497 1482 1467 1529 1496 1517 1538 1517 1496 1475 1454 1397 1340 1284 1227 1310 1394 1367 1339 1385 1430 1396 1362 1395 1429 1415 1401 1404 1407 1458 1509 1475 1442 1409
1511 1409 1376 1415 1455 1447 1439 1359 1279 1310 1341 1444 1546 1507 1467 1434 1401 1368 1336 1365 1395 1472 1549 1494 1439 1515 1591 1616 1450 1438 1427 1387 1347 1354 1362 1342 1322
1505 1322 1302 1282 1348 1415 1402 1389 1338 1287 1283 1279 1267 1254 1321 1387 1419 1450 1481 1513 1450 1388 1404 1421 1363 1306 1316 1325 1417 1319 1328 1336 1346 1357 1414 1472 1467 1463 1458 1453 1473
1499 1473 1494 1514 1534 1449 1365 1391 1417 1345 1273 1344 1414 1440 1465 1490 1515 1470 1424 1379 1333 1404 1476 1468 1460 1436 1412 1341 1269 1321 1374 1426 1478 1450 1422 1441 1461
1494 1461 1453 1446 1439 1432 1376 1321 1271 1222 1217 1306 1432 1399 1320 1241 1295 1348 1284 1219 1298 1376 1451 1526 1458 1391 1375 1359 1422 1485 1400 1314 1340 1365 1468 1571 1493
1489 1493 1416 1468 1424 1234 1203 1226 1248 1281 1314 1277 1240 1314 1388 1336 1283 1309 1336 1292 1247 1203 1158 1149 1141 1211 1281 1301 1321 1341 1361 1344 1327 1390 1452 1396 1340
1483 1340 1237 1291 1381 1375 1382 1293 1259 1319 1267 1310 1353 1396 1397 1399 1442 1486 1462 1533 1526 1297 1211 1346 1446 1450 1442 1434 1442 1449 1408 1368 1366 1365 1363 1361 1376 1391 1486 1580 1568
1477 1568 1556 1497 1437 1419 1400 1423 1445 1546 1551 1515 1637 1633 1533 1365 1291 1293 1296 1304 1312 1388 1463 1460 1456 1451 1446 1441 1436 1406 1376 1346 1317 1358 1400 1441 1483 1462 1441 1456
1472A456J5O7j22q2J4J05q5k6P0L8L9lkL3L4j3j4l7l7J0J0n2n2K7K8RRJ0Rm5m5JR6L1j59r4
1466A243r4K4K4P2P1l8l9l8l9K6K5P4P3K6K6k2k2j1j2j1j2NOONL2L3j6j5k4k3M1n4p9J11N1
1461A425m4Q2Q1l5l5n7n6K3K3J0Rl8l8j3j3j4j3M7M7n8n8k9O7N3j37n6J35J6J6j3j3J3K03
1456A530J02n6j29j30K2K2J0J05K5p0M2n2o2o2P4P4k1k2k2k1l3l2P8P8k0k1Q4Q4Oq9q8Ok6
1451A386k5j20j20jJ58O8O9k4k4K9o6j0rM2J37p9p9p3p4M1M1M0M1j2j3M1n3N7N8J00Mo0j55
1446A315k8k8M8M9M9M9OPJ3q2m2m2n3M1l7l8J02J01R4o4j75j6K1K1L7L7j07j1J4J4J3J3m1
1441A280m0P5j9k0P5P3P2L1L1n4n3K6J21k8j85j14J07P1q7m2m2P0q8J%N3N2jR4r5r5l1O3J5
1435A316J6P4P4OJ00oj65K4K5O7k7PPj10j10QQJ3J4m9M5o1L3k7k6o9o8M5M5M5M5M8M8O0l5
$$ plain form
1472 1456 1471 1538 1416 1334 1348 1453 1368 1342 1412 1450 1489 1486 1484 1517 1551 1538 1524 1487 1450 1460 1470 1418 1366 1393 1421 1430 1439 1449 1458 1413 1368 1369 1465 1496 1337 1243
1466 1243 1149 1173 1197 1269 1340 1302 1263 1225 1186 1212 1237 1311 1384 1410 1436 1414 1392 1381 1369 1358 1346 1351 1357 1363 1368 1400 1433 1417 1402 1378 1355 1396 1342 1263 1374 1425
1461 1425 1381 1463 1544 1509 1474 1417 1361 1384 1407 1417 1426 1388 1350 1337 1324 1310 1297 1344 1391 1333 1275 1246 1313 1366 1229 1173 1308 1324 1340 1327 1314 1327 1530
1456 1530 1632 1576 1447 1317 1339 1361 1371 1476 1501 1431 1473 1421 1359 1297 1371 1445 1424 1402 1380 1359 1326 1294 1372 1450 1430 1409 1493 1577 1583 1494 1406 1412 1386
1451 1386 1361 1241 1121 1120 1278 1346 1415 1391 1367 1396 1330 1320 1311 1353 1490 1411 1332 1259 1185 1226 1267 1307 1348 1336 1323 1364 1311 1368 1426 1526 1530 1470 1315
1446 1315 1287 1259 1307 1356 1405 1454 1460 1467 1480 1398 1356 1314 1261 1302 1265 1227 1329 1430 1524 1460 1285 1269 1290 1311 1348 1385 1278 1267 1281 1295 1308 1321 1280
1441 1280 1240 1315 1296 1276 1351 1424 1496 1527 1558 1504 1451 1477 1598 1570 1385 1271 1378 1449 1362 1320 1278 1348 1260 1261 1261 1314 1366 1365 1459 1364 1269 1238 1301 1316
1435 1316 1332 1406 1480 1486 1586 1580 1415 1439 1464 1531 1504 1511 1518 1408 1298 1306 1314 1327 1341 1292 1337 1276 1309 1282 1256 1187 1119 1164 1209 1254 1299 1347 1395 1455 1420
1430A420j19k4O5O4J5J09q6q7MNMMnnJKm9M7M7m9j2j3j9j8nmmnRQJ9J8QJ67j02j02J00On8
1424A356n8P9j6J8J13Nk17m2J79J8p6Q5p2j21k6J5J5Q4j1noK6K5K6K5l1l2P0k6J3J3j04j03
1419A219M3M3J12J12J46j2j25l0P4k1o3L2o8o9L9n7J2J2m1m1K7K7k0k1kkJ05q5l1l2MMJ3J2
1414A316J3J2j7j7j7j7J14J13k9k9l2l1P4j15J5J5MLK7K6K7K7n8n8n8n9l2l3J5J5L7L8j1j0
1409A268N2N2n5J35K9K9oop0p0p0o9O8O8K1K1l8l7J0RK1K0k6k7RJ0RJ0L1L1N8j31PPn2n3J1
1403A276J0J0J0N1N1LMK4K4q6q7MLMLj4j5Q5Q5O8j21o1o2K2K3K3K2N4N3j4j4j82PJ06J06o6
1398A409o6M4M4mnk8k9Q1Q1l0l0o5o4j7j7M6M5jkl0l0n3n4R8R7p7p7l3l3J5J4O6O6J8J9n2
1392A346n1N9O0l4l4j1j0J3J3l4l4J0J0lmp1Q8J35k3j3j4o5R3K3K4m6m6o3o4J6J5M2M2Q4Q3
$$ plain form
1430 1420 1301 1277 1342 1406 1421 1530 1444 1357 1361 1366 1370 1374 1369 1364 1365 1367 1318 1365 1412 1363 1351 1338 1319 1301 1296 1292 1288 1283 1292 1300 1319 1337 1345 1512 1410 1308 1408 1414 1356
1424 1356 1298 1377 1361 1379 1492 1497 1280 1238 1417 1435 1359 1444 1372 1251 1225 1240 1255 1339 1328 1323 1317 1343 1368 1394 1419 1388 1356 1426 1400 1413 1426 1322 1219
1419 1219 1262 1305 1417 1529 1675 1663 1538 1508 1582 1561 1498 1530 1462 1393 1432 1375 1387 1399 1358 1317 1344 1371 1351 1330 1328 1326 1431 1346 1315 1283 1287 1291 1304 1316
1414 1316 1329 1341 1324 1307 1290 1273 1387 1500 1471 1442 1410 1379 1453 1338 1353 1368 1372 1375 1402 1428 1455 1482 1424 1366 1308 1249 1217 1184 1199 1214 1251 1289 1278 1268
1409 1268 1320 1372 1317 1452 1481 1510 1504 1498 1428 1358 1288 1219 1287 1355 1376 1397 1359 1322 1332 1341 1362 1382 1356 1329 1338 1348 1357 1367 1398 1429 1487 1356 1363 1370 1318 1265 1276
1403 1276 1286 1296 1306 1357 1408 1411 1415 1439 1463 1377 1290 1294 1297 1301 1304 1290 1275 1360 1445 1513 1392 1331 1269 1291 1314 1337 1359 1413 1466 1452 1438 1256 1263 1369 1475 1409
1398 1409 1343 1387 1431 1427 1422 1394 1365 1446 1527 1497 1467 1402 1338 1321 1304 1350 1395 1394 1392 1362 1332 1279 1225 1323 1420 1343 1266 1233 1200 1215 1229 1295 1361 1379 1398 1346
1392 1346 1295 1354 1414 1380 1346 1335 1325 1338 1351 1317 1283 1293 1303 1300 1296 1225 1313 1448 1425 1412 1398 1333 1426 1449 1473 1427 1381 1318 1254 1270 1285 1327 1369 1453 1536
1387A536J5q1k01m3J00Nj06N2J20K5k3k3o3o2M8M8KLN0N0k6k7j00j00O7J61J50rn6n6J3J3
1382A482j3j2r1r1kjK3K2L1L1j7j7ppqpN8N8k1k2M7M6M7M7K1K2l1l2n1j46j0Q5m9j44L0J25
1376A396R4kp8p8n0M5N1m4p4K0J5J4k4P1K9o5O9J64J6p9M1M1J5q0o2L3q6J0qj02L6L6mlL4
1371A391L4R1o7p8J6K9L0ooj01pM2n4O6O6q3q2KLJ35M0q8q9J06J05Lr2QRL3L2p8p8JJnR0K6
1365A445K7m7m6jjm9m8K0K1L1j28N6N7n5M1P1P2L0L0J2J2j2j2k2k2L7n8j60o5J12J13K0K1
1360A502l1j26jR4J1J1M5M6K0p6rj0m0l9K1K1n8n7j8j8L0K9j6j6j6j6Q4Q4n9n8q3q3mmJ06
1355A266J06K7K7JJKJNNNNJ0J1l8l7j7j8R3R4o1o0m8m9n9J31P1P1OOm1m2j9j8j9j9M3M3o7
1349A418o8J8J9J8J9J8J8J8J8j21j21Q4Q5J1J1J2J1n9n9N2N2l8l7J1J0N9N8k0k0n7n7n6n7
$$ plain form
1387 1536 1551 1470 1269 1226 1326 1331 1225 1277 1397 1422 1399 1376 1313 1251 1299 1347 1349 1352 1402 1452 1426 1399 1299 1199 1266 1427 1577 1568 1512 1456 1469 1482
1382 1482 1469 1457 1366 1275 1273 1272 1295 1317 1348 1379 1362 1345 1338 1331 1323 1316 1374 1432 1411 1389 1436 1482 1529 1576 1597 1619 1588 1556 1505 1359 1349 1434 1385 1241 1271 1396
1376 1396 1490 1488 1410 1332 1282 1327 1378 1334 1260 1280 1295 1309 1285 1356 1385 1320 1389 1553 1569 1490 1531 1572 1587 1507 1445 1478 1392 1402 1394 1292 1328 1364 1360 1357 1391
1371 1391 1425 1516 1449 1371 1387 1416 1446 1440 1434 1333 1326 1368 1314 1380 1446 1363 1281 1283 1286 1421 1461 1373 1284 1390 1495 1498 1406 1414 1423 1456 1488 1410 1332 1333 1334 1329 1419 1445
1365 1445 1472 1425 1379 1378 1377 1328 1280 1300 1321 1352 1224 1280 1337 1282 1323 1394 1466 1496 1526 1538 1550 1538 1526 1504 1482 1519 1461 1301 1236 1348 1461 1481 1502
1360 1502 1471 1345 1344 1438 1449 1460 1505 1551 1571 1495 1486 1476 1436 1397 1418 1439 1381 1324 1306 1288 1318 1347 1331 1315 1299 1283 1367 1451 1392 1334 1251 1168 1164 1160 1266
1355 1266 1372 1399 1426 1427 1428 1430 1431 1436 1441 1446 1451 1461 1472 1434 1397 1380 1362 1455 1549 1488 1428 1380 1331 1272 1403 1474 1545 1551 1557 1516 1474 1455 1437 1418 1399 1442 1485 1418
1349 1418 1350 1368 1387 1405 1424 1442 1460 1478 1496 1375 1254 1338 1423 1434 1445 1457 1468 1409 1350 1402 1454 1416 1379 1390 1400 1459 1517 1497 1477 1420 1363 1307 1250
1344A250RJ0RJ0M0M0L9M0j1j0J00J00o6o5o5o6j3j4j4j4qpP1P2o0o0o0n9M1M2M2M2m2m2M3
1339A324M3j8P7Q2j2r7jM0n5O5O5n7n8K0p6l3O1P3k1kj60n0J71R0mk7k7K1K1q3J2n2n1P1q7
1333A265m1N3nJ53M5n1n3n3n4n3n6L9P4P4q4P4n6n6l6N9J2q3N0N0M4M5j0rrrJ12J13qj03m2
1328A391m1m8m8L8L8j0j0K1K1K7o8PPk5j19O5O6N9N9jkL6L6m5k03m0J20O1r8n1M3M0M1l3l3
1323A301n0n0K9K9N4N4nQ9M7m7l0l0k1P4k7k7j9j8K9K9K1K1k7k6J4J4o4o5M2M2l7l7o8o7P5
1317A249P5nmJ6J10J02Pm4j40n9R9kkN5m0oj01n1M4j5j5P9P8P9P8o2o2j4j5p5p6J0Rl7N8j
1312A322jJ25L0j7j7j10M8m1m1p8p8R7R6N5N5k5k4n1n2n1n1onj2Q3%jN9l6K1K2L5J30N6l8
1306A499J1J0O6r3n8L8j9k0M0n4l6l5n3M2J51N6q4q4m6M9M9m6n0n1Q6Q7o4o3j5j6nnn2n2M8
$$ plain form
1344 1250 1259 1269 1278 1288 1328 1368 1407 1447 1436 1426 1526 1626 1560 1495 1430 1364 1351 1337 1323 1309 1301 1294 1365 1437 1377 1317 1257 1198 1239 1281 1323 1365 1323 1281 1324
1339 1324 1367 1349 1426 1508 1496 1399 1398 1438 1383 1448 1513 1456 1398 1418 1342 1309 1370 1443 1422 1420 1260 1210 1381 1471 1467 1440 1413 1434 1455 1372 1384 1332 1281 1352 1265
1333 1265 1224 1277 1272 1425 1470 1419 1366 1313 1259 1206 1150 1189 1263 1337 1253 1327 1271 1215 1179 1238 1250 1167 1217 1267 1311 1356 1346 1337 1328 1319 1431 1544 1536 1433 1391
1328 1391 1350 1302 1254 1292 1330 1320 1310 1331 1352 1379 1311 1318 1325 1300 1181 1246 1312 1371 1430 1429 1427 1463 1499 1454 1251 1211 1331 1392 1294 1243 1286 1326 1367 1334 1301
1323 1301 1251 1201 1230 1259 1313 1367 1362 1451 1498 1451 1421 1391 1370 1444 1417 1390 1371 1353 1382 1411 1432 1453 1426 1400 1414 1428 1364 1299 1341 1383 1346 1309 1241 1174 1249
1317 1249 1324 1319 1315 1331 1441 1543 1550 1506 1366 1307 1406 1404 1402 1457 1417 1411 1310 1259 1303 1288 1273 1352 1430 1509 1587 1525 1463 1449 1434 1359 1283 1293 1302 1265 1323 1322
1312 1322 1321 1446 1476 1459 1442 1332 1380 1339 1298 1220 1142 1239 1335 1390 1445 1420 1396 1345 1293 1242 1191 1185 1180 1168 1251 1251 1250 1309 1273 1294 1316 1351 1481 1537 1499
1306 1499 1510 1520 1586 1493 1435 1473 1454 1434 1474 1420 1384 1349 1296 1338 1489 1545 1461 1377 1331 1380 1429 1383 1333 1282 1368 1455 1391 1328 1313 1297 1292 1287 1235 1183 1231
1301A231M9M8M9J7J7PPL5j24j47J38J23J24o5o4j4j4O5O5l5l4j24L4l1l2K5K6n0n0K9K9J06
1296A440J06N8N9j22j21m2m3m3m3m3m4n0n0O0O0ppP3P2M6M7M6M7l6l6M4M4l4l3q0q1J8J7J7
1291A339J8N8N8k2k1opq5q6J9J8k9l0R6R5J6J6j6j7L1L0p4p4NNL3L3m7m6L5L6m4m4k6k7O9
1286A309r0p7J8M0M0l7N8J42j7K7K8l0l0%%%%MMj07j07N8N7N7N7n6n6K2K3M3M2o8o8J02J02
1280A490K3K3r8r8n0n1ppj3j3J13J9J71J2j56LO8O8Q7p1o1o1n6n6n6n6K5K5P2P2n9n8m3J16
1275A317O4l1k6O8O5l0j7j8L8L9rrk6k5p3p4opppJ11J11J%q5q5K6K6L5L4L5L5j18j18N6N6
1269A346J5J5J4J5J2J3l5l5J3J3l4l4P0O9rj0m3m3m3m3M1M1M1M1j4j4o2o2r3r4N0M9M6M6M6
1264A328M6l4l5M5M4o5o5J4J4o1o2M9N0N9N9N9O0m1m0m1m0j7j6o5o4Q5Q5L7L7k7k7N2N3k7
$$ plain form
1301 1231 1280 1328 1377 1394 1411 1418 1425 1460 1336 1189 1327 1450 1574 1509 1445 1431 1417 1482 1547 1512 1478 1354 1388 1357 1325 1350 1376 1326 1276 1305 1334 1440
1296 1440 1546 1604 1663 1541 1420 1378 1335 1292 1249 1206 1162 1112 1062 1122 1182 1175 1168 1241 1313 1359 1406 1452 1499 1463 1427 1471 1515 1481 1448 1368 1287 1305 1322 1339
1291 1339 1357 1415 1473 1451 1430 1424 1417 1332 1246 1265 1283 1254 1224 1320 1415 1431 1447 1431 1414 1445 1475 1401 1327 1332 1337 1370 1403 1356 1310 1345 1381 1337 1293 1267 1240 1309
1286 1309 1219 1142 1160 1200 1240 1203 1261 1403 1386 1413 1441 1411 1381 1381 1381 1381 1381 1385 1389 1282 1175 1233 1290 1347 1404 1348 1292 1314 1337 1380 1422 1354 1286 1388 1490
1280 1490 1513 1536 1438 1340 1290 1239 1232 1225 1212 1199 1312 1331 1502 1514 1358 1361 1429 1497 1584 1513 1452 1391 1335 1279 1223 1167 1192 1217 1289 1361 1302 1244 1201 1317
1275 1317 1381 1350 1324 1392 1457 1427 1410 1392 1430 1469 1460 1451 1425 1400 1327 1253 1247 1240 1233 1226 1337 1448 1449 1449 1364 1279 1305 1331 1366 1400 1435 1470 1352 1234 1290 1346
1269 1346 1361 1376 1390 1405 1417 1430 1395 1360 1373 1386 1352 1318 1388 1457 1448 1438 1395 1352 1309 1266 1307 1348 1389 1430 1416 1402 1340 1278 1185 1091 1141 1190 1236 1282 1328
1264 1328 1374 1340 1305 1350 1394 1329 1264 1278 1292 1231 1169 1218 1268 1327 1386 1445 1505 1464 1424 1383 1343 1326 1310 1245 1181 1266 1351 1388 1425 1398 1371 1423 1476 1449
1259A449k7k7k6%jM8M7o9o9J0J0K7K7K7K7r5r4J6J6N7N8N7N8j45j44k8J30J7J6P4P4n7n6j5
1254A392j5M3n2j23R9llN9N9p9p9K6K6J05J1j46P6N4m0q5q4l4l3J08J09PPN4N5l0k9l0k9o4
1249A332o4J5J5L5L5m4m4j9j8K9K9j6j6J8J8P7j44N9N9pqM0M0m9m9jkK6K5n4n3R4R5J5J6P0
1243A554O9K2K3r5r4j6j5M1M1j33j32K4K4k3k3MLMLL2L2j5j5MMQ3Q4llklNNm2m2P9P9L2o3
1237A532j70j2J4J09m0l9l4l3J4J4q0P7Q4j1MMm8m8%jO3O3j11j11N3N3j5j6o3R6O1l5l7l7
1232A300NNMNq4P4%JR0Q9k8k8K0J9j%m8m8j4j3j4j3p8p7KKRQRRM7M7M1M1N2m4K1J80O7r1l9
1226A527m0K3K3k5k5oopoj8j9O1O1j6j7j6j7N6N6P1q7j18k2qpK5K4o0o1J02Qj9j9M7M7j18
1220A394k2r7r7K6K6l0O6OOM8m7JJR7LJ5J4l9N5N0N0n8n7n1n1K1J16J46j2m4j39j06N3M8M8
$$ plain form
1259 1449 1422 1395 1369 1369 1368 1416 1463 1394 1325 1335 1345 1372 1399 1426 1453 1358 1264 1280 1296 1353 1411 1468 1526 1381 1237 1209 1339 1356 1372 1446 1520 1463 1407 1392
1254 1392 1377 1420 1368 1245 1344 1341 1338 1397 1456 1377 1298 1324 1350 1455 1466 1320 1396 1450 1410 1325 1241 1207 1174 1282 1391 1398 1405 1459 1514 1484 1455 1425 1396 1332
1249 1332 1268 1283 1298 1333 1368 1324 1280 1261 1243 1272 1301 1285 1269 1287 1305 1382 1238 1297 1356 1349 1341 1381 1421 1372 1323 1322 1320 1346 1371 1317 1264 1358 1453 1468 1484 1554
1243 1554 1623 1645 1668 1573 1479 1463 1448 1489 1530 1397 1265 1289 1313 1290 1267 1271 1274 1278 1281 1313 1345 1330 1315 1319 1323 1406 1490 1487 1484 1482 1479 1484 1489 1447 1405 1484 1563 1595 1532
1237 1532 1362 1350 1364 1473 1433 1394 1360 1327 1341 1355 1275 1352 1436 1425 1429 1433 1385 1337 1337 1336 1399 1462 1351 1240 1293 1346 1331 1315 1252 1348 1409 1374 1337 1300
1232 1300 1305 1310 1314 1319 1235 1309 1309 1310 1400 1489 1461 1433 1453 1472 1471 1471 1423 1375 1361 1348 1334 1321 1243 1166 1168 1170 1179 1187 1196 1205 1252 1299 1340 1381 1433 1389 1410 1590 1657 1566 1527
1226 1527 1487 1510 1533 1508 1483 1477 1471 1464 1458 1440 1421 1482 1543 1527 1510 1494 1477 1533 1589 1660 1573 1455 1433 1425 1418 1443 1467 1407 1346 1448 1456 1437 1418 1465 1512 1394
1220 1394 1372 1275 1178 1204 1230 1200 1266 1272 1278 1326 1279 1280 1281 1378 1381 1396 1410 1371 1426 1476 1526 1468 1411 1360 1309 1330 1446 1592 1580 1536 1397 1291 1344 1392 1440
1215A440J1q5j07N1lkL3o1rqN7N8Rq5o7R1mlL2L2L1L2M5M5o5j61p9Q0K6K6J6p9K2K2j2j3j2
1209A304j3M9N0l0l0K3K2L9n7j13M5N5N4O5l0k5k4k6k6O0N9QJ02L0o5j50n4J85l6l8l7j40
1204A256J8J8J8j9j9O5O4P1k4J10J11l4j93j59%M3M3j4j5L3L3n6n7K2K2J8J7J8J8M1M2M1M2
1199A574q6q6K4K5O1O1J4J4j08j09R8R7l0l0l1l0n4n4ppk1k2N8N7lkn1n0m6m6R6R6J21J21
1194A644j16j16m3m4m4m4P4P4K6K7j9k0j9j9m7m7%JL6L6L6L6n6n5qq%JQ0Q0l8l9M1M1K8K7
1189A506q3q3l6l6l6l5J11J11o2o3l7l8M2M2M2M3l6l7L6L7K6K7J21l7j44m8j4j3r6O2N5N5
1184A382Q1p8j07j3LLK5K5m8m8P1J66R6o1j03rm9J08k3k4k0P5mmO2l4q5Rm9n0R9R8K0J9j36
1178A397j36j9j9m1N4J37k2L8L8j9j9m9m9k9O6J3q2L0J24N1m4p4Q4m8m9r2LP4P5K8K7K6p0
$$ plain form
1215 1440 1451 1366 1259 1310 1307 1305 1338 1277 1268 1260 1317 1375 1384 1299 1232 1323 1319 1316 1348 1380 1411 1443 1488 1533 1468 1307 1228 1308 1334 1360 1376 1297 1319 1341 1329 1316 1304
1209 1304 1291 1340 1390 1360 1330 1353 1375 1414 1357 1244 1289 1344 1398 1463 1433 1408 1384 1358 1332 1392 1451 1459 1561 1591 1526 1376 1322 1507 1471 1433 1396 1256
1204 1256 1274 1292 1310 1291 1272 1337 1401 1472 1448 1558 1669 1635 1442 1283 1283 1326 1369 1355 1340 1373 1406 1350 1293 1315 1337 1355 1372 1390 1408 1449 1491 1532 1574
1199 1574 1488 1402 1426 1451 1512 1573 1587 1601 1493 1384 1482 1579 1549 1519 1488 1458 1404 1350 1343 1336 1315 1293 1351 1408 1405 1403 1352 1302 1256 1210 1306 1402 1523 1644
1194 1644 1528 1412 1369 1325 1281 1237 1311 1385 1411 1438 1419 1399 1380 1361 1314 1267 1267 1268 1304 1340 1376 1412 1356 1301 1293 1285 1285 1286 1366 1446 1408 1369 1410 1451 1479 1506
1189 1506 1423 1340 1304 1268 1232 1197 1308 1419 1357 1294 1257 1219 1261 1303 1345 1388 1352 1315 1351 1388 1414 1441 1562 1525 1381 1333 1319 1306 1210 1272 1327 1382
1184 1382 1463 1385 1278 1265 1268 1271 1296 1321 1273 1225 1296 1462 1558 1497 1394 1385 1336 1444 1421 1397 1377 1452 1448 1444 1506 1472 1387 1396 1347 1297 1396 1494 1514 1533 1397
1178 1397 1261 1242 1223 1182 1236 1373 1351 1389 1427 1408 1389 1340 1291 1262 1328 1341 1259 1289 1413 1464 1420 1346 1430 1382 1333 1241 1244 1318 1393 1421 1448 1474 1404
1173A404o9K5O8O8o8o9J4J3q7QN3N3p8Q1Q1Q1L3o2j0j0o4o3k4k4K3K4L2L2n1j45L3J27O9O8
1168A566j24j25J2J2O1l5q3J3rrm5m4l5O1M9M8J44M9J3q2nnL7L7p3p2J7J7k0J39M1j80q7P1
1163A354N8j01L3L3K3K3LLMLo4o3o4o3K4K5L0L1m9M5P2P1k4k3k4k4k7k8K0K0O4O3O9P0j10
1158A477j4k1k0k4k3o5o6m2N2M1M0jr7L5L6J3J4P3k2m9M6K9K8M5n0p6p6o6o6m0N4L1L1J48
1152A375J48j14j15N4N4Mr0k7k7o5R4MNL2L3m7m6M4M4L5L4K1j38jjKKM9j09k7O9N2N2k4k4
1147A352p5Q3M8j11j2j1k3k2J9J9J28L3m6M9k9k8J9J9J3q3j30l5O6O6O4r5r7J24L7L7K5K4
1142A428K4K5r2r2J9J9l9l8l3l2n0M5J24K9K8K8n7n7m9m9O2O2L3L3j4j4k0j9k0j9ooL6L6M5
1137A370n0MLP4P3r6jj4j08k3P1QPJ03n6n7n8J3J2j3j3O7O6k8k9M4M5K9o7O1O0Qq6J4J4p3
$$ plain form
1173 1404 1335 1360 1428 1496 1428 1359 1373 1386 1299 1307 1360 1413 1335 1416 1497 1578 1611 1549 1539 1529 1465 1402 1378 1354 1377 1401 1433 1465 1414 1269 1302 1429 1498 1566
1168 1566 1442 1317 1329 1341 1402 1367 1284 1297 1288 1279 1234 1190 1155 1216 1265 1313 1457 1506 1519 1437 1432 1427 1464 1501 1428 1356 1373 1390 1370 1509 1550 1370 1283 1354
1163 1354 1412 1311 1344 1377 1400 1423 1426 1429 1433 1436 1372 1309 1245 1182 1206 1231 1261 1292 1243 1288 1360 1431 1407 1384 1360 1336 1309 1281 1301 1321 1385 1448 1517 1587 1477
1158 1477 1463 1442 1422 1398 1375 1310 1244 1202 1254 1295 1335 1334 1237 1272 1308 1321 1335 1408 1386 1337 1383 1412 1440 1485 1435 1359 1283 1217 1151 1111 1165 1196 1227 1375
1152 1375 1523 1409 1294 1348 1402 1406 1316 1289 1262 1197 1291 1295 1300 1332 1365 1318 1272 1316 1360 1395 1429 1450 1312 1311 1310 1312 1314 1363 1254 1227 1296 1348 1400 1376 1352
1147 1352 1277 1360 1408 1297 1285 1274 1251 1229 1248 1267 1395 1428 1382 1431 1402 1374 1393 1412 1425 1342 1212 1177 1243 1309 1373 1278 1181 1305 1342 1379 1404 1428
1142 1428 1452 1477 1385 1293 1312 1331 1292 1254 1221 1189 1139 1184 1308 1337 1365 1393 1336 1279 1230 1181 1243 1305 1338 1371 1357 1343 1323 1304 1284 1265 1259 1253 1289 1325 1370
1137 1370 1320 1324 1327 1401 1474 1378 1377 1363 1255 1232 1303 1311 1318 1421 1365 1308 1250 1263 1275 1262 1249 1316 1382 1354 1325 1369 1414 1443 1376 1437 1497 1505 1419 1433 1447 1374
1131A374p2%Jnr9k6O9J5q1k1k1K8K9P6P6L2L2j5j5j0j0j0j0o4o4j7P8J37k1q5J1l1O3N8N8
1126A460N3m2q9OPOJ3J2M3M2l8l7j1j1j2j1q7q8N5N5KKm6m6N7N8N7N7r5r5J6J6L8L8L9L8k3
1120A439k3k3k3l8l7J0J0O3O4p9p9K8K7K8K8j02j02RRO6O6K4K5j7P8J19l9q5RNr0q4J1%jp
1115A289qM0M0o1o0J8J13J14m4q6P2Q8Q7j40j40N2N2j1Q4R2o5k2j17q1J4n2M4J8J7k3k4n7
1110A243n8K2K2K9L0Q3Q3n0M5N1j71j01J20O1O1p3p2PPlln1n0K2K2P0O9M8M8l1l1l7l7J1J1
1105A397QQQPj02j02k4k3Q9Q8J0Rk8k8J08J08O8k7q5q4j4j4p3K2J13J9q6RP4P3o2o3PQPPK3
1099A455K2k0j9j14k0POJ4J4J4J3O9O8o9o8o6K9J18J17m7m7%%qrM5m9r5r4P4P4L5L6j2j2l7
1094A424l8J0J0poL1L1N8j00M8m7p8J7J22K7r1r0P7P7n7n7rQ5L7j21j10M9K1J17J14m4k4k4
$$ plain form
1131 1374 1302 1302 1303 1298 1199 1173 1242 1257 1176 1155 1134 1162 1191 1267 1343 1375 1407 1392 1377 1367 1357 1347 1337 1273 1209 1192 1270 1407 1386 1301 1312 1281 1344 1402 1460
1126 1460 1513 1471 1382 1388 1395 1401 1414 1426 1469 1511 1473 1436 1425 1414 1402 1391 1304 1216 1271 1326 1328 1330 1284 1238 1295 1353 1410 1467 1372 1277 1293 1309 1347 1385 1424 1462 1439
1120 1439 1416 1393 1370 1332 1295 1305 1315 1378 1442 1363 1284 1312 1339 1367 1395 1293 1191 1200 1209 1275 1341 1365 1390 1373 1451 1570 1531 1446 1455 1460 1370 1286 1297 1297 1296 1289
1115 1289 1281 1321 1361 1300 1240 1258 1371 1485 1441 1355 1427 1515 1602 1462 1322 1374 1426 1415 1499 1591 1526 1504 1387 1306 1320 1268 1312 1330 1347 1324 1300 1243
1110 1243 1185 1207 1229 1258 1288 1371 1454 1404 1449 1500 1329 1228 1348 1409 1470 1397 1325 1332 1339 1336 1333 1282 1232 1254 1276 1346 1415 1463 1511 1480 1449 1412 1375 1386 1397
1105 1397 1405 1413 1421 1428 1326 1224 1200 1177 1266 1354 1364 1373 1345 1317 1425 1533 1601 1574 1489 1405 1391 1377 1304 1326 1439 1458 1372 1381 1455 1528 1466 1403 1410 1418 1425 1432 1455
1099 1455 1477 1457 1438 1324 1304 1311 1317 1331 1345 1359 1372 1441 1509 1440 1372 1306 1335 1453 1570 1523 1476 1476 1476 1468 1459 1504 1455 1360 1266 1340 1414 1449 1485 1473 1461 1424
1094 1424 1386 1396 1406 1399 1393 1424 1455 1513 1413 1461 1414 1336 1353 1475 1502 1411 1321 1398 1475 1418 1361 1352 1437 1474 1353 1243 1292 1313 1430 1544 1500 1476 1452
1089A452P7P7qqkkj05j0J6J6J6J6J6J7R4R4j6j11o1R7J8J13M5j12j62o7J10p9j52L7J7J6J08
1083A557J08j9j9l1l1Q5j05j05j0J36M1K1K1J4J3o5o5rqrrp9p9L2L2L4L4j3j3m5m4O6O6nn
1078A492J3q1o9J20r2KJ7J7K2K3J09J09o6o5j95j96M2M2L6L5L5L5L6L6Q4Q4j20j19K4K3o5
1073A368o5M7M6P5P6o7o6k0k0K8K8m5m5p9J11O2l3m7m7lmllOOOON4N4OOM9M9KJL6L5p5p6K
1067A461LM9N0rj0j22k8P5j16m4m4N7J51P5j16j26O4qp%%o5J25J29L4m3m3J0J0J0J0n5n6n5
1062A366n6J1J0n4M0J81rp0p1qqn6n5J16J16n8n7N9O0n1n0K8K8l7N8Q1j08j08Q2Qq7N8N7K7
1057A443K7q4q3M3M4lmk4k3k4k3L6L6L7L6l0l0J7J8j0rrrn8n8Q5Q4p7p7LKJ01J01p3p3M2M3
1051A417nnJ1J1l6l7%%m8m7l6l6M4M3L6L6p5p5J6J6l1l1P3P3K6K6J06J06l7l6k5k5k5k5J3
$$ plain form
1089 1452 1529 1606 1598 1590 1588 1586 1481 1471 1487 1503 1519 1535 1551 1568 1662 1756 1740 1629 1568 1665 1683 1796 1841 1729 1567 1500 1610 1531 1379 1416 1433 1449 1557
1083 1557 1665 1646 1627 1596 1565 1650 1545 1440 1430 1566 1607 1628 1649 1663 1676 1611 1546 1537 1529 1520 1511 1432 1353 1385 1417 1451 1485 1472 1459 1414 1370 1436 1502 1497 1492
1078 1492 1505 1424 1355 1475 1383 1385 1402 1419 1441 1464 1573 1682 1616 1551 1356 1160 1202 1244 1280 1315 1350 1385 1421 1457 1541 1625 1505 1386 1410 1433 1368
1073 1368 1303 1350 1396 1471 1547 1480 1414 1394 1374 1402 1430 1385 1340 1261 1372 1434 1401 1354 1307 1304 1300 1297 1294 1300 1306 1312 1318 1372 1426 1432 1438 1487 1536 1538 1539 1575 1610 1535 1459 1461
1067 1461 1464 1513 1563 1554 1544 1422 1394 1469 1353 1309 1265 1322 1473 1548 1432 1306 1370 1362 1355 1355 1355 1290 1415 1544 1578 1535 1492 1502 1512 1522 1532 1477 1421 1366
1062 1366 1310 1321 1331 1277 1317 1498 1489 1419 1348 1340 1332 1276 1221 1337 1453 1395 1338 1397 1457 1406 1356 1384 1412 1375 1433 1514 1406 1298 1380 1388 1301 1359 1416 1443
1057 1443 1470 1386 1303 1346 1390 1387 1383 1359 1336 1312 1289 1325 1361 1398 1434 1404 1374 1391 1409 1399 1390 1381 1372 1314 1256 1341 1425 1348 1271 1274 1276 1377 1478 1405 1332 1374 1417
1051 1417 1412 1407 1418 1429 1393 1356 1356 1356 1308 1261 1225 1189 1233 1276 1312 1348 1273 1198 1214 1230 1199 1168 1241 1314 1340 1366 1472 1578 1541 1505 1480 1455 1430 1405 1418
1046A418J3J%J65k5o1o1l9l9l9l9Q5Q4r0r0k4k4J2J2J69k2OOO5O6m6m5J1J1l6l7L8L8J17J17
1041A717l4l4l4l4o6o7j32l7J07q3k4P0jjMN%%Q0P9j4j3j4j4K6K5n4n3k2k1K7K6J3J2M8M8
1035A535N9j31p7J7J6J6k6k6MMLMJ6J5O2O3l9l9KKK2p4q0J10p1p1K1K0L9L9M0L9p3p2OPK3
1029A405K3n6n6L8L9o0o0r2R7R8Lk2P2P3k2o7K9J6J6j9k0j9j9K7K7l2l2J19p2L5L6m6m5r2
1024A322r3O3O3J5J5j6j7L2L1n0n0K9L0O4O4m6m7jkkkJ7J7l0l1P0O9L4j56k5k5M2M2RQRQl2
1018A428l3l2l3j3j2L4L5J06J05j00j01L6L5L5L5p7p7KKp4p4L7L6R0R0j17j16qqrqL1L2j6
1013A261j6L3L4L3L4K3K3n6n7J%%JL5L6L6L6j3j3j3j2l3l2J5J6L8L8m2m1rrP0P0OOp3p4k5
1008A327k5k5k5M8M8J%jkn5M0L4L4j4Q2K1K2q4q3n3n4K5K6K9L0K3K3Q2j4l9l9j38j38N1J47
$$ plain form
1046 1418 1431 1432 1432 1597 1572 1511 1450 1411 1372 1333 1294 1379 1463 1373 1283 1259 1235 1247 1259 1428 1406 1412 1418 1483 1549 1503 1458 1469 1480 1444 1407 1445 1483 1600 1717
1041 1717 1683 1649 1615 1581 1515 1448 1316 1279 1386 1303 1279 1349 1348 1347 1351 1356 1356 1356 1436 1515 1501 1488 1474 1460 1486 1511 1457 1404 1382 1361 1388 1414 1427 1439 1487 1535
1035 1535 1594 1463 1386 1403 1419 1435 1409 1383 1387 1391 1394 1398 1414 1429 1491 1554 1515 1476 1478 1480 1502 1428 1348 1458 1387 1316 1337 1357 1396 1435 1475 1514 1441 1369 1375 1382 1405
1029 1405 1428 1372 1316 1354 1393 1333 1273 1181 1278 1376 1379 1357 1429 1502 1480 1413 1442 1458 1474 1455 1435 1416 1397 1424 1451 1419 1387 1506 1434 1469 1505 1459 1414 1322
1024 1322 1229 1292 1355 1370 1385 1369 1352 1384 1415 1365 1315 1344 1374 1438 1502 1456 1409 1408 1406 1404 1402 1419 1436 1406 1375 1445 1514 1548 1392 1367 1342 1384 1426 1435 1443 1452 1460 1428
1018 1428 1395 1363 1330 1317 1305 1339 1374 1480 1585 1485 1384 1420 1455 1490 1525 1448 1371 1373 1375 1301 1227 1264 1300 1390 1480 1363 1247 1239 1231 1222 1214 1245 1277 1261
1013 1261 1245 1278 1312 1345 1379 1402 1425 1369 1312 1313 1313 1313 1314 1349 1385 1421 1457 1444 1431 1418 1406 1373 1341 1356 1372 1410 1448 1406 1365 1356 1347 1417 1487 1493 1499 1426 1352 1327
1008 1327 1302 1277 1252 1300 1348 1349 1349 1348 1346 1291 1331 1365 1399 1385 1467 1488 1510 1426 1343 1290 1236 1261 1287 1316 1346 1369 1392 1474 1460 1421 1382 1244 1106 1157 1304
1002A304j4Q1Q7qRRKLrrL8L8q8q8m7m7J29L3l0l0K9o6j3j2K3K2l0O4J05J05K2p4o8o8L6L7
997A475L6L6o8o9j00nK0K0k1k1j23k7O9O8K7K7l1l2l1l2J83J83O3l3r7r7O5O6J5p9p9J6LM
991A431RJ0k1k1j5j5KR8Q6p2l4l3m4m4M2M2J30k8j6j7k7k7M0M0kkq7RJ00Nj77J4L8n6J5J11
986A484N6l8l8l8LM%Jm7m7K9K9L0K9RJ0Nj84J8J9j00Q9P2P2NNl0l1l0l0j6j5O4O3j4j5o2o2
980A299R7R6J7J7o4o4M7M6N0M9N0N0j58j57J7J7K0K0O7O8k5k5p3p2LMm4m3K0K1K0K1lkkl%
975A381%%jQ8Q8QRj0j1j0j1o4o5K0K0J2J06Q1j09l0l0l0l0p8J12NMJ5J5P4j16n2n3j7j7N9
969A363N9n2n2N2N2N3N2k4k4J3j76p2Q6J60Jj08j2R8R8p0p0RRJ9J9k8k9n7n7K2K2O3O2j6j7
964A448J0RRJ0j20j21N4N4O7O6m4m4j3j2O6O7K2K3P0P1q8q8l1l1o8Q9M9j10o3L2J40M4p8J6
$$ plain form
1002 1304 1290 1371 1458 1450 1459 1468 1470 1473 1464 1455 1493 1531 1443 1355 1308 1261 1390 1423 1393 1363 1392 1326 1313 1301 1324 1346 1316 1380 1485 1590 1612 1538 1470 1402 1438 1475
997 1475 1511 1547 1479 1410 1310 1305 1325 1345 1324 1303 1180 1153 1222 1290 1317 1344 1313 1281 1250 1218 1401 1584 1647 1614 1517 1420 1485 1551 1566 1487 1408 1424 1427 1431
991 1431 1440 1450 1429 1408 1393 1378 1380 1478 1564 1492 1458 1425 1381 1337 1379 1421 1551 1523 1507 1490 1463 1436 1476 1516 1514 1512 1425 1434 1534 1539 1362 1376 1414 1358 1373 1484
986 1484 1540 1502 1464 1426 1429 1433 1433 1434 1387 1340 1369 1398 1428 1457 1466 1476 1481 1297 1315 1334 1234 1323 1395 1467 1472 1477 1447 1416 1386 1356 1340 1325 1389 1452 1438 1423 1361 1299
980 1299 1396 1492 1509 1526 1462 1398 1445 1491 1541 1590 1640 1690 1532 1375 1392 1409 1429 1449 1516 1584 1559 1534 1461 1389 1392 1396 1352 1309 1329 1350 1370 1391 1388 1386 1384 1381 1381
975 1381 1381 1381 1380 1468 1556 1564 1573 1563 1552 1542 1531 1467 1402 1422 1442 1454 1560 1641 1532 1502 1472 1442 1412 1334 1446 1451 1455 1470 1485 1559 1443 1391 1338 1321 1304 1363
969 1363 1422 1370 1318 1370 1422 1475 1527 1503 1479 1492 1316 1244 1330 1490 1491 1383 1371 1469 1567 1497 1427 1436 1445 1464 1483 1455 1426 1369 1312 1334 1356 1419 1481 1465 1448
964 1448 1458 1467 1476 1486 1366 1245 1299 1353 1420 1486 1442 1398 1385 1373 1439 1506 1528 1551 1621 1692 1604 1516 1485 1454 1386 1475 1524 1414 1351 1383 1523 1567 1489 1505
959A505L6L7n3n3nnk6k6N3N3J4J3l4l4KKj3j09LJ62m5m4M5M5M5M5k6k6p4p3k5k4k5k5R7R7
953A509J8J8L5L5j2j2n2n2nmL8L7p3p3M1M2ooo3o3j6j6K2K2P0O9m0m0QPn2n2K8K7l9l8QRr
947A320rj7J73K8j62j09Q1N1m5LR8P5j15n6L9k1k2O4O4l3l3J5J5Q6Q6n6n6k4k4j3j2J02q8
942A405j7j7r5R5Q9om3m3L1L0QQRQK0K1n3n2o2L2O3j27j0j1K6K5oop8J12Q3j08l6l6M3M3R1
936A436R1q2q1K9L0J7J8o1o2L3L3m6m6N1N1K6K7l2l2Q9oJ28o2m0m0J0Rl8l8L6L6j1j1l3l3
931A396M6M6o6o7J3J3M8M8l1l1l9m0QQK0K1n8n9K8K8K8K8J1J1J1J1j2j3opk9O6J11m7j05N3
926A443J23l6l4l5L5L4N5N4PPJ0Rj28j27K9J24qj67k4P1N5N5l7l6J0J1L7L7j1j1K3K3n6n6
920A486n2n2mR0J51pj08j3o4o5K1K1J7J8l0k9M2M2M3M2rrn6n7L8L7L7L8l5l5l5l5l1l1M8M8
$$ plain form
959 1505 1541 1578 1525 1472 1467 1462 1436 1410 1463 1516 1530 1543 1509 1475 1477 1479 1466 1357 1360 1522 1477 1433 1478 1523 1568 1613 1587 1561 1487 1414 1389 1365 1340 1315 1412 1509
953 1509 1527 1545 1580 1615 1603 1591 1539 1487 1482 1478 1516 1553 1480 1407 1448 1490 1484 1478 1415 1352 1336 1320 1342 1364 1434 1503 1463 1423 1431 1438 1386 1334 1362 1389 1350 1312 1320 1329 1320
947 1320 1311 1294 1467 1495 1333 1224 1305 1356 1311 1314 1412 1487 1372 1316 1355 1334 1312 1376 1440 1407 1374 1389 1404 1490 1576 1520 1464 1440 1416 1403 1391 1493 1405
942 1405 1388 1371 1276 1371 1460 1454 1411 1368 1399 1429 1437 1445 1454 1462 1482 1503 1450 1398 1336 1368 1431 1304 1294 1283 1309 1334 1328 1322 1244 1356 1439 1331 1295 1259 1302 1345 1436
936 1436 1527 1445 1364 1393 1423 1440 1458 1397 1335 1368 1401 1355 1309 1360 1411 1437 1464 1432 1400 1489 1483 1611 1549 1509 1469 1479 1488 1450 1412 1448 1484 1473 1462 1429 1396
931 1396 1442 1488 1422 1355 1368 1381 1429 1477 1446 1415 1376 1336 1344 1352 1372 1393 1335 1276 1304 1332 1360 1388 1399 1410 1421 1432 1420 1407 1401 1394 1365 1431 1542 1495 1390 1443
926 1443 1566 1530 1496 1461 1496 1530 1585 1639 1646 1653 1663 1672 1544 1417 1446 1570 1562 1395 1371 1442 1497 1552 1515 1479 1489 1500 1537 1574 1563 1552 1575 1598 1542 1486
920 1486 1434 1382 1378 1468 1619 1612 1504 1491 1427 1362 1383 1404 1421 1439 1409 1380 1422 1464 1507 1549 1540 1531 1475 1418 1456 1493 1530 1568 1533 1498 1463 1428 1397 1366 1414 1462
915A462ppP2P2K3K3n6n7jjm9m9p8p7L3L3L4L3L3L4j7j6j6j6L0L0P2P1m6j40rJ50K3p3L9L8
909A590J4J4J3J4j10j10L3L2m6m7m7m6j9k0R2R1R5R4p4p3J7J13O9q9M5M5p5p5k7k8K1K0%j
904A525%jO0O0n1n1o0o0N1N0N7N6q6q6O2O3q0J4J35k4p2p1k1k1k1k1J03J04l9l9j4j3qpn9
899A435L6J57jKR6m5m6o2o3J7J7N3N3k1k1oQ9n0k08J20J19l3l3m4m5m4m4l0k9J8J8LMJ14J15
894A641n7n7m6m7q4P3L3L2n0m9J14J14Mj54m0N6K3K4j8j8L4L4l5l5l3J25M2n3q2q2n3J38K2
888A516K3j3j2l4l4M5M5k9k9J9J9L4L5L5L5l4l5M5M5j2j1j1j2M5M5l4l4J2J2o7o7j5j6L2L2
883A575k4k4K3K3QQp1p1N1N0N0N0p3p3L7L7J1J1N8N8LLrj0N9j31k4k4j9j9k0j9J2J2l6l5L8
878A495L7K6K6K8j61qpP1P1qrJ2J2l6l6J8J9J8J9n8n7K2K2L3L4m5m6nnmnM1M2M2M1jjkjM5
$$ plain form
915 1462 1455 1448 1520 1592 1615 1638 1582 1525 1524 1523 1474 1425 1347 1270 1303 1336 1370 1403 1436 1470 1453 1437 1421 1405 1435 1465 1537 1608 1562 1422 1413 1563 1586 1513 1552 1590
909 1590 1604 1618 1631 1645 1535 1425 1458 1490 1444 1397 1350 1304 1285 1265 1357 1448 1543 1637 1563 1490 1507 1620 1689 1600 1645 1690 1615 1540 1513 1485 1506 1526 1526 1525
904 1525 1525 1524 1584 1644 1593 1542 1482 1422 1473 1523 1580 1636 1550 1464 1526 1589 1509 1523 1658 1634 1562 1491 1470 1449 1428 1407 1510 1614 1575 1536 1522 1509 1501 1494 1435
899 1435 1471 1628 1627 1629 1725 1680 1634 1572 1509 1526 1543 1596 1649 1628 1607 1601 1690 1640 1432 1552 1671 1638 1605 1561 1516 1472 1428 1398 1369 1387 1405 1408 1412 1526 1641
894 1641 1584 1527 1481 1434 1350 1423 1456 1488 1438 1389 1503 1617 1621 1467 1427 1483 1506 1530 1512 1494 1528 1562 1527 1492 1459 1584 1626 1573 1491 1409 1356 1494 1516
888 1516 1539 1526 1514 1480 1446 1491 1536 1507 1478 1497 1516 1550 1585 1620 1655 1621 1586 1631 1676 1664 1653 1642 1630 1675 1720 1686 1652 1664 1676 1609 1542 1527 1511 1543 1575
883 1575 1551 1527 1550 1573 1581 1589 1518 1447 1498 1548 1598 1648 1575 1502 1539 1576 1587 1598 1656 1714 1717 1720 1711 1701 1760 1629 1605 1581 1562 1543 1523 1504 1516 1528 1492 1457 1495
878 1495 1532 1558 1584 1612 1451 1443 1436 1507 1578 1570 1561 1573 1585 1549 1513 1531 1550 1568 1587 1529 1472 1494 1516 1549 1583 1538 1492 1487 1482 1478 1473 1514 1556 1598 1639 1638 1637 1635 1634 1679
871A679M5M6M5llq3q2l7l8l8l7P0P0P0P1q3q4K8K8k5k5k5k5J10J11l2l2n7n7K3K2lmlmLKL
866A646KK1K2K1K1o8o9M2M2K3K2q8q8NNNNJ11J11l1l2MLj71j70J9J9O7O6M2M2ooklllP8P7
860A781l3l4N1N0LMPQp1p1j3j3j3j3O3O3J6J5l3l3M6M7j1j0n8n7RJ0Q9Q8j0j0n7n8p3p4k6
854A579k5J00J01m2m1J3J4J4J3LLLLkkkkp2p1M0L9m6m7L3L2Q1Q0l0l0j3j2K5K5K9j30q8q8
848A487K0K0J9K0J23J24n1n0QRRQJ5J5l3l3Q9Q9n4n3m5m4MLrqR2R3L2j26p8Q0N3N4O3O3j07
843A901j08K5K5J29k9j08M9l9l9M9N0m5m4M1M0l8N7R2o5j5j4k5k4rrL8L8J0RN7N8L9M0qpm6
837B075m5m5m6k7k8k7k8M8M8M7M8j8j9j8j8OPOOQ8Q8M0M0n6n6j03j04N3N2ONl8l9l8l8K6K6
832A924K5K6NMl8l7j7P8O3O2Q4p4o5o4N0N1q2J2K4K4K3K4k7j21m3N2M9M8n2M2P0k5K9K9Nr0
$$ plain form
871 1679 1724 1770 1815 1812 1809 1726 1644 1607 1569 1531 1494 1564 1634 1704 1775 1692 1608 1636 1664 1639 1614 1589 1564 1674 1785 1753 1721 1664 1607 1630 1652 1649 1645 1642 1638 1641 1643 1646
866 1646 1648 1669 1691 1712 1733 1665 1596 1638 1680 1703 1725 1637 1549 1554 1559 1564 1569 1680 1791 1760 1728 1732 1735 1564 1394 1413 1432 1499 1565 1607 1649 1643 1637 1635 1632 1629 1626 1704 1781
860 1781 1748 1714 1765 1815 1818 1822 1829 1837 1766 1695 1682 1669 1656 1643 1706 1769 1785 1800 1767 1734 1780 1827 1816 1806 1748 1691 1700 1710 1799 1887 1877 1867 1810 1752 1679 1605 1579
854 1579 1554 1654 1755 1713 1672 1685 1699 1713 1726 1729 1732 1735 1738 1736 1734 1732 1730 1658 1587 1627 1666 1620 1573 1606 1638 1719 1799 1769 1739 1726 1714 1739 1764 1793 1663 1575 1487
848 1487 1507 1527 1546 1566 1689 1813 1762 1712 1720 1729 1738 1746 1761 1776 1743 1710 1799 1888 1834 1781 1736 1692 1696 1699 1690 1682 1774 1867 1899 1773 1695 1775 1828 1882 1945 2008 1901
843 1901 1793 1818 1843 1972 1943 1835 1884 1845 1806 1855 1905 1860 1816 1857 1897 1859 1916 2008 1943 1928 1914 1889 1865 1856 1847 1885 1923 1933 1942 1999 2057 2096 2136 2128 2121 2075
837 2075 2030 1985 1939 1912 1884 1857 1829 1877 1925 1972 2020 2002 1983 1965 1947 1953 1960 1966 1972 2060 2148 2188 2228 2172 2116 2013 1909 1962 2014 2020 2025 1987 1948 1910 1872 1898 1924
832 1924 1949 1975 1980 1984 1946 1909 1892 1970 2033 2095 2179 2105 2040 1976 2026 2077 1995 2007 2031 2055 2078 2102 2075 1954 1911 1963 2012 2060 2008 2050 2120 2095 2124 2153 2158 2068
826B068l1l1m6M8J06J06O9P0k0j15opO1O1rj04mll3l2l3l2O2O1N2N1M0j19k3k4k7O7O2O1J8
821B364J7qj03l6l6L7L8O5O5p2p1o6K9L0o6J4J4RQl9m0O2O2R0o8j11j7M9M9J55O1n2n2j1j0
815B360j7j6n8n8m9M7R3jN4N3M7M8l9l8r3J28J48rk4k3Lr2LLO3l3J1J70p4p4J6J5KLQ1Q2J4
810B746J4J4J4P1P0j4j5rj05m7J42J2J1K3K3n8n8Q5Q5K1K0O8O8o4o5j7j7R3R3j8j8J9K0K0
805C227J9llP6P6n0m9K9L0O4O4O4O4PON4N4%%M8M8MNo1L3J37n3O0N9K0K0J30J30L5L4j3j3
799D352M5M4l4l5J10J10J10J10L0L0L0L1K4K4O6O6J39M4n1J39%R4J66k4q4J1Q8Q8J03J03K4
794E953K4O3O3J43J42L1L1L0L1M3M2J85J85j9k0R1R1J47J47L6L7P9Q0L2L3P0P0J17J17J05
790H179J04J05J05K11K12J01J01P5P4K7K7N6N6J04J03P9P9P9P8J02J02J80J81J28J29J75J76
$$ plain form
826 2068 2037 2006 1960 2008 2114 2220 2289 2359 2339 2224 2218 2211 2272 2333 2324 2220 2216 2213 2180 2148 2115 2083 2145 2206 2258 2309 2349 2230 2207 2183 2156 2223 2285 2346 2364
821 2364 2381 2373 2270 2234 2198 2235 2273 2338 2403 2331 2260 2194 2223 2253 2187 2201 2215 2224 2232 2193 2153 2215 2277 2367 2299 2188 2171 2220 2269 2424 2485 2433 2381 2370 2360
815 2360 2343 2327 2269 2211 2162 2209 2302 2301 2355 2408 2455 2503 2464 2426 2333 2461 2609 2600 2576 2553 2556 2464 2467 2470 2533 2500 2511 2681 2607 2533 2549 2564 2566 2569 2650 2732 2746
810 2746 2760 2774 2788 2859 2929 2915 2900 2891 2786 2739 2881 2893 2904 2927 2950 2892 2834 2919 3004 3025 3045 3113 3181 3117 3052 3035 3018 3111 3204 3186 3168 3187 3207 3227
805 3227 3246 3243 3240 3316 3392 3342 3293 3322 3352 3416 3480 3544 3608 3615 3621 3675 3729 3729 3729 3777 3825 3829 3834 3773 3806 3943 3890 3950 4009 4029 4049 4179 4309 4344 4378 4365 4352
799 4352 4397 4441 4407 4372 4482 4592 4702 4812 4842 4872 4902 4933 4957 4981 5047 5113 5252 5296 5245 5384 5384 5478 5644 5620 5536 5547 5635 5723 5826 5929 5953
794 5953 5977 6040 6103 6246 6388 6419 6450 6480 6511 6554 6596 6781 6966 6947 6927 7018 7109 7256 7403 7439 7476 7555 7635 7667 7700 7770 7840 7957 8074 8179
790 8179 8283 8388 8493 8704 8916 9017 9118 9193 9267 9294 9321 9377 9433 9537 9640 9719 9798 9877 9955 10057 10159 10339 10520 10648 10777 10952 11128
785A1128J29J29N0M9N9N8J70J69O7O6O7O7J3J4K19K19O7O8O7O8J81J81J34J34J10J11J59J58
781A4111J17J17J17J16L6L6L6L6J66J65J66J66J37J37N9N8J9K0J30J31P5P6J22J23R4R4K01
777A6861J1N4N3R0Q9j5j4R6R6J09J09O1O1Q4Q3r1r1L7L7p3p4L2L1j6j6n6n5qrj53j54p4p4
772A7021l8l7l7l7j30j30q2q3p2p1p2p2k13k12k12k13j5j6j64j63n7j52j58L2j44j43j32j31
768A4067k24k23j33j32k40n0j9j14j65p0k2j18k29j33n1n1j46j45j46j46j31j32j31j31r2
764A0893r2m5m4j02j02k23j28j38N2r6r7j47j47o8o8j03j02j44n0k14k4j5j5n8n8n8n8j41
760H408j42l0l1o7o7j47j46j04j03j3j2j69K1K7j63j06j1p6p7n5n4K4K5j13j13l4l4k4k4j66
755F424j67K7K8q4q4n0n1n7n7R1nk00j0o8o9K3K2k9l0j09j08m2m1ooj9k09k2k3J5J5l3l2j24
$$ plain form
785 11128 11257 11386 11436 11485 11544 11602 11772 11941 12008 12074 12141 12208 12221 12235 12454 12673 12740 12808 12875 12943 13124 13305 13439 13573 13683 13794 13953 14111
781 14111 14228 14345 14462 14578 14614 14650 14686 14722 14888 15053 15219 15385 15522 15659 15718 15776 15795 15815 15945 16076 16151 16227 16349 16472 16566 16660 16861
777 16861 16872 16926 16979 17069 17158 17143 17129 17225 17321 17430 17539 17600 17661 17745 17828 17737 17646 17683 17720 17647 17573 17605 17636 17620 17604 17548 17493 17485 17476 17323 17169 17095 17021
772 17021 16983 16946 16909 16872 16742 16612 16530 16447 16375 16304 16232 16160 15947 15735 15523 15310 15295 15279 15115 14952 14895 14743 14585 14617 14473 14330 14198 14067
768 14067 13843 13620 13487 13355 13115 13065 13046 12932 12767 12697 12675 12557 12328 12195 12144 12093 11947 11802 11656 11510 11379 11247 11116 10985 10893
764 10893 10801 10756 10712 10610 10508 10285 10157 10019 10071 9975 9878 9731 9584 9516 9448 9345 9243 9099 9049 8835 8811 8796 8781 8723 8665 8607 8549 8408
760 8408 8266 8236 8205 8138 8071 7924 7778 7674 7571 7558 7546 7377 7398 7425 7262 7156 7145 7069 6992 6937 6883 6907 6932 6819 6706 6672 6638 6614 6590 6424
755 6424 6257 6284 6312 6228 6144 6094 6043 5986 5929 6020 6015 5815 5805 5737 5668 5691 5713 5684 5654 5545 5437 5395 5354 5348 5342 5323 5114 5092 5069 5084 5099 5066 5034 4910
750D910j23J9J9l5l5l6l5p7p7LKK9K9K9K9j5j6j5j5l6l6l6l6q5q4l7l7j12j11R5R4L3L4j5
745D221j4p8p7p8p7NNNNPPp2p3mnn3n2l1l0l1l0l6l7L0o6n6J34m6m6m6J44J1q4k4k5J1J1k3
739C402j18r3R7J1J1K3K3j5j5o2o2o0n9o0n9N5N6N5N5k0k1o9o8k3k4j7j8k6P0J23o7n3n3r2
734B827R7QRK0K0L1L0j12j12m6m6L3L3noM2M2noj01N8J3q2q2J3J67Qm0l9j8j7j7j7J9K0k8
728B711k8p8p8L2L3OOOOm7m7%%J6J6r5r5lmlmM4M4M4M4o5o6j8j8n4n4n4n3N8N8J1J1P4P4o9
722B361o8k0k1k0k1jkJ09J09j07j07LLj2j3o0o0k4k4Q7Q6j4j4N9N9rj04r9O0J01Ok0k1M5j14
717B133j20L8P8j7o4o5J0J0RJ0mmM3M4NONOk8k7k7k7k8k9k8k9k7k8L2o3o3L2J72J5l1l2PO
711A920j1j1M2n3llM4M4n6M0j5j4j7j7N6N6J9p7LR7J7J6k5k5k2k1K5K6j02j03l0k9J14K0j01
$$ plain form
750 4910 4787 4806 4825 4790 4755 4719 4684 4607 4530 4533 4535 4564 4593 4622 4651 4636 4620 4605 4590 4554 4518 4482 4446 4361 4277 4240 4203 4091 3980 4075 4169 4202 4236 4221
745 4221 4207 4129 4052 3974 3897 3902 3907 3912 3917 3924 3931 3859 3786 3782 3777 3724 3672 3641 3611 3580 3550 3514 3477 3507 3441 3385 3519 3473 3427 3381 3525 3536 3452 3428 3403 3414 3425 3402
739 3402 3284 3191 3288 3299 3310 3333 3356 3341 3326 3264 3202 3142 3083 3023 2964 3019 3075 3130 3185 3165 3144 3075 3007 2984 2960 2943 2925 2899 2969 3092 3025 2972 2919 2827
734 2827 2924 2932 2941 2961 2981 3012 3042 2930 2818 2772 2726 2759 2792 2787 2781 2823 2865 2860 2854 2753 2811 2824 2742 2660 2673 2840 2848 2808 2769 2751 2734 2717 2700 2719 2739 2711
728 2711 2683 2605 2527 2559 2592 2598 2604 2610 2616 2569 2522 2522 2522 2538 2554 2459 2364 2361 2357 2354 2350 2394 2438 2482 2526 2461 2395 2377 2359 2305 2251 2197 2144 2202 2260 2271 2282 2356 2430 2361
722 2361 2293 2273 2252 2232 2211 2210 2208 2317 2426 2319 2212 2215 2218 2206 2193 2133 2073 2049 2025 2112 2198 2184 2170 2229 2288 2279 2175 2076 2136 2237 2243 2223 2202 2247 2133
717 2133 2013 2051 2129 2112 2048 1983 1993 2003 2012 2022 2018 2014 2057 2101 2106 2112 2117 2123 2095 2068 2041 2014 1986 1957 1929 1900 1873 1845 1877 1814 1751 1783 1955 1970 1939 1907 1914 1920
711 1920 1909 1898 1940 1887 1884 1881 1925 1969 1913 1953 1938 1924 1907 1890 1946 2002 2021 1944 1947 2044 2061 2077 2052 2027 2005 1984 2009 2035 1933 1830 1800 1771 1885 1905 1804
706A804j01K6K5P9j6NMqpK6o9L2J27P8q1j91l3Q2j4LLrj0lr8l4l4l4l4R2J87K3K2m7m8m7m8
700A652l6l6l0l0j1Q4Q4j1P4P5M3n2m1m1K6K6M3n2j63o7N8N9m0m0q4J2L1L2J10J6J1q3m4m5
695A530lkK8K7K2K2L4o0n5n5K8K8J65On3n3o3o3ppJ2J07M7m8m2N3j3j4j9P6K2p2n4n5mR1M4
689A600n2MLj2j2J12m7n9n9l9J19P1P2Nr0l6l7L3L2J2q2l8N7L9M0Q4j1j53n8J28J28nj63o1
684A525R8q1q0M5M5R9MJ8J8r9r9M7M7l3l2nmj0Q4R5R4p4p3p1p1J3J08M6m9m3m3P3k3K4J20
679A713l4l3l4l4N4m0j20k5N6N6j7j8PPPPN2N3o5o4K7o7mmj5J44N4N4l5l5l5l5K7K7K7K7o
673A679oM2M1m1m0L8L9n1n2R2R1n4n5n4n4k6k6o6J25J32n8q1q2J3J4J3J3q1q1M2M2j01Q9J09
668A605J3J06J1j37m3K0K0K6K7nnM3M3l1l2M8M7qrrrM1M1j8j8P6j14j34l9M8J44llj33N8k
$$ plain form
706 1804 1703 1729 1754 1833 1817 1822 1826 1818 1811 1837 1768 1800 1927 2005 1924 1733 1700 1782 1768 1771 1774 1765 1755 1752 1654 1620 1586 1552 1518 1610 1797 1820 1842 1795 1747 1700 1652
700 1652 1616 1580 1550 1520 1509 1593 1677 1666 1740 1815 1858 1806 1765 1724 1750 1776 1819 1767 1604 1537 1595 1654 1614 1574 1490 1502 1533 1565 1675 1691 1702 1619 1575 1530
695 1530 1527 1525 1553 1580 1602 1624 1658 1598 1543 1488 1516 1544 1709 1715 1662 1609 1546 1483 1476 1469 1481 1588 1635 1587 1545 1598 1585 1571 1552 1628 1650 1578 1524 1469 1465 1556 1600
689 1600 1548 1552 1555 1543 1531 1643 1596 1537 1478 1439 1558 1629 1701 1706 1616 1580 1543 1576 1608 1620 1538 1500 1557 1596 1636 1720 1709 1556 1498 1626 1754 1749 1586 1525
684 1525 1623 1542 1462 1507 1552 1651 1655 1673 1691 1592 1493 1540 1587 1554 1522 1517 1513 1503 1587 1682 1776 1702 1629 1558 1487 1500 1608 1654 1605 1562 1519 1592 1569 1593 1713
679 1713 1679 1646 1612 1578 1632 1592 1472 1447 1503 1559 1542 1524 1531 1538 1545 1552 1604 1657 1592 1528 1555 1488 1484 1480 1465 1609 1663 1717 1682 1647 1612 1577 1604 1631 1658 1685 1679
673 1679 1673 1715 1756 1715 1675 1713 1752 1701 1649 1741 1832 1778 1723 1669 1615 1589 1563 1497 1622 1754 1696 1615 1533 1546 1560 1573 1586 1505 1424 1466 1508 1407 1496 1605
668 1605 1618 1724 1735 1598 1555 1575 1595 1621 1648 1643 1638 1681 1724 1693 1661 1709 1756 1748 1739 1730 1721 1762 1803 1785 1767 1843 1729 1595 1556 1604 1748 1745 1742 1609 1667 1665
662A665kj5j4j5j5O9O8j1j0rj0rrk6k6Q3J77lj93j14P5Q1j4j13j8N0N1N6N7j3j3r2r1L9M0
657A676M0L9n7n7Q5Q5l0l0l1l0L7L7L7L7j32j32k1k2J51J51n5n5l2l3l2l2K3K3K3K3M1M1o
652A762pNNm3m3O2O2J4J5M0M0l9l9m8m9r6r6O2O3J10J09j2j3o1o0qqQ1p7o3o2O0O0J24l4N5
646A871N5K1K2K1K2M6M6r7r6k0k0j9k0L9M0L9M0K1K2k6k5O3O3m7m8popppoLLj40J8Q7qP3k3
641A986P2P3l3l3o6o7j00J22R6o3n9R9n4M1Q5Q5M4M3r7r6j8j8O0O0q3q3J02J02p2p2m6m5m5
635A920m5M9M9o1o2L0K9L0K9J%Q0P9nno9K6J18m0j16k0Q7po0n9j1j1O7O8j8j8j9j8rrP1P0
630B141p5p5O7O8ook1P3Pj51K3K2K7K6K6K6j5j4r4r3L9M0qqnoq5q5P5P4o8o7R6R6j4j09j40
624A781J9J62Lp1K4m0l9K9K9n0n0qrqr%jm8m8k2k3M5n0j23R7J00Nl4l4J03J03j9j8q8q8o8
$$ plain form
662 1665 1663 1648 1634 1619 1604 1673 1741 1730 1720 1711 1701 1692 1683 1657 1631 1714 1891 1888 1695 1581 1656 1737 1723 1610 1592 1642 1693 1749 1806 1793 1780 1688 1597 1636 1676
657 1676 1716 1755 1698 1641 1726 1811 1781 1751 1720 1690 1727 1764 1801 1838 1706 1574 1553 1531 1682 1833 1778 1723 1691 1658 1626 1594 1617 1640 1663 1686 1727 1768 1762
652 1762 1755 1760 1765 1722 1679 1741 1803 1817 1832 1872 1912 1873 1834 1786 1737 1641 1545 1607 1670 1780 1889 1877 1864 1803 1743 1735 1727 1808 1731 1668 1606 1666 1726 1850 1816 1871
646 1871 1926 1947 1969 1990 2012 2058 2104 2007 1911 1891 1871 1852 1832 1871 1911 1950 1990 2011 2033 2007 1982 2045 2108 2061 2013 2006 2000 1993 1986 1979 1973 1976 1979 1839 1857 1944 1936 2009 1986
641 1986 2058 2131 2098 2065 1999 1932 1832 1954 2050 1987 1928 2027 1973 2014 2099 2184 2228 2271 2174 2078 2060 2042 2102 2162 2079 1996 2098 2200 2128 2056 2010 1965 1920
635 1920 1875 1924 1973 1912 1850 1880 1909 1939 1968 1969 1969 2049 2128 2123 2118 2049 2075 2193 2153 2037 2017 2104 2097 2037 1978 1967 1956 2023 2091 2073 2055 2036 2018 2009 2000 2071 2141
630 2141 2066 1991 2058 2126 2120 2114 2093 2166 2173 2022 2045 2067 2094 2120 2146 2172 2157 2143 2049 1956 1995 2035 2027 2019 2014 2008 1923 1838 1913 1987 1919 1852 1948 2044 2030 1921 1781
624 1781 1800 1962 1965 1894 1918 1878 1839 1868 1897 1847 1797 1789 1780 1772 1763 1763 1762 1714 1666 1644 1621 1666 1616 1493 1590 1690 1695 1661 1627 1730 1833 1814 1796 1708 1620 1552
619A552R0J38k0n1n0J8J9j1j1r1r0R1R1L7j21j23j24QRO3O4O3O3K9L0n0m9k0k0k0k0k8k7J9
614A458K0M9N0N0M9PPj03j04QQp1p1M8M9JJPPPQK5K4K5K5KKm5m6o9p0M2M1J%J%j%M7M7N8N8
607A652k1k1JKj09j09j4j3mml1J28J9p6j01pM5M4K9K9j9j8llq2q3P8P9P8P8l9l9l8l9J7J7
601A423J6J7POPOj7j7j7j7%J%Jk6k6k6k6L6L7j1j0k7k6k7k7K5K5M1n5m2J16J53N9l6l6m2m2
596A423o0o0N1N1L2L2L2L2r3r4M9M9q9q9m2m2K3K2k5k5J7J7J7J7N9N9k1k0JKJKO2O2j13j12
590A227J09J09l4l3n1n0O0O1J0J1J1J1k7k7p5p4nnnnK0K1O8O8k6k5k6k5J0J0J0J0O8O9m2m3
585A385m6m6JJK2K2K2K2m0l9l9m0j3j4l4J89L0o4LMK1K2QQM0j81j16k1K2p3J1J07LLN6N6J71
579A463J70l5l5p3p3OPj16j17nnL2L2Q0Q0p3p2k4k5j0j0o9K5L8n8Q1Q1O8O8j1j1n5n5J9J8
$$ plain form
619 1552 1642 1780 1760 1709 1659 1677 1696 1685 1674 1583 1493 1584 1675 1712 1591 1468 1344 1352 1361 1424 1488 1551 1614 1643 1673 1623 1574 1554 1534 1514 1494 1466 1439 1458
614 1458 1478 1527 1577 1627 1676 1683 1690 1587 1483 1491 1499 1428 1357 1405 1454 1455 1456 1463 1470 1477 1485 1510 1534 1559 1584 1586 1588 1543 1497 1428 1358 1400 1441 1442 1442 1443 1443 1442 1442 1489 1536 1594 1652
607 1652 1631 1610 1611 1613 1504 1395 1381 1368 1364 1360 1329 1457 1476 1400 1299 1292 1337 1381 1410 1439 1420 1402 1399 1396 1314 1231 1309 1388 1466 1544 1505 1466 1428 1389 1406 1423
601 1423 1439 1456 1463 1469 1476 1482 1465 1448 1431 1414 1414 1415 1415 1416 1390 1364 1338 1312 1348 1385 1374 1364 1337 1311 1284 1257 1282 1307 1348 1293 1251 1367 1520 1579 1543 1507 1465 1423
596 1423 1363 1303 1354 1405 1437 1469 1501 1533 1440 1346 1395 1444 1355 1266 1224 1182 1205 1227 1202 1177 1194 1211 1228 1245 1304 1363 1342 1322 1323 1325 1326 1328 1390 1452 1339 1227
590 1227 1336 1445 1411 1378 1327 1277 1337 1398 1408 1419 1430 1441 1414 1387 1312 1238 1233 1228 1223 1218 1238 1259 1327 1395 1369 1344 1318 1293 1303 1313 1323 1333 1401 1470 1428 1385
585 1385 1339 1293 1294 1295 1317 1339 1361 1383 1343 1304 1265 1225 1212 1198 1164 1353 1383 1319 1322 1326 1347 1369 1377 1385 1425 1244 1128 1107 1129 1056 1067 1174 1177 1180 1236 1292 1463
579 1463 1633 1598 1563 1490 1417 1423 1430 1314 1197 1192 1187 1219 1251 1331 1411 1338 1266 1242 1217 1207 1197 1128 1153 1191 1133 1214 1295 1363 1431 1420 1409 1354 1299 1318 1336
574A336O5l0J8J7P9j6r9j00n4M0pj02R5R5M5j12p0Q9O7k8m2m2L1L2M8M7n7n7p5K0J5J4j4j3
569A235K8K8J14K0j23k8n7n8N3N3J4q2j29l4J01J01O0r8j1Q5K1K1k9l0N0N0r0r1J41j7L7L8
564A373N1N1p8p8l1l0K8K9K8K9n4n5l6l7J33L8j14j9Q4p3p4Q4O1l4K9K9K2K2Rq5k05J7J9p5
558A058N0N0O8O8L2L2j6j5J9J9L2o4j09j4NOO5O5L9n6l2l2k2P3J40j7kkp4p4q3q4O8q9m9J10
553A165P0k5J5J5J01J02N4j04q0J6K6K5L6n8k9k9pok11J1P0O9N8l7K8K8K2K2opj2j3l7j32
548A140p3p3k3P1l0k9M8M9J02PQPn8L8O0l5k9O5n2n2L3L3K5K5n3M2K1K1j5j5r6kP8j7j2j2
542A197L0L0MMm3m3rqP1P1J22J22n6j51j27l2K8K9l6J22k5j19j%R5jK0J9l4l4N2N2n8n9m5
537A187m5O6O6n1n1K8K8P3P3l8l8J9K0J9K0r2r1j2j2l4l4l4l4QPQPJ19J19QQJ4J3J4J4r0r1
$$ plain form
574 1336 1401 1371 1389 1406 1485 1469 1370 1270 1216 1256 1249 1147 1242 1337 1382 1270 1200 1289 1356 1328 1286 1244 1275 1307 1355 1402 1345 1288 1213 1233 1248 1262 1248 1235
569 1235 1263 1291 1405 1425 1302 1274 1217 1159 1212 1265 1279 1197 1068 1034 1135 1236 1296 1198 1187 1272 1293 1314 1285 1255 1305 1355 1265 1174 1315 1298 1335 1373
564 1373 1424 1475 1397 1319 1288 1258 1286 1315 1343 1372 1318 1263 1227 1190 1323 1361 1247 1228 1312 1239 1165 1249 1310 1276 1305 1334 1356 1378 1387 1302 1097 1114 1133 1058
558 1058 1108 1158 1226 1294 1326 1358 1342 1327 1346 1365 1397 1333 1224 1210 1215 1221 1286 1351 1390 1334 1302 1270 1248 1321 1461 1444 1442 1440 1366 1292 1209 1125 1193 1104 1055 1165
553 1165 1235 1210 1225 1240 1341 1443 1497 1393 1313 1329 1355 1380 1416 1358 1329 1300 1293 1287 1076 1087 1157 1226 1284 1247 1275 1303 1325 1347 1341 1334 1322 1309 1272 1140
548 1140 1067 994 971 1042 1012 983 1031 1080 1182 1189 1197 1204 1146 1184 1244 1209 1180 1245 1193 1141 1174 1207 1232 1257 1204 1246 1267 1288 1273 1258 1162 1160 1238 1221 1209 1197
542 1197 1227 1257 1261 1265 1222 1179 1170 1162 1233 1304 1426 1548 1492 1341 1214 1182 1210 1239 1203 1325 1300 1181 1180 1180 1275 1274 1294 1313 1279 1245 1297 1349 1291 1232 1187
537 1187 1142 1208 1274 1223 1172 1200 1228 1301 1374 1336 1298 1317 1337 1356 1376 1284 1193 1181 1169 1135 1101 1067 1033 1041 1048 1056 1063 1182 1301 1309 1317 1331 1344 1358 1372 1282 1191
531A191Q4Q3L9L9p1p2n1n0llOPPPJ7J8J8J7QPl9m0O2O3q0p9k3k2K5K5q2q2J24J24L6L7j1j0
525A326r7r8P8P7j5j5j5j5l9l9QRrj0rrK9L0P7P7j6j6j5j6Q3Q3k8k7jjjjq8q8q8q7R5R5J6
520A240J6K9L0K9K9JJj10j11M8M7J31r1j23k8P9P9l3l4J5J4J5J5K1K2pQ8M0n4r0q9M8M7l9
514A275l9QRKKLKl1l1l1l1J3J3O9P0r2O6J13m4m5m5n5n4L9M0M0L9JKO4l1j11M7N2m2o5o5M0
509A197M0Q1Q2L5j24k2P3N1N1pj02j32K6p9J5J40j8l3l4kkP3k2j07j2Qq6kR3m8m8j7P9Q4Q5
503A316Q1Q0K6j32r6jl4l4L2o3nQ9R0nj01oJ09m9j00nNMJ17K2L3L4o0L4P0q8J6J6p3p3k5k6
498A198k6k5J0J0N8N8m1m1N3j04q5J0K5K6M4M5llK9L0j44J4J65P1K3K3j%%jl7l6J0J1L9L9
492A444rqp3p3p3p2M7M8%%PQN4N5J3J3o6o6k6k5K2K2N0N0N0N0n9o0j2j2l0l0p7p8M6M7jkL5
$$ plain form
531 1191 1275 1358 1397 1436 1365 1293 1242 1192 1189 1186 1192 1199 1206 1213 1230 1248 1266 1283 1291 1298 1259 1219 1281 1344 1264 1185 1162 1140 1165 1190 1108 1026 1150 1274 1310 1347 1336 1326
525 1326 1229 1131 1209 1286 1271 1256 1241 1226 1187 1148 1156 1165 1156 1146 1137 1128 1157 1187 1264 1341 1325 1309 1294 1278 1361 1444 1416 1389 1388 1387 1386 1385 1297 1209 1121 1034 1129 1224 1240
520 1240 1256 1285 1315 1344 1373 1374 1375 1265 1154 1202 1249 1380 1289 1166 1138 1217 1296 1263 1229 1244 1258 1273 1288 1309 1331 1324 1412 1452 1398 1308 1219 1267 1314 1275
514 1275 1236 1244 1253 1255 1257 1260 1262 1231 1200 1169 1138 1151 1164 1233 1303 1211 1277 1390 1346 1301 1256 1201 1147 1186 1226 1266 1305 1306 1308 1372 1341 1230 1277 1329 1287 1222 1157 1197
509 1197 1237 1318 1400 1435 1311 1289 1362 1413 1464 1457 1355 1223 1249 1170 1185 1325 1307 1274 1240 1238 1236 1309 1287 1180 1168 1176 1090 1088 1181 1133 1085 1068 1147 1231 1316
503 1316 1397 1477 1503 1371 1275 1274 1240 1206 1238 1175 1170 1259 1349 1344 1243 1237 1346 1297 1197 1192 1197 1201 1318 1340 1373 1407 1347 1381 1451 1363 1379 1395 1322 1249 1224 1198
498 1198 1172 1147 1157 1167 1225 1283 1242 1201 1254 1150 1065 1075 1100 1126 1170 1215 1212 1209 1238 1268 1124 1138 1303 1374 1397 1420 1419 1419 1419 1418 1381 1345 1355 1366 1405 1444
492 1444 1435 1427 1354 1281 1208 1136 1183 1231 1231 1231 1238 1246 1300 1355 1368 1381 1315 1249 1223 1198 1220 1242 1292 1342 1392 1442 1383 1323 1311 1299 1269 1239 1162 1084 1130 1177 1176 1174 1209
486A209L5L6L5rqn6n6j3j4j3j3M0M0M0M0K9K9j8j9p1p0j07N2oR0kkm1m1OPQ7Q7LKOq9k03m6
480I76R8R7K8K8o7o7M3M4P4P3nol5l5J2J3p3p3POm7m7J27J27n6n7rqL1L2l8l7p1Q7N2m3L5
475A216L5K9K9m7m6m6m7J9J9r2r2N0N0R7R7l9l9R7R7K2p4j63mQ7rQPJ6J5o4o3l3l2J11J10
469A321K5K4L4j24K1K0l7l7n1n2J22J23m6m6KJn4n4opJ06J06p8p7P2q7lR2OOJ1J2k3k2l9N7
464A318kj60n4J05P6q3l2l2R4R3J4J4o5o4J5J5MMm3m4N3N2N2N3J5J6J52oo2o2k4k5K3K2K2
458A454K2m5m6KKl4l5M5M5mmJ07J07j04j05j00oJ2J70J29k9k0j9J8J8L3L2j09j10k5k6K2K2
453A419LKLLP5P4K2K1l0j26n0J08J11J12O9r0m1m1mlQ0P9l1l1j0rO9O9p9p9l1l2l4l4M5M5
448A654P4P4P4P4p3p2j5j5q0P8M2n3K0K0l3l3l0k9k9l0O8O8K1K0J2J2J1J2J2J2J2J1l4l5l4
$$ plain form
486 1209 1244 1280 1315 1306 1298 1242 1186 1173 1159 1146 1133 1173 1213 1253 1293 1322 1351 1333 1314 1243 1173 1066 1118 1112 1202 1200 1198 1157 1116 1122 1129 1216 1303 1306 1308 1314 1225 1022 976
480 976 1074 1171 1199 1227 1160 1093 1136 1180 1254 1327 1322 1316 1281 1246 1258 1271 1198 1125 1132 1138 1091 1044 1171 1298 1242 1185 1176 1168 1199 1231 1193 1156 1085 1172 1224 1181 1216
475 1216 1251 1280 1309 1262 1216 1170 1123 1142 1161 1069 977 1027 1077 1174 1271 1232 1193 1290 1387 1409 1335 1172 1168 1255 1246 1254 1261 1277 1292 1228 1165 1132 1100 1211 1321
469 1321 1346 1370 1404 1280 1301 1321 1284 1247 1196 1144 1266 1389 1343 1297 1299 1300 1246 1192 1186 1179 1285 1391 1313 1236 1308 1221 1218 1310 1316 1322 1333 1345 1322 1300 1261 1318
464 1318 1316 1156 1102 1207 1283 1200 1168 1136 1230 1323 1337 1351 1286 1222 1237 1252 1256 1260 1217 1173 1226 1278 1330 1383 1398 1414 1566 1560 1498 1436 1412 1387 1410 1432 1454
458 1454 1476 1431 1385 1387 1389 1355 1320 1365 1410 1406 1402 1509 1616 1512 1407 1307 1301 1313 1483 1612 1583 1563 1544 1562 1580 1613 1645 1536 1426 1401 1375 1397 1419
453 1419 1422 1424 1427 1430 1505 1579 1601 1622 1592 1466 1416 1524 1635 1747 1816 1726 1685 1644 1640 1637 1717 1796 1765 1734 1724 1715 1784 1853 1774 1695 1664 1632 1598 1564 1609 1654
448 1654 1728 1802 1876 1950 1877 1805 1790 1775 1695 1773 1815 1762 1782 1802 1769 1736 1706 1677 1648 1618 1686 1754 1775 1795 1807 1819 1830 1842 1854 1866 1878 1889 1855 1820 1786
443A786l5k4k4N5N5p4p4O8O8KKj4j09o6R2J30L5l5l4m0m0q0q1J25J25j4j4L3L3l7l7m9m9Q8
437A767j02p4p5j6j6O3O3k7k7K0K0L2L1L1L1k8k8N1N1p3p4O9O9n3n3n3n3MMN2N2n5n4n5n4
432A440K7K8k0k0P1P1l9m0K0J9P9j11j6j5p6p5K3K2K3K3k2k2Q9Q9p6p7O6O7L5L4j2j3p6p5
427A441J21o8k09k0LMM4M5J51l9n2n3P8P9r4r4M8M9mmmmK3K3n6n7J7J7r4r4KKKKL3L3Q0Q0
421A431noN4j37n8n9P2P2K6K5L0K19n5n5m3m3o6o6j8j8M9M9KKn9n9n8n9M9M9KJK6K5K0J9O
415A364q9j90%R4R4N9N8m5m5KLO2O1J5J4m3m3N5N6Q1j08o9o9k4J67R9r1k45n5J27J27m9m8
410A325%jl2l2l3l2N6N7N6N6JJp8p9k4k3K3K4O5O5m5m6j10j11O4O3pojjoQ8O3j27K1K2RJ0
405A275j4j4L3L3mmmmo6o6J40J40j5j5o3o3n4n4K5K6L1L1q0p9Q4Q4n8n9J8J8J8J8J0J0N7N8
$$ plain form
443 1786 1751 1727 1703 1758 1813 1739 1665 1733 1801 1803 1805 1791 1682 1616 1708 1838 1873 1838 1804 1764 1724 1644 1563 1688 1813 1799 1785 1818 1851 1814 1777 1728 1679 1767
437 1767 1665 1591 1516 1500 1484 1547 1610 1583 1556 1576 1596 1628 1659 1690 1721 1693 1665 1716 1767 1694 1620 1689 1758 1705 1652 1599 1546 1550 1554 1606 1658 1603 1549 1494 1440
432 1440 1467 1495 1475 1455 1526 1597 1558 1518 1538 1557 1636 1525 1509 1494 1418 1343 1366 1388 1411 1434 1412 1390 1479 1568 1492 1415 1481 1548 1583 1617 1605 1592 1516 1441
427 1441 1562 1494 1285 1265 1268 1272 1316 1361 1512 1473 1421 1368 1446 1525 1431 1337 1385 1434 1430 1426 1422 1418 1441 1464 1408 1351 1368 1385 1291 1197 1199 1201 1203 1205 1238 1271 1351 1431
421 1431 1426 1420 1474 1337 1279 1220 1292 1364 1390 1415 1445 1664 1609 1554 1511 1468 1402 1336 1318 1300 1349 1398 1400 1402 1343 1284 1226 1167 1216 1265 1267 1268 1294 1319 1339 1358 1364
415 1364 1275 1085 1085 1179 1273 1332 1390 1345 1300 1302 1305 1367 1428 1443 1457 1414 1371 1426 1482 1563 1455 1386 1317 1293 1460 1559 1468 1223 1168 1295 1422 1373 1325
410 1325 1325 1324 1292 1260 1227 1195 1251 1308 1364 1420 1421 1422 1344 1265 1241 1218 1241 1265 1330 1395 1350 1304 1194 1083 1147 1210 1203 1197 1196 1195 1189 1277 1340 1213 1234 1256 1265 1275
405 1275 1261 1247 1280 1313 1309 1305 1301 1297 1231 1165 1305 1445 1430 1415 1352 1289 1235 1181 1206 1232 1263 1294 1214 1135 1219 1303 1245 1186 1204 1222 1240 1258 1268 1278 1335 1393
399A393llq2q2M8M8o3o3O4O4J6J6m2m2ONn1n1n1n1P1P1K3K3k8k8k9k8J05J06onj5j4j5j4N
393A298MNNm6m6KKk9k8k9k8j2j1O7O8k4k4K4K3m2m3L7L6RQQRo6o6J3J4j8j7O2O2l3l3l3l3
388A095O4O4O4O4J8J9o1o1M8M8%Jm1m2POl5l5J3J3qqqqk9k9J8J9J8J8J9J8J3J3O1O0o1o1j4
382A280j4m0m0J4J3l5O0O0l5L9L9j35K3L2L2K6o9j09M8R1o8j2j2j10M7K4K4Q1Q1l9l9J5q0
377A192J2J3%%N9l6K3K3q8OL2L3o8o8j6P9P0k4j34K5J0J0O8r1j5Q1P0k4k0k1k0k1j4Q1J63
371A390Oj4j3k3k3j1j0j1j0P1P1N0m4j05j1k2k3k4k5k4k5j9k0j3j4K0J15p1K4L8L9lll5l5
366A193P2k3o3L1K0J9J9J8L9J33M5n0O3l2r4r5NMQq8m0N5J01J00K9o5m1J48m3m3K9K9j14j13
361A256J7J8J8J7L1L0j7j7%%q0p9O5O5O5O5k3k2k2k3M4M4lmj5j5rrj6P9N3j37q3q4j6j6J02
$$ plain form
399 1393 1390 1387 1305 1223 1271 1319 1256 1193 1257 1321 1337 1353 1311 1269 1275 1280 1229 1178 1127 1076 1147 1218 1241 1264 1236 1208 1179 1151 1256 1362 1356 1351 1336 1322 1307 1293 1298
393 1298 1302 1307 1312 1266 1220 1222 1224 1195 1167 1138 1110 1098 1087 1154 1222 1198 1174 1198 1221 1179 1136 1173 1209 1218 1226 1234 1243 1177 1111 1124 1138 1120 1103 1165 1227 1194 1161 1128 1095
388 1095 1159 1223 1287 1351 1369 1388 1327 1266 1314 1362 1362 1363 1322 1280 1287 1293 1258 1223 1236 1249 1241 1233 1225 1217 1188 1159 1177 1196 1214 1232 1251 1269 1282 1295 1356 1416 1355 1294 1280
382 1280 1266 1226 1186 1200 1213 1178 1238 1298 1263 1302 1341 1206 1229 1261 1293 1319 1250 1141 1189 1280 1212 1200 1188 1078 1125 1149 1173 1254 1335 1296 1257 1272 1192
377 1192 1204 1217 1217 1217 1276 1240 1263 1286 1198 1204 1236 1269 1201 1133 1117 1196 1266 1242 1108 1133 1143 1153 1221 1130 1115 1196 1266 1242 1222 1201 1181 1160 1146 1227 1390
371 1390 1396 1382 1369 1346 1323 1312 1302 1291 1281 1352 1423 1473 1429 1324 1313 1291 1268 1244 1219 1195 1170 1151 1131 1118 1104 1124 1239 1168 1192 1230 1269 1266 1263 1228 1193
366 1193 1265 1242 1179 1210 1230 1249 1268 1286 1325 1458 1503 1453 1516 1484 1390 1295 1300 1304 1312 1224 1184 1239 1340 1440 1469 1404 1363 1511 1468 1425 1454 1483 1369 1256
361 1256 1273 1291 1309 1326 1357 1387 1370 1353 1353 1353 1273 1194 1259 1324 1389 1454 1431 1409 1387 1364 1408 1452 1449 1445 1430 1415 1406 1397 1381 1460 1513 1376 1293 1209 1193 1177 1279
355A279J02qqn8n8j0j1J2J1J2J1l8l8l8l8K0K0K1K0l3l3J5J5J23J24j9j9k0j9k0k0%jq0q0
350A136Q0Q0JJk8k7k8k8KKJ62k8J2J08rj04n4M1oj01l1O4N2N3J5J6J6J6J6J6J6J5j23j23J9
344A249J9OOJ90j26k8O7o6K9N2m3J1J0j4j10J13m6NOJKL0J25K1p5p3K1P3P3NNp4p5k6k7N2
339A388N2M6M6kjo9o9j1j2qJ51j8j8M3M2M3M3n8n8o3L1M2M1K8o8j5Q0J4J5Q8qo4o5j0j0p0
333A496K6L6n9l9N6j06J15M9m5N4N5N4m0l7l7J1q4r4r3M2M3K3K2J7J7J05J0J6J6j44j43L0
328A372L0M0L9M0L9K4K4n5n6o6o6J3J3J01J02j4j08l3O1LKk5k5l1l1Q0j5o3L2k0k0k4J34P7
323A574P7O1l4rj0o2o3J9J8L1L0q8J02N4m1n7L9k1k1k9k8k9k8JJj09j10J00J01K1K1k5k4N4
318A516N5n9n9K0K0O8O7j1j2o4o5M7M6l8l7l8l8j3j3L4L4J8J9J8J9R0R1n1n2m5m4LKN2N2M
$$ plain form
355 1279 1381 1373 1365 1307 1249 1239 1228 1240 1251 1263 1274 1236 1198 1160 1122 1142 1162 1183 1203 1170 1137 1152 1167 1290 1414 1395 1376 1356 1337 1317 1297 1297 1296 1216 1136
350 1136 1216 1296 1297 1298 1270 1243 1215 1187 1189 1191 1353 1325 1337 1445 1436 1332 1278 1319 1313 1212 1181 1245 1297 1350 1365 1381 1397 1413 1429 1445 1461 1476 1353 1230 1249
344 1249 1268 1274 1280 1470 1344 1316 1383 1317 1346 1398 1355 1366 1376 1362 1252 1365 1319 1324 1330 1331 1333 1363 1488 1509 1434 1361 1382 1455 1528 1533 1538 1464 1389 1363 1336 1388
339 1388 1440 1486 1532 1530 1529 1460 1391 1380 1368 1360 1511 1493 1475 1518 1560 1603 1646 1588 1530 1467 1498 1540 1581 1609 1541 1526 1606 1620 1635 1723 1715 1651 1586 1576 1566 1496
333 1496 1522 1558 1499 1460 1516 1410 1525 1574 1529 1583 1638 1692 1652 1615 1578 1589 1505 1411 1318 1360 1403 1426 1448 1465 1482 1587 1597 1613 1629 1485 1342 1372
328 1372 1402 1442 1481 1521 1560 1584 1608 1553 1497 1431 1365 1378 1391 1492 1594 1580 1472 1439 1500 1503 1505 1480 1455 1424 1393 1473 1458 1395 1427 1407 1387 1363 1497 1574
323 1574 1651 1712 1678 1669 1659 1597 1534 1553 1571 1602 1632 1544 1646 1700 1659 1602 1641 1620 1599 1570 1542 1513 1485 1486 1487 1378 1268 1368 1469 1490 1511 1486 1462 1516
318 1516 1571 1512 1453 1473 1493 1561 1628 1617 1605 1541 1476 1523 1569 1531 1494 1456 1418 1405 1392 1426 1460 1478 1497 1515 1534 1624 1715 1664 1612 1567 1523 1526 1528 1580 1632 1636
313A636Nm9n0R4R3k3k4p0p1NNONOPk2J69R7R7l3l3j6j7j6j6q7q8K4K3JKJKQRQQO2O2O2O1q4
306A859q5l7l7J8J7N3N4J12p7j57L4O4O4lmjjjjo4o4L1L1M8M8m7m7LLm4m5M6M5M6M5L4L4n1
300A923n1n5J04q1q1m0m1N4N5R6R6o3o2J0Rn3M1J17m2%R5l8l7l1l2p8p9P9Q0l1l0O5O4KJJ
295A967Kj5j6j5j5j8j9k4k4N3m1j31K8J90R5N9l6q9Poom5m6LKJKQ7Q7Q3p5j35m0M9M9klJ39
289B102j9k5k5k7k6O9O8j7j8L1L0k1k1k1k1M2M3nnn4n3M1M2L8L9n7n6nnRRq6J34N8j01o1L4
283B060N6N6R4o4p0p0P4P3q0p9KR7M3M4JJmnK2p4L3o2j3j3J3J08Q4p5k6O8M9J44R0R1p0j64
278B434j06j05m2N3R5R4k3k3k9k9R2lLLn4n5M7M6q4J0MMK5K5K5K5K1K0K0K1K0K0l9N6O5l0
272B606o6o6qqj08j4J41J40Q3p5j01no8o9K4K4K9L0j3Q3k4P1M8M8J3q3j4j5o8R1J25L1n5n4
$$ plain form
313 1636 1641 1592 1542 1636 1729 1706 1682 1612 1541 1546 1551 1557 1562 1568 1575 1553 1722 1819 1916 1883 1850 1834 1817 1801 1785 1698 1610 1634 1657 1658 1660 1661 1663 1671 1680 1688 1696 1758 1820 1882 1943 1859
306 1859 1774 1737 1700 1718 1735 1788 1842 1954 1877 1720 1754 1818 1882 1879 1875 1874 1873 1872 1871 1807 1743 1774 1805 1853 1901 1854 1807 1810 1813 1769 1724 1770 1815 1861 1906 1940 1974 1923
300 1923 1872 1817 1921 1840 1759 1719 1678 1732 1787 1883 1979 1916 1854 1864 1873 1820 1861 1978 1936 1936 2031 1993 1956 1925 1893 1815 1736 1815 1895 1864 1834 1899 1963 1965 1966 1967
295 1967 1969 1954 1938 1923 1908 1890 1871 1847 1823 1876 1835 1704 1732 1922 2017 2076 2040 1951 1958 1952 1946 1901 1855 1858 1860 1861 1863 1950 2037 2120 2045 1910 1870 1919 1968 1966 1963 2102
289 2102 2083 2058 2033 2006 1980 2049 2117 2100 2082 2113 2143 2122 2101 2080 2059 2101 2144 2139 2134 2080 2027 2068 2110 2148 2187 2130 2074 2069 2064 2073 2082 1996 2130 2188 2087 2026 2060
283 2060 2116 2172 2266 2202 2132 2062 2136 2209 2129 2050 2052 2149 2192 2236 2237 2238 2234 2229 2251 2177 2210 2148 2135 2122 2135 2243 2327 2252 2226 2294 2343 2487 2577 2668 2598 2434
278 2434 2328 2223 2181 2234 2329 2423 2400 2377 2348 2319 2411 2408 2411 2414 2360 2305 2352 2398 2314 2324 2328 2332 2357 2382 2407 2432 2453 2473 2493 2514 2534 2554 2515 2571 2636 2606
272 2606 2540 2474 2466 2458 2350 2336 2477 2617 2700 2625 2524 2519 2451 2382 2406 2430 2459 2489 2476 2559 2535 2606 2654 2702 2715 2632 2618 2603 2535 2626 2751 2782 2727 2673
267B673j43J6K2j37M3J38O9O9L7n8JKm9M5Q8p1m4N1M1n4j8j8L5L5j06Q4J63k7N1N2qpn3n3
262B869nnJ9J9M2M3N2N2k7k7n4n4ppJ1J1l6l6N5N5Q9j01j33l8N1N1kJ87J45m4j24l0p7j71
257B773k6J64N1N1N6N6P4k1r5R6J48m1j07Q4N9l5M2n2j71J9J74j6r5R5Q7j04l8N7L0L0L6L7
252C418N1N2N2N1k3k4N6N6m7m7L2L2m5m5M6M6o5J25J29J29N3N4OPJ9J9O7O7p0p0m7m6L9L9
247D116J19J18mmM4M3j0j0l4l4J9J8j1j1M7m8m2J17k3j17J19J20N4N4n6n7MNj1J47J84Q8n3
242D891n4J4J4R3R3J23J24j14j14P1P1K4K3M8M8M8M7J30J30N1N1P8P9K5K6J67P3q0P9J88R4
237F541P7P8P2P3M8M9O9O8R2R2O1O2J40J41J79J79O8O9K24K25Q2Q2J32J33Q5Q4J28J28Q1Q0
233I622J85J84J61J61J53J52J43J42J92L3J1J1OOm1m2O4O5M0M1P2P3J52J52R0R1M7j12M1J99
$$ plain form
267 2673 2530 2546 2568 2431 2474 2612 2681 2750 2787 2729 2730 2732 2683 2728 2816 2745 2701 2752 2793 2739 2721 2703 2738 2773 2667 2751 2914 2887 2938 2990 2982 2975 2922 2869
262 2869 2864 2859 2878 2897 2939 2982 3034 3086 3059 3032 2978 2924 2917 2910 2921 2932 2896 2860 2915 2970 3059 2958 2825 2787 2838 2889 2887 3074 3219 3175 3051 3021 2944 2773
257 2773 2747 2911 2962 3013 3069 3125 3199 3178 3083 3179 3327 3286 3179 3263 3322 3287 3329 3277 3106 3125 3299 3283 3188 3283 3370 3266 3228 3285 3315 3345 3381 3418
252 3418 3469 3521 3573 3624 3601 3577 3633 3689 3642 3595 3627 3659 3614 3569 3615 3661 3596 3721 3850 3979 4032 4086 4092 4099 4118 4137 4204 4271 4201 4131 4084 4038 4077 4116
247 4116 4235 4353 4349 4345 4389 4432 4422 4412 4378 4344 4363 4381 4370 4359 4406 4358 4316 4433 4410 4293 4412 4532 4586 4640 4584 4527 4531 4536 4525 4672 4856 4944 4891
242 4891 4837 4851 4865 4958 5051 5174 5298 5184 5070 5141 5212 5236 5259 5307 5355 5403 5450 5580 5710 5761 5812 5890 5969 5994 6020 6187 6260 6180 6259 6447 6541
237 6541 6618 6696 6768 6841 6889 6938 7007 7075 7167 7259 7320 7382 7522 7663 7842 8021 8089 8158 8382 8607 8689 8771 8903 9036 9121 9205 9333 9461 9542 9622
233 9622 9807 9991 10152 10313 10466 10618 10761 10903 11095 11128 11139 11150 11156 11162 11121 11079 11143 11208 11248 11289 11361 11434 11586 11738 11828 11919 11966 11854 11895 12094
228A2094J29L5J32J31J26J26N1N1J08J09%J59J49J49R3R2J72J72L28L29L28L28K55K55J76
224A6077J76K75K74K75K74K97K97K52J57Q5K75K73K74K53K53L59N48M69N65O97O97O83O83
221B4468L98m5k03l93n51n51n23n22l80l80k61k60k61k60n09n09n87n88m74m74m15m15m28
217A5877k39j44k39k20j26j84l73j78q4j6j11j79j80j85j85n5n5j02j02q7q7p5p5j25O6O9
213A2606O9r1r1k6j20k15k5NNj47j46j94j94lmj45j46q6q6q7q6p3p4k6k6l2l2q0q0k8k7k7
208A0288k8j0j0q9q9J0J0MMK5p1k14k5J92Kj29O2M2M2O4r4ooM3n1r4%l2O2J02J03q7QJKj3
203A0018j07P3J68N5N5O5l0P2P1J21J20Q9o9N1j08p0p0j65p0p6p6M3M4m1m2m8j44j49n4K9
198I755o5j71p5J02J03r8r7K2K3K2K2N1N0N0N0K4K5P2q6j92r7j8j8p2p3r3LP0j50j59o4j7
$$ plain form
228 12094 12223 12258 12390 12521 12647 12773 12824 12875 12983 13092 13092 13251 13400 13549 13642 13734 13906 14078 14406 14735 15063 15391 15646 15901 16077
224 16077 16253 16528 16802 17077 17351 17648 17945 18197 18354 18439 18714 18987 19261 19514 19767 20126 20674 21143 21708 22405 23102 23785 24468
221 24468 24866 24821 24618 24225 23674 23123 22600 22078 21698 21318 21057 20797 20536 20276 19767 19258 18671 18083 17609 17135 16720 16305 15877
217 15877 15638 15494 15255 15035 14909 14725 14352 14174 14090 14074 13963 13784 13604 13419 13234 13179 13124 13022 12920 12833 12746 12671 12596 12471 12537 12606
213 12606 12675 12584 12493 12467 12347 12132 12107 12112 12117 11970 11824 11630 11436 11433 11429 11284 11138 11052 10966 10879 10793 10720 10646 10620 10594 10562 10530 10450 10370 10342 10315 10288
208 10288 10260 10250 10240 10151 10062 10072 10082 10086 10090 10115 10044 9830 9805 9997 9999 9870 9932 9974 10016 10080 9986 9980 9974 10017 9966 9872 9872 9840 9902 10004 10107 10020 10028 10029 10031 10018
203 10018 9911 9984 10152 10207 10262 10327 10297 10369 10440 10561 10681 10770 10701 10752 10644 10574 10504 10339 10269 10193 10117 10160 10204 10163 10121 10073 9929 9780 9726 9755
198 9755 9690 9519 9444 9546 9649 9551 9454 9476 9499 9521 9543 9594 9644 9694 9744 9768 9793 9865 9779 9587 9490 9472 9454 9382 9309 9216 9219 9289 9139 8980 8916 8899
193H899j12j12j7oj00o2R7M3j15o4o4k1k2k1k1j0j0j68p3o7K8L9n5j12j8KKm0m1P1P0l7l8
188G845O8O8m3j39nol0l1P1k5l8l9j9P7O9O9l5l6k3k3N6N6P4P3R7R7m3m4o7o7m0l9J02J03
183H133p6p7R7R8N1N2N1N2LLp6p6j3j4J61J61O0O1n0n0MMMLK5K5K4K5jjjjQ2Q3L4L5m3m3r0
177H719r1R4R3M6M6J%M8M8P0P1P0P1kkJ40J41R4R3P0P0M9N0N0N0Q0Q0L2L2O5O4J44J43R2R1
172A0912n1n1k0k0m4m4k9k8j40j39J4J4J4J4j20j20K3K3r1r1j2j2klm9n0n6n6q0p9N3N4OO
167I746K2K2k5k6L8L7Q5Q5M5M5J34n6j13j8N9N9J09J09o5o5q1q1L0L0R6R7m5m6K8K7P5P5O5
162A0497O4m6m6k1k0N8N9k3k3N7N6J01J00P7P6L2L2P9P9J2J3N9O0k9l0l0k9J57J57j7j7J35
157A1629J34N5N5J9J8J9J8M6M6J25J25Q4Q4ONm6m5KLM7M7%%K1K2lkL4L4J13J13L0L0P7P7O6
$$ plain form
193 8899 8787 8675 8658 8652 8552 8490 8587 8630 8515 8451 8387 8366 8344 8323 8302 8292 8282 8114 8041 7974 8002 8041 7986 7874 7856 7858 7860 7820 7779 7850 7920 7883 7845
188 7845 7913 7981 7938 7799 7794 7788 7758 7727 7798 7773 7735 7696 7677 7754 7823 7892 7857 7821 7798 7775 7831 7887 7961 8034 8131 8228 8185 8141 8074 8007 7967 7928 8030 8133
183 8133 8057 7980 8077 8175 8226 8278 8329 8381 8384 8387 8311 8235 8222 8208 8369 8530 8590 8651 8601 8551 8555 8559 8563 8566 8591 8616 8640 8665 8664 8663 8662 8661 8743 8826 8860 8895 8852 8809 8719
177 8719 8628 8722 8815 8861 8907 8908 8908 8956 9004 9074 9145 9215 9286 9284 9282 9422 9563 9657 9750 9820 9890 9939 9989 10039 10089 10169 10249 10281 10313 10378 10442 10586 10729 10821 10912
172 10912 10861 10810 10790 10770 10726 10682 10653 10625 10485 10346 10360 10374 10388 10402 10282 10162 10185 10208 10117 10026 10014 10002 10000 9997 9948 9898 9842 9786 9706 9627 9680 9734 9740 9746
167 9746 9768 9790 9765 9739 9777 9814 9899 9984 10029 10074 10208 10152 10039 10021 10080 10139 10248 10357 10292 10227 10146 10065 10095 10125 10221 10318 10273 10227 10255 10282 10357 10432 10497
162 10497 10561 10515 10469 10448 10428 10486 10545 10522 10499 10556 10612 10713 10813 10890 10966 10998 11030 11109 11188 11200 11213 11272 11332 11303 11273 11243 11214 11371 11528 11511 11494 11629
157 11629 11763 11818 11873 11892 11910 11929 11947 11993 12039 12164 12289 12373 12457 12463 12468 12422 12377 12379 12382 12429 12476 12476 12476 12497 12519 12516 12514 12548 12582 12695 12808 12838 12868 12945 13022 13088
151A3088O6jjr0J01J7J8K9K9n1n0q8q9N5N4N6N6M2n3j79J1q3J3M4n0L9L9j0Q6R2lK5J21J15
146A3448K0mmo3L1J2J2M3J39R2R2N1N0N1N1R8R8%Jq5q4K9o6o6K9L8L8l0l0q6J0RRn8L7R5R4
140A4101m8m7poJ23K7K8K8Oq9M4M4k4k4lR1oj01J2q3N6N5N6N6j73p8n2n2QQQQP1P0rqPOr4
134A4009r4n6J03Q7Q6J05J1O3O4R5R5R5R5j2j2jr5K6J21J09m9o6K9J3J3k1k1o8o8n4n4N7N7
129A4662j08j07k8k8j02j01k3k2pqo0L4kkQ3Q3j3j3j3j3O1O0O0O1M6M7jjK0K1O8O8l7l7J37
124A4785J38J4J4O1O2R3R3j7j8J19J18K7J22J10K67J85J84J58J58K05K06J53J54K33K33J51
120A8008J51J50J51J72J73K20K19J41J40J40J41K52K52K71J77R5L17M51L56J94K90K19L13
117B2993L55K59L19L19L43L42L43L43L61L61M72M72L93L93M72M72O08O09O08O09O98O99M92
$$ plain form
151 13088 13154 13153 13152 13062 13163 13180 13198 13227 13256 13205 13155 13067 12978 13033 13087 13143 13199 13241 13188 13009 13020 12937 12950 12994 12944 12983 13022 13012 13098 13190 13187 13212 13333 13448
146 13448 13468 13464 13460 13397 13428 13440 13452 13495 13634 13726 13818 13869 13919 13970 14021 14119 14217 14217 14218 14133 14049 14078 14012 13946 13975 14013 14051 14021 13991 13905 13915 13924 13933 13875 13912 14007 14101
140 14101 14053 14006 13999 13993 14116 14143 14171 14199 14205 14116 14160 14204 14180 14156 14153 14244 14238 14137 14149 14066 14122 14177 14233 14289 14116 14038 13986 13934 13942 13950 13958 13966 14037 14107 14098 14090 14097 14103 14009
134 14009 13915 13859 13962 14049 14135 14240 14251 14314 14378 14473 14568 14663 14758 14746 14734 14733 14638 14664 14785 14894 14845 14779 14808 14821 14834 14813 14792 14724 14656 14602 14548 14605 14662
129 14662 14554 14447 14419 14391 14289 14188 14165 14143 14136 14128 14068 14102 14100 14098 14181 14264 14251 14238 14225 14212 14273 14333 14393 14454 14500 14547 14546 14545 14565 14586 14654 14722 14685 14648 14785
124 14785 14923 14937 14951 15012 15074 15167 15260 15243 15225 15344 15462 15489 15611 15721 15988 16173 16357 16515 16673 16878 17084 17237 17391 17624 17857 18008
120 18008 18159 18309 18460 18632 18805 19025 19244 19385 19525 19665 19806 20058 20310 20581 20758 20853 21170 21621 21977 22171 22461 22680 22993
117 22993 23348 23607 23926 24245 24588 24930 25273 25616 25977 26338 26810 27282 27675 28068 28540 29012 29620 30229 30837 31446 32144 32843 33335
113C3335M93O13O13O91O92N44N43O32O33P78R37Q53P59Q94Q94Q88Q88J020J020J098J099J155
110E1072J155J203J203J251J250J204J203J186J185J170J328J350J254J322J512J587J587
107G3022J678J678J644J643J850J849J857J857J976K166K071J881K174K173K220K219K362
104A06320K361K374K373K484K485K538K539K539K539K658K659K603K794K521K078J653J336
102A46854J428J524J707J897J985J985K007K197K315K410K321K416K482K577K631K726K818
99A84280L008K987K987L164L165L224L224L414L604L701L796L810M126M075M170M498M498
97B45731M489M678M737M928N111N207N314N313N178M987M287L085K323K417K930L498L855
94C18068L950L883M072M273M588M765N081N809O632P779Q855J0025J0119R224P009K904m51
$$ plain form
113 33335 33828 34441 35054 35745 36437 36981 37524 38156 38789 39567 40504 41357 42116 43010 43904 44792 45680 46700 47720 48818 49917 51072
110 51072 52227 53430 54633 55884 57134 58338 59541 60727 61912 63082 64410 65760 67014 68336 69848 71435 73022
107 73022 74700 76378 78022 79665 81515 83364 85221 87078 89054 91220 93291 95172 97346 99519 101739 103958 106320
104 106320 108681 111055 113428 115912 118397 120935 123474 126013 128552 131210 133869 136472 139266 141787 143865 145518 146854
102 146854 148282 149806 151513 153410 155395 157380 159387 161584 163899 166309 168630 171046 173528 176105 178736 181462 184280
99 184280 187288 190275 193262 196426 199591 202815 206039 209453 213057 216758 220554 224364 228490 232565 236735 241233 245731
97 245731 250220 254898 259635 264563 269674 274881 280195 285508 290686 295673 299960 303045 305368 307785 310715 314213 318068
94 318068 322018 325901 329973 334246 338834 343599 348680 354489 361121 368900 377755 387780 397899 407123 414132 417036 416585
92D16585k439l642l899l709l933l933l099k022j098p82p74j470k760l837l844l021k016r40
89C69367J44R67J540J983J991J991K033K033K373K943L378L568L267K950L042L358L999M696
86D15623N555O757Q214J0176J2333J4547J5490J4287J1330M431k660o900r635j1217j1644
84D76687j2594j3377j2175j0244q282p443p633q812j1280j3812j4761j3804j2348j0949r620
81C09553q513p689p004o562o079n889n631n442n226n131n042n041m885m695m454m137l733
79B14400l291l134k945k638k543k473k284k131j942j519j076p91j235k063l013l653m097l948
76A69624l758l471l281l192l097k945k755k683k682k529k528k532k533k384k384k286k191
74A22393k050j861j978j979k061j871j813j622j511j512j434j434j435j434j178j178j447
$$ plain form
92 416585 414146 410504 406605 402896 398963 395030 391931 389909 388811 388029 387255 385785 383025 379188 375344 372323 370307 369367
89 369367 369511 370478 372018 374001 375992 377983 380016 382049 384422 387365 390743 394311 397578 400528 403570 406928 410927 415623
86 415623 421178 427935 436149 446325 458658 473205 488695 502982 514312 518743 516083 509183 499548 488331 476687
84 476687 464093 450716 438541 428297 420015 412572 404939 396127 384847 371035 356274 342470 330122 319173 309553
81 309553 301040 293351 286347 279785 273706 267817 262186 256744 251518 246387 241345 236304 231419 226724 222270 218133 214400
79 214400 211109 207975 205030 202392 199849 197376 195092 192961 191019 189500 188424 187633 186398 184335 181322 177669 173572 169624
76 169624 165866 162395 159114 155922 152825 149880 147125 144442 141760 139231 136703 134171 131638 129254 126870 124584 122393
74 122393 120343 118482 116504 114525 112464 110593 108780 107158 105647 104135 102701 101267 99832 98398 97220 96042 94595
71I4595j447j455j455j455j455j325j326j214j215j285j284j111j111j056j056j008j008r61
68G2368r61q50q51r34r34q23q24p71p71p71p71p97p98p18p18p63p63p15p16o14o15n67n67
65E4756n59n59o70o70m82m83n93n93n14n14m67m67n68n69l94l95n31n31m20m20m15m15m63
61D3064m62l42l42l42l42l73l73l72l73l61l61l61l61l85l85l84l85l06l05k27k26l78l77
58C4941k98k98m03m04l56l57k72k72k72k72k62k62k62k62k64k64j53j53k78k77k78k78j23
54B8621j24k34k34j54j54k02k01j62j62j15j14k00j99k00k00j08j07j08j08j44j43j95l7k0
50B4996j78k85j27jr7j71p7r9j94j29j29j18k3j02j97p6p5j23j23j7P9k2k2j29j28J3J4K2
46B2482K2n8n7r2r2J8J9L6L5L6L5P7P7Q2j2r0q9p0K5r4r5q8q9j31j31n8n8j5j10j04j04m5
$$ plain form
71 94595 93148 91693 90238 88783 87328 86003 84677 83463 82248 80963 79679 78568 77457 76401 75345 74337 73329 72368
68 72368 71407 70557 69706 68772 67838 67015 66191 65420 64649 63878 63107 62310 61512 60794 60076 59313 58550 57835 57119 56505 55890 55323 54756
65 54756 54197 53638 52968 52298 51816 51333 50740 50147 49633 49119 48652 48185 47617 47048 46654 46259 45728 45197 44777 44357 43942 43527 43064
61 43064 42602 42260 41918 41576 41234 40861 40488 40116 39743 39382 39021 38660 38299 37914 37529 37145 36760 36454 36149 35922 35696 35318 34941
58 34941 34643 34345 33942 33538 33182 32825 32553 32281 32009 31737 31475 31213 30951 30689 30425 30161 30008 29855 29577 29300 29022 28744 28621
54 28621 28497 28263 28029 27875 27721 27519 27318 27156 26994 26879 26765 26565 26366 26166 25966 25858 25751 25643 25535 25391 25248 25053 25016 24996
50 24996 24818 24533 24406 24405 24308 24137 24060 23961 23767 23638 23509 23391 23368 23266 23069 22993 22918 22795 22672 22655 22734 22712 22690 22561 22433 22446 22460 22482
46 22482 22504 22446 22389 22297 22205 22223 22242 22278 22313 22349 22384 22461 22538 22620 22608 22518 22429 22359 22384 22290 22195 22107 22018 21887 21756 21698 21640 21625 21515 21411 21307 21262
41B1262m6j52n7o1j56r1r0j62o7K8K8j22k7q1q0o5o5l9N6L2L3M4M4p4K1R5jL4o1O6O5N8N8
36B0427O9K28J79K0%K85K68J74J12J12J1J70Q0Q1J15J15K57K58K58K57L29M87N26L05J95k8
32B5290j96k92m26m26l77l77l19k25k29k30k77k77l68m63n52n52m69m68m22m21k63k63n1n1
29A7296k78j82j57j57k07k07k08k07k00j99j53j52r6r6r5r6p3p3j20k5M4J39n5j49j18k3K8
25A4181K9LLn1n0j15k09k04k03r3r4j53n8n5j50j70j70n9n9o9o9q1k38j97j97n1n1Rq6j80
20A1113q4N6N7o1j55m9j44p2p1m3N3M1J99L1L1L1o4o4L0K6K6l7l8PJ64N0m5Q0P9n9n8N7K16
15A1303J11m8pQ7J34J35Q4Q5J32J32QQQ8Q7J28J29J34J34J51K46J13J13J76J75O4O5J65J65
11A4297M3M3J81rj8j8J2q3j36N4N1N0J6J5L4L4J13J13P0P1m1m0Q2Q2J30J30J27J27j5j5J03
$$ plain form
41 21262 21216 21064 21007 20946 20790 20699 20609 20447 20380 20408 20436 20314 20287 20206 20126 20061 19996 19957 20013 20045 20078 20122 20166 20092 20113 20208 20207 20241 20180 20246 20311 20369 20427
36 20427 20496 20724 20903 20923 20923 21208 21476 21650 21762 21874 21885 22055 22135 22216 22331 22446 22703 22961 23219 23476 23805 24292 24818 25123 25318 25290
32 25290 25094 24802 24376 23950 23573 23196 22877 22652 22423 22193 21916 21639 21271 20808 20256 19704 19235 18767 18345 17924 17661 17398 17347 17296
29 17296 17018 16836 16679 16522 16315 16108 15900 15693 15493 15294 15141 14989 14893 14797 14702 14606 14533 14460 14340 14315 14359 14498 14443 14294 14176 14153 14181
25 14181 14210 14213 14216 14165 14115 14000 13791 13587 13384 13291 13197 13044 12986 12931 12781 12611 12441 12382 12323 12254 12185 12104 11866 11669 11472 11421 11370 11379 11293 11113
20 11113 11029 11085 11142 11081 10926 10877 10733 10661 10590 10547 10600 10641 10840 10871 10902 10933 10869 10805 10835 10861 10887 10850 10812 10819 10983 11033 10988 11068 11147 11088 11030 11087 11303
15 11303 11414 11366 11359 11446 11580 11715 11799 11884 12016 12148 12156 12164 12252 12339 12467 12596 12730 12864 13015 13261 13374 13487 13663 13838 13902 13967 14132 14297
11 14297 14340 14383 14564 14555 14537 14519 14531 14448 14312 14366 14417 14467 14483 14498 14532 14566 14679 14792 14862 14933 14892 14852 14934 15016 15146 15276 15403 15530 15515 15500 15603
6A5603J04J03J04J93J94J93J93J00R9J77K72K69Q0J92J93L55L56K45K45L93L93L46L46L42
2B1090L42K94K95J77J77L32L31L44N33N53O48R22J016P67P68N15P2l12m07m93n88n40n41n27
-1B5768n28n35l45j99l89m70o60q23r18o86n92n30m35m83m83l79l78l32l31l64l63k51l46
-5A4948k48n9k09l05k27m16k18k7j00j01j99j99j44j43o5o4n8n7n8n7r6r5k39k38j96j97j17
-9A0816j18j49j50j50j49j65j64j65j64j21j20j20j21k27k27n3n3j07j06O7O8j24j23j71j71
-13G733n8n9n8n9j31j32q4q5k3k4k3k4j21j22j1j0m8m7r5r5o2o1o2o1j23j24j14j13j45J4
-17E573j6j10k2P3N5j03m1m1llj01j02P3P2j2j3r1j87o0R8K4j36j60lRRl7l7J1J0k6k6p4p4
-23D529RRRRj23j22m4m3p3p3L7L8M6M5jkj46j46p0Q8J72J5q8OK8o7j19j19K5K4K5K5p2p3P
$$ plain form
6 15603 15707 15810 15914 16107 16301 16494 16687 16787 16886 17063 17335 17604 17684 17876 18069 18424 18780 19025 19270 19663 20056 20402 20748 21090
2 21090 21432 21726 22021 22198 22375 22707 23038 23382 23915 24468 25116 26038 27054 27821 28589 29104 29176 28864 28457 27964 27376 26836 26295 25768
-1 25768 25240 24705 24360 24161 23772 23302 22642 21819 20901 20215 19623 19093 18658 18175 17692 17313 16935 16603 16272 15908 15545 15294 14948
-5 14948 14700 14641 14432 14127 13900 13484 13266 13239 13139 13038 12839 12640 12496 12353 12288 12224 12166 12109 12051 11994 11898 11803 11564 11326 11130 10933 10816
-9 10816 10698 10549 10399 10249 10100 9935 9771 9606 9442 9321 9201 9081 8960 8733 8506 8453 8400 8293 8187 8254 8322 8198 8075 7904 7733
-13 7733 7675 7616 7558 7499 7368 7236 7152 7067 7044 7020 6997 6973 6852 6730 6719 6709 6661 6614 6519 6424 6362 6301 6239 6178 6055 5931 5817 5704 5559 5573
-17 5573 5557 5447 5425 5498 5553 5450 5409 5368 5365 5362 5261 5159 5232 5304 5292 5279 5188 5001 4941 5039 5063 4927 4767 4764 4773 4782 4745 4708 4719 4729 4703 4677 4603 4529
-23 4529 4538 4547 4556 4565 4442 4320 4276 4233 4160 4087 4124 4162 4208 4253 4252 4250 4104 3958 3888 3976 4148 4163 4075 4081 4109 4042 3923 3804 3829 3853 3878 3903 3831 3758 3765
-28C765Pm8m8N0N1N5j35q2J4l9l9l3l3m5m6m5m6OOOOQQJ27o4p8J12M7m8K2K3j38N2j8j7n4
-33C309n4NMj4Q1Q1j10m4m4m2m2m2m1m5m5O6O6N9N9k0k0j1j2j1j1j07j08L6L5OPm1m1J10J09
-39C128o4o5m4m5L4L5n5n5K4K4MMNMp8p8p8p7K9K9P0P1j0j05j10P9L4L4l3l3k9k9J8J8j4j4
-44B628O5O5m3m2m2m3O6O5R9r1j39m4O5O4n2n2K7K7ppP2P2l1l2l2l2J3J4o6o6Q8Q8M1M1n3
-50B726n4n3n3nnnnKKLKL2L1j5j6n8n9j1j1o0o0j3j3O9P0j0j0NNm2m3qqqqO7O7O8O7m1m0P
-56B509Om6m7JJK4K4K4K4r8r9n1n1L4L4L4L4K9K9n0n0n6n6N5N5L5L5j2j3O1O0n0n1k1k2k2
-62B313k2MLl4l4pJ51J4J5j00j00n3n2q5q5L6L5k7J31R5%M5M4m0m0%Jm7m7M0M0p1p1kkM5M5
-67B138j33j33J0RM6M6R3R3l6l7l6l7M4M4l6l5rqn7n6J19J18k4k4l6l6J2J2M0M0ppLKo6o7
$$ plain form
-28 3765 3772 3724 3676 3726 3777 3832 3697 3615 3629 3590 3551 3518 3485 3440 3394 3349 3303 3309 3315 3321 3327 3335 3343 3470 3406 3328 3440 3487 3439 3461 3484 3346 3398 3380 3363 3309
-33 3309 3255 3260 3264 3250 3331 3412 3302 3258 3214 3172 3130 3088 3047 3002 2957 3023 3089 3148 3207 3187 3167 3156 3144 3133 3122 3015 2907 2943 2978 2984 2991 2950 2909 3019 3128
-39 3128 3064 2999 2955 2910 2944 2979 2924 2869 2893 2917 2921 2925 2930 2934 2856 2778 2700 2623 2652 2681 2751 2822 2812 2707 2597 2676 2710 2744 2711 2678 2649 2620 2638 2656 2642 2628
-44 2628 2693 2758 2715 2673 2631 2588 2654 2719 2818 2727 2588 2544 2609 2673 2621 2569 2596 2623 2616 2609 2681 2753 2722 2690 2658 2626 2639 2653 2587 2521 2609 2697 2738 2779 2726
-50 2726 2672 2619 2566 2561 2556 2551 2546 2548 2550 2553 2555 2587 2618 2603 2587 2529 2470 2459 2448 2388 2328 2315 2302 2371 2441 2431 2421 2426 2431 2389 2346 2338 2330 2322 2314 2381 2448 2516 2583 2542 2502 2509
-56 2509 2515 2469 2422 2423 2424 2448 2472 2496 2520 2422 2323 2272 2221 2255 2289 2323 2357 2386 2415 2365 2315 2259 2203 2258 2313 2348 2383 2371 2358 2419 2479 2429 2378 2357 2335 2313
-62 2313 2291 2295 2298 2264 2230 2223 2374 2388 2403 2303 2203 2150 2098 2013 1928 1964 1999 1972 2103 2198 2198 2243 2287 2247 2207 2207 2208 2161 2114 2154 2194 2123 2052 2050 2048 2093 2138
-67 2138 2005 1872 1882 1891 1937 1983 2076 2169 2133 2096 2060 2023 2067 2111 2075 2040 2031 2023 1966 1910 2029 2147 2123 2099 2063 2027 2039 2051 2091 2131 2124 2117 2120 2122 2056 1989
-73A989n9R9J10J6m9m8n5n4K4K4m9m9K3J18J16m2j24L4O7k7m4m4n0n0onM2M2k9k9N0N0l7l7
-78A917N8j00O5J60J8J7jjm8m9P4P4l6l7l6l6J2J2n0n0L0K9l7l7M2M3k3k2k2k2N0N0l0k9P3
-83B058P2l2l2m4N0K1j37j23J00J22K8j7j12j18k3L1L2L7L7J7J8J7J7L7L7m2m2m0m0n2M3L3
-88A953o2n0n0J02J01Q1j4p3K1LLK2p3rj0n8J00J1J2j4j5j9k0O9k6K1K2qj02m9m9L4L4j9P5
-93A944k1k1rro3L2k1k1K1K0J5J4R1nM9M9q5q5l8l7L0L1P8P8j33j32j6j6m5N1rrJ32L8k0k0
-99A858j6j6L8n8ppJ2J08K2K3k3j18l8N7klL3L2j32l7N7N8j0j0j29l3K3K4N3N4l2l2R7Kl4
-104A814l3J26l3q6q5ooP4P3lmKLn8L7L1L1k1k1K7K7N1N1o0o0k7k6p4p4Q9Q9R0Q9n5n6K4K4
-110A964j08j07O6O6Q9Q8n5n4k2k3k3k2o3o3o3o3P7P6l4O1P8q1l9N6rqM5j14n8L7N3N3O2O3
$$ plain form
-73 1989 1930 2029 2139 2155 2106 2058 2003 1949 1973 1997 1948 1899 1922 2040 2156 2114 1990 2024 2091 2064 2020 1976 1926 1876 1870 1865 1907 1949 1920 1891 1941 1991 1954 1917
-78 1917 1975 1875 1940 2100 2118 2135 2134 2133 2085 2036 2110 2184 2148 2111 2075 2039 2051 2063 2013 1963 1993 2022 1985 1948 1990 2033 2010 1988 1966 1944 1994 2044 2014 1985 2058
-83 2058 2130 2098 2066 2022 2072 2093 1956 1833 1933 2055 2083 2066 1954 1836 1813 1844 1876 1913 1950 1967 1985 2002 2019 2056 2093 2051 2009 1969 1929 1877 1920 1953
-88 1953 1891 1841 1791 1893 1994 2075 2061 1988 2009 2012 2015 2037 1964 1955 1945 1887 1987 1998 2010 1996 1981 1962 1942 2011 1985 2006 2028 2020 1918 1869 1820 1854 1888 1869 1944
-93 1944 1923 1902 1893 1884 1821 1853 1832 1811 1832 1852 1867 1881 1972 1967 2016 2065 1980 1895 1857 1820 1850 1881 1959 2037 1904 1772 1756 1740 1695 1746 1737 1728 1860 1898 1878 1858
-99 1858 1842 1826 1864 1806 1799 1792 1804 1912 1934 1957 1934 1816 1778 1835 1833 1830 1863 1895 1763 1726 1783 1841 1831 1821 1692 1659 1682 1706 1759 1813 1781 1749 1846 1848 1814
-104 1814 1781 1907 1874 1788 1703 1697 1691 1765 1838 1835 1831 1833 1836 1778 1815 1846 1877 1856 1835 1862 1889 1940 1991 1931 1871 1844 1818 1744 1670 1759 1848 1938 2027 1972 1916 1940 1964
-110 1964 1856 1749 1815 1881 1970 2058 2003 1949 1927 1904 1881 1859 1796 1733 1670 1607 1684 1760 1726 1787 1865 1784 1745 1801 1792 1784 1829 1715 1657 1694 1747 1800 1862 1925
-115A925j12j11N3N2ONm0m1L9L9j9j9K9K8j6j6j5j6l8l8M1M1k5k5K2K2l6l7L6L6Qq7j29K9
-120A591J24L0L5o0pon4n4J4J08J45j4o5o4O8O8l2l2N3N3j14k0j21L7K9o6J4J08N6j03pqL1
-125A737L0m9m9llJ09J08r3r3j4j3j8j7L0L0JJK5K5K2K3p9p9k5J32mmP7P6r7r7K8K8J07J07
-131A959k3k3p1p1o7o7J2J2mln1n1Q0Q0l0l0L9M0J5J6p5p5O8O8qqn6n5J12J12l0l0q2q2l4
-136A587l4N3N4O9k6p3Q5k6j84R2J87J29L5l8l8m3m4m4m3LMM7M6r6r6O1O1j9j8P9P9k3k2r7
-141A707O2N1N2k0k1MLl0l0J7J7k5k5m3m3j5Q1O9r0p7p6K4K4L0L1POJ3J4l5l4N3N4L9n5l9
-147A700J50P2j18l1O4J0J0L1j59j59L1k3k3n8n8J13J13L4L5k2k2KKn8n7Q4Q5m3m4kkO9k6
-152A700j58L1L4L3K2K2m3m3NMk4k4p1p2O1O1n1M3J24o5q5RQRl4l3K9L0N3N3M5M4klm1m1J01
$$ plain form
-115 1925 1813 1702 1755 1807 1813 1818 1778 1737 1776 1815 1796 1777 1806 1834 1818 1802 1787 1771 1733 1695 1736 1777 1752 1727 1749 1771 1735 1698 1734 1770 1778 1691 1562 1591
-120 1591 1715 1745 1780 1720 1713 1707 1653 1599 1613 1721 1866 1852 1787 1723 1791 1859 1827 1795 1848 1901 1787 1767 1646 1683 1712 1646 1660 1768 1824 1721 1714 1706 1737
-125 1737 1767 1718 1669 1666 1663 1772 1880 1787 1694 1680 1667 1649 1632 1662 1692 1693 1694 1719 1744 1766 1789 1710 1631 1606 1738 1734 1730 1807 1883 1786 1689 1717 1745 1852 1959
-131 1959 1936 1913 1842 1771 1704 1637 1649 1661 1657 1654 1603 1552 1632 1712 1682 1652 1691 1731 1746 1762 1687 1612 1680 1748 1740 1732 1676 1621 1733 1845 1815 1785 1703 1621 1587
-136 1587 1553 1606 1660 1729 1703 1630 1715 1689 1505 1597 1784 1913 1948 1910 1872 1829 1785 1741 1698 1701 1705 1752 1798 1702 1606 1667 1728 1709 1691 1770 1849 1826 1804 1707
-141 1707 1769 1820 1872 1852 1831 1835 1838 1808 1778 1795 1812 1787 1762 1719 1676 1661 1742 1811 1721 1644 1568 1592 1616 1646 1677 1684 1690 1703 1717 1682 1648 1701 1755 1794 1739 1700
-147 1700 1850 1922 1804 1773 1837 1847 1857 1888 1729 1570 1601 1578 1555 1497 1439 1552 1665 1699 1734 1712 1690 1692 1694 1636 1579 1663 1748 1705 1661 1659 1657 1726 1700
-152 1700 1542 1573 1607 1640 1662 1684 1641 1598 1603 1607 1583 1559 1488 1416 1477 1538 1487 1530 1654 1589 1504 1513 1521 1530 1496 1463 1492 1522 1575 1628 1673 1717 1715 1712 1671 1630 1731
-157A731J02KLm5m5o8o8P4P4r9j00k1k1J04J04N7N6mnM2M3j07j07L5L6J8J7o1o2j4j4L4L3
-162A724n0m9K9L0n5n4K5K5N0N1LLj07j06O8O8J5J6J5J5n2n2K7K7J5J5RRJ34L9J3j44p0K5
-168A711l8l8m7m7O4O4K2K3k5k6J5J5J5J5j0j1k6J31L1o4n4M1Q3Q3k1k2q9q9K1K2l6l6q3q3
-173A511N5N6QRQ1Q2o1o1LLQ3Q2k3k3k4k3j20j19rqJ7J7J7J7O4O4J7J6q7q7N5N5q6q7N7N6
-178A607%%%jJ3J2o7o7K9K9K9K9pqqqO1O1j12j13rj0J01J02n3n3K6K6n9n9N1N1jjJ00R9N5
-184A845j03p8J7O5r4J3J72J5j43j33K5nnNOk0k0K8K8mno4L1P0k5L5L4n1n2K8K7J3J3J3J3
-189A694m9n0MJ63l9l8RRR7o2q0J5j8j12noK7K6K0K0P7j9L5L5M4M3l9j34j01oo6o6N7N6O8
-195A609k7K5J21PQj1j06n3n3kkQ3Q3m6M9mmj27j27m7m8J26J25J5J4j2j2o0j54p5Q4R9J00
$$ plain form
-157 1731 1833 1835 1838 1793 1748 1680 1612 1686 1760 1661 1561 1540 1519 1623 1727 1784 1840 1836 1831 1873 1916 1809 1702 1737 1773 1791 1808 1747 1685 1671 1657 1691 1724
-162 1724 1674 1625 1654 1684 1629 1575 1600 1625 1675 1726 1729 1732 1625 1519 1587 1655 1670 1686 1701 1716 1664 1612 1639 1666 1681 1696 1705 1714 1848 1887 1900 1756 1686 1711
-168 1711 1673 1635 1588 1541 1605 1669 1691 1714 1689 1663 1678 1693 1708 1723 1713 1702 1676 1807 1838 1774 1720 1761 1844 1927 1906 1884 1795 1706 1727 1749 1713 1677 1594 1511
-173 1511 1566 1622 1630 1639 1720 1802 1741 1680 1683 1686 1769 1851 1828 1805 1781 1758 1638 1519 1510 1502 1519 1536 1553 1570 1634 1698 1715 1731 1644 1557 1612 1667 1581 1494 1551 1607
-178 1607 1607 1607 1607 1606 1619 1631 1564 1497 1526 1555 1584 1613 1606 1598 1590 1582 1643 1704 1592 1479 1470 1460 1561 1663 1610 1557 1583 1609 1550 1491 1542 1593 1592 1591 1691 1790 1845
-184 1845 1742 1664 1681 1746 1652 1665 1837 1852 1709 1576 1601 1596 1591 1596 1602 1582 1562 1590 1618 1614 1609 1545 1576 1646 1621 1656 1690 1639 1587 1615 1642 1655 1668 1681 1694
-189 1694 1645 1595 1599 1762 1723 1685 1694 1703 1800 1738 1658 1673 1655 1543 1538 1532 1559 1585 1605 1625 1702 1683 1718 1753 1797 1840 1801 1667 1566 1560 1494 1428 1485 1541 1609
-195 1609 1582 1607 1728 1735 1743 1732 1626 1573 1520 1518 1516 1599 1682 1636 1685 1681 1677 1550 1423 1376 1328 1454 1579 1594 1608 1596 1584 1524 1370 1295 1379 1478 1578
-200A578PPPPM1M0opl4l3l3l3K5K5O7O6N7l8r1MKr2r2KP1k4n9L5JR5M8M9RRRRkln0n0k2k1
-206A580o9o9j1j2R9R9ONm3m2K5K5k2k3KLo5o5r9R1K0K0K02J1j31N9Q6Q5p6p7k7k7k7k7J9
-211A525J8O6O6k8k8k8k8j4j5L2L3p6p5N5N6J32n8o9J21O6j24nok0k0R1R1l9m0l9l9k1k0N8
-217A618N9k5k5N4N4m2m1m2m2R1R1j15j15l8l7RJ0K7K8K7K7O6O6J9J8q8q8k8k9l4J55M5j46
-222A529l6l6L1L1m2m1OPL2L1L2L2l2l3q0q0J10J10o4o4J01J02m0m1l5l6J2J2J2J2J8J8o7
-227A511K8Q7j03o8K7J20K5mr8n0n1P0P0mlOJ02J67k4j53L8l5l4LLp6p6JJQ0Q0P4P3o9o9o1
-232A588o1p0J21J07q4o3o4k2J68O1O1o1o2o1o1pppoLMp6p6O8O8K0K1j8j8O1O1l1l1l1l0m7
-238A418m7O4O4k8k9k9k9n0n0J55J56LLj08j07L0L0L0L1j%J42J41m5m6L3L4o8o7M3M3ppn5
$$ plain form
-200 1578 1585 1592 1599 1606 1647 1687 1681 1674 1640 1607 1574 1541 1566 1591 1658 1724 1781 1743 1652 1656 1658 1566 1474 1476 1547 1523 1464 1499 1500 1595 1643 1692 1701 1710 1719 1728 1726 1723 1673 1623 1601 1580
-206 1580 1511 1442 1431 1419 1518 1617 1623 1628 1585 1543 1568 1593 1571 1548 1550 1553 1488 1423 1324 1415 1435 1455 1657 1668 1537 1596 1682 1767 1691 1614 1587 1560 1533 1506 1525
-211 1525 1543 1609 1675 1647 1619 1591 1563 1549 1534 1566 1599 1523 1448 1503 1559 1691 1633 1564 1685 1751 1627 1622 1616 1596 1576 1667 1758 1719 1679 1640 1601 1580 1560 1618
-217 1618 1677 1652 1627 1681 1735 1693 1652 1610 1568 1659 1750 1635 1520 1482 1445 1454 1464 1491 1519 1546 1573 1639 1705 1724 1742 1654 1566 1538 1509 1475 1630 1675 1529
-222 1529 1493 1457 1488 1519 1477 1436 1442 1449 1481 1512 1544 1576 1544 1511 1431 1351 1461 1571 1507 1443 1544 1646 1606 1565 1530 1494 1506 1518 1530 1542 1560 1578 1511
-227 1511 1539 1626 1523 1455 1482 1602 1627 1623 1525 1475 1424 1494 1564 1560 1557 1563 1665 1832 1808 1655 1693 1658 1624 1627 1630 1554 1478 1479 1480 1560 1640 1714 1787 1718 1649 1588
-232 1588 1527 1457 1578 1685 1601 1538 1474 1452 1620 1681 1742 1681 1619 1558 1497 1490 1483 1476 1470 1473 1477 1401 1325 1393 1461 1481 1502 1484 1466 1527 1588 1557 1526 1495 1465 1418
-238 1418 1371 1435 1499 1471 1442 1413 1384 1334 1284 1439 1595 1598 1601 1493 1386 1416 1446 1476 1507 1506 1506 1648 1789 1744 1698 1731 1765 1697 1630 1673 1716 1709 1702 1647
-243A647n5K4K3n6n6J3J3J3J3l9m0M0L9j4j4L4L4m9m8J4q0o5R4m9m9O3O3J54N9N7j01k17o0
-248A405P9P8n4n5nnnnl3l3P8P8J7J8J7J7n4n4n3n4QRl9l8L2L3m7m7J6J5J5J6JKJKJ0J1N8
-254A435N8K1K2O8O9o7o7n1M3K9j29q2J3J2J07P1k4r0OK4K5j2j3O6O7k5k5k4k5j3j3j4j3L8
-259A487L8rrj09j10L3J29N7j02ooN7N7N8N7l6l7l6l7m5m5L5L4K3K3J13m6J2J3O2l3r0Mpp
-264A522J6J7l1l1L8L9p3p2K8K9j8j9K4K4o5R3L8L8j22k7N6l8k6k6J07J07J8J9k8j85j44J4
-269A322O1l5k2J35J26l2r8lk6k5K7K8J3J2J12m6j55LM7M7k4k5k4k4q8q7L3J28P2P2m3m3R7
-274A535o2k0k0o7o6J2J3M6M7oQ8L6L6l7l7J9J9n4n4p3K2Q0j6o5R4kjm4m4LLp7p7L4L3O5O6
-280A429o8K8O9O9Q1j5p4p5ppM9m6QPL5L4L4L5LMq6P3l8l7k7k7q7q6K4K4R5R4J6J5OOm1m1
$$ plain form
-243 1647 1592 1616 1639 1583 1527 1540 1553 1566 1579 1540 1500 1540 1579 1565 1551 1585 1619 1570 1522 1536 1456 1391 1485 1436 1387 1450 1513 1667 1726 1783 1682 1465 1405
-248 1405 1484 1562 1508 1453 1448 1443 1438 1433 1400 1367 1445 1523 1540 1558 1575 1592 1538 1484 1431 1377 1385 1394 1355 1317 1349 1382 1335 1288 1304 1319 1334 1350 1351 1353 1354 1356 1366 1377 1435
-254 1435 1493 1514 1536 1604 1673 1606 1539 1488 1531 1560 1431 1349 1362 1374 1481 1552 1528 1438 1444 1468 1493 1481 1468 1534 1601 1576 1551 1527 1502 1489 1476 1462 1449 1487
-259 1487 1525 1516 1507 1398 1288 1321 1450 1507 1405 1399 1393 1450 1507 1565 1622 1586 1549 1513 1476 1431 1386 1421 1455 1478 1501 1614 1568 1580 1593 1655 1622 1532 1536 1529 1522
-264 1522 1538 1555 1524 1493 1531 1570 1497 1425 1453 1482 1464 1445 1469 1493 1428 1521 1559 1597 1475 1448 1504 1466 1440 1414 1521 1628 1646 1665 1637 1452 1308 1322
-269 1322 1383 1348 1326 1461 1587 1555 1457 1454 1428 1403 1430 1458 1471 1483 1595 1549 1394 1397 1444 1491 1467 1442 1418 1394 1306 1219 1252 1380 1452 1524 1481 1438 1535
-274 1535 1473 1453 1433 1366 1300 1312 1325 1371 1418 1412 1500 1536 1572 1535 1498 1517 1536 1482 1428 1355 1377 1457 1441 1376 1470 1468 1467 1423 1379 1382 1385 1308 1231 1265 1298 1363 1429
-280 1429 1361 1389 1458 1527 1608 1593 1519 1444 1437 1430 1479 1433 1441 1448 1483 1517 1551 1586 1589 1593 1507 1580 1542 1505 1478 1451 1364 1278 1302 1326 1421 1515 1531 1546 1552 1558 1517 1476
-286A476j4j4j3j4KJKJlmlll1l1j4J43L7n9ONl0k9p6Q1J6q0l2O3J19l9J4J4J2J07J1j49m7
-291A425J11l5l5l9m0M0M0Q8Q8k3k3j78j78l6J23P9j6M7M7qqqqo2o1j5j4l6l6P4P5MMNMOO
-297A407OPP4P5nnj9k0r8r9k7k6K0K1kkkkj5j4L2L3%JP9P9k8k9m4N1J09m9r1r0m8M8onM7M8
-303A411l1l2lmmlM7M8M8m8Qq8m1m0L4L4L3L4K0J9K0J9m0m0J03n6m5N1O6O5l4l5J2J3J1J2
-309A564q9N%%R0R1j02pj3j3p4p4L1L0K6p0n7n8n5M1R7R8j8j8M1n3n6M0L3o1M2M2j1j1OPJ
-314A445%M9m7m1m0O5O5k4k4P3q5j32K6K0K1L7L6m1N3n4n3Qq6RRM5m9L7L8J60o1j70J15L5
-319A439J31J02j19J3q2m3m3J0J1Q9Q9r9j00k0P4O8r1r7jN0M9R8o1m6m5pqJ1J1J2J1n5n5K5
-325A321K4N2N2k7k7J4J4J4J4M4M5l5l4l0k9J7J8N6N7QRl9l9l3l3m2N2M7j11r0NJ15J16PQ
$$ plain form
-286 1476 1462 1448 1435 1421 1423 1424 1426 1427 1424 1420 1417 1414 1383 1352 1338 1481 1518 1459 1465 1470 1440 1411 1335 1416 1432 1352 1320 1383 1502 1463 1477 1491 1503 1610 1621 1472 1425
-291 1425 1536 1501 1466 1427 1387 1427 1467 1555 1643 1620 1597 1419 1241 1205 1328 1407 1391 1438 1485 1477 1469 1461 1453 1391 1330 1315 1301 1265 1229 1303 1378 1382 1386 1391 1395 1401 1407
-297 1407 1413 1420 1494 1569 1564 1559 1540 1520 1422 1323 1296 1270 1290 1311 1309 1307 1305 1303 1288 1274 1306 1339 1339 1340 1419 1498 1470 1441 1397 1448 1557 1508 1417 1327 1279 1327 1321 1316 1363 1411
-303 1411 1380 1348 1345 1341 1337 1334 1381 1429 1477 1429 1437 1349 1308 1268 1302 1336 1369 1403 1423 1442 1462 1481 1441 1401 1504 1448 1403 1454 1520 1585 1551 1516 1528 1541 1552 1564
-309 1564 1475 1480 1480 1480 1570 1661 1559 1552 1539 1526 1452 1378 1409 1439 1465 1395 1338 1280 1225 1266 1363 1461 1443 1425 1466 1413 1357 1397 1430 1369 1411 1453 1442 1431 1437 1444 1445
-314 1445 1445 1494 1447 1406 1366 1431 1496 1472 1448 1521 1436 1304 1330 1350 1371 1408 1444 1403 1456 1402 1349 1357 1271 1280 1289 1334 1285 1322 1360 1520 1459 1289 1404 1439
-319 1439 1570 1672 1553 1566 1484 1441 1398 1408 1419 1508 1597 1498 1398 1378 1452 1520 1429 1332 1331 1381 1430 1528 1467 1421 1376 1369 1361 1372 1383 1395 1406 1351 1296 1321
-325 1321 1345 1397 1449 1422 1395 1409 1423 1437 1451 1495 1540 1505 1471 1441 1412 1429 1447 1503 1560 1568 1577 1538 1499 1466 1433 1391 1443 1490 1379 1289 1294 1409 1525 1532 1540
-330A540j03j03llOPj31K8M9m5m1J17P0P0LKm5m4O6O6j2j3k0k1K7K7nnJ1J06O2r7q1q1J2J1
-335A427J2J1m1m2m2m2O1O1j8j8M6M7M6M6l2l3l2l2k1k1N3N3P2k2j05N3K1K1p9q0L9L8Q0p8
-341A449l2l3J00J00m5m5L4L4m5m5QRp1K4J08n1l6l7L4L3l1l1k1k2o8Q9R0o9Q8Q7kko6o6J3
-346A482J3k2k3K6K5r5r5L7L7J25l4m9m9n1M5Pj51mR1K8K8J5J5l2l3J5J5O2O2o7o6J2J3m4
-351A338m3L5L6L1L2j6j6rqn6n6k2k1l1l2J89L1L1o4m9n0L0L0K4J19P6q2m5m5n5n5M2M2M2
-356A373M2K3K3j20j19L5L6L6L5K7K7K7K7k1k2M2n2j28L2J5J5K4K4K5K4K8K8k0j9k4k3l5l5
-361A350J46m4m8m7n4n3j8J72P5P5QQK4K3q7q7j7j7j6j7P7P7l4l4j2j1j2j2k1k2L9L8k02j2
-367A235K3K3R5R5j6j7lllmJ02J01rj0j21j21m2m2P7P8l4l4M5M5o7o6M0M0M1M0MNNMo9o8M2
$$ plain form
-330 1540 1437 1334 1331 1328 1334 1341 1210 1238 1287 1242 1201 1318 1388 1458 1461 1463 1418 1374 1440 1506 1494 1481 1461 1440 1467 1494 1489 1484 1495 1601 1663 1566 1485 1404 1416 1427
-335 1427 1439 1450 1409 1367 1325 1283 1344 1405 1387 1369 1415 1462 1508 1554 1522 1489 1457 1425 1404 1383 1436 1489 1561 1539 1434 1487 1508 1529 1450 1370 1409 1447 1527 1449
-341 1449 1417 1384 1484 1584 1539 1494 1528 1562 1517 1472 1480 1489 1418 1442 1550 1499 1463 1426 1460 1493 1462 1431 1410 1388 1320 1409 1499 1430 1518 1605 1603 1601 1535 1469 1482
-346 1482 1495 1473 1450 1476 1501 1406 1311 1348 1385 1510 1476 1427 1378 1327 1372 1379 1228 1224 1315 1343 1371 1386 1401 1369 1336 1351 1366 1428 1490 1423 1357 1369 1382 1338
-351 1338 1295 1330 1366 1397 1429 1413 1397 1388 1380 1324 1268 1246 1225 1194 1162 1351 1382 1413 1349 1300 1250 1280 1310 1334 1453 1529 1447 1402 1357 1302 1247 1289 1331 1373
-356 1373 1415 1438 1461 1341 1222 1257 1293 1329 1364 1391 1418 1445 1472 1451 1429 1471 1419 1291 1323 1338 1353 1377 1401 1426 1450 1478 1506 1486 1467 1443 1420 1385 1350
-361 1350 1496 1452 1404 1357 1303 1250 1232 1404 1479 1554 1562 1570 1594 1617 1530 1443 1426 1409 1393 1376 1453 1530 1496 1462 1450 1439 1427 1415 1394 1372 1411 1449 1247 1235
-367 1235 1258 1281 1376 1471 1455 1438 1435 1432 1429 1425 1527 1628 1619 1609 1488 1367 1325 1283 1360 1438 1404 1370 1415 1460 1393 1327 1367 1407 1448 1488 1492 1497 1502 1506 1437 1369 1411
-372A411M2K0J9k8k8K5K5q6q6m1m0P0P1M4M5lll9l8M0M1M4M4l4l5OONOj2j2o0o0J0J1kjP1
-378A448j19j2j1M1M2L7j52N2N2l9l9M2M2M2M2KLqpO1r8o8K7R1mj03p%R6l0l1M2M2K7o9j71
-383A263j3R7R8kjM0j18n8n9N2N2q4P5O4O5K1K0l6l6J07n2k43M2K16N7k00m1J09J5o5o5NO
-389A331NOO4O5m6m6K0K1n9n9N6N6k3k3L1L2j7j6lmmmp8p8JKR6R6j5j5k4k4k3k4n1n0O0O1
-394A317ooM1M2J1J0jr6j74M8J9J8J28l1J1J1L0L1q1q0P8P9l3l2K6K6K6K6j0j0n1n2j6P8O6
-400A443r2l9l9R3R3opn4n4K2K3K2K2K1K0K0K1P4P4r9j00l1l2J6J6l1l2p9p9J02J02O6j24
-405A352m6m6n8n8Q5Q4Q4Q5q8q7rrO0O0J2J2m3m3MMM6M5r6r7K6K6O1O2L5j56O3O2nnnnq5q5
-410A242K6K5O1O0j8j9K8K8J35n5n6n5M3M4n3n2nno0n9K0K0K2K2K2K2l3l2l3l3j1j1J56l5
$$ plain form
-372 1411 1453 1473 1492 1464 1436 1461 1486 1400 1314 1273 1233 1303 1374 1418 1463 1460 1457 1418 1380 1420 1461 1505 1549 1515 1480 1486 1492 1497 1503 1491 1479 1419 1359 1369 1380 1378 1377 1448
-378 1448 1329 1317 1306 1347 1389 1426 1274 1326 1378 1339 1300 1342 1384 1426 1468 1470 1473 1465 1458 1519 1421 1353 1380 1471 1467 1364 1357 1357 1453 1423 1392 1434 1476 1503 1434 1263
-383 1263 1250 1347 1445 1443 1442 1482 1364 1306 1247 1299 1351 1267 1342 1406 1471 1492 1512 1476 1440 1547 1495 1252 1294 1510 1567 1367 1326 1435 1450 1385 1320 1325 1331
-389 1331 1336 1342 1406 1471 1425 1379 1399 1420 1361 1302 1358 1414 1391 1368 1399 1431 1414 1398 1395 1391 1387 1383 1305 1227 1228 1230 1326 1422 1407 1392 1368 1344 1321 1297 1246 1196 1256 1317
-394 1317 1311 1305 1346 1388 1399 1409 1408 1312 1138 1186 1205 1223 1351 1320 1331 1342 1372 1403 1322 1242 1320 1399 1366 1334 1360 1386 1412 1438 1428 1418 1367 1315 1299 1377 1443
-400 1443 1351 1312 1273 1366 1459 1453 1446 1392 1338 1360 1383 1405 1427 1448 1468 1488 1509 1583 1657 1558 1458 1427 1395 1411 1427 1396 1364 1285 1206 1308 1410 1476 1352
-405 1352 1306 1260 1202 1144 1229 1313 1397 1482 1394 1307 1298 1289 1349 1409 1421 1433 1390 1347 1351 1355 1401 1446 1350 1253 1279 1305 1366 1428 1463 1307 1370 1432 1427 1422 1417 1412 1327 1242
-410 1242 1268 1293 1354 1414 1396 1377 1405 1433 1568 1513 1457 1402 1445 1489 1436 1384 1379 1374 1314 1255 1275 1295 1317 1339 1361 1383 1350 1318 1285 1252 1241 1230 1386 1351
-416A351j52L7O2O1nnn3n2Q5Q5P2P3Q8j02j38j38Q0Q0l1l1k7k7N2N3q3q2K8K9Q1Q1R6o1j19
-421A388k3j46n1J51N7j7P9k0j9O6O5n4n4n4n4j3j4O5O5j8j8Kr3j20J02R6j26J8J9NNM9N0
-426A388KLj0j0rj0R9R8q2q1J4q1p4Q3J39M4o7o7n5n5pqK0J9O7O7k4k4K3K3j9k0K8K8j06j06
-431A230n8n8N4N4N4N5O2O2q1q0K0K0K1K0M1M1opO9O8j69j1J3q2k5P0j9j9J23l5K2K1J2J2
-436A494j6j6L1L2j9j9o6o7j01j02M1M1N5N5PPm2m3N8l6K5K6K6K5k9O5j3j09J9J9r4JJ17K1
-442A393o2o2l4l4J3J3j7j7k9O6J63O8m7m7lkp6p6M9J43J1J2M4M4o6o7k4k4k4k4m1m2K8K8
-447A257R2o6j36m0K3J19rql4l4M5M5M8M7l2l2K6K7K6K7L0L1L7n8NNj%l8l8LMjr5m2m2M1M1
-453A273M7m8K2K1l8N7m1m2J2J3j9j9K9K9k9l0P8j8k4P0J1J1n5n6k9O5M6M7K6o8o2o2K2K1
$$ plain form
-416 1351 1199 1236 1298 1359 1354 1349 1296 1244 1329 1414 1486 1559 1647 1545 1407 1269 1349 1429 1398 1367 1340 1313 1365 1418 1335 1253 1281 1310 1391 1472 1568 1507 1388
-421 1388 1365 1219 1168 1319 1376 1359 1438 1418 1399 1465 1530 1476 1422 1368 1314 1301 1287 1352 1417 1399 1381 1383 1290 1170 1272 1368 1242 1260 1279 1284 1289 1338 1388
-426 1388 1390 1393 1383 1373 1364 1354 1453 1551 1469 1388 1402 1321 1247 1330 1469 1513 1446 1379 1324 1269 1262 1254 1274 1293 1360 1427 1403 1379 1402 1425 1406 1386 1414 1442 1336 1230
-431 1230 1172 1114 1168 1222 1276 1331 1393 1455 1374 1294 1314 1334 1355 1375 1416 1457 1451 1444 1513 1581 1412 1401 1414 1332 1307 1377 1358 1339 1462 1427 1449 1470 1482 1494
-436 1494 1478 1462 1493 1525 1506 1487 1421 1354 1253 1151 1192 1233 1288 1343 1350 1357 1315 1272 1330 1294 1319 1345 1371 1396 1367 1432 1419 1310 1329 1348 1254 1255 1372 1393
-442 1393 1331 1269 1235 1201 1214 1227 1210 1193 1164 1230 1393 1461 1414 1367 1364 1362 1286 1210 1259 1402 1413 1425 1469 1513 1447 1380 1356 1332 1308 1284 1243 1201 1229 1257
-447 1257 1349 1283 1147 1107 1130 1249 1240 1232 1198 1164 1209 1254 1302 1349 1317 1285 1311 1338 1364 1391 1421 1452 1489 1431 1436 1441 1440 1440 1402 1364 1367 1371 1370 1275 1233 1191 1232 1273
-453 1273 1320 1272 1294 1315 1277 1334 1293 1251 1263 1276 1257 1238 1267 1296 1267 1237 1315 1297 1273 1343 1354 1365 1310 1254 1225 1290 1336 1383 1409 1341 1279 1217 1239 1260
-458A260j0J47J01n8j03j03klL2L1L2L1M0M0M0M0o0o1o0o0J23J23k0j9J1J1o2o2r5%J39n2
-463A371j55o0J00J00Q9j02j07Q2J47N1k5k5M7M8r5r4q8q8qrl8l8l8l8Q9R0M2M1M2M1oooo
-468A348J13p7j28O2n7n7k7k7Q4Q4O8O7K1K0j16j16l7l7J3J4R2R3L4L4j08j09M2M2M3M2l8
-473A382l7l7l7j0j0O9P0o7o6n4n5o9J21O8k7N6N5LKl4l4J3J3k0k0K7K7j10j11O4O4L1L1m
-478A294no9J22J21o9n1n2n2n2n6J34J34n7k5k6M2M2K9K9K9K9p0p0J0Rj6j6j23O7J2J2K4K3
-483A353L5L5m4m4l2l3M7M7OOPOL8L8L8L8o1o0N1N0k6k7K1K1m1m2m1m1l6l7K4K3j60L1O6O7
-488A323JJJJj5j4k6k6J76j4j8j8lmn1n1%jP9P9k8k7k8k7Q0Q0l0l0J5J5l2l2J4J4l3l3K6K5
-494A389K6K6K9K9n0n1o7o6J2J2jkkjk2k2j0j0o9J20J27o3p3K3J1q5J4J4m6N0O4O5K3K3mn
$$ plain form
-458 1260 1250 1397 1498 1440 1337 1234 1232 1229 1261 1292 1324 1355 1395 1435 1475 1515 1455 1394 1334 1274 1397 1520 1500 1481 1492 1503 1441 1379 1284 1284 1423 1371
-463 1371 1216 1156 1256 1356 1445 1343 1236 1318 1465 1516 1491 1466 1513 1561 1466 1372 1284 1196 1188 1179 1141 1103 1065 1027 1116 1206 1248 1289 1331 1372 1366 1360 1354 1348
-468 1348 1461 1384 1256 1318 1261 1204 1177 1150 1234 1318 1386 1453 1474 1494 1378 1262 1225 1188 1201 1215 1307 1400 1434 1468 1360 1251 1293 1335 1378 1420 1382
-473 1382 1345 1308 1271 1261 1251 1320 1390 1323 1257 1203 1148 1079 1200 1268 1241 1297 1352 1355 1357 1323 1289 1302 1315 1295 1275 1302 1329 1219 1108 1172 1236 1267 1298 1294
-478 1294 1289 1220 1342 1463 1394 1343 1291 1239 1187 1131 1265 1399 1342 1317 1291 1333 1375 1404 1433 1462 1491 1421 1351 1361 1370 1354 1338 1215 1282 1294 1306 1330 1353
-483 1353 1388 1423 1379 1335 1303 1270 1317 1364 1370 1376 1383 1389 1427 1465 1503 1541 1480 1420 1471 1521 1495 1468 1489 1510 1469 1427 1386 1345 1309 1272 1296 1319 1159 1190 1256 1323
-488 1323 1324 1325 1326 1327 1312 1298 1272 1246 1422 1408 1390 1372 1369 1365 1314 1263 1263 1262 1341 1420 1392 1365 1337 1310 1390 1470 1440 1410 1425 1440 1408 1376 1390 1404 1371 1338 1364 1389
-494 1389 1415 1441 1470 1499 1449 1398 1331 1265 1277 1289 1288 1286 1284 1283 1261 1239 1229 1219 1150 1270 1397 1334 1261 1284 1295 1210 1224 1238 1192 1242 1306 1371 1394 1417 1413 1408
-500A408nmo4o4o8R1l3O1P0j52j7P9J7p8p7p7N9O0J9K0P2k2jkM6m9j6j6j7j6K7J23K1K1l7
-505A379l7J0J1j5j4j5j4n1n1K8K8J02J01p3p2opn3M1l8N7j6j11K4K3K4K3o1L3L7L8j06N2
-510A271l6l7M4M3mmj43j42O9O9L6J31K1p4RRkkM4n1K8J23k7k8j01j00K9L0k9O5M2n3J%O8
-515A299k7j00oQ6J81m1m1m5m4KLN5N4q8q8J7J7l1l1P1P1qql8l8P3P3j16j16J16J15l3j28
-520A206j25R5N1m3n6n6K1K0K1K0R7R7j4j4ppj50n4J22l5J1J2K9L0j8j8k9l0J9J8L3L3L3L3
-526A345J1J1j53j53m1J17Qq6o0L5J18J18L5L5p6p6k5k5N5N4M2M3M2M3l3l2l2l3k7k8k7k7
-530A178l1l0M8M9J8J9k8k9POJ06n3p9P9N9N9j3j2o0o0J9J8J8J8n0n1O1O0JJm7m6KLKLN1N0
-536A346k8k8l0l0Q0Q1ononp4p3ooJ05q5L3L4m0J50L9j51n9n9QRO9P0j0rm5m5KLN8N8J1J1
$$ plain form
-500 1408 1403 1399 1335 1271 1203 1294 1261 1322 1392 1240 1223 1302 1319 1241 1164 1087 1146 1206 1225 1245 1317 1295 1294 1292 1338 1289 1273 1257 1240 1224 1251 1374 1395 1416 1379
-505 1379 1342 1352 1363 1348 1334 1319 1305 1254 1203 1231 1259 1361 1462 1389 1317 1311 1304 1251 1292 1254 1311 1295 1184 1208 1231 1255 1278 1217 1250 1287 1325 1219 1271
-510 1271 1235 1198 1242 1285 1281 1277 1134 992 1061 1130 1166 1297 1318 1244 1253 1262 1260 1258 1302 1251 1279 1402 1375 1347 1246 1146 1175 1205 1176 1241 1283 1230 1231 1231 1299
-515 1299 1272 1172 1166 1252 1433 1392 1351 1306 1262 1264 1267 1322 1376 1288 1200 1217 1234 1203 1172 1243 1314 1306 1298 1260 1222 1295 1368 1252 1136 1252 1367 1334 1206
-520 1206 1081 1176 1227 1184 1128 1072 1093 1113 1134 1154 1251 1348 1334 1320 1313 1306 1156 1102 1224 1189 1200 1212 1241 1271 1253 1235 1206 1176 1195 1213 1246 1279 1312 1345
-526 1345 1356 1367 1214 1061 1020 1137 1145 1059 999 1034 1152 1270 1305 1340 1264 1188 1163 1138 1193 1247 1289 1332 1374 1417 1384 1352 1320 1287 1260 1232 1205 1178
-530 1178 1147 1117 1165 1214 1232 1251 1223 1194 1201 1207 1313 1260 1181 1260 1319 1378 1365 1353 1293 1233 1252 1270 1288 1306 1256 1205 1266 1326 1327 1328 1281 1235 1237 1240 1242 1245 1296 1346
-536 1346 1318 1290 1260 1230 1310 1391 1385 1380 1374 1369 1295 1222 1216 1210 1315 1230 1263 1297 1257 1407 1446 1295 1236 1177 1185 1194 1263 1333 1323 1314 1269 1224 1226 1229 1287 1345 1356 1367
-542A367j26j27J6J6J6J7J7J7k2k2N8N7J7J8l1l0k5k5K2K2j4j5j4j5j3j4R8R7l0l0J56l4k4
-547A400k5j42M7j9j9ppP7P6o6o7l6l7J1J1M6M6M7M6j4j5j4j5q6q5poN1N1MMM4M4r8r8M3M4
-553A229M3M3JJp8p9Q7Q7k4k4k7k7k7k7N3N4k6k5l5l4J3J3RRl9l9M8M7j0j05M4M4L8L8J1J0
-558A296O4l1n9n9P7P8NNl6l6m7M8J4J09P8j6j31j31mmmnJ5J5m3j37K5K6K6p0N5N4JJlkN7
-564A231l8n6L8N8N8m1m1K8K8Pj52m7J11R3jn5n6K8o7L4L4P4P4K2p3j11j6O7O6j1j2M2n4m0
-569A222m0O4O5O7O8j07j06nmnmj15j15k5O9J10J09O9O8l5l5j9j14m1J18O4O4J06J2m6m5q2
-574A332q1l4l4l8l7J9K0p9Q0L8n6O2l3q0J4j5Q0J15m2R1lk9k9o3R4R3j29r9O0kkM0n4NNj27
-579A082l2LR9L3L3L9L9n3n4kR3Pq8J9J9nmM3M3m6m6k6O9N1m4l2l1j6j5R2ll9N6N1m5n5n4
$$ plain form
-542 1367 1241 1114 1130 1146 1162 1179 1196 1213 1191 1169 1227 1284 1301 1319 1288 1258 1233 1208 1230 1252 1238 1223 1209 1194 1181 1167 1265 1362 1332 1302 1458 1424 1400
-547 1400 1375 1233 1280 1261 1242 1235 1228 1305 1381 1315 1248 1212 1175 1186 1197 1243 1289 1336 1382 1368 1353 1339 1324 1238 1153 1146 1140 1191 1242 1246 1250 1294 1338 1240 1142 1185 1229
-553 1229 1272 1315 1316 1317 1239 1160 1247 1334 1310 1286 1259 1232 1205 1178 1231 1285 1259 1234 1199 1165 1178 1191 1200 1209 1170 1131 1179 1226 1216 1111 1155 1199 1237 1275 1286 1296
-558 1296 1360 1329 1270 1211 1288 1366 1371 1376 1340 1304 1257 1305 1319 1428 1506 1490 1359 1228 1224 1220 1216 1211 1226 1241 1198 1061 1086 1112 1138 1068 1123 1177 1178 1179 1176 1174 1231
-564 1231 1193 1137 1175 1233 1291 1250 1209 1237 1265 1272 1120 1073 1184 1277 1276 1221 1165 1193 1126 1160 1194 1268 1342 1364 1291 1180 1164 1231 1297 1286 1274 1316 1262 1222
-569 1222 1182 1246 1311 1378 1446 1339 1233 1228 1224 1219 1215 1100 985 960 1029 1139 1248 1317 1385 1350 1315 1296 1182 1141 1259 1323 1387 1493 1505 1459 1414 1332
-574 1332 1251 1217 1183 1145 1108 1127 1147 1068 1148 1186 1130 1192 1159 1079 1093 1078 1158 1273 1231 1322 1319 1290 1261 1198 1292 1385 1256 1157 1217 1215 1213 1253 1199 1204 1209 1082
-579 1082 1050 1053 1152 1185 1218 1257 1296 1243 1189 1187 1280 1287 1199 1218 1237 1232 1228 1271 1314 1268 1222 1196 1265 1316 1272 1240 1209 1193 1178 1270 1267 1228 1284 1335 1290 1235 1181
-585A181M6m9kR3J28l0o8K8J7p8J7J6o9o9l5l5J03Qn2M2j7j7QRl3l3j1Q4L6L7p2K4J13m6q6
-590A188Rj%r3KL4L4k4P1QQP6q3OOk3k2K5J20Pj52N5N5OOOOk9k8j7j11m0N6k5j84J25J25R9
-596A301Nr6O3q0q0m2m2L7L7O6O7j3j3noooRJ0l9l8O6O6j4j3M2M2o8o8k6k6K1K2opooJ1J2
-602A171J1J2P6P7o6o5J9J9n9o0K4K3K4K3k3k3K5K5j%m8m8K0J9O7O7K7K6q4q5ooN7l8j24L4
-608A110J03QO7O7n0n0M5M5l4l5m2m2J04n3r1O8J11m7j04j0k5k5k6k5K2K2PPPPQ9Q9n9k17
-613A043jjM3M3oQ9P7q1m5m5qqR5R4R6r3j04qL9n6j44M7M4M4j5j5j5j5L2L2L1L2l4l4J3J3
-618A179j7j7j6j7J5J5J4J5mnP4P5o2o1N0N0N4N5k5k4j3j3j2j3o8o7o8o8N9N9J2J1K2K1Q1
-624A291j09p0p0L0K9QPp1p2P4P4P4P4l3l4P8P7o5o5j9P5Q2j08m9M6L2L2m0m1%JJJn0m9O1
$$ plain form
-585 1181 1227 1178 1176 1269 1397 1367 1299 1327 1344 1266 1283 1299 1230 1161 1126 1091 1194 1202 1150 1192 1175 1158 1166 1175 1142 1109 1098 1182 1218 1255 1183 1207 1320 1274 1188
-590 1188 1197 1196 1196 1103 1105 1139 1173 1149 1220 1228 1236 1312 1229 1235 1241 1218 1196 1221 1341 1348 1196 1251 1306 1312 1318 1324 1330 1301 1273 1256 1145 1105 1161 1136 952 1077 1202 1301
-596 1301 1306 1210 1273 1193 1113 1071 1029 1066 1103 1169 1236 1223 1210 1205 1199 1193 1187 1196 1206 1167 1129 1195 1261 1247 1234 1276 1318 1250 1182 1156 1130 1151 1173 1167 1160 1154 1148 1159 1171
-602 1171 1182 1194 1270 1347 1281 1216 1235 1254 1195 1135 1159 1182 1206 1229 1206 1183 1208 1233 1232 1232 1184 1136 1156 1175 1242 1309 1336 1362 1278 1193 1187 1181 1238 1200 1076 1110
-608 1110 1213 1221 1288 1355 1305 1255 1300 1345 1311 1276 1234 1192 1296 1243 1152 1220 1331 1284 1180 1170 1145 1120 1094 1069 1091 1113 1120 1127 1134 1141 1230 1319 1260 1043
-613 1043 1042 1041 1084 1127 1121 1210 1287 1206 1161 1116 1108 1100 1195 1289 1385 1292 1188 1180 1219 1163 1019 1066 1110 1154 1139 1124 1109 1094 1126 1158 1189 1221 1187 1153 1166 1179
-618 1179 1162 1145 1129 1112 1127 1142 1156 1171 1167 1162 1236 1311 1249 1188 1238 1288 1342 1397 1372 1348 1335 1322 1310 1297 1229 1162 1094 1026 1085 1144 1156 1167 1189 1210 1291
-624 1291 1182 1112 1042 1072 1101 1109 1116 1045 973 1047 1121 1195 1269 1236 1202 1280 1357 1292 1227 1208 1283 1365 1257 1208 1254 1286 1318 1278 1237 1237 1238 1239 1240 1190 1141 1202
-629A202O1o8o9J1J0ooopJ4J4m6m5P5j15o1L3klQ2Q3q2q2O0O1L8L8L7L8m2m2NNO5O4m6m6M2
-635A264M1o3o3o2L3k0k1Q9R0J0J0p1p1N0J44q5q4ooJ35M0J4J4j4j3q7q7j36m2J96J96k8j86
-640A181p5Q3L4L5J9p6J3J4m5M9k2k2R1mn7L7J05Rl1j26p8p9M2M2R6Jp6p6O0O1K8K8l0j24
-645A107m9m9qpM7M7J06J1j05j1M0M1k4k3J14K0l5N9J02Ol6l5m7M8jjm2m2M4M4l5l6J3J3O7
-651A343k9n1n1n2n1p6J9m1m0J15J9R3J88j0j06j00nJ1J1J06n2PPj20j19Nr0P5P4L7L7j7P9
-656A216m4m5n0M5N4m0m0N4M3n2J3J3j93r8Q7Q6Q1Q1L4L4J4J4m3j38K2K2%R6L6j22p4p4j4
-661A018j4R6R7OONOk1k1K7K7N0N0n4n5l6O0N9l6j12j13Q8Q7N5N5n2M3L6n8j38m3K0p5p6K0
-666A007O9k6j4j4J0J0MR9jj%jk4j20P7P7J5J6J6J6o6o6m1N5l0l1l6N9J01NP1k4k9k9J3J2
$$ plain form
-629 1202 1263 1195 1126 1137 1147 1141 1135 1129 1122 1136 1150 1104 1059 1134 1019 958 991 989 986 1068 1151 1069 987 1047 1108 1146 1184 1221 1259 1217 1175 1180 1185 1250 1314 1268 1222 1264
-635 1264 1305 1242 1179 1117 1150 1130 1109 1198 1288 1298 1308 1237 1166 1216 1360 1275 1191 1185 1179 1314 1354 1368 1382 1368 1355 1268 1181 1045 1003 1199 1395 1367 1181
-640 1181 1106 1189 1223 1258 1277 1201 1214 1228 1183 1232 1210 1188 1279 1275 1218 1255 1360 1369 1338 1212 1134 1055 1097 1139 1235 1236 1160 1084 1144 1205 1233 1261 1231 1107
-645 1107 1058 1009 1001 994 1041 1088 1194 1205 1100 1089 1129 1170 1146 1123 1237 1257 1222 1281 1383 1389 1353 1318 1271 1319 1318 1317 1275 1233 1277 1321 1286 1250 1263 1276 1343
-651 1343 1314 1263 1212 1160 1109 1033 1052 1011 971 1086 1105 1198 1386 1376 1270 1170 1165 1176 1187 1293 1241 1248 1255 1135 1016 1021 931 1006 1080 1117 1154 1137 1216
-656 1216 1172 1127 1077 1122 1176 1136 1096 1150 1193 1141 1154 1167 974 876 963 1049 1130 1211 1245 1279 1293 1307 1264 1126 1148 1170 1170 1266 1302 1180 1106 1032 1018
-661 1018 1004 1100 1197 1203 1209 1214 1220 1199 1178 1205 1232 1282 1332 1278 1223 1187 1247 1306 1270 1158 1045 1133 1220 1275 1330 1278 1321 1357 1299 1161 1118 1138 1063 987 1007
-666 1007 1076 1050 1036 1022 1032 1042 1046 1145 1144 1143 1143 1142 1118 998 1075 1152 1167 1183 1199 1215 1149 1083 1042 1097 1067 1036 1000 1059 1160 1165 1236 1212 1183 1154 1167 1179
-671A179k5k5M8M9N2m2l7l7l1l2k2k1q1P7L6L5P4P5j00j00Q8Q7k9l0N5m0p6Q2O4O4j00j00
-676A137K0K1K0K1k9k8m3N1M6j12p1K5O1O1%R4K22jqj66j60kJ%J13m5M3M4o3o4o3o3O7O7j2
-682A184j2MNp5p5K9K9R7Jo0J62M1j17k9k9l9l9K7K7K8K7L9L9l4l4p9J6R9n9L0L0r1r1l1l2
-687I88P0O9O7r0n0M6j7P8J19l9m3m3n3n3L7L6L7L7j3j3L5L5l5l4q2q2K6K6K6K5KJM8M9J2
-692A222J2l5l6L2L2j10j11J17J17P0P0p4p3O9O9q5q6ooQ4Q4j54j54KJM9N0M0M1M1M1o1o1
-697A191J9J8O4O5p7p8J2J3J2J2n8n8K2K1P4P5r9j00POPOJ7J8r4r3kjM6M6ONNOP3P4l8l7p
-703A178oM1M0m8m9O2O2j2j2j2j2J4J5l3l3j1j1j1j1K4K5n4n5L1L1P8P8l3l2l2l3mnM3M3m3
-709A213m2m3m2J0J0o9o9o3o3J6J6J37J37N8N8l1l0J7J7m6m7j25j26mnM7J42J20K5k0k1j01
$$ plain form
-671 1179 1154 1129 1177 1226 1278 1236 1199 1162 1131 1099 1077 1056 975 1052 1088 1123 1197 1272 1172 1072 1160 1247 1218 1188 1243 1203 1127 1209 1273 1337 1237 1137
-676 1137 1157 1178 1198 1219 1190 1162 1119 1170 1216 1104 1033 1058 1119 1180 1180 1274 1496 1495 1487 1321 1161 1159 1160 1160 1273 1228 1271 1315 1252 1188 1125 1062 1129 1196 1184
-682 1184 1172 1176 1181 1106 1031 1060 1089 1186 1187 1127 1289 1330 1213 1184 1155 1116 1077 1104 1131 1159 1186 1225 1264 1230 1196 1117 1133 1232 1173 1203 1233 1142 1051 1020 988
-687 988 1058 1127 1194 1104 1054 1100 1083 1161 1280 1241 1198 1155 1102 1049 1086 1122 1159 1196 1183 1170 1205 1240 1205 1171 1089 1007 1033 1059 1085 1110 1112 1113 1161 1210 1222
-692 1222 1234 1199 1163 1195 1227 1117 1006 1123 1240 1310 1380 1306 1233 1302 1371 1286 1200 1194 1188 1272 1356 1202 1048 1050 1051 1100 1150 1190 1231 1272 1313 1252 1191
-697 1191 1210 1228 1292 1357 1280 1202 1214 1227 1239 1251 1193 1135 1157 1178 1252 1327 1228 1128 1135 1141 1148 1154 1171 1189 1095 1002 1000 999 1045 1091 1097 1102 1107 1113 1186 1260 1222 1185 1178
-703 1178 1172 1213 1253 1205 1156 1218 1280 1268 1256 1244 1232 1246 1261 1228 1195 1184 1173 1162 1151 1175 1200 1146 1091 1122 1153 1231 1309 1276 1244 1212 1179 1175 1170 1213 1256 1213
-709 1213 1171 1128 1086 1096 1106 1037 968 905 842 858 874 1011 1148 1206 1264 1233 1203 1220 1237 1191 1144 1019 893 889 884 931 1073 1193 1218 1198 1177 1076
-714A076oJ20J20p9J5Q9ok7j21q0J5L9L9klj9j9K2K3K5p0R1mqQ7Q1j4j36j37N4m2j2j2L6n9
-719A076M0M1m5m4O8O8l7l7J4J10L4j24K3K2o1o0Q5J81M4n1j00nj02j03n8R9J11J7k5k6J6
-724A171J7RRRJ0PPm1m0l9m0l9N5K1J16j0j1k9k9l0k9M4M4R1R1m7m7j01nQ7Q8q0q0n6n6Q7
-729A154Q7K8K8L7j20k2k1p3p3r9lK2K2L3L3Q6qm0m0N9N8J24K9oj01JJnnj2j3M1M1o6K9L0
-735A236o6l4l4m6m5L5o0n4n3R1R2J39M4J0q6l9l8L1L1L1L1J%JJo7o6J2J3p0p1RRj4j4J24
-740A084L0n7L8k1k2m2m2R4R4N5m1l4l5K3K3K3K2K7K6L2L2r6kppo3o2j4j5J30J30J9j39r0
-745A093Nnno5L0o6o5J2J07J07J2j0j0mr9j2Q4K4K4q9q9J8p6NJ00L4L5M3n2q8P0j9j9R2m%
-751A118%J9J14nnj8j14n0M6j4j4L9L9J9J14P6j46k15n7O3O3M8m8N7N8q5q5n5M1J20K5J0J0
$$ plain form
-714 1076 1070 1190 1310 1231 1246 1335 1329 1302 1181 1101 1116 1155 1194 1192 1189 1170 1151 1173 1196 1221 1151 1242 1238 1230 1317 1398 1384 1248 1111 1165 1123 1111 1099 1135 1076
-719 1076 1116 1157 1112 1068 1136 1204 1167 1130 1144 1254 1288 1164 1187 1209 1148 1088 1173 1354 1398 1347 1247 1242 1140 1037 979 1078 1189 1206 1181 1155 1171
-724 1171 1188 1197 1206 1215 1225 1232 1239 1198 1158 1119 1079 1040 1095 1116 1232 1222 1211 1182 1153 1123 1094 1138 1182 1273 1364 1317 1270 1169 1164 1251 1339 1259 1179 1123 1067 1154
-729 1154 1241 1269 1297 1334 1214 1192 1171 1098 1025 926 923 945 967 1000 1033 1119 1111 1071 1031 1090 1148 1272 1301 1295 1194 1195 1196 1191 1186 1174 1161 1202 1243 1177 1206 1236
-735 1236 1170 1136 1102 1056 1011 1046 986 932 879 970 1062 1201 1245 1255 1169 1130 1092 1123 1154 1185 1216 1217 1217 1218 1219 1152 1086 1098 1111 1041 970 979 988 974 960 1084
-740 1084 1114 1057 1095 1074 1052 1010 968 1062 1156 1211 1170 1136 1101 1124 1147 1170 1192 1219 1245 1277 1309 1213 1211 1204 1197 1134 1072 1058 1043 1173 1303 1322 1183 1093
-745 1093 1098 1093 1088 1023 1053 987 922 934 1041 1148 1160 1150 1140 1136 1037 1025 1109 1133 1157 1068 979 997 921 926 1026 1060 1095 1138 1086 998 1068 1049 1030 1122 1118 1118
-751 1118 1118 1137 1251 1246 1241 1223 1109 1059 1105 1091 1077 1116 1155 1174 1288 1364 1218 1003 946 1009 1072 1120 1072 1129 1187 1102 1017 962 1003 1123 1148 1158 1168
-756A168MMM6M5j60o5J22l7p4K1J7J7L5o1k0P4R4R4r4r4J7J7k5k6k6k5k6k7l8N7J18K2n1M4
-761A167K7K7j4j5O3O2Or0j26j26m7J11P8P7j9P6M5n0l3j29q9J32M3M4N3m2l6l6j4j4O5O5
-766A261m9n0n5L9JJPPOOm2m2K8K8k6O9M1M1NNj36m2J6J6j7j8K0K0J28l1n2n2l2l2K2p4K9
-772A046K8K3K2J3J3J2J3m0l9l4l4k2P3O6O7p1p0j9P5O8k7m7m7M0M0L5J29KKj28j28p7J8P5
-777A077P6lkn0m9L2L2L9L8MJ00o5o5k1k0L3L3q1J4QQKKKK%jN9l5m2N3R4%j8j8l5N9j2j07
-783A143n3M1K3K4j9j8PPp1p2O4O3J1j48qpj8j7Q5Q5J38M3p6p6p6p7K1J16J0q4m4N0j5j5P3
-788A110k2m2m2o2L2K6K7N4N4P1k5j18M1N0N0Q1j5j60j61K1J16P3q6J6J6l6l5m7M9nnP2P1
-793A169K4K3j1j0O2O2p7j72qqj5j5o8K7M6M7K7o9m1m1ooJ11J5o3L2N8N9J1J05j26j27l8N7
$$ plain form
-756 1168 1172 1176 1222 1267 1107 1042 1164 1127 1053 1074 1091 1108 1143 1082 1062 1136 1230 1324 1230 1136 1153 1170 1145 1119 1093 1068 1042 1015 977 1034 1152 1174 1123 1167
-761 1167 1194 1221 1207 1192 1255 1317 1323 1233 1107 981 934 1045 1123 1200 1181 1257 1302 1252 1219 1090 1001 1133 1176 1220 1273 1231 1195 1159 1145 1131 1196 1261
-766 1261 1212 1162 1107 1146 1147 1148 1155 1162 1168 1174 1132 1090 1118 1146 1120 1189 1230 1271 1276 1281 1145 1103 1119 1135 1118 1100 1120 1140 1268 1237 1185 1133 1101 1069 1091 1017 1046
-772 1046 1074 1097 1119 1132 1145 1157 1170 1130 1091 1057 1023 1001 1074 1140 1207 1136 1066 1047 1122 1190 1163 1116 1069 1109 1149 1184 1313 1315 1317 1189 1061 984 1002 1077
-777 1077 1153 1150 1148 1098 1049 1081 1113 1152 1190 1194 1294 1229 1164 1143 1123 1156 1189 1108 1122 1130 1138 1140 1142 1144 1146 1146 1145 1204 1169 1127 1180 1274 1274 1256 1238 1203 1262 1250 1143
-783 1143 1090 1131 1154 1178 1159 1141 1148 1155 1084 1012 1076 1139 1150 1002 994 987 969 952 1037 1122 1260 1303 1227 1151 1075 998 1019 1135 1145 1061 1017 1067 1052 1037 1110
-788 1110 1088 1046 1004 942 974 1000 1027 1081 1135 1206 1181 1063 1104 1154 1204 1285 1270 1110 949 970 1086 1159 1073 1089 1105 1069 1034 987 1036 1031 1026 1098 1169
-793 1169 1193 1216 1205 1195 1257 1319 1242 1070 1062 1054 1039 1024 956 983 1029 1076 1103 1034 993 952 946 940 1051 1066 1003 1035 1093 1152 1163 1268 1142 1015 977 1034
-798A034P7j8l8l7PQKKQ2j2o5K9O8k8L8L8j00mP4P5jj59RRK5K5J9J14l9l9j18j18O1l3k7k7
-804I33Q5Q6L2L2J8p8p2p1M4M4M4M4k3k2L1L1q8QR6o2l3O3jjNMMNP5P6P0O9k5j19o7o7P6P6
-810A322o6o7j3j2o0o0J1J1N9N8r8r7M5M4j4j5O5O4n5n5N5N6j6j6j04N3onMMj4j4n1n1r1O7
-815I38J53J52MMm3m4J7J7O5O4n9n9o0n9l9l9J03J04j%j%l0l1k4k4l2O3J04n4k5O9POl8l8
-821A170l8l9j5j5N7N8k4j20j17J04R4jM6m9q2J2j42m6P2J68O3l2LKllk0k0J8J7Q6p2j48n2
-826I32J09J08MMk8k8N2N1rrm7m7j9J40KLo4o4j6j7m8m8L1L1mlM4M4j0rL8L8QPp1p2N0M9P
-832A139Qj9P6O2j27j96oQ1Q1k7k6k7k6M8M9JJK0J9K0J9n8n7N3N3M1M0M1M1m8m9m8m8Q1Q1
-837A293j24j25k1k2J09J09O3j28j33N7Q3j2q5J0P3k3j37j37qqL8J33J19p1M2M2J9J8J25o5
$$ plain form
-798 1034 1111 1093 1055 1018 1025 1033 1035 1037 1119 1107 1042 1071 1139 1111 1149 1187 1087 1083 1157 1232 1231 1072 1081 1090 1115 1140 1159 1273 1234 1195 1077 959 1020 987 960 933
-804 933 1018 1104 1136 1168 1186 1108 1036 965 1009 1053 1097 1141 1118 1096 1127 1158 1070 1078 1174 1112 1079 1142 1141 1140 1145 1149 1153 1158 1233 1309 1379 1448 1423 1304 1237 1170 1246 1322
-810 1322 1256 1189 1176 1164 1104 1044 1055 1066 1125 1183 1085 988 1033 1077 1063 1048 1113 1177 1122 1067 1122 1178 1162 1146 1042 1095 1089 1084 1088 1092 1078 1064 1013 962 871 938
-815 938 1091 1243 1247 1251 1208 1164 1181 1198 1263 1327 1268 1209 1149 1090 1051 1012 1115 1219 1218 1218 1217 1217 1187 1156 1132 1108 1076 1139 1243 1189 1164 1233 1240 1246 1208 1170
-821 1170 1132 1093 1078 1063 1120 1178 1154 1034 917 1021 1115 1114 1160 1111 1029 1041 899 853 925 1093 1156 1124 1127 1129 1126 1123 1103 1083 1101 1118 1204 1132 984 932
-826 932 1041 1149 1153 1157 1129 1101 1153 1204 1195 1186 1139 1092 1073 1213 1215 1218 1154 1090 1074 1057 1009 961 992 1023 1019 1016 1060 1104 1094 1085 1123 1161 1169 1176 1105 1033 1083 1132 1139
-832 1139 1147 1128 1204 1266 1139 943 937 1018 1099 1072 1046 1019 993 1041 1090 1091 1092 1112 1131 1151 1170 1112 1055 1108 1161 1202 1242 1283 1324 1276 1227 1179 1131 1212 1293
-837 1293 1169 1044 1023 1001 1110 1219 1282 1154 1021 1078 1161 1149 1064 1074 1147 1124 987 850 842 834 872 1005 1124 1053 1095 1137 1156 1174 1299 1234
-842A234jkj24j24L6L7L6L6j9k0K6J21O3j27r4r4P5P5J5J5J06q3j63K7P9P9q3q3J9J8J9J9
-847A118L2L2j6j5m0m1m0m0j0j0j0j1L2L1j6j6rrL8L8K3K3k4k4L3L2L3L3j07j07MMO8O7m3
-852A053m3Q2Q2MLj9j9Q8j02J1J2%%%%J%l3l4J5J4lkP6P7j14j13lkn1n1K8K8L4L4L4L4J5J4
-858A150J5J5m9m8L0L1q2q2O1O1k2k1k1k2mnO3O3Q6j03LLm5m5L3L4k0k1K7K7OOm2m1L2L2L2
-864A137L1j0j1j0j1l5l5l5l5M1M1l9l8OPOPKLLL%j%%N3N4NOJ6J6J5J6j44j44L0L0LLQ3Q2
-870A151J16J16j22j21k5k4rj04m4J14K6p0m5m4O0O0poopJJ%JJ5J4RRJ9p5j47P5R2R2J16m3
-875A188p7p7qQ7P5q3J7p7Q1Q1r9j00m6m6R6R6J1J0J05n3n8L7K1K2n8n8Or0L1J89m8m9k4k5
-880A077k4k5R2R3j9j8k5k4k5k4J00J00m3m3j8j8o5o6M9M8o3o3JJJ11J12p9p9L2L1M4M4l6
$$ plain form
-842 1234 1233 1231 1107 983 1019 1056 1092 1128 1109 1089 1115 1236 1299 1172 1078 984 1059 1134 1149 1164 1270 1187 1024 1051 1130 1209 1126 1043 1062 1080 1099 1118
-847 1118 1150 1182 1166 1151 1111 1070 1030 990 980 970 960 949 981 1012 996 980 971 962 1000 1038 1061 1084 1060 1036 1069 1101 1134 1167 1060 953 957 961 1029 1096 1053
-852 1053 1010 1092 1174 1178 1181 1162 1143 1231 1129 1140 1152 1152 1152 1152 1152 1153 1153 1120 1086 1101 1115 1112 1110 1186 1263 1149 1036 1033 1031 980 929 957 985 1019 1053 1087 1121 1136 1150
-858 1150 1165 1180 1131 1083 1113 1144 1062 980 1041 1102 1080 1059 1038 1016 1012 1007 1070 1133 1219 1116 1119 1122 1077 1032 1065 1099 1079 1058 1085 1112 1118 1124 1082 1041 1073 1105 1137
-864 1137 1168 1158 1147 1137 1126 1091 1056 1021 986 1027 1068 1029 991 997 1004 1010 1017 1019 1022 1025 1028 1028 1027 1027 1027 1080 1134 1139 1145 1161 1177 1192 1208 1064 920 950 980 983 986 1069 1151
-870 1151 1267 1383 1261 1140 1115 1091 1082 978 934 1048 1074 1004 959 915 975 1035 1028 1022 1016 1009 1010 1011 1011 1012 1027 1041 1050 1059 1078 1003 856 931 1023 1115 1231 1188
-875 1188 1111 1034 1026 1113 1188 1105 1122 1045 1126 1207 1108 1008 962 916 1012 1108 1119 1129 1234 1181 1123 1160 1181 1203 1145 1087 1093 1003 1034 1223 1175 1126 1102 1077
-880 1077 1053 1028 1120 1213 1194 1176 1151 1127 1102 1078 1178 1278 1235 1192 1174 1156 1091 1025 1074 1122 1059 996 997 998 1109 1221 1142 1063 1095 1126 1170 1214 1178
-885A178l5l5l6J3J2k9k9J8J8L2L1P3q5m9n0P7P7k4j19K9J24r2KL5L4PPN4m0rj04o2L3K2K2
-891A100k5P0j9k0j3j3l4l3R9Mj7j7j1J48J02n6l6l6q4q4l6l6M4M3LKk5O9o8o9J17K3N0m4
-896A098o6o5k0P5O0l6k9O6Q4Q5k5j19j09j3M3M4n3M3Q4p4j28l3P8J73O6r1n0M5llLLJJo9
-901A066o8nJ53J06n3n1n2J8J8l5l4j33K5J41j8j18L9K1K0J0q4j03rk4P1J39q2q6J35J03n5
-906A055q5J0O1O2M2n3K4K5J2J07p0p1J5J5j1j1n8n8l3l3mlL6J32L5j24j7J41L6L7l6j31r0
-911I57OJ32L8N9N9j63mj4j4rrM2J38R5Jj9j8j14j14JR6rj04p2J49J65n6j07j3j29l5L5L5
-916A005j3Q2K2J18k4k4j8j8j19j19J34L9J13J9p7p6KKN5N6j31l5N4J48Q2p6k09j14P2P2N8
-921A080l6k6O9l8l7k6k6N3N3l9l9L9M0K5K5l5O1L0o5p9p9n5M1O7O6J%n3n2N3m2J1J2L1L2
$$ plain form
-885 1178 1143 1108 1072 1085 1097 1068 1039 1057 1075 1107 1138 1211 1126 1077 1027 1104 1181 1157 1038 1067 1191 1099 1101 1136 1170 1177 1184 1238 1198 1189 1085 1023 1056 1078 1100
-891 1100 1075 1145 1126 1106 1093 1080 1046 1013 1112 1116 1099 1082 1071 1219 1321 1265 1229 1193 1109 1025 989 953 997 1040 1043 1045 1020 1089 1021 952 1069 1092 1142 1098
-896 1098 1032 967 947 1022 1082 1046 1017 1083 1167 1252 1227 1108 999 986 1029 1073 1020 1063 1147 1073 945 912 990 1163 1229 1138 1088 1133 1130 1127 1130 1133 1134 1135 1066
-901 1066 998 993 1146 1252 1199 1148 1096 1114 1132 1097 1063 930 955 1096 1078 960 999 1020 1040 1050 966 863 854 830 901 1040 958 872 1007 1110 1055
-906 1055 970 980 1041 1103 1145 1092 1116 1141 1153 1260 1190 1119 1134 1149 1138 1127 1069 1011 978 945 941 938 974 1106 1141 1017 1000 1141 1177 1214 1178 1047 957
-911 957 963 1095 1133 1192 1251 1088 1084 1070 1056 1047 1038 1080 1218 1313 1314 1295 1277 1163 1049 1050 1146 1137 1033 961 1110 1275 1219 1112 1099 970 935 970 1005
-916 1005 992 1074 1096 1214 1190 1166 1148 1130 1011 892 1026 1065 1178 1197 1120 1044 1046 1048 1103 1159 1028 993 1047 1195 1277 1201 992 878 950 1022 1080
-921 1080 1044 1018 1087 1049 1012 986 960 1013 1066 1027 988 1027 1067 1092 1117 1082 1143 1173 1108 1029 950 895 936 1003 1069 1070 1070 1017 965 1018 976 987 999 1030 1062
-926A062j1j0n7L9J53oj5j5r2r3j45M4Q0Q0N6N6QRN4N5L1L1j7j8o4o5R7R8J2J2l6j31j11P9
-931A170J05J1o7o6n1n1r2LkJ87J15p6j6j6p5p5L9L9qqOOp3p2O8O9O8O9j5j5o3o3N4N4L0L0
-937A219n6n5K3K4L0L0L0L0m0l9q7q6N2N3k6k7kjn0m9P3P3K6K6o9o8k1k1Q2Q2r2r2N6N7k3
-942A062k2n0n1K9K9P8P8kjK0K1k7k6k2k2JKN7N6J0Rj05j06k5k6N1N1k8k8n6n6Q7Q6M0M0p1
-948A083p1R4R3R3R4n4n4j33j33O6O7m4N1qj66RQL4L4L3L4p7p7KKK3K2K2K2R8R9m4m5l1l1
-953A115J7J6L7L6j1j2r0r1j1j2Q7Q6K9K9oj65j23k8M3J37L3o1j%poM9M8M9M9r2r3J9J8k8
-958A060k9Q3Q3j02j02RRP1P0o6o6RJ04R9o1j81q7KR7M5M5N1N1k1k2p2Q5M3j15L2L1K0J9j8
-964A176j8j38J9M2M1JKJJP2P3p0p0m0l9L4L4N9l5o1o2L5L5L4L5J1J0l1l1o5L1Q7Q8m1m0q8
$$ plain form
-926 1062 1051 1041 984 1023 1176 1170 1155 1140 1048 955 810 854 934 1014 1070 1126 1134 1143 1197 1252 1283 1314 1297 1279 1215 1150 1247 1345 1357 1369 1333 1202 1091 1170
-931 1170 1275 1286 1219 1153 1102 1051 959 962 960 1147 1262 1186 1170 1154 1079 1004 1043 1082 1074 1066 1072 1078 1005 933 1001 1070 1138 1207 1192 1177 1114 1051 1105 1159 1189 1219
-937 1219 1163 1108 1131 1155 1185 1215 1245 1275 1235 1196 1109 1023 1075 1128 1102 1075 1073 1072 1022 973 1046 1119 1145 1171 1102 1034 1013 992 1074 1156 1064 972 1028 1085 1062
-942 1062 1040 990 939 968 997 1075 1153 1151 1150 1170 1191 1164 1138 1116 1094 1095 1097 1154 1210 1220 1229 1124 1018 993 967 1018 1069 1041 1013 957 901 988 1074 1114 1154 1083
-948 1083 1012 1106 1199 1292 1386 1332 1278 1145 1012 1078 1145 1101 1152 1144 978 987 995 1029 1063 1096 1130 1053 976 978 980 1003 1025 1047 1069 1167 1266 1222 1177 1146 1115
-953 1115 1132 1148 1185 1221 1210 1198 1108 1017 1006 994 1081 1167 1196 1225 1219 1054 931 903 946 1083 1116 1055 1054 1054 1047 1041 1090 1138 1187 1236 1144 1051 1070 1088 1060
-958 1060 1031 1114 1197 1095 993 1002 1011 1082 1152 1086 1020 1029 1133 1232 1171 990 903 905 1002 1047 1092 1143 1194 1173 1151 1079 1164 1207 1092 1124 1155 1175 1194 1176
-964 1176 1158 1020 1039 1081 1122 1123 1125 1126 1127 1199 1272 1202 1132 1092 1053 1087 1121 1180 1145 1084 1022 1057 1092 1126 1161 1172 1182 1151 1120 1055 1086 1173 1261 1220 1180 1092
-969A092Pk0P5J23K8m3j38l3l4q8P0K8K8l7l7NMQ4j2l1l1o3L1N7N7K6K6j38m3J5J4l9N6J12
-974A151J8J9p6m8m8M6M7J1j48m8m8r3O6k3k3R6R7j06j0R6%PJ01o4o3K1K1o5o4j2j1O6J61
-979A074K8K8m4m5L5L5J7J6l0l1q9r0j1j0j4j3L4L4NOJ37q6p9J6K7K8j2j2j2j1LLJ71J3q7
-985A034q7qQ7N4N3l0j24O7O7J3J4k4k4K4K3M5M5l3l4j5j5o3o3j6j7j6j7rqrrJ68J68l8l9
-990A164k6k6j33N7m8m8J1J2K6K6k1k2k7k7K0K0L8L9L9L9K3K2p6p6j21P0M1M2m5m4L4L5m4
-995I74m3j03Q7O2O2P3P4l7l7J0J1k9l0k9k9O9O8j05j05K0J9k7k8M2M1o9o9P7P6o5o6K0J9
-1000I33K0J9J1J1J1J0O6O6O7O6m7m6m7m6n8n9Q4Q5K2K3k5k5m0m0QQL1L1L1L2m6m6R0R1kr8
-1006A191m4m3M8M8q9q8o1L5o6o7L9L8R2lk7k8l3l3R3R3J5J4o8o8M7J42M6m9j01j01L3L2k1
$$ plain form
-969 1092 1099 1079 1154 1277 1305 1262 1124 1091 1057 969 1039 1067 1095 1058 1021 1026 1030 1114 1102 1071 1040 977 1008 1065 1122 1148 1174 1036 993 1008 1022 983 1039 1151
-974 1151 1169 1188 1112 1064 1016 1062 1109 1120 972 924 876 783 849 826 803 899 996 890 880 976 976 983 1084 1020 957 978 999 934 870 858 847 913 1074
-979 1074 1102 1130 1086 1041 1076 1111 1128 1144 1114 1083 994 904 893 883 869 856 890 924 929 935 1072 986 907 923 950 978 966 954 942 931 934 937 1108 1121 1034
-985 1034 947 939 1026 1080 1133 1103 979 1046 1113 1126 1140 1116 1092 1116 1139 1184 1229 1196 1162 1147 1132 1069 1006 990 973 957 940 931 923 914 905 1073 1241 1203 1164
-990 1164 1138 1112 979 1036 988 940 951 963 989 1015 994 972 945 918 938 958 996 1035 1074 1113 1136 1158 1082 1006 885 955 996 1038 993 949 983 1018 974
-995 974 931 828 915 977 1039 1112 1186 1149 1112 1122 1133 1104 1074 1045 1016 1085 1153 1048 943 963 982 955 927 969 1010 941 872 949 1025 960 894 914 933
-1000 933 953 972 983 994 1005 1015 1081 1147 1214 1280 1233 1187 1140 1094 1036 977 1061 1146 1168 1191 1166 1141 1101 1061 1069 1077 1108 1139 1170 1202 1156 1110 1200 1291 1289 1191
-1006 1191 1147 1104 1152 1200 1111 1023 962 997 931 864 903 941 1033 1030 1003 975 942 909 1002 1095 1110 1124 1056 988 1035 1177 1223 1174 1073 972 1005 1037 1016
-1011A016P3J6J5n8n8K2K1k6k6J6J5l2l1J5J5R4R4J4J4j1j07o5o5j2j07JR6R0nk5k5k5k5R
-1016I33J05J04J0r4r4m3N3Q0Q0L4o0n4M1M4n0j05N4OOM4M5N0m5%jn9L5L6L7l7l7M0L9J4q1
-1021A130p8p8n9L7K1K1K1K1J1q3l6l6J04J0j6j7O0O0m4m5l5O0N4N4j05j05L1L2L7n8J07J07
-1026A183k7k7M2M3qj65p6J8p4K1Q3Q4nnj38m2J41J41r0r0j4j3M0M0k9O6j0j1qqq2q1r1MJ14
-1031I26K0N3N4%%j8j7K4K4J09J4o9o9n2M3N9N9P2q7j22J00NNk2k2o9K6J05J0o7o7L2L2J0
-1037A101q5K6K5q1P7L0j29J0RM8M7K9L0j8j8J9K0j8j8j09M9R3lJ3J2j17M2J08n0j50j51O
-1041H47J01J01Pp2p1OJ00M1n5J1q4n1n0N4J49J36k3r2LM2M2l1l1l6l7M3M3kkK1K2l1l1l2
-1047A038l1L1L0m9m8n1n0MJ95O5j25j25O5J34n7p0K4KKp2p2O8O7K0K0j7j7OPQQQ7Q7J7J6
$$ plain form
-1011 1016 1089 1105 1120 1062 1004 1026 1047 1021 995 1011 1026 994 963 978 993 1087 1181 1195 1209 1198 1091 1026 961 949 842 843 939 1029 1024 999 974 949 924 933
-1016 933 1038 1142 1152 1058 964 921 974 1054 1134 1168 1108 1054 1095 1139 1089 984 1038 1044 1050 1094 1139 1189 1144 1144 1143 1084 1119 1155 1192 1155 1118 1158 1197 1211 1130
-1021 1130 1052 974 915 952 973 994 1015 1036 1047 964 928 892 996 1006 990 973 1033 1093 1049 1004 969 1029 1083 1137 1032 927 958 990 1027 969 1076 1183
-1026 1183 1156 1129 1171 1214 1206 1041 965 983 909 930 1013 1097 1092 1087 949 907 1048 1189 1099 1009 995 982 1022 1062 1033 1099 1089 1078 1070 1062 980 899 808 812 926
-1031 926 946 999 1053 1053 1053 1035 1018 1042 1066 1175 1189 1120 1051 999 1042 1101 1160 1232 1145 1023 1123 1128 1133 1111 1089 1020 1046 1151 1161 1094 1027 1059 1091 1101
-1037 1101 1016 1042 1067 986 1063 1093 964 974 983 1031 1078 1107 1137 1119 1101 1120 1140 1122 1104 995 1044 1137 1134 1147 1159 1042 1084 1192 1142 992 841 847
-1041 847 948 1049 1056 984 913 919 1019 1060 1005 1016 932 881 831 885 1034 1170 1147 1055 1058 1100 1142 1111 1080 1044 1007 1050 1093 1091 1089 1110 1132 1101 1070 1038
-1047 1038 1007 1038 1068 1019 971 920 870 874 1069 1134 1009 884 949 1083 1026 956 980 982 984 912 840 908 975 995 1015 998 981 987 994 1002 1010 1097 1184 1201 1217
-1052A217j3k03o4L0N6N6j38N1Q3j3J9J13q9q9K5K5M9M9q0q0L0L1L6L6m3m3J8J8o1o0l6l6
-1057H94M3M3l7l8J49m1K5K5L8L7QQQQq0q0k6k7M2J37N9j30l5J55L2j58q9q8P3P4j3j3L3J27
-1062A163J08q2j40m4P6j9opK7K7k1k0M0M0nj00j42M8M7M6M2M1j00j01J0J0J1J0NNJ1J1OJ02
-1067A099K02J2o3o2p5p4K8K9n1n1QQQPq2q2O0O0J3J2p3p3R7Jn8J32O4l2m5m5M1M1poJ7J7
-1073A077p2K3k2J68Rq6L2L1n4n3O8O8nnr7lN8j33m1N4k8O6Q1j08N3N2llq3q2m8m9O3O2M9
-1078A039M8o2o2L0L1O7O6O9j22j4j5K5K5K5K5r6r6J5J5JJO1j29L1L2r3R8N3m2p1K4l4O1J4
-1083A020J4l2l1M8M7ONp4p4K9K9j9j8p4p4l8J51N6N7p5p4L6L7j1j1O2O2j7j7k8k9J9J8M7
-1088A047M6jjn1n2n1n2k1k2Q9Q9o4o5J5J5O6O7m5m4jjj%nmmnl4l4J4J3M6M5jkl7l6l7l6P
$$ plain form
-1052 1217 1204 1001 937 967 1023 1079 941 992 1075 1062 1081 1194 1105 1016 1041 1066 1115 1164 1084 1004 1034 1065 1101 1137 1094 1051 1069 1087 1026 966 930 894
-1057 894 937 980 943 905 1054 1013 1038 1063 1101 1138 1146 1154 1162 1170 1090 1010 984 957 999 1136 1195 1065 1030 1185 1217 1059 970 882 955 1029 1016 1003 1036 1163
-1062 1163 1271 1189 1049 1005 1081 1062 1056 1049 1076 1103 1082 1062 1102 1142 1137 1037 895 943 990 1036 1078 1119 1019 918 928 938 949 959 964 969 980 991 997 1099
-1067 1099 1301 1313 1250 1188 1113 1039 1067 1096 1045 994 1002 1010 1018 1025 943 861 921 981 994 1006 933 860 957 958 900 1032 1096 1064 1019 974 1015 1056 1049 1043 1060 1077
-1073 1077 1005 1028 1006 1174 1183 1097 1129 1160 1106 1053 1121 1189 1184 1179 1082 1079 1137 1004 963 1017 989 1055 1136 1028 1081 1133 1130 1127 1044 962 914 865 928 990 1039
-1078 1039 1087 1025 963 993 1024 1091 1157 1226 1104 1090 1075 1100 1125 1150 1175 1079 983 998 1013 1014 1015 1076 947 978 1010 917 1015 1068 1026 955 979 945 1006 1020
-1083 1020 1034 1002 971 1019 1066 1072 1077 1003 929 958 987 968 950 876 802 764 915 971 1028 953 879 915 952 941 930 992 1054 1037 1020 992 963 982 1000 1047
-1088 1047 1093 1092 1091 1040 988 937 885 864 842 931 1020 956 891 906 921 987 1054 1009 965 964 963 962 962 957 953 949 944 910 876 890 903 949 994 993 991 954 918 881 845 852
-1095H52PJ18J18M2M3nnj3j4j3j4r6r7M0M0N1m5j03Q6J11J6KKo5o4M6M7K6K7n3n2O2O3q0p9
-1100A001Q4Q5k7k6m7m7J%q9q9j1j0O0O1O0O0J3J2J3J3llM5M4q0q0l2l3%j%jK4K4n5n5N9N9
-1106A029j16j15N7N6J0RM8M7%%k6k7K1K1J8J7J8J7J5J4l2l3o2o1M9M9O5O5j4j4N8N8J0J0
-1111A261p2p3k5k6L6L5p0p0p1K3J7j41Q7J82JKnj00JJ59j5j10m7m7n3n2R0Q9kkkjQRN7N6
-1116A129p2p2PQk6k5k6k5L2L2j6j5J4J4J5J4j7j8L1L0k3k3K4K5m5m5m4m5P4P4nnMMLMj9j9
-1122I53K9K9l0k9J14J13qqn6n6m0m1l0l1j0J49N9l5lr7l3O1J29k9m5m4llllp5p5J30J31J7
-1128A127J8n6n5m7M8Q4p5k5k4J2J3O9P0p4p3k6k5K1K2j4j4L4L4m6m5KKKKm6m5KKm6m5j8j8
-1133G47L0K9pqJ04J03k0k0k1k0O3O2q0q0M7M7M7M6Q4Q3n9n9n4n4K5K5O9P0m1m2k6k6k1k0
$$ plain form
-1095 852 859 977 1095 1137 1180 1175 1170 1157 1143 1130 1116 1020 923 963 1003 1054 1009 906 992 1103 1119 1121 1123 1058 994 1040 1087 1113 1140 1087 1035 1097 1160 1080 1001
-1100 1001 1085 1170 1143 1117 1070 1023 1024 1024 935 846 835 825 885 946 1006 1066 1079 1091 1104 1117 1114 1111 1156 1200 1120 1040 1008 975 975 974 974 973 997 1021 966 911 970 1029
-1106 1029 913 798 855 911 921 930 978 1025 1025 1025 999 972 993 1014 1032 1049 1067 1084 1099 1113 1081 1048 986 925 974 1023 1088 1153 1139 1125 1183 1241 1251 1261
-1111 1261 1189 1116 1091 1065 1101 1136 1066 996 925 948 965 824 911 1093 1094 1096 1091 991 992 1151 1136 1026 979 932 879 827 917 1006 1004 1002 1000 999 1007 1016 1073 1129
-1116 1129 1057 985 992 1000 974 949 923 898 930 962 946 931 945 959 974 988 971 953 984 1014 991 968 992 1017 972 927 883 838 912 986 981 976 980 984 987 991 972 953
-1122 953 982 1011 981 952 1066 1179 1171 1163 1107 1051 1011 970 940 909 899 1048 1107 1072 1069 972 939 1000 1129 1100 1055 1011 1008 1005 1002 999 924 849 979 1110 1127
-1128 1127 1145 1089 1034 987 1035 1119 1044 1019 995 1007 1020 1089 1159 1085 1012 986 961 982 1004 990 976 1010 1044 998 953 955 957 959 961 915 870 872 874 828 783 765 747
-1133 747 777 806 799 791 895 998 978 958 937 917 980 1042 962 882 929 976 1023 1069 1153 1236 1177 1118 1064 1010 1035 1060 1129 1199 1158 1116 1090 1064 1043 1023
-1138A023k00j05M7K06J02PrrK4K4Qq6k4J35p1p0k1k0o8o8J18J17OOj0j0j0j0j15j15N9O0
-1143I21l2l1l1l2M8M8M8M7N8N8kjP8j11n2n2k5k4Q6Q7M2M2l8l7KLKKK3K3q7q8J2J2O0O0l0
-1149A089k9k9l0L3L3L3L2k7k8k7k8q3q4R1R0J9J9k8k8LLj03Q6O1O2j4k03MJ93l5l6j9j9o6
-1154I35o6L4L4L4L4KLm5m5K6K6L8L8JJ92L7L7j48j48l7l7M5M6l4l4m5m5m5m5J15J14O7O7
-1159A151n1n0llm0m0P1P1qrqrp6p7O5O6n9o0K0K0o6o7j8j9L2L2L2L2K1K0O8O8k6k5k6k5m1
-1165I63m0PPL0L0j8j8K4K4K3K4J3J2J3J3k3k3L6j22j64J20Q7p1J4J5NNK7K7k0k0J3J2l5l5
-1170I55j0j1L7L7N5N5k4k5o6o7j9j9j7j7J26J25J5J6o3o4l7l7J1J1K5K5K5K5J6J5l2l2J5
-1175A049J6J6J5j5j5R6R5J7J6o3o3j00j00L6L6j4j08j42Q0J01n7o1L5J40M5o0L6n0n0J98
$$ plain form
-1138 1023 823 718 765 971 1073 1080 1071 1062 1086 1110 1118 1032 1008 1143 1072 1002 981 961 893 825 943 1060 1066 1072 1062 1052 1042 1032 917 802 861 921
-1143 921 889 858 827 795 843 891 939 986 1044 1102 1100 1099 1177 1066 1014 962 937 913 999 1086 1128 1170 1132 1095 1097 1100 1102 1104 1127 1150 1063 975 987 999 1059 1119 1089
-1149 1089 1060 1031 1001 1034 1067 1100 1132 1105 1077 1050 1022 939 855 946 1036 1055 1074 1046 1018 1021 1024 921 1007 1068 1130 1116 913 917 1110 1075 1039 1020 1001 935
-1154 935 869 903 937 971 1005 1007 1010 965 920 946 972 1010 1048 1049 1241 1278 1315 1167 1019 982 945 990 1036 1002 968 923 878 833 788 903 1017 1084 1151
-1159 1151 1100 1050 1047 1044 1004 964 1035 1106 1098 1089 1081 1072 996 919 984 1050 991 931 951 971 905 838 820 801 833 865 897 929 950 970 1038 1106 1080 1055 1029 1004 963
-1165 963 923 930 937 967 997 979 961 985 1009 1032 1056 1069 1081 1094 1107 1084 1061 1097 975 811 931 1018 947 961 976 981 986 1013 1040 1020 1000 1013 1025 990 955
-1170 955 945 934 971 1008 1063 1118 1094 1069 1003 936 917 898 881 864 990 1115 1130 1146 1083 1019 982 945 956 967 992 1017 1042 1067 1083 1098 1066 1034 1049
-1175 1049 1065 1081 1096 1081 1066 1162 1257 1274 1290 1227 1164 1064 964 1000 1036 1022 914 772 852 953 896 835 870 1010 1055 995 1031 981 931 1129
-1180A129k4p9J6o8K8P6q2J3J3qqL9M0l9l8R8R7j6j12r8R2O6j24q4q4R8R9J9K0j5j4o2o2k3
-1185I03k3K4K4O8O9m2m3l0l0k5k4O6J60P2j18N4N5l7l6jjjjk8k8k8k8M0M0M1M0j7j7o4o4
-1190I70l3l4P7P8LMp5p5n0n0O2O1K2K2k6k6K6K6k2k1m8m7%jL9L8L9L8M6M6O4l1j59L0K8K9
-1196A050m7m6l5l4o4J27K0K0j7j7j6j7M9N0KKm7m7J9p7j11P9M5M5N4N3k6k6M3M3l6l6m0m1
-1201I21J85J85k4k13j07j07Q9Q9q5q5L3L4L4L3M0M0J00r1n2n2r2R8M8M7n1n2j1j1L7L6m3
-1206I73m4m3m4k6k7q6J04J51J50j2j2L0L1m9m8j8j7j8j7k9l0k9k9J92J92j09j09pqqqJ13
-1211A109J14r3r2m8m8j%Q7Q8QRJ1J1l6l6l7l7l7l8l4l4J3J3Q6Q5k5k6J1J2l7l6J5J4J5J4
-1216A020j2j2j2j2PPPPN1N0r2r1nmM3M3r8r7J3J3R5R4M6M7m6m6L8L9r6kJ9J8M0n5j3Q1j7
$$ plain form
-1180 1129 1105 1026 1042 974 1002 1078 996 1009 1022 1014 1006 1045 1085 1046 1008 1106 1203 1187 1075 977 1069 1135 1011 927 843 941 1040 1059 1079 1064 1050 988 926 903
-1185 903 880 904 928 996 1065 1023 980 950 920 895 871 937 1097 1169 1051 1105 1160 1123 1087 1086 1085 1084 1083 1055 1027 999 971 1011 1051 1092 1132 1115 1098 1034 970
-1190 970 937 903 980 1058 1061 1065 990 915 865 815 877 938 960 982 956 930 956 982 960 939 891 844 844 843 882 920 959 997 1043 1089 1153 1122 963 993 1021 1050
-1196 1050 1003 957 922 888 824 951 971 991 974 957 941 924 973 1023 1025 1027 980 933 952 875 764 843 888 933 987 1040 1014 988 1031 1074 1038 1002 962 921
-1201 921 1106 1291 1267 1054 947 840 929 1018 933 848 881 915 949 982 1022 1062 1162 1071 1019 967 875 973 1021 1068 1017 965 954 943 980 1016 973
-1206 973 929 886 842 816 789 703 807 958 1108 1096 1084 1114 1145 1096 1048 1030 1013 995 978 949 919 890 861 1053 1245 1136 1027 1020 1012 1004 996 1109
-1211 1109 1223 1130 1038 990 942 941 941 1028 1116 1124 1133 1144 1155 1119 1083 1046 1009 972 934 900 866 879 892 978 1063 1038 1012 1023 1035 998 962 977 991 1006 1020
-1216 1020 1008 996 984 972 979 986 993 1000 1051 1101 1009 918 913 909 952 995 897 800 813 826 921 1015 1061 1108 1062 1016 1054 1093 997 995 1014 1032 1072 1017 1004 1085 1068
-1221A068j12j08N0J72n0m7m8o5R4N8l7J%n9L7mlQ2Q1r5r5J5J6K7K7j4j5k1P3P4k1o8o8j6
-1227I29P8J8J7K3K3RJ0p6p6M9m6m5J14Q1p7K2K1n1n2j41J8J32J33R9n9o8R1j4j3m3j37m3
-1232I26m3N5m1m0N4j6j6L7L7J5J4r2KJ15K0j6j10R8LLR8j9P5M0n5n9L7k2k3m1m1l6l5k0P6
-1237I80P5j9K3K3J8J7o1o1j14j9J59J60j04j04J4J3J02n6k0k0l6O0j8j8j2j2j2j2j8P6P6
-1242A080P6r2r2L7L7o8o8L7J32L1L1q3q2KLJ0J05J06J0q1q0q7q6O1O2m9m9K9K9n1n0J0J0
-1247H80kR3N6l8K1K1o3o3J11J11O4O4j58o2j14j9J03Rm9M6K8K8Rq7k7k8k9O5O5l0J5J5LL
-1252A041K5p1N7N6o3j58q9O9Q8qRQO2O2P2q7j06j06j58%J22J22Q1j4q4J1Or0L7L7o4R5K4
-1257I86p1j14k0J05Rp0K5J22K7j9j9OJ01M7M7K2K2j20j20K1K1n9n8R4R4M6M6p6p7L5L4l4
$$ plain form
-1221 1068 956 848 898 1070 1020 973 925 860 954 1012 975 976 976 917 954 950 947 1029 1110 1015 920 935 951 978 1005 991 976 955 1028 1102 1081 1013 945 929
-1227 929 1007 1025 1042 1065 1088 1097 1107 1031 955 1004 958 913 1027 1108 1031 1053 1074 1023 971 830 848 980 1113 1212 1153 1085 1176 1162 1149 1106 969 926
-1232 926 883 938 897 857 911 895 879 916 953 968 982 890 892 1007 1027 1011 901 999 1002 1005 1103 1084 1159 1199 1144 1085 1122 1100 1077 1036 995 959 924 904 980
-1237 980 1055 1036 1059 1082 1100 1117 1056 995 881 862 1021 1181 1077 973 987 1000 1102 1046 1026 1006 970 1030 1012 994 982 970 958 946 928 1004 1080
-1242 1080 1156 1064 972 1009 1046 978 910 947 1079 1110 1141 1058 976 978 981 991 1096 1202 1212 1131 1051 964 878 939 1001 952 903 932 961 910 860 870 880
-1247 880 878 971 1027 989 1010 1031 968 905 1016 1127 1191 1255 1097 1035 921 902 1005 1014 965 1011 1039 1067 1076 989 962 934 905 970 1035 1005 1020 1035 1038 1041
-1252 1041 1066 995 1052 1108 1045 887 798 867 955 947 956 964 1026 1088 1160 1073 967 861 703 703 825 947 1028 1014 930 941 947 857 894 931 867 962 986
-1257 986 915 801 781 886 895 825 850 972 999 980 961 967 1068 1115 1162 1184 1206 1086 966 987 1008 949 891 985 1079 1125 1171 1095 1018 1053 1087 1053
-1262A053l4j45j45%%J12J11ppppK5K6n4n3k3k2J20J19k9k9l0k9P1P1qrq6q6q6q7Q4Q4Q3Q4
-1267A060MLMLrrL8L8j8j8l2j27j36N4J65k6l7N8jr6k7k6L5L5J27o3n7L7rrllQ3Q3L5L6j4
-1273A178j4r3r3K4K4P1P1n6n7rrL7L7j0j0QRmmO2j29o9K6j08j3N6N6J5J10J62k6n1n1J7J6
-1278A173o3o4J6J5q6q6N6N6O1O2q2q1QQRQn2n2m1m0m2J49M1M1L4L3m6m5K2K3n7n6j5j5o3
-1283H29o2K5K4m2m3K5K15K9K8l9m0M0M0ooM1M2J3J3jr6j50M1R8Kj27l2N0N1L2L2L1L2J9J9
-1289A127k8k9ONNNj00j00J1J0O6O6J9J8klklk9l0J8J9k5k5K3K3m4m5m4m4M1M1M2M1J1J0J1
-1294A065J1j27j26r9K18J18J18P7j14j62o7J23o7o9K6J84nl8N7Lr1j38m3j4Q2k0k1j5j4n0
-1299H02n1K9K9K9L0K9K9J0J1J0J1N3N3N3N4n5n4j02j02N6N6N6N7j02j02J03J04KJJKo7o7
$$ plain form
-1262 1053 1019 874 729 729 729 841 952 945 938 931 924 949 975 921 868 845 823 943 1062 1033 1004 974 945 1016 1087 1079 1070 984 898 812 725 809 893 976 1060
-1267 1060 1064 1067 1071 1074 1065 1056 1094 1132 1114 1096 1064 937 801 855 1020 994 957 1015 1014 918 891 865 900 935 1062 999 942 979 970 961 958 955 1038 1121 1156 1192 1178
-1273 1178 1164 1071 978 1002 1026 1097 1168 1112 1055 1046 1037 1074 1111 1101 1091 1099 1108 1104 1100 1162 1033 964 990 882 869 925 981 996 1106 1268 1242 1191 1140 1157 1173
-1278 1173 1110 1046 1062 1077 991 905 961 1017 1078 1140 1058 977 985 993 1002 1010 958 906 865 825 783 932 973 1014 1048 1081 1035 990 1012 1035 978 922 907 892 829
-1283 829 767 792 816 774 731 756 971 1000 1028 989 949 989 1029 1023 1017 1058 1100 1113 1126 1125 1029 879 920 1018 1020 893 861 911 962 994 1026 1057 1089 1108 1127
-1289 1127 1099 1070 1076 1081 1086 1091 991 891 902 912 978 1044 1063 1081 1079 1076 1074 1071 1042 1012 1030 1049 1024 999 1022 1045 1001 956 912 868 909 950 992 1033 1044 1054 1065
-1294 1065 1076 949 823 724 942 1060 1178 1255 1141 979 912 1035 968 899 925 1109 1104 1066 1123 1126 1035 897 854 840 922 902 881 866 852 802
-1299 802 751 780 809 838 868 897 926 936 947 957 968 1021 1074 1127 1181 1126 1072 970 868 924 980 1036 1093 991 889 992 1096 1098 1099 1100 1102 1035 968
-1304I68J3J2k4k5K4K3J7J7l0J28M2n4j61o5J10J6K7K7m9m9kkl3l4M6M6%JM8M8K6K6k1k1l5
-1309A060l5q3q2J10J10J11J10r4r3m6m6l6l6l6l6N1N1MLN4N4n3j48n5J67Q4Q3m6m6m6m6K5
-1314A014K5k2k3N2N2k8k7M5M6r7r7P1P0Q6rj09M9m6m6m8m9R5R4o3o3n3n3JJ59m2m1LMLLL0
-1320I86L0j8j8P8P8jjr8r8L4L5J35k3J9J9p6p6LLj1j0r0q9P5P5lmKLKKr9j00J1J2rrj9J40
-1326H90K4K5p6p6k6k5N3N4M1M2M1M2J1J0J1J0J4J3l3l4JJJJ%Jj6j11j03N6O1l4NMjjm1m0
-1332G95P0P0O3O3Q3j39j34m0MML8L7Q5Q5O7O7j08j07K0K1K0K0n3n3non6n6Q6qq0P8L0L1J0
-1337A002Rr1r1l7J22L2L2RQN6N7l7l6l7l6M9M8JKk7k7k7k7j1j1j1j1J1J2o7o8P7P7kkm2m1
-1343H65m1m1RRRRN1N1N0N1l0l1M9M9o0n9j2j2K5K5K4K5NNN2N3q1q1O1O1n8n8j06j06onoo
$$ plain form
-1304 968 981 993 969 944 968 991 1008 1025 995 1123 1165 1111 950 885 995 1011 1038 1065 1016 967 965 963 930 896 942 988 988 989 1037 1085 1111 1137 1116 1095 1060
-1309 1060 1025 942 860 970 1080 1191 1301 1207 1114 1068 1022 986 950 914 878 929 980 984 987 1041 1095 1042 894 839 1006 1090 1173 1127 1081 1035 989 1014
-1314 1014 1039 1017 994 1046 1098 1070 1043 1088 1134 1037 940 1011 1081 1167 1158 1049 1098 1052 1006 958 909 1004 1098 1035 972 919 866 867 1026 984 943 946 950 953 956 986
-1320 986 1016 998 980 1058 1136 1135 1134 1036 938 972 1007 1142 1119 1138 1157 1081 1005 1008 1011 1000 990 900 811 886 961 958 954 956 959 961 963 864 764 775 787 778 769 750 890
-1326 890 914 939 863 787 761 736 789 843 884 926 967 1009 1020 1030 1041 1051 1065 1078 1045 1011 1012 1013 1014 1015 1015 1016 1000 889 786 842 903 869 874 878 877 876 835 795
-1332 795 865 935 998 1061 1144 1005 871 831 835 839 877 914 999 1084 1151 1218 1110 1003 1023 1044 1064 1084 1031 978 973 967 911 855 941 933 853 931 961 992 1002
-1337 1002 1011 920 829 792 914 946 978 987 995 1051 1108 1071 1035 998 962 1011 1059 1060 1062 1035 1008 981 954 943 932 921 910 921 933 866 798 875 952 950 948 906 865
-1343 865 824 783 792 801 810 819 870 921 971 1022 992 961 1010 1059 999 940 928 916 941 966 990 1015 1020 1025 1077 1130 1049 968 1029 1090 1032 974 868 762 756 751 745 739
-1348G39J34J33K3K3m9n0m9m9K3K3K3K3j4j3j4j4K1K1O9O8k0k1k0k1L9L9o2o3j67qJ39J40
-1353A046j6j6j5j6PPm0m1l9l8M0M1J4J5O2O2j09j08L3L4L0L1L0L1n9n9j2j1poM1M0n0n0k
-1359H70lk9k9J8J8onnoR5R4M1j17MNM2M2j2j3j2j3J3J3R1R2o9p0k2k2j9j9K3j36m0m0O1O1
-1364H96M0L9L9M0l8l8l8l8J5J4O2O2J8J8J8J9K1K1n2n2r4%R0o9o8K7J1J1j0j0rj0kkm9m9
-1370H33R5R5j6j5opooj6j6L1L1nmj1j1J15K0j2j70nnO5O4O1O0p2p2m9J09L1j29n1n0j4j3
-1375H49P8P9l2l2K2K2n7n6M8M8M8M9n7n6L2L2m0J17Q8pj19k4l6l5j1j0L7L7j9j9j9k0O8O8
-1380A073p5p4j5j6N4N4Q8p1J9J9j6j7M8m8j26L2L3j26o8K8J2J1P7P7P7P6L3L2j10j10M8M9
-1385A068r4r4N1N0k8k9l8l8M1M0L1L2M6j11j13j8kkL3L4j4j4L2L2j5j5L2L2L2L2O0N9O0O0
$$ plain form
-1348 739 873 1006 1029 1052 1003 953 904 855 878 901 924 947 933 920 906 892 913 934 1003 1071 1051 1030 1010 989 1028 1067 1005 942 775 767 906 1046
-1353 1046 1030 1014 999 983 990 997 957 916 877 839 879 920 934 949 1011 1073 964 856 889 923 953 984 1014 1045 986 927 915 904 897 891 932 972 922 872 870
-1359 870 867 838 809 827 845 839 834 829 823 918 1012 1053 936 940 945 987 1029 1017 1004 992 979 992 1005 1096 1188 1119 1049 1027 1005 986 967 990 854 814 774 835 896
-1364 896 936 975 1014 1054 1016 978 940 902 917 931 993 1055 1073 1091 1109 1128 1149 1170 1118 1066 972 972 1062 993 925 952 963 974 964 954 945 935 933 931 882 833
-1370 833 928 1023 1007 992 986 979 973 967 951 935 966 997 992 988 977 966 1081 1101 1089 919 914 909 974 1038 1099 1159 1087 1015 966 1075 1106 977 926 876 862 849
-1375 849 927 1006 974 942 964 986 929 873 921 969 1017 1066 1009 953 985 1017 977 1094 1182 1175 1056 1032 996 961 950 940 977 1014 995 976 957 937 1005 1073
-1380 1073 998 924 909 893 947 1001 1089 1018 1037 1056 1040 1023 1071 1023 897 929 962 836 768 796 808 819 896 973 1050 1126 1159 1191 1081 971 1019 1068
-1385 1068 974 880 931 981 953 924 886 848 889 929 960 992 1038 927 814 796 794 792 825 859 845 831 863 895 880 865 897 929 961 993 1053 1112 1172 1232
-1390A232j40j39LMQQQRNNNOn7n7n6n7OOONk5k6K2J17J47j2kkL5o0j02N6M9m5K3K4k6O9m3
-1396A009N1kr7q5P3R5%m4N2P3k2N7j00q9P0J8J9k9k8q1J3M4M4o0o1L2L2K7K6p3j68mml0k9
-1402G29q3J2Q9Q9j2Q4O1l3L1L2j21k6R0mr5JP8P7m3j38k1P4k5P1P7j9j8j9J7J7rj05j3j4
-1407H31J66RM9N0L2L2m7m8q6q7o1L4KKKR7k4k4J15J9o5o6l9N5k7O8k6k7QQQQO9O9P4k0j22
-1413A038j22p1K5Q0Q1k5k4j09j10L9L9O2J57J86l5j23k8m2j37j6j5K6K7N3N3NOn9n8j2j1
-1417H80N1N1N1N1o9o9J0J0l2l3J5J5M0L9j22j23l0J59N3N2j2j3r1r2P8P7l3l3R5R6O0j31
-1422A000j6j6k9k8P1P0j03j04M5M5M5M4r5r5P9P9k4k4k4k4L8L7m2m2R1R1J07q4Q5j05j0j0
-1427A052q7q6K5K4j4j4p4J17J7J8p0o9j06Q5N6N7O3O2m8m8j9j9J99Rj10j10j1j1L1L0q0q0
$$ plain form
-1390 1232 1092 953 956 960 968 976 984 993 998 1003 1008 1014 957 900 844 787 793 799 805 810 785 759 781 898 1045 1033 1031 1029 1064 1004 902 958 1007 962 985 1009 983 1052 1009
-1396 1009 1060 1058 961 876 949 1044 1044 1000 1052 1125 1103 1160 1060 971 1041 1059 1078 1049 1021 940 953 997 1041 981 920 952 984 1011 1037 964 796 792 788 758 729
-1402 729 646 658 747 836 824 908 969 936 967 999 878 852 942 938 843 844 922 999 956 818 797 871 846 917 994 975 957 938 955 972 963 858 845 831
-1407 831 997 1006 1055 1105 1137 1169 1122 1074 988 901 840 874 876 878 880 977 953 929 1044 1063 998 932 893 948 921 989 963 936 944 952 960 968 1037 1106 1180 1160 1038
-1413 1038 916 845 870 950 1031 1006 982 873 763 802 841 903 1060 1246 1211 1088 1060 1018 881 865 850 876 903 956 1009 1014 1020 961 903 891 880
-1417 880 931 982 1033 1084 1015 946 956 966 934 901 916 931 971 1010 888 765 735 894 947 999 987 974 883 791 869 946 913 880 975 1071 1131 1000
-1422 1000 984 968 939 911 982 1052 949 845 890 935 980 1024 929 834 913 992 968 944 920 896 934 971 929 887 978 1069 1176 1092 1177 1072 1062 1052
-1427 1052 965 879 904 928 914 900 826 943 960 978 908 839 733 818 874 931 994 1056 1008 960 941 922 1121 1130 1020 910 899 888 919 949 869 789
-1432G89J6J5J6J6L1L1P9P8klj45j45J6J6r1R9J9J9j6j7J7J6l1l1j6j5L2L3O7O7j2j2p2p1
-1437G93QPrrJ33J34qqqrJ4J4j61j60O2O2nnj30O1R6R6K8K9P6P6j06j06L6L7j6j6q2J4P1j19
-1443H90N1J47P0P0o6o7q3q2R1R1q9r0K1K1J5J4r8R1O6k9n5n4P6j13j14P7O9P0o1o1O0O0J3
-1448A001J3N7N6K1j69j5j4M5j45j26O5J20J20KJm5m6L0L1j7j7NNONJ9J8O6O5n5n5qqo8o7
-1453H96M3M4p2p2k5k4j6j6L2L2LLLLj0j0J01J01o6o6j9j8L0L1P9P8qpn5n6K6K6k1k1M6M6
-1458A041jjj3j4j3j3pqjkm8M7J06q4o5L0P0P0J6p9j44M6Q0j09l9l8K1K1K1K1M4M4o7o6l2
-1464H34l2M7M7k2k3N6N7k1k0R0R0p7p7KKl8l7q5q5j0j0oJ84L2L2M3M4j8j7j7j7nmnmN6N6
$$ plain form
-1432 789 805 820 836 852 883 914 993 1071 1069 1066 921 776 792 808 717 816 835 854 838 821 838 854 823 792 776 761 793 826 893 960 948 936 864 793
-1437 793 801 808 799 790 923 1057 1049 1041 1033 1024 1038 1052 891 731 793 855 850 845 715 776 872 968 996 1025 1101 1177 1071 965 1001 1038 1022 1006 924 938 1009 890
-1443 890 941 1088 1158 1228 1162 1095 1012 930 1021 1112 1023 933 954 975 990 1004 906 997 1063 1034 979 925 1001 888 774 851 920 990 929 868 928 988 1001
-1448 1001 1014 1071 1127 1148 979 964 950 995 850 724 789 909 1029 1031 1032 987 941 971 1002 985 968 973 978 984 989 1008 1026 1092 1157 1102 1047 1039 1031 963 896
-1453 896 939 983 911 839 814 790 774 758 790 822 825 828 831 834 824 814 915 1016 950 884 865 847 877 908 987 1065 1057 1050 995 939 965 991 970 949 995 1041
-1458 1041 1040 1039 1026 1012 999 986 979 971 970 968 920 967 1073 989 924 954 1024 1094 1110 1031 887 933 1013 904 865 827 848 869 890 911 955 999 932 866 834
-1464 834 802 849 896 874 851 907 964 943 923 1013 1103 1026 949 951 953 915 878 793 708 698 688 682 866 898 930 973 1017 999 982 965 948 943 939 934 930 986 1042
$$ [...]
##END=	
##END=	
##END=	
