##TITLE=	kmi-Antnracene-1.10.fid


##JCAMP-DX=	6.0	$$ MestReNova 14.1.1-24571
##DATA TYPE=	LINK
##BLOCK_ID=	1
##BLOCKS=	1    
##ORIGIN=	Mestrelab Research S.L.
##OWNER=	hrzepa
##$MNOVA/LINK_BLOCK_TYPE=	ITEM	$$ NMR Spectrum
##$MNOVA/ITEM/POLYGON=	(XY..XY)
5321,5787.81
8722,5787.81
8722,8160.81
5321,8160.81
5321,5787.81
##$MNOVA/ITEM/Z=	0
##$MNOVA/ITEM/ANGLE=	0
##TITLE=	kmi-Antnracene-1.10.fid
##JCAMP-DX=	6.0	$$ MestReNova 14.1.1-24571
##BLOCK_ID=	2
##DATA TYPE=	NMR SPECTRUM
##DATA CLASS=	XYDATA
##NUMDIM=	1
##ORIGIN=	Bruker BioSpin GmbH
##OWNER=	root
##.OBSERVE FREQUENCY=	500.13308850747802126
##.OBSERVE NUCLEUS=	^1H
##.SOLVENT NAME=	CDCl3
##.PULSE SEQUENCE=	zg30
##LONGDATE=	2022/03/10 11:09:00.000
##.ACQUISITIONMODE=	SIMULTANEOUS (DQD)
##$ORIGINAL FORMAT=	Bruker XWIN-NMR
##$MNOVA/SCALES_VERSION=	9
##$PARAMETER FILE=	(acqus, ASCII, /Users/hrzepa/Library/Mobile%20Documents/com~apple~CloudDocs/C2/Pure%20samples/kmi-Antnracene-1/anthracene/acqus, 0)
$$ ##TITLE= Parameter file, TOPSPIN		Version 3.2
$$ ##JCAMPDX= 5.0
$$ ##DATATYPE= Parameter Values
$$ ##NPOINTS= 11	$$ modification sequence number
$$ ##ORIGIN= Bruker BioSpin GmbH
$$ ##OWNER= root
$$ $$ 2022-03-10 11:09:26.639 +0900  root@CZC31189P3
$$ $$ C:/Users/root/Desktop/NMR/miyamoto/kmi-4-PhPy-1/10/acqus
$$ $$ process C:\Bruker\TopSpin3.2\prog\mod\shimcntl.exe
$$ ##$ACQT0= -2.52100840336134
$$ ##$AMP= (0..31)
$$ 100 100 100 100 100 100 100 100 100 100 100 100 100 100 100 100 100 100
$$ 100 100 100 100 100 100 100 100 100 100 100 100 100 100
$$ ##$AMPCOIL= (0..19)
$$ 0 0 0 0 0 0 0 0 0 0 0 0 0 0 0 0 0 0 0 0
$$ ##$ANAVPT= -1
$$ ##$AQSEQ= 0
$$ ##$AQ_mod= 3
$$ ##$AUNM= <au_zg>
$$ ##$AUTOPOS= <18 >
$$ ##$BF1= 500.13
$$ ##$BF2= 500.13
$$ ##$BF3= 500.13
$$ ##$BF4= 500.13
$$ ##$BF5= 500.13
$$ ##$BF6= 500.13
$$ ##$BF7= 500.13
$$ ##$BF8= 500.13
$$ ##$BYTORDA= 0
$$ ##$CAGPARS= (0..11)
$$ 0 0 0 0 0 0 0 0 0 0 0 0
$$ ##$CFDGTYP= 0
$$ ##$CFRGTYP= 9
$$ ##$CHEMSTR= <none>
$$ ##$CNST= (0..63)
$$ 1 1 1 1 1 1 1 1 1 1 1 1 1 1 1 1 1 1 1 1 1 1 1 1 1 1 1 1 1 1 1 1 1 1 1 1
$$ 1 1 1 1 1 1 1 1 1 1 1 1 1 1 1 1 1 1 1 1 1 1 1 1 1 1 1 1
$$ ##$CPDPRG= (0..8)
$$ <> <> <> <> <> <> <> <> <>
$$ ##$D= (0..63)
$$ 0 1 0 0 0 0 0 0 0 0 0 0 0 0 0 0 0.0002 0 0 0 0 0 0 0 0 0 0 0 0 0 0 0 0
$$ 0 0 0 0 0 0 0 0 0 0 0 0 0 0 0 0 0 0 0 0 0 0 0 0 0 0 0 0 0 0 0
$$ ##$DATE= 1646878165
$$ ##$DE= 6.5
$$ ##$DECBNUC= <off>
$$ ##$DECIM= 2000
$$ ##$DECNUC= <off>
$$ ##$DECSTAT= 4
$$ ##$DIGMOD= 1
$$ ##$DIGTYP= 12
$$ ##$DQDMODE= 0
$$ ##$DR= 22
$$ ##$DS= 2
$$ ##$DSPFIRM= 0
$$ ##$DSPFVS= 20
$$ ##$DTYPA= 0
$$ ##$EXP= <A.Proton>
$$ ##$F1LIST= <>
$$ ##$F2LIST= <>
$$ ##$F3LIST= <>
$$ ##$FCUCHAN= (0..9)
$$ 0 2 0 0 0 0 0 0 0 0
$$ ##$FL1= 90
$$ ##$FL2= 90
$$ ##$FL3= 90
$$ ##$FL4= 90
$$ ##$FOV= 20
$$ ##$FQ1LIST= <>
$$ ##$FQ2LIST= <>
$$ ##$FQ3LIST= <>
$$ ##$FQ4LIST= <>
$$ ##$FQ5LIST= <>
$$ ##$FQ6LIST= <>
$$ ##$FQ7LIST= <>
$$ ##$FQ8LIST= <>
$$ ##$FRQLO3= 23161.4925220013
$$ ##$FRQLO3N= 2
$$ ##$FS= (0..7)
$$ 83 83 83 83 83 83 83 83
$$ ##$FTLPGN= 0
$$ ##$FW= 125000
$$ [...]
$$ 130000 130000 130000 130000 130000 130000 130000 130000 130000 130000 130000
$$ 130000 130000 130000 130000 130000 130000 130000 130000 130000 130000 130000
$$ 130000 130000 130000 130000 130000 130000 130000 0 0 0 0 0 0 0 0 0 0 0
$$ 0 0 0 0 0 0 0 0 0 0 0 0 0
$$ ##$ShimPowMaxUC= (0..63)
$$ 130000 130000 130000 130000 130000 130000 130000 130000 130000 130000 130000
$$ 130000 130000 130000 130000 130000 130000 130000 130000 130000 130000 130000
$$ 130000 130000 130000 130000 130000 130000 130000 130000 130000 130000 130000
$$ 130000 130000 130000 130000 130000 130000 130000 0 0 0 0 0 0 0 0 0 0 0
$$ 0 0 0 0 0 0 0 0 0 0 0 0 0
$$ ##$ShimPowMaxUG= (0..63)
$$ 524287 524287 524287 524287 524287 524287 524287 524287 524287 524287 524287
$$ 524287 524287 524287 524287 524287 524287 524287 524287 524287 524287 524287
$$ 524287 524287 524287 524287 524287 524287 524287 524287 524287 524287 524287
$$ 524287 524287 524287 524287 524287 524287 0 0 0 0 0 0 0 0 0 0 0 0 0 0 0
$$ 0 0 0 0 0 0 0 0 0 0
$$ ##$ShimPowRcbType= 3
$$ ##$ShimPowRes= (0..63)
$$ 1e-020 1e-020 1e-020 1e-020 1e-020 1e-020 1e-020 1e-020 1e-020 1e-020 1e-020
$$ 1e-020 1e-020 1e-020 1e-020 1e-020 1e-020 1e-020 1e-020 1e-020 1e-020 1e-020
$$ 1e-020 1e-020 1e-020 1e-020 1e-020 1e-020 1e-020 1e-020 1e-020 1e-020 1e-020
$$ 1e-020 1e-020 1e-020 1e-020 1e-020 1e-020 1e-020 0 0 0 0 0 0 0 0 0 0 0
$$ 0 0 0 0 0 0 0 0 0 0 0 0 0
$$ ##$ShimPowRng0= (0..63)
$$ 1 1 1 1 1 1 1 1 1 1 1 1 1 1 1 1 1 1 1 1 1 1 1 1 1 1 1 1 1 1 1 1 1 1 1 1
$$ 1 1 1 1 0 0 0 0 0 0 0 0 0 0 0 0 0 0 0 0 0 0 0 0 0 0 0 0
$$ ##$ShimPowRng1= (0..63)
$$ 1 1 1 1 1 1 1 1 1 1 1 1 1 1 1 1 1 1 1 1 1 1 1 1 1 1 1 1 1 1 1 1 1 1 1 1
$$ 1 1 1 1 0 0 0 0 0 0 0 0 0 0 0 0 0 0 0 0 0 0 0 0 0 0 0 0
$$ ##$ShimPowRng2= (0..63)
$$ 1 1 1 1 1 1 1 1 1 1 1 1 1 1 1 1 1 1 1 1 1 1 1 1 1 1 1 1 1 1 1 1 1 1 1 1
$$ 1 1 1 1 0 0 0 0 0 0 0 0 0 0 0 0 0 0 0 0 0 0 0 0 0 0 0 0
$$ ##$ShimPowRng3= (0..63)
$$ 1 1 1 1 1 1 1 1 1 1 1 1 1 1 1 1 1 1 1 1 1 1 1 1 1 1 1 1 1 1 1 1 1 1 1 1
$$ 1 1 1 1 0 0 0 0 0 0 0 0 0 0 0 0 0 0 0 0 0 0 0 0 0 0 0 0
$$ ##$ShimSysFunc= (0..63)
$$ 1 2 3 4 5 6 7 8 9 10 0 37 38 35 16 15 14 13 12 11 28 27 26 25 24 23 36
$$ 22 30 29 20 21 34 33 32 31 17 18 19 0 0 0 0 0 0 0 0 0 0 0 0 0 0 0 0 0 0
$$ 0 0 0 0 0 0 0
$$ ##$ShimSysMatrix= 0
$$ ##$ShimSysType= 4
$$ ##$TFXNUM= 0
$$ ##$TRIPLO2= 0
$$ ##$VTU= 2
$$ ##$VTUETH= <149.236.99.20>
$$ ##$VTUTY= <no>
$$ ##$WBREFAM= (0..15)
$$ 100 100 100 100 100 100 100 100 100 100 100 100 100 100 100 100
$$ ##$WBREFLM= (0..15)
$$ 1 0 0 0 0 0 0 0 0 0 0 0 0 0 0 0
$$ ##$WBREFPH= (0..15)
$$ 0.03 0 0 0 0 0 0 0 0 0 0 0 0 0 0 0
$$ ##$WBSGU= (0..15)
$$ 0 0 0 0 0 0 0 0 0 0 0 0 0 0 0 0
$$ ##$XFAC= 2
$$ ##END=
$$ 
##$DECIM=	2000
##$DSPFVS=	20
##XUNITS=	HZ
##YUNITS=	ARBITRARY UNITS
##FIRSTX=	8074.3010970013501719
##LASTX=	-1925.5463151080250555
##DELTAX=	-0.152587890625
##XFACTOR=	1
##YFACTOR=	0.0098996143856378074344
##FIRSTY=	14.33050537109375
##MINY=	5.8028578758239746094
##MAXY=	7047.67236328125
##NPOINTS=	65536
##XYDATA=	(X++(Y..Y))
$$ [...]
5108A306j0j7j7k5k5N4N5P2o0j06K4M3M3R2l8l0l1M9M9j6j7k9k9LLk7k6k7k7m4m4J08J08m7
$$ 1306 1296 1279 1262 1237 1212 1266 1321 1393 1333 1227 1251 1294 1337 1429 1391 1361 1330 1379 1428 1412 1395 1366 1337 1340 1343 1316 1290 1263 1236 1192 1148 1256 1364 1317
5103A317m8O1O1jjo6o6j0j0K3K2o1o1M8M8K0J9K0K0o1o1NMJ7J6j5j6MNk8k8J04J04L9L9j12
$$ 1317 1269 1330 1391 1390 1389 1323 1257 1247 1237 1260 1282 1221 1160 1208 1256 1276 1295 1315 1335 1274 1213 1218 1222 1239 1255 1240 1224 1228 1233 1205 1177 1281 1385 1424 1463 1351
5097A351j12mmj2j3j3j3POOPk8k8L7L8K3K4K4K4n1n1N8N8j0j0j0j0l6l5J16J17q0q0m7m7j7
$$ 1351 1239 1235 1231 1219 1206 1193 1180 1187 1193 1199 1206 1178 1150 1187 1225 1248 1272 1296 1320 1269 1218 1276 1334 1324 1314 1304 1294 1258 1223 1339 1456 1376 1296 1249 1202 1185
5092A185j7j7j8L8L8k8k7K7K8K7K8L8L7L8L8onl8l8l9m0K5K5JJ%Jm0m0K6K5j2j2j2j2J9J9
$$ 1185 1168 1151 1133 1171 1209 1181 1154 1181 1209 1236 1264 1302 1339 1377 1415 1409 1404 1366 1328 1289 1249 1274 1299 1300 1301 1301 1302 1262 1222 1248 1273 1261 1249 1237 1225 1244 1263
5086A263K0J9j0j0j0j1k9k9Q0P9r0q9k4k5M6M5J3J3l5l5l6l5K6K6ppL5L4l1l1MMMLK3K2K2
$$ 1263 1283 1302 1292 1282 1272 1261 1232 1203 1283 1362 1272 1183 1159 1134 1180 1225 1238 1251 1216 1181 1145 1110 1136 1162 1155 1148 1183 1217 1186 1155 1159 1163 1167 1170 1193 1215 1237
5081A237K3M6M7j8j9k0k0M4M5K7K7q1q2J7J6J6J6k6k5M0M0q3q2n0m9J18J17J0RK8K8l7l7j22
$$ 1237 1260 1306 1353 1335 1316 1296 1276 1320 1365 1392 1419 1338 1256 1273 1289 1305 1321 1295 1270 1310 1350 1267 1185 1135 1086 1204 1321 1331 1340 1368 1396 1359 1322 1200
5075A200j21P4P4QPn8n8R7R7j2j2m4m4P3P2j9J12J35q1j86n6l4l4j0j1R8R9l3l3L2L2noon
$$ 1200 1079 1153 1227 1235 1242 1184 1126 1223 1320 1308 1296 1252 1208 1281 1353 1334 1446 1581 1500 1314 1258 1224 1190 1180 1169 1267 1366 1333 1300 1332 1364 1359 1353 1347 1342
5070A342kkkkk5k4k5k5j5j4N0N1p2p1Q0Q1J3J2J3J3M6M5o3o3n8n7J5j15K6K7RJ0J41J0k6k5
$$ 1342 1340 1338 1336 1334 1309 1285 1260 1235 1220 1206 1256 1307 1235 1164 1244 1325 1338 1350 1363 1376 1422 1467 1404 1341 1283 1226 1241 1126 1152 1179 1188 1198 1339 1349 1323 1298
5065A298k3k4k3k3M8M9J6J6RRn6n6M6M5o0P0K5K5l2l3m1m1J6J6O0o9O8O9l2l3M1q9m8m8m8
$$ 1298 1275 1251 1228 1205 1253 1302 1318 1334 1343 1352 1296 1240 1286 1331 1271 1341 1366 1391 1359 1326 1285 1244 1260 1276 1336 1267 1335 1404 1372 1339 1380 1291 1243 1195 1147
5059A147m8m0R1N0N0l8l7K0K0Q4m6ooNNJ19j1l8R3n4n4p4p4Q6Q6q1M9Q2m8P1P1m6m5n9n9k6
$$ 1147 1099 1059 1150 1200 1250 1212 1175 1195 1215 1299 1253 1247 1241 1246 1251 1370 1359 1321 1414 1360 1306 1232 1158 1244 1330 1249 1298 1380 1332 1403 1474 1428 1383 1324 1265 1239
5054A239k6m6m6O2O3L2L2l3l3o6o5J22J21R0m1j06K5K5K6L4L4ppp1p2j3j2N3N3RRRRj4j4k2
$$ 1239 1213 1167 1121 1183 1246 1278 1310 1277 1244 1178 1113 1235 1356 1446 1405 1299 1324 1349 1375 1409 1443 1436 1429 1358 1286 1273 1261 1314 1367 1376 1385 1394 1403 1389 1375 1353
5048A353k2j0j39j89K8J39J39J26no2O9K7j02j2j1k0k0ppm8m8J95O4j37j36k3J08L4L5nnp1
$$ 1353 1331 1321 1182 993 1021 1160 1299 1425 1420 1358 1427 1454 1352 1340 1329 1309 1289 1282 1275 1227 1179 1374 1438 1301 1165 1142 1250 1284 1319 1314 1309 1238
5043A238O1n7P3R0m0o0P1j1j0k5k6k5k5OOOOn4n5J1J1K8K9l7l7P7P7o7o7r1L8J18J18p8p7
$$ 1238 1299 1242 1315 1405 1365 1305 1376 1365 1355 1330 1304 1279 1254 1260 1266 1272 1278 1224 1169 1180 1191 1219 1248 1211 1174 1251 1328 1261 1194 1103 1141 1259 1377 1299 1222
5038A222j2j2P2P2M5q5j36oO4O5kjjkl4l3OPM3J73n2n2N8N9K3j07k6k5j2J18K47K9j09j09
$$ 1222 1210 1198 1270 1342 1387 1302 1166 1160 1224 1289 1287 1286 1285 1283 1249 1216 1222 1229 1272 1445 1393 1341 1399 1458 1481 1374 1348 1323 1311 1429 1676 1705 1596 1487
5033A487j46P2n9n9L4r7q9J29J65L4l0l0j1j0q4q4Q0n0K3K4n9n8PPk9k9Q0P9JJm9Q2Q0n1O2
$$ 1487 1341 1413 1354 1295 1329 1232 1143 1272 1437 1471 1441 1411 1400 1390 1306 1222 1302 1252 1275 1299 1240 1182 1189 1196 1167 1138 1218 1297 1298 1299 1250 1332 1412 1361 1423
5028A423O3k5k6k6k5k5k5r8L2P9Q0K3j07j58N8J11k0M3M3P6n5o4o5j38P9J18j2JJJ1j20j68
$$ 1423 1486 1461 1435 1409 1384 1359 1334 1236 1268 1347 1427 1450 1343 1185 1243 1354 1334 1377 1420 1496 1441 1377 1312 1174 1253 1371 1359 1360 1361 1372 1252 1084
5023A084M8R1R0j2j3L7r3m5m5qJ22M0M0N5p5j0J21o7o6k6k6K3K3j0rK4K4m0m1j5j4L5r6o3
$$ 1084 1132 1223 1313 1301 1288 1325 1232 1187 1142 1134 1256 1296 1336 1391 1316 1306 1427 1360 1294 1268 1242 1265 1288 1278 1269 1293 1317 1277 1236 1221 1207 1242 1146 1083
5018A083O7m6m7P0P0P8n2j5j6M2M1r9j00R6R6N2N2n7n6m0m1L9J68n7n8J6J6K6K7j12J8J5J5
$$ 1083 1150 1104 1057 1127 1197 1275 1223 1208 1192 1234 1275 1176 1076 1172 1268 1320 1372 1315 1259 1219 1178 1217 1385 1328 1270 1286 1302 1328 1355 1243 1261 1276 1291
5012A291q6q5J39J40m7m8j23PJ59K9n0n0PPP7P7j48j8O9O9Q6m5o2o2nnQ7Q8j08j08q4q4J7
$$ 1291 1205 1120 1259 1399 1352 1304 1181 1188 1347 1376 1326 1276 1283 1290 1367 1444 1296 1278 1347 1416 1502 1457 1395 1333 1328 1323 1410 1498 1390 1282 1198 1114 1131
5007A131J6P3n7M8M9M5M5n5n6l7R2J74m3m6m7o0o1n5n5R6R7L5L6k9l0m4m4O4O4mnmmn8n7Q
$$ 1131 1147 1220 1163 1211 1260 1305 1350 1295 1239 1202 1294 1468 1425 1379 1332 1272 1211 1156 1101 1197 1294 1329 1365 1336 1306 1262 1218 1282 1346 1342 1337 1333 1329 1271 1214 1222
5002A222Pn3n4p0O0J97O7nml5l6mll9l9m8Q3O8O7l3l3p9p9P4P3J4J4k7J04m5m5l7l7O0O0m8
$$ 1222 1229 1176 1122 1052 1112 1309 1376 1371 1367 1332 1296 1292 1289 1250 1211 1163 1246 1314 1381 1348 1315 1236 1157 1231 1304 1318 1332 1305 1409 1364 1319 1282 1245 1305 1365 1317
4996A317m9J6J5n0n0L3L3p5p6P1P1OOn3n3J2J2M3M2J8J8j52k3M3q7K6K5Q3Q3j9k0M5M6PQr
$$ 1317 1268 1284 1299 1249 1199 1232 1265 1190 1114 1185 1256 1262 1268 1215 1162 1174 1186 1229 1271 1289 1307 1155 1132 1175 1088 1114 1139 1222 1305 1286 1266 1311 1357 1364 1372 1363
4991A363J22L0j00kj33j86n5J45J45m9m8j6j6K3K3n0P9P7P6k4k4j1j1P1n9j09K1R2R2j00r9
$$ 1363 1485 1515 1415 1413 1280 1094 1039 1184 1329 1280 1232 1216 1200 1223 1246 1196 1275 1352 1428 1404 1380 1369 1358 1429 1370 1261 1282 1374 1466 1366 1267
4986A267JJK8j01l4J83j21RN5p5l7l8O3O3L6L7l7l7Q6m4m4m5J37Pj02K8K1K0mmN3N2p0o9Q5
$$ 1267 1268 1269 1297 1196 1162 1345 1224 1233 1288 1213 1176 1138 1201 1264 1300 1337 1300 1263 1349 1305 1261 1216 1353 1360 1258 1286 1307 1327 1323 1319 1372 1424 1354 1285 1370
4981A370j31q2M7k1k1J4J44J02k8j2j2RRRRr5r5o3o2Q7Q7K2K2n0n1N0N0K8j03LLj27j28L7
$$ 1370 1239 1157 1204 1183 1162 1176 1320 1422 1394 1382 1370 1379 1388 1397 1406 1311 1216 1153 1091 1178 1265 1287 1309 1259 1208 1258 1308 1336 1233 1236 1239 1112 984 1021
4976A021J68P9P9N2p8o1o2MMn0Q0L2L1L9r2j8j8J24J25l5l5k1j50q6M5k0j9K1K1L8L8L9L8
$$ 1021 1189 1268 1347 1399 1321 1260 1198 1202 1206 1156 1236 1268 1299 1338 1246 1228 1210 1334 1459 1424 1389 1368 1218 1132 1177 1157 1138 1159 1180 1218 1256 1295 1333
4971A333k1k2k1k1O8O9L6L6NNn9o0m1m0nJ25kjM8q3k1k1p8N3L2r8j7j7j9j8j8j9n6n6J03J04
$$ 1333 1312 1290 1269 1248 1316 1385 1421 1457 1462 1467 1408 1348 1307 1267 1262 1387 1385 1384 1432 1349 1328 1307 1229 1282 1314 1216 1199 1182 1163 1145 1127 1108 1052 996 1099 1203
4965A203o1O9K20R1j35j35p7p8l3l2P6P6P0O9NNNOk8k7l3l3l4l3N7N7rqk9k9L7L6L9L9k6k7
$$ 1203 1142 1211 1431 1522 1387 1252 1175 1097 1064 1032 1108 1184 1254 1323 1328 1333 1338 1344 1316 1289 1256 1223 1189 1156 1213 1270 1261 1253 1224 1195 1232 1268 1307 1346 1320 1293
4960A293ooJ9J8N6p5l4l4M9M9J7J7m0l9K5K6PPk5k5j5j4J9J8J1J1j6j46k6J05P3n8l9R1P5
$$ 1293 1287 1281 1300 1318 1374 1299 1265 1231 1280 1329 1346 1363 1323 1284 1309 1335 1342 1349 1324 1299 1284 1270 1289 1307 1318 1329 1313 1167 1141 1246 1319 1261 1222 1313 1388
4954A388P5n7n6r0q9O1O1K8K9mno9o9l1l0P3j44o8J48J36q2m1m1N5N4K6K6l9m0%%%JM8M9j7
$$ 1388 1463 1406 1350 1260 1171 1232 1293 1321 1350 1346 1341 1272 1203 1172 1142 1215 1071 1003 1151 1287 1205 1164 1123 1178 1232 1258 1284 1245 1205 1205 1205 1205 1206 1254 1303 1286
4949A286j7m3m4K1K2l0k9l0k9j8j7j7j8M9M8M8M8L1L0L1L0P5P5p6p7o5o5M4M4J7J7m8m8NN
$$ 1286 1269 1226 1182 1203 1225 1195 1166 1136 1107 1089 1072 1055 1037 1086 1134 1182 1230 1261 1291 1322 1352 1427 1502 1426 1349 1284 1219 1263 1307 1324 1341 1293 1245 1250 1255
4944A255o0o0M5M6M5M6n5n5J1J0mnmmQPQQJ4J4J4J4o8o7lkP1P2l7l7llllM9M9j6j6n0n0N8
$$ 1255 1195 1135 1180 1226 1271 1317 1262 1207 1218 1228 1224 1219 1215 1211 1219 1226 1234 1242 1256 1270 1284 1298 1230 1163 1160 1158 1229 1301 1264 1227 1224 1221 1218 1215 1264 1313 1297 1281 1231 1181 1239
4937A239N8l5l6P3P3J2J2J2J2J3J2r6r7mmJ05J05n5n4j76M1mmP4P5kkj10j11J1J0P5P6LMn
$$ 1239 1297 1262 1226 1299 1372 1384 1396 1408 1420 1433 1445 1349 1252 1248 1244 1349 1454 1399 1345 1169 1210 1206 1202 1276 1351 1349 1347 1237 1126 1137 1147 1222 1298 1301 1305 1300
4932A300mL8r3m7J71J31q6q8M1L2L3o9o8k6k6k6k6N3N2N3N3MMj05j05J9J9m7m6k2k1M8J79
$$ 1300 1296 1334 1241 1194 1365 1496 1410 1322 1363 1395 1428 1359 1291 1265 1239 1213 1187 1240 1292 1345 1398 1402 1406 1301 1196 1215 1234 1187 1141 1119 1098 1146 1325
4927A325P1o0j25OJ27kJ3J4m5m5j18J2rrJ95J95J7J6r1r2j9j9R0Q9r6r7l1l1M8M7M8M8j1j0
$$ 1325 1396 1336 1211 1217 1344 1342 1355 1369 1324 1279 1161 1173 1164 1155 1350 1545 1562 1578 1487 1395 1376 1357 1447 1536 1440 1343 1312 1281 1329 1376 1424 1472 1461 1451
4922A451o8o7j17J4P9n1N2N2J17j4n2n2o0o1OOJ5J4k7J03M6q5r9L1N0N0J63L3j0j1L0j00k7
$$ 1451 1383 1316 1199 1213 1292 1241 1293 1345 1462 1448 1396 1344 1284 1223 1229 1235 1250 1264 1237 1340 1386 1301 1202 1233 1283 1333 1496 1529 1519 1508 1538 1438 1411
4916A411k6n1n0n0n1JKO6O6N9N9poJ1J2n4n4k6k6k6k6rj0j0j0JJpJ23J0J0q2q2J8J48Q3m7
$$ 1411 1385 1334 1284 1234 1183 1184 1186 1252 1318 1377 1436 1429 1423 1434 1446 1392 1338 1312 1286 1260 1234 1225 1215 1205 1195 1196 1197 1190 1313 1323 1333 1251 1169 1187 1335 1418 1371
4911A371j1j1M6M7j0j0j0j0j6j5j5j6p8p9L0L0K8K8O1O1m2m1O7O7k9l0l0l0LLKLPPPON8N8
$$ 1371 1360 1349 1395 1442 1432 1422 1412 1402 1386 1371 1356 1340 1262 1183 1213 1243 1271 1299 1360 1421 1379 1338 1405 1472 1443 1413 1383 1353 1356 1359 1361 1364 1371 1378 1385 1391 1449 1507
4905A507j24j23n1J66M5M4o8o7lkrqK4K4RJ0RRn6n6QRp4p4L5L4M1M0J06j11r6L5O7o3m8J70
$$ 1507 1383 1260 1209 1375 1420 1464 1396 1329 1326 1324 1315 1307 1331 1355 1364 1374 1383 1392 1336 1280 1288 1297 1223 1149 1184 1218 1259 1299 1405 1294 1198 1233 1300 1237 1189 1359
4900A359OOJ0J1J0J0MMk9k9L6L7p2p2J0J0J1J0j33j33k5k4M6M6M6M7N1N2j3j3O8O8m0m0J4
$$ 1359 1365 1371 1381 1392 1402 1412 1416 1420 1391 1362 1398 1435 1363 1291 1301 1311 1322 1332 1199 1066 1041 1017 1063 1109 1155 1202 1253 1305 1292 1279 1347 1415 1375 1335 1349
4894A349J4J4J4N9N9K7K7q2q3K6K6l5l5lkk3k4M2M2k5k5M0M0o0n9OOJ3J3J4J3n0n0j8j7n9
$$ 1349 1363 1377 1391 1450 1509 1536 1563 1481 1398 1424 1450 1415 1380 1377 1375 1352 1328 1370 1412 1387 1362 1402 1442 1382 1323 1329 1335 1348 1361 1375 1388 1338 1288 1270 1253 1194
4889A194n9M9N0J3J2J2J3jjjjJ9J9m6m6J1J1J2J1J0J1r8r8K3K4rj0L9M0J04J04L2L2p6p6M5
$$ 1194 1135 1184 1234 1247 1259 1271 1284 1283 1282 1281 1280 1299 1318 1272 1226 1237 1248 1260 1271 1281 1292 1194 1096 1119 1143 1134 1124 1163 1203 1307 1411 1443 1475 1399 1323 1368
4883A368M5J2J3n5n5J0J1M0M0k5k5j8j8j8j8p4p4qrJ07J07m6m5L1L2l4l4m3m3J09J08n1n2
$$ 1368 1413 1425 1438 1383 1328 1338 1349 1389 1429 1404 1379 1361 1343 1325 1307 1233 1159 1151 1142 1249 1356 1310 1265 1296 1328 1294 1260 1217 1174 1283 1391 1340 1288
4878A288n2n2K9K8R4R3n7n7QQl3l3L3L2J6J5j36j37K6K6K5K6M4M4P7P6q2q2K6K7l5l6klM2
$$ 1288 1236 1184 1213 1241 1335 1428 1371 1314 1322 1330 1297 1264 1297 1329 1345 1360 1224 1087 1113 1139 1164 1190 1234 1278 1355 1431 1349 1267 1293 1320 1285 1249 1247 1244 1286
4873A286M2J0J0ppopj02j03R3R3jjPPK5J57M7q2m6m5n4n3n5n5p1N9J62L1l4R7P8n2p7N4P7
$$ 1286 1328 1338 1348 1341 1334 1328 1321 1219 1116 1209 1302 1301 1300 1307 1314 1339 1496 1543 1461 1415 1370 1316 1263 1208 1153 1082 1141 1303 1334 1300 1397 1475 1423 1346 1400 1477
4867A477P7M9q0j01j00L0j00o3o3L7L7J5J4K8K8j29Q9P6P5l0l1l0l1Q1Q0q0p9Q8m3j15J4R5
$$ 1477 1554 1603 1523 1422 1322 1352 1252 1189 1126 1163 1200 1215 1229 1257 1285 1156 1245 1321 1396 1366 1335 1305 1274 1355 1435 1355 1276 1364 1321 1206 1220 1315
4862A315l6P9P8j0j0p4p5M9M9J6J7ONOOr6r7n5n5L2J62O0j58M3M3p9p9J00R9K6K6O3o7k7k7
$$ 1315 1279 1358 1436 1426 1416 1342 1267 1316 1365 1381 1398 1404 1409 1415 1421 1325 1228 1173 1118 1150 1312 1372 1214 1257 1300 1221 1142 1242 1341 1367 1393 1456 1389 1362 1335
4857A335r9r9N3N2O1O0r1r1P7P6MMk7j58nJ25J7J8qpP3P3QQn3n2J2J3M7M8j04j05nonnN5N5
$$ 1335 1236 1137 1190 1242 1303 1363 1272 1181 1258 1334 1338 1342 1315 1157 1152 1277 1294 1312 1304 1297 1370 1443 1451 1459 1406 1354 1366 1379 1426 1474 1370 1265 1260 1254 1249 1244 1299 1354
4851A354K8j02j05K6O1O2n6P4M2q8j25j24K0J49J38q0l1J00J54K3M0M0l4l3l4l3o3o3M6M6
$$ 1354 1382 1280 1175 1201 1262 1324 1268 1342 1384 1296 1171 1047 1067 1216 1354 1274 1243 1343 1497 1520 1560 1600 1566 1533 1499 1466 1403 1340 1386 1432
4847A432RJ0k4k3jko7o6k8k7o0o0K9K9K9K9l6l6J5J6K39K2n1n1Q2Q2J2j19q2M9l3l2J3J4J19
$$ 1432 1441 1451 1427 1404 1403 1401 1334 1268 1240 1213 1153 1093 1122 1151 1180 1209 1173 1137 1152 1168 1407 1429 1378 1327 1409 1491 1503 1384 1302 1351 1318 1286 1299 1313 1432
4841A432j0J0J0o3o3NOJ3J3O6J97m2j73p7p6k0j9O7O7q5q4K0K1Q5Q6r3r3J46J46p0o9j60N8
$$ 1432 1422 1432 1442 1379 1316 1321 1327 1340 1353 1419 1616 1574 1401 1324 1248 1228 1209 1276 1343 1258 1174 1194 1215 1300 1386 1293 1200 1346 1492 1422 1353 1193 1251
4836A251P3P2K0K1l0k9l0k9J9J9j6j46M8M9M1M0mnJ9K0K9j02q5q5q7M4LLM2M1M2M2J2J3J3
$$ 1251 1324 1396 1416 1437 1407 1378 1348 1319 1338 1357 1341 1195 1243 1292 1333 1373 1369 1364 1383 1403 1432 1330 1245 1160 1073 1117 1120 1123 1165 1206 1248 1290 1302 1315 1328
4831A328J2kko8o7O4O4m4m5m3m3O6O6L3L3p5p6P5P4p7p8L3L2L3L2m1m1K4K5P3P3P3P3r0r0
$$ 1328 1340 1338 1336 1268 1201 1265 1329 1285 1240 1197 1154 1220 1286 1319 1352 1277 1201 1276 1350 1273 1195 1228 1260 1293 1325 1284 1243 1267 1292 1365 1438 1511 1584 1494 1404
4826A404k4k5K8K9k1k1j28J33N1N1l7l8l7l7o9o9L9M0k7k7Q1Q2P6P6J1J1j11j11M1M0j56j57
$$ 1404 1380 1355 1383 1412 1391 1370 1242 1375 1426 1477 1440 1402 1365 1328 1259 1190 1229 1269 1242 1215 1296 1378 1454 1530 1541 1552 1441 1330 1371 1411 1255 1098
4821A098L9L9R6R5n6n6o9o9k1K40m2m2k6k6M0M0M0M0KKKKJ8J7J8J7q0q0P1P2q3q4j8j8J23
$$ 1098 1137 1176 1272 1367 1311 1255 1186 1117 1096 1336 1294 1252 1226 1200 1240 1280 1320 1360 1362 1364 1366 1368 1386 1403 1421 1438 1358 1278 1349 1421 1338 1254 1236 1218 1341
4815A341J23k9k9j14j15Q2Q1kjo7o7k1k1k1k0R4R4n7n8m3m4qJ22J6J7K4K4J9J9J9J9r2r3k7
$$ 1341 1464 1435 1406 1292 1177 1259 1340 1338 1337 1270 1203 1182 1161 1140 1120 1214 1308 1251 1193 1150 1106 1098 1220 1236 1253 1277 1301 1320 1339 1358 1377 1285 1192 1165
4810A165k7P5P6p1N9L4r7k4J07KJJ0J0j3j4nnj3J18J18j2l5l4r9r9M2J74L4L5k8k8l5l6N3
$$ 1165 1138 1213 1289 1218 1277 1311 1214 1190 1297 1299 1300 1310 1320 1307 1293 1288 1283 1270 1388 1506 1494 1459 1425 1326 1227 1269 1443 1477 1512 1484 1456 1421 1385 1438
4805A438p7mmj8j9j9j8Q0Q0k9k8JKr9r9m7Q5Q4m6J6J6%%M9q2j7J13j51j51R5R6k8k7L8L7O9
$$ 1438 1361 1357 1353 1335 1316 1297 1279 1359 1439 1410 1382 1383 1385 1286 1187 1140 1225 1309 1263 1279 1295 1295 1295 1344 1262 1245 1358 1207 1056 1151 1247 1219 1192 1230 1267 1336
4800A336O9j13J7NNNNJ21j0q9q8Q8Q9o4o3M4M3L0L1J50o7n3n3j39j39N7N6qrM8M9J00l1k2
$$ 1336 1405 1292 1309 1314 1319 1324 1329 1450 1440 1351 1263 1351 1440 1376 1313 1357 1400 1430 1461 1611 1544 1491 1438 1299 1160 1217 1273 1265 1256 1304 1353 1453 1422 1400
4794A400k2n0n1n8P1p6p7j2j2R8l3O4O5J46J5o4o3K0K1q9q8O0N9noj6j7qrl9R1K6j04n1n2
$$ 1400 1378 1328 1277 1219 1290 1214 1137 1125 1113 1211 1178 1242 1307 1453 1468 1404 1341 1361 1382 1293 1205 1265 1324 1319 1313 1297 1280 1272 1263 1224 1315 1341 1237 1186 1134
4789A134j4j3l4J84O2O2QRJ6J7j20J1M6M6klk6k7o6O5%%j50k0O0N9j5j4m6m7L6L5O8O9J5J5
$$ 1134 1120 1107 1073 1257 1319 1381 1389 1398 1414 1431 1311 1322 1368 1414 1412 1409 1383 1356 1290 1355 1355 1355 1205 1185 1245 1304 1289 1275 1229 1182 1218 1253 1321 1390 1405 1420
4784A420j7j7LLM4q6n6n7o4o5L6L7l7R3M1M1M8M9o3o4p1N9l8l7P9P9m2m2K3K3N8N8J2J2Pk09
$$ 1420 1403 1386 1389 1392 1436 1350 1294 1237 1173 1108 1144 1181 1144 1237 1278 1319 1367 1416 1353 1289 1218 1277 1239 1202 1281 1360 1318 1276 1299 1322 1380 1438 1450 1462 1469 1260
4778A260j20j21J26J25R0m0kkj0j1K8K8Q5Q4J6j16m1m2o2o2LKM1M1J06J07q4q4j9j9j1j0N4
$$ 1260 1140 1019 1145 1270 1360 1320 1318 1316 1306 1295 1323 1351 1436 1520 1536 1420 1379 1337 1275 1213 1216 1218 1259 1300 1406 1513 1429 1345 1326 1307 1296 1286 1340
4773A340N4m7m8m7m8P9P8Qj23j26LL1L1n7n7R4R5M4M5O0o9o0P1j1j1l7l6J15J15p2p2l6R3
$$ 1340 1394 1347 1299 1252 1204 1283 1361 1369 1246 1120 1123 1154 1185 1128 1071 1165 1260 1304 1349 1409 1340 1280 1351 1340 1329 1292 1256 1371 1486 1414 1342 1306 1399
4768A399n4n4l9l8K7J58l3l3Q0n1j0j1l0l1l0l1L9L8L8L8l6l6m4m4M6q5j2j1N1N1N1N2j2j1
$$ 1399 1345 1291 1252 1214 1241 1399 1366 1333 1413 1362 1352 1341 1311 1280 1250 1219 1258 1296 1334 1372 1336 1300 1256 1212 1258 1173 1161 1150 1201 1252 1303 1355 1343 1332
4763A332J27lo6o7mJ26J7j13%JL8L8j05j06l9R2J0J1J38Pk8k7K9K9L0K9o9o8lmQ0Q0J5J5l9
$$ 1332 1459 1456 1390 1323 1319 1445 1462 1349 1349 1350 1388 1426 1321 1215 1176 1268 1278 1289 1427 1434 1406 1379 1408 1437 1467 1496 1427 1359 1356 1352 1432 1512 1527 1542 1503
4757A503m0opl3l4j06K4J29J30n7n7NOn9n9nml6l7K3K2K2K3m6m6O3O2J4J4P9P9l8l9M3q7j24
$$ 1503 1463 1457 1450 1417 1383 1277 1301 1430 1560 1503 1446 1451 1457 1398 1339 1334 1330 1294 1257 1280 1302 1324 1347 1301 1255 1318 1380 1394 1408 1487 1566 1528 1489 1532 1445 1321
4752A321Pkkk4J06J03j14j50O6P5P5k1j51j43j3JJ31j3j43L9M0J12j8q4M6L8L8j0J20j8j8
$$ 1321 1328 1326 1324 1300 1406 1509 1395 1245 1311 1386 1461 1440 1289 1146 1133 1134 1265 1252 1109 1148 1188 1300 1282 1198 1244 1282 1320 1310 1430 1412 1394
4747A394K3K2L9r1j61l0Q4Q4k2k2k2k2RRo5O6l1l0q7q8L8L7L8L7J10J09m3m2m6m7O3O2m1m1
$$ 1394 1417 1439 1478 1387 1226 1196 1280 1364 1342 1320 1298 1276 1285 1294 1229 1295 1264 1234 1147 1059 1097 1134 1172 1209 1319 1428 1385 1343 1297 1250 1313 1375 1334 1293
4742A293K5K4o1o2MMNNP0P1J5J6J5J6mml7l6m4m3qJ22n0n0N8N8J18j3K8K7m3m3m4m3N7N7j25
$$ 1293 1318 1342 1281 1219 1223 1227 1232 1237 1307 1378 1393 1409 1424 1440 1436 1432 1395 1359 1315 1272 1264 1386 1336 1286 1344 1402 1520 1507 1535 1562 1519 1476 1432 1389 1446 1503 1378
4736A378OJ0RJ0J0J3j16m3m4Q0P9J5J4m9m9rrp2N9m8m7O1O1K1K0M0r1j7j8L0K9n1P8%j31J6
$$ 1378 1384 1394 1403 1413 1423 1436 1320 1277 1233 1313 1392 1407 1421 1372 1323 1314 1305 1233 1292 1244 1197 1258 1319 1340 1360 1400 1309 1292 1274 1304 1333 1282 1360 1360 1229 1245
4731A245J7j6j5Q6Q5P0o0r5r5L0L0L0L0p2p2poJ05J05K7j04k8k8n2P8J31JMj27j6j7RQj08
$$ 1245 1262 1246 1231 1317 1402 1472 1412 1317 1222 1252 1282 1312 1342 1270 1198 1191 1185 1290 1395 1422 1318 1290 1262 1210 1288 1419 1420 1424 1297 1281 1264 1273 1281 1173
4726A173j08Q8Q8Q8Q8J0j21J0Rk5j56k9J01K8j03N1N1J0J0L1L1L1L1p8p8K3K3J2j18K9K9o9
$$ 1173 1065 1153 1241 1329 1417 1427 1306 1316 1325 1300 1144 1115 1216 1244 1141 1192 1243 1253 1263 1294 1325 1356 1387 1309 1231 1254 1277 1289 1171 1200 1229 1160
4721A160O1K8j02RRRRj18J3M8M8L4L4l1l2J5J4M7M6P0O9P7n3k3k3j05K6n7n7QQQ8m2p7p8R5
$$ 1160 1221 1249 1147 1156 1165 1174 1183 1065 1078 1126 1174 1208 1242 1211 1179 1194 1208 1255 1301 1371 1440 1517 1464 1441 1418 1313 1339 1282 1225 1233 1241 1329 1287 1210 1132 1227
4715A227R4N9p1NOL0L0o2o2R0R0o3o2k9l0L2L2L2L3JJKJj1j1klj05K5J63r7L4L3r2r1K2K3
$$ 1227 1321 1380 1309 1314 1320 1350 1380 1318 1256 1346 1436 1373 1311 1282 1252 1284 1316 1348 1381 1382 1383 1385 1386 1375 1364 1362 1359 1254 1279 1442 1345 1379 1412 1320 1229 1251 1274
4710A274K3K3O3O3m6m6jkL0L1K2K2j1j1J2J3k1k0j2j2p8p7nnO0O0MMk9k9j5j6N0M9L8L8k7
$$ 1274 1297 1320 1383 1446 1400 1354 1353 1351 1381 1412 1434 1456 1445 1434 1446 1459 1438 1418 1406 1394 1316 1239 1234 1229 1289 1349 1353 1357 1328 1299 1284 1268 1318 1367 1405 1443 1416
4704A416k7l8l8P0P1q2q2P0O9J3J3k0k0J0J0J0J0j6j7J6J7j1j0p6p5k0j9M6M5K1K2m4m4O8
$$ 1416 1389 1351 1313 1383 1454 1372 1290 1360 1429 1442 1455 1435 1415 1425 1435 1445 1455 1439 1422 1438 1455 1444 1434 1358 1283 1263 1244 1290 1335 1356 1378 1334 1290 1358
4699A358O8LKl9l9l9l9P3P3PQl3l3l2l3M4M4R1j70N5J86O9o2o6O5j7j8qqo5o6o2O9M4q7p8
$$ 1358 1426 1429 1431 1392 1353 1314 1275 1348 1421 1428 1436 1403 1370 1338 1305 1349 1393 1484 1314 1369 1555 1624 1562 1496 1561 1544 1526 1518 1510 1445 1379 1317 1386 1430 1343 1265
4693A265N2k9l0K2K1N3N4J6J6m9m8n7n7RQnnO0O0N8N8n0n1J2J3J2J3MMJ02j16p6N3J05k5m8
$$ 1265 1317 1288 1258 1280 1301 1354 1408 1424 1440 1391 1343 1286 1229 1238 1246 1241 1236 1296 1356 1414 1472 1422 1371 1383 1396 1408 1421 1425 1429 1531 1415 1339 1392 1497 1472 1424
4688A424m8n7n6m1m2J11J10L9L9Lj27j00j00L6L6J30jJ5J5j05K5J6J7KJKKL5L6J09k1l2l2
$$ 1424 1376 1319 1263 1222 1180 1291 1401 1440 1479 1482 1355 1255 1155 1191 1227 1357 1356 1371 1386 1281 1306 1322 1339 1341 1342 1344 1346 1381 1417 1526 1505 1473 1441
4683A441m1m0k4k4k4k4j7j7j7j7J07J08jjl5l5J04k7JJJ8J7K0j10j10K0K2K2J4J45N3p7m7
$$ 1441 1400 1360 1336 1312 1288 1264 1247 1230 1213 1196 1303 1411 1410 1409 1374 1339 1443 1416 1417 1418 1436 1453 1473 1363 1253 1273 1295 1317 1331 1476 1529 1452 1405
4678A405m7q8J29J5j15OOO3O4j30j30O6O6M1M1k5k4j6j6M8M9M7M7j1j0m1Q9qrj39j0p4p5o4
$$ 1405 1358 1270 1399 1414 1299 1305 1311 1374 1438 1308 1178 1244 1310 1351 1392 1367 1343 1327 1311 1359 1408 1455 1502 1491 1481 1440 1529 1521 1512 1373 1363 1289 1214 1150
4673A150O7K6K6M2M2j40rJ8J9K6K7O6O7O6O7p8p8r4L6Q5m5NMm4m3K2K1M2M1P4P4J4J3j38j38
$$ 1150 1217 1243 1269 1311 1353 1213 1204 1222 1241 1267 1294 1360 1427 1493 1560 1482 1404 1310 1346 1431 1386 1391 1395 1351 1308 1330 1351 1393 1434 1508 1582 1596 1609 1471 1333
4667A333LKnJ25K6K5L4L4l3l4L1L2n5n6j77L9J7J6L9r2M8M8Q1m9M4M5p3p2N4N4j1j0o4o3q0
$$ 1333 1336 1338 1333 1458 1484 1509 1543 1577 1544 1510 1541 1573 1518 1462 1285 1324 1341 1357 1396 1304 1352 1400 1481 1432 1476 1521 1448 1376 1430 1484 1473 1463 1399 1336 1256
4662A256N1J21rj96o6J19J20J9J9j0rrj0PPP2P2r2r1k6k7j8j9J37q1l3l2k0J12J17j3j22R
$$ 1256 1307 1428 1419 1223 1157 1276 1396 1415 1434 1424 1415 1406 1396 1403 1410 1482 1554 1462 1371 1345 1318 1300 1281 1418 1337 1304 1272 1252 1364 1481 1468 1346 1355
4657A355O5o6J5J6k3k3q8q8QQP3P4l6l5K9L0PPP3P2%%l2l3p2p3pqR4R4n8n7J7J7L7L6M7j69
$$ 1355 1420 1354 1369 1385 1362 1339 1251 1163 1171 1179 1252 1326 1290 1255 1284 1314 1321 1328 1401 1473 1473 1473 1441 1408 1336 1263 1256 1248 1342 1436 1378 1321 1338 1355 1392 1428 1475 1306
4651A306n6P5O1O2k04J2P9P8N7p4M6M5k7k8ONn9o0k4k5q9r0M7M7J12J12K5K6l2l2j02K7J07
$$ 1306 1250 1325 1386 1448 1244 1256 1335 1413 1470 1396 1442 1487 1460 1432 1438 1443 1384 1324 1300 1275 1186 1096 1143 1190 1302 1414 1439 1465 1433 1401 1299 1326 1433
4646A433J06o7o7kko2o3LLQ2Q3Q3Q3j30j29n1Q0Q2Q2K5K6l0k9k9l0p4p4rrJ9J9m6m6K9K9p2
$$ 1433 1539 1472 1405 1403 1401 1339 1276 1279 1282 1364 1447 1530 1613 1483 1354 1303 1383 1465 1547 1572 1598 1568 1539 1510 1480 1406 1332 1323 1314 1333 1352 1306 1260 1289 1318 1246
4641A246p2l1J00K6K6L2L2L1L2n3n3J1J2L3L2p6p7N6N6j0rK4K5K4K5n8n7p4N7R8l2q8M1l5
$$ 1246 1174 1143 1243 1269 1295 1327 1359 1390 1422 1369 1316 1327 1339 1372 1404 1328 1251 1307 1363 1353 1344 1368 1393 1417 1442 1384 1327 1253 1310 1408 1376 1288 1329 1294
4635A294l6O7O8O2j56j06K4J2J1K0J9ONL8L8mmN4N3Oj24n0n1M0M0k5k5K7K8q1q1O4O4m5m5
$$ 1294 1258 1325 1393 1455 1299 1193 1217 1229 1240 1260 1279 1285 1290 1328 1366 1362 1358 1412 1465 1471 1347 1297 1246 1286 1326 1301 1276 1303 1331 1250 1169 1233 1297 1252 1207
4630A207P5P5J0J0k2k2J0J0lkllQ1Q1M5q4L1L2qrm3m3j0j0P3P2QPPOJ5j16J3J2l6l6L4r5M2
$$ 1207 1282 1357 1367 1377 1355 1333 1343 1353 1350 1348 1345 1342 1423 1504 1549 1465 1496 1528 1520 1511 1468 1425 1415 1405 1478 1550 1558 1565 1572 1578 1593 1477 1490 1502 1466 1430 1464 1369 1411
4624A411M3q1q2J9J9O2o9NNJ0J0KKLj28j8J11K5K6JJkjkjk8k8L7L7J3J2n2n2j37j37j4J16
$$ 1411 1454 1373 1291 1310 1329 1391 1322 1327 1332 1342 1352 1354 1356 1359 1231 1213 1324 1349 1375 1376 1377 1375 1374 1372 1371 1343 1315 1352 1389 1402 1414 1362 1310 1173 1036 1022 1138
4618A138J01J02JJn9n9N7N8OJ37L1L1j5j4m2j72p0O0M3M4R1R2o0o1j4j4m7m7k8k9Q0Q0J0R
$$ 1138 1239 1341 1342 1343 1284 1225 1282 1340 1346 1483 1514 1545 1530 1516 1474 1302 1232 1292 1335 1379 1470 1562 1502 1441 1427 1413 1366 1319 1291 1262 1342 1422 1432 1441
4613A441J8J8j6J13o8o8J9J9j3j4OOo8o8R3l7p8N2N4p6NNN4N3j1j2l3l4j%J4J4j8j8j47j47
$$ 1441 1459 1477 1461 1574 1506 1438 1457 1476 1463 1449 1455 1461 1393 1325 1418 1381 1303 1355 1409 1333 1338 1343 1397 1450 1439 1427 1394 1360 1359 1359 1373 1387 1369 1351 1204 1057
4608A057k5J06J42J42P2n9m5m5J2J2Q0Q0k9k8k2k2k2k2N5N4r7r8N6N5J4J5O2o9J3J3j34lL1
$$ 1057 1032 1138 1280 1422 1494 1435 1390 1345 1357 1369 1449 1529 1500 1472 1450 1428 1406 1384 1439 1493 1396 1298 1354 1409 1423 1438 1500 1431 1444 1457 1323 1320 1351
4603A351L2NNk8k8pom7Q4J14J14N2p9j58k9Q6Q6p5p5l5l4nJ26P4j43p1N8MNk9k9k9k9J3J4
$$ 1351 1383 1388 1393 1365 1337 1330 1324 1277 1361 1475 1589 1641 1562 1404 1375 1461 1547 1472 1397 1362 1328 1323 1449 1523 1380 1309 1367 1371 1376 1347 1318 1289 1260 1273 1287
4597A287J3J3N5N5K2K2J6J5m9n0j0j1K2K3L5L5l1l0Q5Q4M9q1K9K9m5m4klj11j11j1j1j1j1
$$ 1287 1300 1313 1368 1423 1445 1467 1483 1498 1449 1399 1389 1378 1400 1423 1458 1493 1462 1432 1517 1601 1650 1569 1598 1627 1582 1538 1536 1533 1422 1311 1300 1289 1278 1267
4592A267K5K5R0R0j2j2l6l7qJ21j7j6l9l8J01l0l3l2K5K5J3J3M5M5m6m6m7m6l0l0m7Q4J61
$$ 1267 1292 1317 1407 1497 1485 1473 1437 1400 1392 1513 1496 1480 1441 1403 1504 1474 1441 1409 1434 1459 1472 1485 1530 1575 1529 1483 1436 1390 1360 1330 1283 1367 1528
4587A528L1q4q3n2n1p3N6J82l5L0K9KKp1p1Q7m2L0L1%Jj6J15N5p5p6N5k4j54L6L5%J%%m3m3
$$ 1528 1559 1475 1392 1340 1289 1216 1272 1454 1419 1449 1478 1480 1482 1411 1340 1427 1385 1415 1446 1446 1447 1431 1546 1601 1526 1450 1505 1481 1327 1363 1398 1398 1399 1399 1399 1356 1313
4582A313O6O5MMj05j05J5J5j8j8mmK9K8O5O5L0j00O6O7K5K6ONo0n9K8K8K7K8o1o1MMk5k6R
$$ 1313 1379 1444 1448 1452 1347 1242 1257 1272 1254 1236 1232 1228 1257 1285 1350 1415 1445 1345 1411 1478 1503 1529 1535 1540 1480 1421 1449 1477 1504 1532 1471 1410 1414 1418 1393 1367 1376
4576A376J40m8m9m1m0J5J5Q0Q0m6m6J9J9k6k6n9n9M3M2k2k3m2m2K3J53J06j10m6m5L6L7MM
$$ 1376 1516 1468 1419 1378 1338 1353 1368 1448 1528 1482 1436 1455 1474 1448 1422 1363 1304 1347 1389 1367 1344 1302 1260 1283 1436 1542 1432 1386 1341 1377 1414 1418 1422
4571A422p3p3pqj1j2K1K1Q7Q6N0p9p0p0mnq1M9RQQ4Q4J1J0Pj23N8N9M8M9o1o0l4l4P9n0p8
$$ 1422 1349 1276 1269 1261 1250 1238 1259 1280 1367 1453 1503 1424 1354 1284 1280 1275 1194 1243 1252 1260 1344 1428 1439 1449 1456 1333 1391 1450 1498 1547 1486 1426 1392 1358 1437 1387 1309
4565A309N2L5L6N8N7O6o4l0l0P1P0o0o1r3r3N4N4j1j1l0l0K8K7Q8m2q2M7L5r5o3O7O4o7m3
$$ 1309 1361 1396 1432 1490 1547 1613 1549 1519 1489 1560 1630 1570 1509 1416 1323 1377 1431 1420 1409 1379 1349 1377 1404 1492 1450 1368 1415 1450 1355 1292 1359 1423 1356 1313
4560A313m2j19J2J77J77k7k8klnj36LLL8L7L0K9R0l9m0m0Q6m4l5l6l5l5J04k7j4j4m4j74p3
$$ 1313 1271 1152 1164 1341 1518 1491 1463 1461 1458 1453 1317 1320 1323 1361 1398 1428 1457 1547 1508 1468 1428 1514 1470 1435 1399 1364 1329 1433 1406 1392 1378 1334 1160 1087
4555A087J43j9j9Q6Q6N8p1j4J16K6K7K8j02j34mPOQ0Q0k5k5o5O5j8j8N5N5k6k6J13j8oom6
$$ 1087 1230 1211 1192 1278 1364 1422 1351 1337 1453 1479 1506 1534 1432 1298 1294 1301 1307 1387 1467 1442 1417 1352 1417 1399 1381 1436 1491 1465 1439 1552 1534 1528 1522 1476
4550A476m7POL9L9lmmml8l8K6K7k4k4k3k4jjJ38QM2M2p4p5NNqrJ14j03q6M3j9k0N4N4n2n1
$$ 1476 1429 1436 1442 1481 1520 1517 1513 1509 1505 1467 1429 1455 1482 1458 1434 1411 1387 1386 1385 1523 1531 1573 1615 1541 1466 1471 1476 1468 1459 1573 1470 1384 1427 1408 1388 1442 1496 1444 1393
4544A393j09J09N9O0L8r2j1j1M6M6j15j16PJ37j3j2mnQ5Q4k9j60q8M3O7o4MMnmRQRQl8l8p9
$$ 1393 1284 1393 1452 1512 1550 1458 1447 1436 1482 1528 1413 1297 1304 1441 1428 1416 1412 1407 1492 1576 1547 1387 1299 1342 1409 1345 1349 1353 1348 1344 1353 1361 1370 1378 1340 1302 1223
4538A223N1O4O4q1q0J7J8N8p2K4K5J6J6M9M9j7j6J9J9O0p1l5l6klp7N3J27lq1M9L3L3r0r1
$$ 1223 1274 1338 1402 1321 1241 1258 1276 1334 1262 1286 1311 1327 1343 1392 1441 1424 1408 1427 1446 1506 1435 1400 1364 1362 1359 1282 1335 1462 1459 1378 1427 1460 1493 1403 1312
4533A312n7n8Q0Q0M7M7M5M4o1O9POn0n0L3L3m0m1pj38p3N8P7P8k3k3j5j5N0N1J9J9m6m6m3
$$ 1312 1255 1197 1277 1357 1404 1451 1496 1540 1479 1548 1555 1561 1511 1461 1494 1527 1487 1446 1439 1301 1228 1286 1363 1441 1418 1395 1380 1365 1415 1466 1485 1504 1458 1412 1369
4527A369m4O6O5N6N5q2M7q5q5L1L1K2K1m4m4J10J11L2r8p2p1J02k8K1K2P0P0n9j90q3q4M6
$$ 1369 1325 1391 1456 1512 1567 1485 1532 1447 1362 1393 1424 1446 1467 1423 1379 1489 1600 1632 1534 1462 1391 1493 1465 1486 1508 1578 1648 1589 1399 1316 1232 1278
4523A278M7j9j8P0P1R5R6mj34k1k0p9N1M3M3O5O6m3m4o8o8ONk3J08KJNMMMk0k0J2J2l1l1j70
$$ 1278 1325 1306 1288 1358 1429 1524 1620 1616 1482 1461 1441 1362 1413 1456 1499 1564 1630 1587 1543 1475 1407 1413 1418 1395 1503 1505 1506 1511 1515 1519 1523 1503 1483 1495 1507 1476 1445 1275
4517A275l9O6O5RRK9K9K9L0O3O4jkL0L0j8J11K4j07j40rRj22j13J7N6N5l6l7OJ36r0q9Q2Q1
$$ 1275 1236 1302 1367 1376 1385 1414 1443 1472 1502 1565 1629 1628 1626 1656 1686 1668 1779 1803 1696 1556 1547 1556 1434 1321 1338 1394 1449 1413 1376 1382 1518 1428 1339 1421 1502
4511A502k6k7j2j2o9o9j0J19J85N5j5j4k3k3m1m1K4K4K1K2O2o8O8O8q4q3j01L0K2K2j9j9N5
$$ 1502 1476 1449 1437 1425 1356 1287 1277 1396 1581 1636 1621 1607 1584 1561 1520 1479 1503 1527 1548 1570 1632 1564 1632 1700 1616 1533 1432 1462 1484 1506 1487 1468 1523
4506A523N4j45j4K0K1m1m0j14J6R1R0M2M1k4J06p5p6k0k0K0K1n1P9L8L8p7p7L1L1j7j7k5J06
$$ 1523 1577 1432 1418 1438 1459 1418 1378 1264 1280 1371 1461 1503 1544 1520 1626 1551 1475 1455 1435 1455 1476 1425 1504 1542 1580 1503 1426 1457 1488 1471 1454 1429 1535
4501A535P8P9Qj22o7o7K0K0P4j44o2O9J7J6pqN7N8q7q7J4J43NNm7m7J9J8k2k3k2k2K5K6K5
$$ 1535 1613 1692 1700 1578 1511 1444 1464 1484 1558 1414 1352 1421 1438 1454 1447 1439 1496 1554 1467 1380 1394 1537 1542 1547 1500 1453 1472 1490 1468 1445 1423 1401 1426 1452 1477
4496A477K6n5n5l2R7J23r5q6J31llk2k1n5n5J0J0NNONk4k3P6P7l2j63K0K0K5K5K6K5M1M1J30
$$ 1477 1503 1448 1393 1361 1458 1581 1486 1400 1531 1528 1525 1503 1482 1427 1372 1382 1392 1397 1402 1408 1413 1389 1366 1442 1519 1487 1324 1344 1364 1389 1414 1440 1465 1506 1547 1677
4490A677q6r0r0l9l8j8j7j8j7M9N0M9M9j0j0j1j0M0L9M0M0j04j03M0M1K9j00NOnnj3j2N9p1
$$ 1677 1591 1501 1411 1372 1334 1316 1299 1281 1264 1313 1363 1412 1461 1451 1441 1430 1420 1460 1499 1539 1579 1475 1372 1412 1453 1482 1382 1387 1393 1388 1383 1370 1358 1417 1346
4485A346J10J11K5K6m0m0QPj31%K5K6L3L3K4K3M0r1j11K0J19j0q1q1L3J63l2l1RRk4k5j05
$$ 1346 1456 1567 1592 1618 1578 1538 1546 1553 1422 1422 1447 1473 1506 1539 1563 1586 1626 1535 1424 1444 1563 1553 1472 1391 1424 1587 1555 1524 1533 1542 1518 1493 1388
4480A388K4Q9m2k6k6K6K6O7o4L2L2m9Q1k3k4j5j4L7L7NMK2K2m3m3K1K1j62l1M4M3J8J9KJJ6
$$ 1388 1412 1501 1459 1433 1407 1433 1459 1526 1462 1494 1526 1477 1558 1535 1511 1496 1482 1519 1556 1561 1565 1587 1609 1566 1523 1544 1565 1403 1372 1416 1459 1477 1496 1498 1499 1515
4475A515J5j44P4R5R6N6p3j09j09l2l2%JP8P9M3q7J08J08n2n2l6l7P2P2k3k3K6j04p8N2L6
$$ 1515 1530 1386 1460 1555 1651 1707 1634 1525 1416 1384 1352 1352 1353 1431 1510 1553 1466 1574 1682 1630 1578 1542 1505 1577 1649 1626 1603 1629 1525 1447 1499 1535
4470A535L6j0j0j0j0K6K5j56k6opKKj1j1K2K1N8N7q1N0J10J09J0RNOn2n1p6N4O2o7r4L7m5
$$ 1535 1571 1561 1551 1541 1531 1557 1582 1426 1400 1394 1387 1389 1391 1380 1369 1391 1412 1470 1527 1446 1496 1606 1715 1725 1734 1739 1745 1693 1642 1566 1620 1682 1615 1521 1558 1513
4464A513m5L4L4K6K6M5q5j2j2J9J8K6K6j07K3m2m3l6R3K8j02k4k5K4K4N5p7O2O3N4N5O3o7
$$ 1513 1468 1502 1536 1562 1588 1633 1548 1536 1524 1543 1561 1587 1613 1506 1529 1487 1444 1408 1501 1529 1427 1403 1378 1402 1426 1481 1404 1466 1529 1583 1638 1701 1634
4459A634P1P1L5r4j91o0J9J8k4J05l3l3Q4Q4J8J9p4p4p3p4O7O7oJ25q5q5p7p6kkp5N5M9M8
$$ 1634 1705 1776 1811 1717 1526 1466 1485 1503 1479 1584 1551 1518 1602 1686 1704 1723 1649 1575 1502 1428 1495 1562 1556 1681 1596 1511 1434 1358 1356 1354 1279 1334 1383 1431
4454A431R0R0o1o0lmOj25M9M9J37Pk8k8nnnnO4O4j5j45N5N4r2L8m0m0q9q9j08K2J31JppJ37
$$ 1431 1521 1611 1550 1490 1487 1483 1489 1364 1413 1462 1599 1606 1578 1550 1545 1540 1535 1530 1594 1658 1643 1498 1553 1607 1515 1553 1513 1473 1384 1295 1187 1209 1340 1341 1334 1327 1464
4448A464J37n5n6JKL0j01L8L8k1k1M5M4k0j9NNM8q3rrlmNNl8R2R2l9j8j8k6k6K2K3K3K2J0
$$ 1464 1601 1546 1490 1491 1493 1523 1422 1460 1498 1477 1456 1501 1545 1525 1506 1511 1516 1564 1481 1472 1463 1460 1456 1461 1466 1428 1520 1612 1573 1555 1537 1511 1485 1507 1530 1553 1575 1585
4443A585J0Q3m7p7p8q5q5M4M4M4M4k4k5QQp4p4P8P8l0l1P8P8ppl9m0JJL4L4J0J1n4n5nnO0
$$ 1585 1595 1678 1631 1554 1476 1391 1306 1350 1394 1438 1482 1458 1433 1441 1449 1375 1301 1379 1457 1427 1396 1474 1552 1545 1538 1499 1459 1460 1461 1495 1529 1539 1550 1496 1441 1436 1431 1491
4437A491O1r0r0O3O2M9N0J7J7L1L2j20j20J6J6m9m9L6L5L5L5l5l6l5l5P1P2l7l7J9K0K0K0
$$ 1491 1552 1462 1372 1435 1497 1546 1596 1613 1630 1661 1693 1573 1453 1469 1485 1436 1387 1423 1458 1493 1528 1493 1457 1422 1387 1458 1530 1493 1456 1475 1495 1515 1535
4432A535Q4Q3J8J8q5q5k0k0K0J9J9J9k3k3M3M2N0N0j01j02N6N6n3n3k6k7Q3Q2m8m8J7J7J06
$$ 1535 1619 1702 1720 1738 1653 1568 1548 1528 1548 1567 1586 1605 1582 1559 1602 1644 1694 1744 1643 1541 1597 1653 1600 1547 1521 1494 1577 1659 1611 1563 1580 1597 1703
4427A703J05m6m6r4r3N9N9J2J3k1k0n7n8N1N1M6M6j9j9k1k2M3M4r9r9J0J0N3N3j1j2N8N8n1
$$ 1703 1808 1762 1716 1622 1529 1588 1647 1659 1672 1651 1631 1574 1516 1567 1618 1664 1710 1691 1672 1651 1629 1672 1716 1617 1518 1528 1538 1591 1644 1633 1621 1679 1737 1686
4421A686n0JJRj21P5P6L1r8k6k5L1L2K1K1j17J2o0o1J00J00N2N2nnj02K8N4N5k6j57m8Q2M6
$$ 1686 1636 1637 1638 1647 1526 1601 1677 1708 1610 1584 1559 1590 1622 1643 1664 1547 1559 1499 1438 1538 1638 1690 1742 1737 1732 1630 1658 1712 1767 1741 1584 1536 1618 1664
4416A664M5J43p4n9n8j14J7MMJ19j3k9k9K7K8j17j16J23J22KJk3k3k8J03M5q4j51k0PPkjN6
$$ 1664 1709 1852 1778 1719 1661 1547 1564 1568 1572 1691 1678 1649 1620 1647 1675 1558 1442 1565 1687 1689 1690 1667 1644 1616 1719 1764 1680 1529 1509 1516 1523 1521 1520 1576
4411A576N5J12j9m5m6nJ25J01l0j03K8q7q6N2N2L8L8M7j71j22QLMQ4Q4q2M9m1Q9Q6m4j01K9
$$ 1576 1631 1743 1724 1679 1633 1628 1753 1854 1824 1721 1749 1662 1576 1628 1680 1718 1756 1803 1632 1510 1518 1521 1525 1609 1693 1611 1660 1619 1708 1794 1750 1649 1678
4406A678N6N6m5m4l7l6m5m4O4o7PPM8M8o1o1k8k8L7L8m7m7J8J8J11J10M5M6K1K1q8q8n8n9
$$ 1678 1734 1790 1745 1701 1664 1628 1583 1539 1603 1536 1543 1550 1598 1646 1585 1524 1496 1468 1505 1543 1496 1449 1467 1485 1596 1706 1751 1797 1818 1839 1751 1663 1605 1546
4401A546R3R3k8k8k8k9L0L1lkLMo2o1k3k4k3k4J22J21J00j17j46j6OO%%O6O5O0N9r3r2Q8Q8
$$ 1546 1639 1732 1704 1676 1648 1619 1649 1680 1677 1675 1678 1682 1620 1559 1536 1512 1489 1465 1587 1708 1808 1691 1545 1529 1535 1541 1541 1541 1607 1672 1732 1791 1698 1606 1694 1782
4395A782Q7Q8P6P6j20j20j24j24j5j5J5J5m9n0N2N3Q5Q5q8q7K0K1M6M6o3o3R2R1K6K6l4l4
$$ 1782 1869 1957 2033 2109 1989 1869 1745 1621 1606 1591 1606 1621 1572 1522 1574 1627 1712 1797 1709 1622 1642 1663 1709 1755 1692 1629 1721 1812 1838 1864 1830 1796
4391A796l5l4qrK5K4K6K6l9l9rqrqlklkl5l4kkJ15J16l7l6j09j08Q7Q7o8o8M0M1jjl4l3m5
$$ 1796 1761 1727 1719 1710 1735 1759 1785 1811 1772 1733 1724 1716 1707 1699 1696 1694 1691 1689 1654 1620 1618 1616 1731 1847 1810 1774 1665 1557 1644 1731 1663 1595 1635 1676 1675 1674 1640 1607 1562
4385A562m5J07J07k6k6k6k6k5k5L2L3J71M0l8l8q8q8K0K0L2L2J8J8J55o1q4q3PJ37l6l7j28
$$ 1562 1517 1624 1731 1705 1679 1653 1627 1602 1577 1609 1642 1813 1853 1815 1777 1689 1601 1621 1641 1673 1705 1723 1741 1896 1835 1751 1668 1675 1812 1776 1739 1611
4380A611JO7o3k7k7m3Q7M4M5K0K0N4N5j1j0N7N8j25Ol2l3RQPQL9M0p3p3O5o5l2l2O9O8K6K5
$$ 1611 1612 1679 1616 1589 1562 1519 1606 1650 1695 1715 1735 1789 1844 1833 1823 1880 1938 1813 1819 1787 1754 1763 1771 1778 1786 1825 1865 1792 1719 1784 1719 1687 1655 1724 1792 1818 1843
4374A843m0m0l7l8m5Q5L7L8k0k0j9k0M5M6l2l3L3L3m0m1K5K5L7L6k0k0j13J8J0Rl4l4L1L1
$$ 1843 1803 1763 1726 1688 1643 1728 1765 1803 1783 1763 1744 1724 1769 1815 1783 1750 1783 1816 1776 1735 1760 1785 1822 1858 1838 1818 1705 1723 1733 1742 1708 1674 1705 1736
4369A736k9k9K8K9J14j5n1n0m9m9q9M0N3N2P4j43RQnoj2j1M0L9J60n8l1l1p9J37QPP6n5J8
$$ 1736 1707 1678 1706 1735 1849 1834 1783 1733 1684 1635 1546 1586 1639 1691 1765 1622 1631 1639 1634 1628 1616 1605 1645 1684 1844 1786 1755 1724 1645 1782 1790 1797 1873 1818 1836
4364A836J8K1K1K9j01r1r0J0J0L8L8L8L8j3j4j3j4O1O0j8j49n5n5M6M5J0J0n5n5J5J5J6J5
$$ 1836 1854 1875 1896 1925 1824 1733 1643 1653 1663 1701 1739 1777 1815 1802 1788 1775 1761 1822 1882 1864 1715 1660 1605 1651 1696 1706 1716 1661 1606 1621 1636 1652 1667
4358A667m2m1m2m1N0N0Q3Q2L5L4l0l1j46j47R3R2K9K8l7l6L7L7NNM5M4N3p7l7l6O3O4j2j2
$$ 1667 1625 1584 1542 1501 1551 1601 1684 1766 1801 1835 1805 1774 1628 1481 1574 1666 1695 1723 1686 1650 1687 1724 1729 1734 1779 1823 1876 1799 1762 1726 1789 1853 1841 1829
4353A829K1K1j6j6j6j6%JK5K6K8j01l7R4k7k6L8L9J41J2J9K0j50j50J0J0m1Q9qqJ6J46p1p1
$$ 1829 1850 1871 1855 1839 1823 1807 1807 1808 1833 1859 1887 1786 1749 1843 1816 1790 1828 1867 2008 2020 2039 2059 1909 1759 1769 1779 1738 1827 1819 1811 1827 1973 1902 1831
4348A831q5M5J2J3p8N3Q5m5o6o7m5J72M8M7L4r7j22PL4L5j8j8J5J5k0k0k0k0MLO9O9O4O5q7
$$ 1831 1746 1791 1803 1816 1738 1791 1876 1831 1765 1698 1653 1825 1873 1920 1954 1857 1735 1742 1776 1811 1793 1775 1790 1805 1785 1765 1745 1725 1729 1732 1801 1870 1934 1999 1912
4343A912q7n1n1N7N8l1l2KJK5K6K5K5j31j31O4O4M5M6M5M5k4k3M1M1o0o0NNj1j2N4N4M1M1
$$ 1912 1825 1774 1723 1780 1838 1807 1775 1777 1778 1803 1829 1854 1879 1748 1617 1681 1745 1790 1836 1881 1926 1902 1879 1920 1961 1901 1841 1846 1851 1840 1828 1882 1936 1977 2018
4337B018o8o8K5K5K4K5m5m5m5m5n3n3N6N5O7O7m1m2p0p0nmL6L6L6L6l7l7P1P1KJJKl6l5P3
$$ 2018 1950 1882 1907 1932 1956 1981 1936 1891 1846 1801 1748 1695 1751 1806 1873 1940 1899 1857 1787 1717 1712 1708 1744 1780 1816 1852 1815 1778 1849 1920 1922 1923 1924 1926 1890 1855 1928
4332A928P3n7n6R5R5l3l3jjL3L2l3l3j1j0N4N5q7q7k2k2r5r6J01J00j04j03M9M8J%%JL5L5
$$ 1928 2001 1944 1888 1983 2078 2045 2012 2011 2010 2043 2075 2042 2009 1998 1988 2042 2097 2010 1923 1901 1879 1784 1688 1789 1889 1785 1682 1731 1779 1780 1780 1780 1781 1816 1851
4326A851KKJ0RP4P4k2k2n4n5p0p0L8L8Q0Q0J5J5k3k2n5n5K2K2Q8Q7m7m8J8J7m4m5m5m5M6M6
$$ 1851 1853 1855 1865 1874 1948 2022 2000 1978 1924 1869 1799 1729 1767 1805 1885 1965 1980 1995 1972 1950 1895 1840 1862 1884 1972 2059 2012 1964 1982 1999 1955 1910 1865 1820 1866 1912
4321A912j0j1j12J9J42J41J3J2r5r6M1M1RQL7L7j06j07mJ27P7P8K5j06J%K0J9r7r7J10k0K1
$$ 1912 1902 1891 1779 1798 1940 2081 2094 2106 2011 1915 1956 1997 2006 2014 2051 2088 1982 1875 1871 1998 2075 2153 2178 2072 2073 2073 2093 2112 2015 1918 2028 2008 2029
4316B029K1k9k9K9K8M7q3m2m2K0K1Q6Q6j0j0O3o7J1J0KLl2l3o5o4P5P6J1J1M0L9k5k5o3o3
$$ 2029 2050 2021 1992 2021 2049 2096 2013 1971 1929 1949 1970 2056 2142 2132 2122 2185 2118 2129 2139 2141 2144 2112 2079 2014 1950 2025 2101 2112 2123 2163 2202 2177 2152 2089 2026
4311B026J19j1jjj0rl7l7P6n3j33lJ04J03N0q0opj6j6J19r7q6J32j2j2O6o3j29KO0O0LLO9
$$ 2026 2145 2134 2133 2132 2122 2113 2076 2039 2115 2062 1929 1926 2030 2133 2183 2103 2097 2090 2074 2058 2177 2080 1994 2126 2114 2102 2168 2105 1976 1978 2038 2098 2101 2104 2173
4305B173O8p6p5n8P2o6o6L3L3L3L2L1L1R6R6n3n3OK24M0j77m9n0M7q3q3M7K7K7L6L5NMMMq
$$ 2173 2241 2165 2090 2032 2104 2038 1972 2005 2038 2071 2103 2134 2165 2261 2357 2304 2251 2257 2481 2521 2344 2295 2245 2292 2209 2126 2173 2200 2227 2263 2298 2303 2307 2311 2315 2307
4300B307rR9J00l2l2L3L3j7j8M7M8l4l4m3Q9J80J80J24J23K41K42J33J33J80J80J73J72J79
$$ 2307 2298 2397 2497 2465 2433 2466 2499 2482 2464 2511 2559 2525 2491 2448 2537 2717 2897 3021 3144 3385 3627 3760 3893 4073 4253 4426 4598 4777
4295D777M9J3J4O4O5P9j39k48k47k29k29l14l13j54j53j87n7Rj22o6o7o6o7pJ22J7J7j4j4
$$ 4777 4826 4839 4853 4917 4982 5061 4922 4674 4427 4198 3969 3655 3342 3188 3035 2848 2791 2800 2678 2612 2545 2479 2412 2405 2527 2544 2561 2547 2533
4291B533q0p9QQQQp3p3pqO1O0mnmnl7l8J2J1m5m5k4J07Q3m8K2J53L8L9QPL2L2m0j70r7r6K5
$$ 2533 2453 2374 2382 2390 2398 2406 2333 2260 2253 2245 2306 2366 2362 2357 2353 2348 2311 2273 2285 2296 2251 2206 2182 2289 2372 2324 2346 2499 2537 2576 2584 2591 2623 2655 2615 2445 2348 2252 2277
4285B277K5L3L3k1J09J09k1l1l2l9l9nnK8K7o1o1mnQ2m9q2M9R2R2qrnnp0p0O6O6N2N3J52o4
$$ 2277 2302 2335 2368 2347 2456 2565 2544 2513 2481 2442 2403 2398 2393 2421 2448 2387 2326 2322 2317 2399 2350 2268 2317 2409 2501 2493 2484 2479 2474 2404 2334 2400 2466 2518 2571 2723 2659
4279B659r4r5ONONL2L2L2L2K9K8mmLKo3o3OONON9N9n0n0L7L7k9k8K2K3R5l4K4K5M9M9o9p0
$$ 2659 2565 2470 2476 2481 2487 2492 2524 2556 2588 2620 2649 2677 2673 2669 2672 2674 2611 2548 2554 2560 2565 2571 2630 2689 2639 2589 2626 2663 2634 2606 2628 2651 2746 2712 2736 2761 2810 2859 2790 2720
4273B720mmL1L2l3l4n0n1p2N9J35q1K5K4p6N4L7L8P5n6J8J8N9N9n0n0K9K9K9L0o8o8M1M0J8
$$ 2720 2716 2712 2743 2775 2742 2708 2658 2607 2535 2594 2729 2648 2673 2697 2621 2675 2712 2750 2825 2769 2787 2805 2864 2923 2873 2823 2852 2881 2910 2940 2872 2804 2845 2885 2903
4268B903J7ppn5P6J16j4o8O3k8k7N5p5p5N5N8N8q6q5J6J6Q1Q1J2J1r6r7nnmnL6L7L6L6l8l9
$$ 2903 2920 2913 2906 2851 2927 3043 3029 2961 3024 2996 2969 3024 2949 2874 2929 2987 3045 2959 2874 2890 2906 2987 3068 3080 3091 2995 2898 2893 2888 2884 2879 2915 2952 2988 3024 2986 2947
4262B947l8l8Q2Q2J8J7K7K6l8l8Q2Q2J7J6L6L6p2p3L8L9k7k6m8m9J04J04m5m4J86l0n6n5l
$$ 2947 2909 2871 2953 3035 3053 3070 3097 3123 3085 3047 3129 3211 3228 3244 3280 3316 3244 3171 3209 3248 3221 3195 3147 3098 3202 3306 3261 3217 3403 3373 3317 3262 3259
4257C259mR9J00n3n2J0J0J0J0K7K8K8K7k5k5k5k6n1n2N7N7PPn7n8K6K6N8N9rj0K4K3M4M5M4
$$ 3259 3255 3354 3454 3401 3349 3359 3369 3379 3389 3416 3444 3472 3499 3474 3449 3424 3398 3347 3295 3352 3409 3416 3423 3366 3308 3334 3360 3418 3477 3468 3458 3482 3505 3549 3594 3638
4252C638M4K4K4q5q4P9P9M7M6J%o4o5M9N0J6J7J9J9m7m6J4J5J4J5j2j1R7R7J21J21l1l1j65
$$ 3638 3682 3706 3730 3645 3561 3640 3719 3766 3812 3813 3813 3749 3684 3733 3783 3799 3816 3835 3854 3807 3761 3775 3790 3804 3819 3807 3796 3893 3990 4111 4232 4201 4170 4005
4247D005j65L1L0L7L6LMJ3J4P9P9QQQRQ5Q5J9K0j6j5m9m8J7J8Q2Q3O8O8MLJ0J0m2m2l4J83
$$ 4005 3840 3871 3901 3938 3974 3977 3981 3994 4008 4087 4166 4174 4182 4190 4199 4284 4369 4388 4408 4392 4377 4328 4280 4297 4315 4397 4480 4548 4616 4620 4623 4633 4643 4601 4559 4525 4708
4241D708J83l4lkp4J44MNQ3Q3o7o7J1J1l1J85J28kj8j49nJ26K5K6L3L4P9P9M6M7Q9R0o3o2
$$ 4708 4891 4857 4854 4852 4778 4922 4926 4931 5014 5097 5030 4963 4974 4985 4954 5139 5267 5265 5247 5098 5093 5219 5244 5270 5303 5337 5416 5495 5541 5588 5677 5767 5704 5642
4236E642K1K1K1K1K8K8K8K8N2N1J16J16O1O1O1O0J8J8J8J8QQM1M0j9j8J33J33J28J28O3O3
$$ 5642 5663 5684 5705 5726 5754 5782 5810 5838 5890 5941 6057 6173 6234 6295 6356 6416 6434 6452 6470 6488 6496 6504 6545 6585 6566 6548 6681 6814 6942 7070 7133 7196
4231G196N2N3K0K0l2l3P7P6J21J22N7N6J72J72J9K0J18J19Q5Q6M8M7J57J56J27J27J27J28
$$ 7196 7248 7301 7321 7341 7309 7276 7353 7429 7550 7672 7729 7785 7957 8129 8148 8168 8286 8405 8490 8576 8624 8671 8828 8984 9111 9238 9365 9493
4227I493J18J18N4N3K58K58J93J93K25K26J60J61J36J36K01K01J43J42M25M25N85N85Q11R40
$$ 9493 9611 9729 9783 9836 10094 10352 10545 10738 10963 11189 11349 11510 11646 11782 11983 12184 12327 12469 12894 13319 13904 14489 15300 16240
4223A6240J032J293J176R15J062Q02P36P36Q02Q02J025J285J508J507J763K023K291K552K638
$$ 16240 17272 18565 19741 20656 21718 22520 23256 23992 24794 25596 26621 27906 29414 30921 32684 34707 36998 39550 42188
4220D2188L073L333M114N385O860Q554R509R088Q958R922J2265J6931K3269L2314M3862N4293
$$ 42188 45261 48594 52708 58093 64953 73507 83016 92104 101062 110984 123249 140180 163449 195763 239625 293918
4218B93918O4627P2663O9972N7838N1672L9434o847l4156m3099o1063p2264p1852o4124n6519
$$ 293918 358545 431208 501180 559018 610690 650124 643277 609121 566022 504959 432695 360843 296719 240200
4216B40200m5492l4800k6204j9186j4411j1817j0515j0553j0118q763p112n720m418l560k953
$$ 240200 194708 159908 133704 114518 100107 88290 77775 67222 57104 48341 41229 35509 31091 27531 24578
4213B4578k601k167j925j665j513j383j361j230j114j114r37n03k34k35k45J5J26J27L4L4
$$ 24578 21977 19810 17885 16220 14707 13324 11963 10733 9619 8505 7568 7065 6831 6596 6351 6366 6492 6619 6653 6687
4210F687j18j19j83j84j40j40j72j73j53j53k61k62j27j27o1o2n2n3j09j09j46j5q8q9p4p4
$$ 6687 6569 6450 6267 6083 5943 5803 5631 5458 5305 5152 4891 4629 4502 4375 4314 4252 4200 4147 4038 3929 3783 3768 3680 3591 3517 3443
4206C443p4p4n9n9O1p0k22nM6q3j1j0r2L9nmLLq1q2m6Q4n2n2j2j1n2n1m4m3o6O5rqLLLLQP
$$ 3443 3369 3295 3236 3177 3238 3168 2946 2941 2987 2904 2893 2883 2791 2830 2825 2821 2824 2827 2746 2664 2618 2702 2650 2598 2586 2575 2523 2472 2428 2385 2319 2384 2375 2367 2370 2373 2376 2379 2387 2394
4200B394PPn6n6o5O6j7j7p4p4nnJ03J04K4K5R0R0L6L7k9k8m0l9j05j04O0O0m0m0j34lo9o8
$$ 2394 2401 2408 2352 2296 2231 2297 2280 2263 2189 2115 2110 2105 2208 2312 2336 2361 2451 2541 2577 2614 2585 2557 2517 2478 2373 2269 2329 2389 2349 2309 2175 2172 2103 2035
4195B035J3J43l8l8L3L3%Jl8l9l0l0k7J04l5l5P2P2l6l7n7n6o5O5LMJ2J2J4J5OPN1p9K2J51
$$ 2035 2048 2191 2153 2115 2148 2181 2181 2182 2144 2105 2075 2045 2018 2122 2087 2052 2124 2196 2160 2123 2066 2010 1945 2010 2013 2017 2029 2041 2055 2070 2076 2083 2134 2055 2077 2228
4189B228O9o1j18J2R7R7L4r5r9L1j8j8n4n4J1J1k6k6k6k6L4L3%Jj4j4J38J39p1p0nnl8l9n
$$ 2228 2297 2236 2118 2130 2227 2324 2358 2263 2164 2195 2177 2159 2105 2051 2062 2073 2047 2021 1995 1969 2003 2036 2036 2037 2023 2009 2147 2286 2215 2145 2140 2135 2097 2058 2053
4184B053ok8k7L8L8N7N8n1n1M6M6n5n4j33lP6P6o8o9l8J79J8J8P2n8lkj0j0k0k0M6M5n0n1
$$ 2053 2047 2019 1992 2030 2068 2125 2183 2132 2081 2127 2173 2118 2064 1931 1928 2004 2080 2012 1943 1905 2084 2102 2120 2192 2134 2131 2129 2119 2109 2089 2069 2115 2160 2110 2059
4179B059O4o6n1P9J36Op3p4q9M0M6M6lkp1O0M3M3J4j17n2n2L6r6k1k2O6O6N9N8J05k5j34m
$$ 2059 2123 2057 2006 2085 2221 2227 2154 2080 1991 2031 2077 2123 2120 2118 2047 2107 2150 2193 2207 2090 2038 1986 2022 1926 1905 1883 1949 2015 2074 2132 2237 2212 2078 2074
4174B074n9o0N7N6J2J1j03K8J28lk9l0PPk6k6M0M1o8o8K9K8N3N3L4r6RJ0J1J2J1J1KJJJj18
$$ 2074 2015 1955 2012 2068 2080 2091 1988 2016 2144 2141 2112 2082 2089 2096 2070 2044 2084 2125 2057 1989 2018 2046 2099 2152 2186 2090 2099 2109 2120 2132 2143 2154 2156 2157 2158 2159 2041
4168B041j18J20J21J2J2Q5m5j14j15non2P9P0P0k6k6l4l5P3n7Q1Q1NOn9o0j11j11J28J28O3
$$ 2041 1923 2043 2164 2176 2188 2273 2228 2114 1999 1994 1988 1936 2015 2085 2155 2129 2103 2069 2034 2107 2050 2131 2212 2217 2223 2164 2104 1993 1882 2010 2138 2201
4163B201O4M2q8k28j1J1J0L6L5K8K7L1j00j23R3L7r3J02J03onJ24nK6j05n6P5J9j12N2p9l9
$$ 2201 2265 2307 2219 1991 1980 1991 2001 2037 2072 2100 2127 2158 2058 1935 2028 2065 1972 2074 2177 2171 2166 2290 2285 2311 2206 2150 2225 2244 2132 2184 2105 2066
4158B066R2k5j55o5o4K7K8J39Rk7k7L9L9kjP8n1Q6Q7k2k3M3M3O4O5j61l1KKn5n5rj0p4p5N7
$$ 2066 2158 2133 1978 1913 1849 1876 1904 2043 2052 2025 1998 2037 2076 2074 2073 2151 2100 2186 2273 2251 2228 2271 2314 2378 2443 2282 2251 2253 2255 2200 2145 2136 2126 2052 1977 2034
4153B034N7N7N8j07j06KKn4n4Q9R0R2l8p9N2J40J0o0o1MMo9O1N5N5kkllL0L0M8M8o0o1q1q1
$$ 2034 2091 2148 2206 2099 1993 1995 1997 1943 1889 1978 2068 2160 2122 2043 2095 2235 2245 2185 2124 2128 2132 2063 2124 2179 2234 2232 2230 2227 2224 2254 2284 2332 2380 2320 2259 2178 2097
4147B097K8K8l9l9K7K6L9M0L9L9o0o1k8k7N5N6j0j0N0M9j5j6%%j%L4L4L3L4k7k7k8k7%%%j
$$ 2097 2125 2153 2114 2075 2102 2128 2167 2207 2246 2285 2225 2164 2136 2109 2164 2220 2210 2200 2250 2299 2284 2268 2268 2268 2267 2267 2301 2335 2368 2402 2375 2348 2320 2293 2293 2293 2293 2292
4141B292KKj29Q9J62L1N3N4j2j1N4N4PPM0M0K39K39J74J74J90J90J89J90J79J79P0P0POn8
$$ 2292 2294 2296 2167 2256 2418 2449 2502 2556 2544 2533 2587 2641 2648 2655 2695 2735 2974 3213 3387 3561 3751 3941 4130 4320 4499 4678 4748 4818 4825 4831 4773
4136D773n9k58k58j49j50k10k10j85j86j13k44j92K5R1l9k3j52p7N3P8n2j07j07ooL1L1O3
$$ 4773 4714 4456 4198 4049 3899 3689 3479 3294 3108 2995 2751 2559 2584 2675 2636 2613 2461 2384 2437 2515 2463 2356 2249 2243 2237 2268 2299 2362
4132B362O4n6n6j21j20P7P8J01J02J4j16j09J09P0o0ooo9o9L9M0J7J7J7J8j8j9j8j8L0L0l5
$$ 2362 2426 2370 2314 2193 2073 2150 2228 2329 2431 2445 2329 2220 2329 2399 2339 2333 2327 2258 2189 2228 2268 2285 2302 2319 2337 2319 2300 2282 2264 2294 2324 2289
4127B289l5n9n8M2M2J15j5n1n1%Jl3l2M5M5M5M6JKL4L5m8m8n6P5PPj2j42m8Q2O6O6j5j6N8
$$ 2289 2254 2195 2137 2179 2221 2336 2321 2270 2219 2219 2220 2187 2155 2200 2245 2290 2336 2337 2339 2373 2408 2360 2312 2256 2331 2338 2345 2333 2191 2143 2225 2291 2357 2342 2326 2384
4122B384p3klO3o8O3O2n4n4QQn7n7K9K8J16j5j42P6J0J1L0L0l5l5J7J7k4k3J12j7j0rK4K3
$$ 2384 2311 2309 2306 2369 2301 2364 2426 2372 2318 2326 2334 2277 2220 2249 2277 2393 2378 2236 2312 2322 2333 2363 2393 2358 2323 2340 2357 2333 2310 2422 2405 2395 2386 2410 2433
4116B433m1m2M4M4N2N2j30jO5o5j9j9L8L7m5m6L6r5J3J43O1O2p0p0o1o2J5J44R3l7n1J66l0
$$ 2433 2392 2350 2394 2438 2490 2542 2412 2411 2476 2411 2392 2373 2411 2448 2403 2357 2393 2298 2311 2454 2515 2577 2507 2437 2376 2314 2329 2473 2566 2529 2478 2644 2614
4111B614k9r4r3R4R4N8p2p2N8q4q5j18J3j4j5R4R4Q8m3o9p0rJ22M9M8j0j0j18j18R7R8O3o8
$$ 2614 2585 2491 2398 2492 2586 2644 2572 2500 2558 2474 2389 2271 2284 2270 2255 2349 2443 2531 2488 2419 2349 2340 2462 2511 2559 2549 2539 2421 2303 2400 2498 2561 2493
4106B493j6j5R9j19P2P3K6K6k9k8r4r4O3O4l7l7k5J05M8q2MJ33N2N2j3j4m6m6k8k7L8L8m6
$$ 2493 2477 2462 2561 2442 2514 2587 2613 2639 2610 2582 2488 2394 2457 2521 2484 2447 2422 2527 2575 2493 2497 2630 2682 2734 2721 2707 2661 2615 2587 2560 2598 2636 2590
4101B590m5m6m6k5k6L9M0mllmj7j8J5J4R2R1K7K6m8m8j8K00jjm5m4l7R4N3N4n8n7j%P2n8J5
$$ 2590 2545 2499 2453 2428 2402 2441 2481 2477 2474 2471 2467 2450 2432 2447 2461 2553 2644 2671 2697 2649 2601 2583 2783 2782 2781 2736 2692 2655 2749 2802 2856 2798 2741 2740 2740 2812 2754 2769
4096B769J6n4n4j9J12K6K6l0l1P8P8L7L7M8q3j15J5J10J11l4l4rrO4O3n5P5J40Rj4j4Q6Q7
$$ 2769 2785 2731 2677 2658 2770 2796 2822 2792 2761 2839 2917 2954 2991 3039 2956 2841 2856 2966 3077 3043 3009 3000 2991 3055 3118 3063 3138 3278 3287 3273 3259 3345 3432
4091C432J14J15J15J15J01J02J67J67J03J03J11J11j22Qo5o5j49j50j65l6M9q2n7n8j71m1
$$ 3432 3546 3661 3776 3891 3992 4094 4261 4428 4531 4634 4745 4856 4734 4742 4677 4612 4463 4313 4148 4112 4161 4079 4022 3964 3793 3752
4087C752ooj03j04j03K7qJ24O6O6p0O0R6R6K35K36L00Q4r4L6j22k51j45j4o0P0K3K4L1L1P9
$$ 3752 3746 3740 3637 3533 3430 3457 3449 3573 3639 3705 3635 3695 3791 3887 4122 4358 4658 4742 4648 4684 4562 4311 4166 4152 4092 4162 4185 4209 4240 4271 4350
4082D350P9j52j51j79m9L8L9j8J13J21rL9J70K36J05k4J06Q2Q2J3j18k82k83k34k34j25j26
$$ 4350 4429 4277 4126 3947 3898 3936 3975 3957 4070 4191 4182 4221 4391 4627 4732 4708 4814 4896 4978 4991 4873 4591 4308 4074 3840 3715 3589
4078C589J0J0m7m8j13J6QRM2M2J15j5KLj58j57n1n1P1K01k6k7N5p5m8m7n6n6%%%%M3M3k2k2
$$ 3589 3599 3609 3562 3514 3401 3417 3425 3434 3476 3518 3633 3618 3620 3623 3465 3308 3257 3206 3277 3478 3452 3425 3480 3405 3357 3310 3254 3198 3198 3198 3198 3198 3241 3284 3262 3240
4072C240l8l9K7K7K8K8K8K8k9k9k9k9J02J03q5q5n6P4QRl7R4K0K0K8K9K8K8j7j7j6j7K1K1
$$ 3240 3202 3163 3190 3217 3245 3273 3301 3329 3300 3271 3242 3213 3315 3418 3333 3248 3192 3266 3274 3283 3246 3340 3360 3380 3408 3437 3465 3493 3476 3459 3443 3426 3447 3468
4067C468Q7Q6p6p6q5M6M1M0qqo8O2N5N4llj32Q4J10j9O7O7m0m0m0m0PPO4O4n8j88l6R4L9L9
$$ 3468 3555 3641 3565 3489 3404 3450 3491 3531 3523 3515 3447 3509 3564 3618 3615 3612 3480 3564 3674 3655 3722 3789 3749 3709 3669 3629 3636 3643 3707 3771 3713 3525 3489 3583 3622 3661
4062C661N6N5j14J6N2N1j5j5k3J07M9M9rq%%%jN7N7N7N7r0r1J06J05LMLLppqp%j%jo6o6M3
$$ 3661 3717 3772 3658 3674 3726 3777 3762 3747 3724 3831 3880 3929 3920 3912 3912 3912 3912 3911 3968 4025 4082 4139 4049 3958 4064 4169 4172 4176 4179 4182 4175 4168 4160 4153 4153 4152 4152 4151 4085 4019 4062
4055D062M3K2K2Q8Q7opR4R4K0j11j19J1J04k6m6m5k7J02L0K9k7k8k7k8M7M8N5N5L7J66O7o4
$$ 4062 4105 4127 4149 4237 4324 4318 4311 4405 4499 4519 4408 4289 4300 4404 4378 4332 4287 4260 4362 4392 4421 4394 4366 4339 4311 4358 4406 4461 4516 4553 4719 4786 4722
4050D722n8P2J6J5Rj21n5P4R1R1m5m5J3J44L8L8J4J3K01K01J06k4n7P4N9O0q5q4k3k2j10K1
$$ 4722 4664 4736 4752 4767 4776 4655 4600 4674 4765 4856 4811 4766 4779 4923 4961 4999 5013 5026 5227 5428 5534 5510 5453 5527 5586 5646 5561 5477 5454 5432 5322 5343
4045E343J28q8o8o7o7o6M1M2K4K3rrj8j8M6M7l6l7jJ29J9K0J01l0J8J8P5P5O0N9LKN4J84J1
$$ 5343 5471 5383 5315 5248 5181 5115 5156 5198 5222 5245 5236 5227 5209 5191 5237 5284 5248 5211 5210 5339 5358 5378 5479 5449 5467 5485 5560 5635 5695 5754 5757 5759 5813 5997 6008
4040F008J0mJ26K34J04n3n4J33J33m7m7Jj29j10K0J1j18m4m5J3J3%%L3L2LMO8O8J6J5M8M8
$$ 6008 6018 6014 6140 6374 6478 6425 6371 6504 6637 6590 6543 6544 6415 6305 6325 6336 6218 6174 6129 6142 6155 6155 6155 6188 6220 6223 6227 6295 6363 6379 6394 6442 6490
4035F490J3J3J3J3J07J07jjRQqJ23N9p2J8J8K6J55RJ0J27lL8L7P5P4L4L4P9n1M6M7J81N1k8
$$ 6490 6503 6516 6529 6542 6649 6756 6755 6754 6763 6771 6763 6886 6945 6873 6891 6909 6935 7090 7099 7109 7236 7233 7271 7308 7383 7457 7491 7525 7604 7553 7599 7646 7827 7878 7850
4030G850k8M9M9M2M1J39J0k4J07PQQ0Q1O6O6O6O6o0o0J70J71J46J7K4K5J36J36P0P1L6L7J01
$$ 7850 7822 7871 7920 7962 8003 8142 8152 8128 8235 8242 8250 8330 8411 8477 8543 8609 8675 8615 8555 8725 8896 9042 9059 9083 9108 9244 9380 9450 9521 9557 9594 9695
4025I695J02O5O5J72M1M3M4K22OM3M3J02k8K26K26J45J44J34MP6P7J33J33J97J98J75J75K40
$$ 9695 9797 9862 9927 10099 10140 10183 10227 10449 10455 10498 10541 10643 10615 10841 11067 11212 11356 11490 11494 11570 11647 11780 11913 12110 12308 12483 12658 12898
4020A2898K2J0J39K35J04J15J15J72J72K60K60M47K29J84J84K35K36K38K38M33K16L47M77
$$ 12898 12920 12930 13069 13304 13408 13523 13638 13810 13982 14242 14502 14949 15178 15362 15546 15781 16017 16255 16493 16926 17142 17489 17966
4017A7966P21N91Q54J159J184J183J853J984K106K106K222K223K705L444M165M296L172J740
$$ 17966 18687 19278 20132 21291 22475 23658 25511 27495 29601 31707 33929 36152 38857 42301 46466 50762 53934 55674
4014E5674Q90p16J41K356M550O071P329O244N101K973k687n074l186j667L82L204O725R763
$$ 55674 56564 55848 55989 58345 62895 68966 76295 82539 87640 90613 87926 82852 79666 77999 78381 81585 88310 98073
4011I8073J5080K1765K8002L3471M7137O9453P2509L2652J2942r200n7832o4692m7792l5374
$$ 98073 113153 134918 162920 196391 243528 312981 385490 418142 431084 421884 364052 299360 251568 216194
4009B16194k9805k4508j8029j2037p288l033J167N769R346J2386J8257L1022M8722N7666M6486
$$ 216194 186389 161881 143852 131815 124527 121494 122661 128430 137776 150162 168419 199441 248163 305829 352315
4007C52315J7050j0598k9961m5755m7751l8680k7305j9664j6103j2716p939k187L458Q268
$$ 352315 369365 358767 328806 283051 235300 196620 169315 149651 133548 120832 112893 110706 114164 122432
4005A22432J1655J4477K2552L6635M9747N1374M0521K5835r158l9691m8982m8651l7450k5369
$$ 122432 134087 148564 171116 207751 257498 308872 349393 375228 366070 326379 277397 228746 191296 165927
4003A65927j8163j4849j0247n178m03L483P910J4022K0881K6300L3681N1058P3721O5811K2133
$$ 165927 147764 132915 122668 117490 117087 120570 128480 142502 163383 189683 223364 274422 348143 413954 436087
4001D36087O938j7636o4677p0495n4290m2741l7802l1290k3507j6822j1831o882l094k28K494
$$ 436087 443025 425389 360712 290217 235927 193186 155384 124094 100587 83765 71934 65052 61958 61730 64224
3998F4224O229O131M86k821m644o995o994n896l204m41L40j000j609l583m539m668m233l444
$$ 64224 70453 76584 77070 74249 69605 62610 55616 49720 46516 46075 46415 45415 43806 40223 35684 31016 26783 23339
3995B3339k662k633k763k347j566j083q22n68l06m43m43m65k04l08l07l24l24k17k17k17k17
$$ 23339 20677 18044 15281 12934 11368 10285 9463 8895 8589 8146 7703 7238 7034 6726 6419 6095 5771 5554 5337 5120 4903
3992D903q3q2p5p4j56k6k5k6j1J20l3j62j01j00j60j60k35j8N5N6k9k8n2n3j32km0R0J6J6
$$ 4903 4820 4738 4663 4589 4433 4407 4382 4356 4345 4465 4432 4270 4169 4069 3909 3749 3514 3496 3551 3607 3578 3550 3498 3445 3313 3311 3271 3361 3377 3393
3988C393m1m1N8N7r5r4j68j68r8L3Q4m6o0o0n0J68J11J11q8q9k3k3K1K2q7q7o9o9o0o1r6L5
$$ 3393 3352 3311 3369 3426 3331 3237 3069 2901 2803 2836 2920 2874 2814 2754 2704 2872 2983 3094 3006 2917 2894 2871 2892 2914 2827 2740 2671 2602 2542 2481 2385 2420
3983B420K6K6K4K3K3K4J6J6r3r2Q8Q9O4O4j66l5j%kjo7o7k8k9J18j2j87n7N8N7N2N2j3j3p1
$$ 2420 2446 2472 2496 2519 2542 2566 2582 2598 2505 2413 2501 2590 2654 2718 2552 2517 2516 2516 2514 2513 2446 2379 2351 2322 2440 2428 2241 2184 2242 2299 2351 2403 2390 2377 2306
3977B306p2L7L7n0n0R4R4m2j73l4l4P4P4RRK4K4p7p7K9J59J00j18p1p2k8k8M3q8K1J51M5M6
$$ 2306 2234 2271 2308 2258 2208 2302 2396 2354 2181 2147 2113 2187 2261 2270 2279 2303 2327 2250 2173 2202 2361 2461 2343 2272 2200 2172 2144 2187 2099 2120 2271 2316 2362
3972B362q5q5j63N5Q4Q5J8J8J8J8k1k2k9l0M5q6nmn3P9mlQ6m4j09K2mln2n2k1J09M5M4o7O3
$$ 2362 2277 2192 2029 2084 2168 2253 2271 2289 2307 2325 2304 2282 2253 2223 2268 2182 2177 2173 2120 2199 2195 2192 2278 2234 2125 2147 2143 2140 2088 2036 2015 2124 2169 2213 2146 2209
3967B209O3o6j02j02l2l1l3J85j7j6J28q8l2l1J1J2r4L7L1L1PPK8K9l7l7N2N2ono4O7O6o4
$$ 2209 2272 2206 2104 2002 1970 1939 1906 2091 2074 2058 2186 2098 2066 2035 2046 2058 1964 2001 2032 2063 2070 2077 2105 2134 2097 2060 2112 2164 2158 2153 2089 2156 2222 2158
3962B158o1o2L9L8P3P3M2j74o9p0K6K5J12J13m0m0o8o8J27J28j13j13nmqrqqj8j8j8j8N5N4
$$ 2158 2097 2035 2074 2112 2185 2258 2300 2126 2057 1987 2013 2038 2150 2263 2223 2183 2115 2047 2174 2302 2189 2076 2071 2067 2059 2050 2042 2034 2016 1998 1980 1962 2017 2071
3957B071M6M6O1o9j35mJ8J8K5K6P3P4QQr6r6J3J3M0M1J6J6j08K3J4J4KLo3o3J5J6j7j7l9l9
$$ 2071 2117 2163 2224 2155 2020 2016 2034 2052 2077 2103 2176 2250 2258 2266 2170 2074 2087 2100 2140 2181 2197 2213 2105 2128 2142 2156 2158 2161 2098 2035 2050 2066 2049 2032 1993 1954
3951A954ppP4P4L4L3J7j13m0m0m3m3K3K2K0K1mml6R4K1K2l0k9J23J23j03j03n7n7l0J86qr
$$ 1954 1947 1940 2014 2088 2122 2155 2172 2059 2019 1979 1936 1893 1916 1938 1958 1979 1975 1971 1935 2029 2050 2072 2042 2013 2136 2259 2156 2053 1996 1939 1909 2095 2087 2078
3946B078p0k00Q2K13K5K5l2l1P3P3M6q4j25NL3L2O3O2q9q9m6m6J9K0J5J6j30jJ25ol3l3L4
$$ 2078 2008 1808 1890 2103 2128 2153 2121 2090 2163 2236 2282 2198 2073 2078 2111 2143 2206 2268 2179 2090 2044 1998 2017 2037 2052 2068 1938 1937 2062 2056 2023 1990 2024
3941B024L5l1l0m2m2P1n8M5J75N9p2K0K1k0k1n5n5n5n5L5L6L5L5J2J2J2J2q0q0K9K8l8l9l
$$ 2024 2059 2028 1998 1956 1914 1985 1927 1972 2147 2206 2134 2154 2175 2155 2134 2079 2024 1969 1914 1949 1985 2020 2055 2067 2079 2091 2103 2023 1943 1972 2000 1962 1923 1920
3936A920J27M4M5J33Mj18J3mmO0O0m9m9J02J02ppl1l2L4L4L9L9k7k6p1p1Q1Q1Q8Q9Q8Q9J40
$$ 1920 2047 2091 2136 2269 2273 2155 2168 2164 2160 2220 2280 2231 2182 2284 2386 2379 2372 2341 2309 2343 2377 2416 2455 2428 2402 2331 2260 2341 2422 2510 2599 2687 2776 2916
3930B916J41J73J73J57J56P8n2j01j02j09j09j19j19q6q6j26j27l9R1J26K56K49L1q8q9Q0
$$ 2916 3057 3230 3403 3560 3716 3794 3742 3641 3539 3430 3321 3202 3083 2997 2911 2785 2658 2619 2710 2836 3092 3341 3372 3284 3195 3275
3927C275n0J10J10l6R4n1n1R5l5k0j9k7k8q9q9j6j47j36j36j12j11J%J10J09J02J01N2J83
$$ 3275 3225 3335 3445 3409 3503 3452 3401 3496 3461 3441 3422 3395 3367 3278 3189 3173 3026 2890 2754 2642 2531 2532 2532 2642 2751 2853 2954 3006 3189
3922C189J33Ll2l3J81M9K9K8p8J40J99O9L3L3j28j27J7J7k58k57k36j06o2o3j98o8l2l3R1
$$ 3189 3322 3325 3293 3260 3441 3490 3519 3547 3469 3609 3808 3877 3910 3943 3815 3688 3705 3722 3464 3207 2971 2865 2803 2740 2542 2474 2442 2409 2500
3918B500R1j04j05l3l3o6o6n1n2k9J00J74m4K2K2l0k9LLo8o8M0M1j25j25P0P0m6m7J9J9N8
$$ 2500 2591 2487 2382 2349 2316 2250 2184 2133 2081 2052 2152 2326 2282 2304 2326 2296 2267 2270 2273 2205 2137 2177 2218 2093 1968 2038 2108 2062 2015 2034 2053 2111
3913B111N7ppq5q5j9k0L7L7L8L7j8j9j8j9k6k7k6k7J05J05J05J05o0o1j26j26M2M1k3k3m4
$$ 2111 2168 2161 2154 2069 1984 1965 1945 1982 2019 2057 2094 2076 2057 2039 2020 1994 1967 1941 1914 2019 2124 2229 2334 2274 2213 2087 1961 2003 2044 2021 1998 1954
3908A954m3j0j1mnK8K9M3M4J1J1J5J5r3r4O6O5m3m2k8k7L8L8Q8Q8N6N6n5n5J0J0nnp0p0k2
$$ 1954 1911 1901 1890 1886 1881 1909 1938 1981 2025 2036 2047 2062 2077 1984 1890 1956 2021 1978 1936 1908 1881 1919 1957 2045 2133 2189 2245 2190 2135 2145 2155 2150 2145 2075 2005 1983
3902A983k2Q7Q6j1j0m4m3N4N5N4N4p9p9m6m7k8k9L6L6J3J2M5M5n2n3R9J00q2q3m9n0K5K5m0
$$ 1983 1961 2048 2134 2123 2113 2069 2026 2080 2135 2189 2243 2164 2085 2039 1992 1964 1935 1971 2007 2020 2032 2077 2122 2070 2017 2116 2216 2134 2051 2002 1952 1977 2002 1962
3897A962m0J8J8j5j5J9J9Q3Q4p4p3L4L5O0N9m9n0L8L8p1p0N0N0J15J16n3n2m4m4p9N3J66n1
$$ 1962 1922 1940 1958 1943 1928 1947 1966 2049 2133 2059 1986 2020 2055 2115 2174 2125 2075 2113 2151 2080 2010 2060 2110 2225 2341 2288 2236 2192 2148 2069 2122 2288 2237
3892B237J3J3r6r5n5J63Q2m9qqq2q1mlJ2j17o6O5J8J49R7R7M0M1p7p6j1j2L7L6p2p3M1M0M0
$$ 2237 2250 2263 2167 2072 2017 2180 2262 2213 2205 2197 2115 2034 2030 2027 2039 1922 1856 1921 1939 2088 2185 2282 2322 2363 2286 2210 2199 2187 2224 2260 2188 2115 2156 2196 2236
3887B236M1p5p5r7J20J54K3p7p7r6L4K6K6j07j07M5M5J8J8j5j5K6K6opj1j0j1j1L6L5k1k2
$$ 2236 2277 2202 2127 2030 2150 2304 2327 2250 2173 2077 2111 2137 2163 2056 1949 1994 2039 2057 2075 2060 2045 2071 2097 2091 2084 2073 2063 2052 2041 2077 2112 2091 2069
3882B069m1Q9Q9m1M2M2KJk3k4M2M1q9q9N5N4k2j52q7M3Q5Q5N3N3M9q1p3p3M5M4L1L1P6j41
$$ 2069 2028 2117 2206 2165 2207 2249 2251 2252 2229 2205 2247 2288 2199 2110 2165 2219 2197 2045 1958 2001 2086 2171 2224 2277 2326 2245 2172 2099 2144 2188 2219 2250 2326 2185
3877B185r2L8J4J5R6l4J9J9J1J0l1l1P7P7lko8o8l8l8K7K7L9M0o9o9M2M2M2M2n9o0M9M9o3
$$ 2185 2093 2131 2145 2160 2256 2222 2241 2260 2271 2281 2250 2219 2296 2373 2370 2368 2300 2232 2194 2156 2183 2210 2249 2289 2220 2151 2193 2235 2277 2319 2260 2200 2249 2298 2235
3871B235o3KLP3P4l5l5j2j1K1K1NNk8k7P0P0q1q2p2p2J23J23kkl5l4k8k8o1o0jkJ07J07L5
$$ 2235 2172 2174 2177 2250 2324 2289 2254 2242 2231 2252 2273 2278 2283 2255 2228 2298 2368 2287 2205 2133 2061 2184 2307 2305 2303 2268 2234 2206 2178 2117 2057 2056 2054 2161 2268 2303
3866B303L4p4p4K9K9K9K9k7k7L9L8m2m2K2K3o1o1M7M7P1P1l7l8kll4l5j2j2m4m5L3L2%%J7
$$ 2303 2337 2263 2189 2218 2247 2276 2305 2278 2251 2290 2328 2286 2244 2266 2289 2228 2167 2214 2261 2332 2403 2366 2328 2326 2323 2289 2254 2242 2230 2186 2141 2174 2206 2206 2206 2223
3860B223J7Q2Q2kjjjK3K3q6q5l0l0L6L5N9O0m9n0kkj11j11j2j2K0K0j1j2j1j2J42J42J06k4
$$ 2223 2240 2322 2404 2402 2401 2400 2399 2422 2445 2359 2274 2244 2214 2250 2285 2344 2404 2355 2305 2303 2301 2190 2079 2067 2055 2075 2095 2084 2072 2061 2049 2191 2333 2439 2415
3855B415PPN7j61p2p1N9N9P1n9o7O3m0j71R8R8J11j8j76M1kkJ2J2K2K1K2K1pqqqk4k4k5k4
$$ 2415 2422 2429 2486 2325 2253 2182 2241 2300 2371 2312 2245 2308 2268 2097 2195 2293 2404 2386 2210 2251 2249 2247 2259 2271 2293 2314 2336 2357 2350 2342 2334 2326 2302 2278 2253 2229
3849B229M7M6M6M7M6M7o3o2r7r7N5N5n8n9Q4Q5J21rj26MJ07k3n0n0L2L3l3l2O1O1mmK2K2J4
$$ 2229 2276 2322 2368 2415 2461 2508 2445 2383 2286 2189 2244 2299 2241 2182 2266 2351 2472 2463 2337 2341 2448 2425 2375 2325 2357 2390 2357 2325 2386 2447 2443 2439 2461 2483 2497
3844B497J5jj31o6O4M7M7n4n4lkO3O3K6K7l8l8K9L0K9L0k5k4k5k4P4P5Q2m8k6k7j08K2MLQ4
$$ 2497 2512 2511 2380 2314 2378 2425 2472 2418 2364 2361 2359 2422 2485 2511 2538 2500 2462 2491 2521 2550 2580 2555 2531 2506 2482 2556 2631 2713 2665 2639 2612 2504 2526 2530 2533 2617
3839B617m5K1K1n2n2O6O7m3m2k7k6L9L9j18j19q9J29M9M8j1j1J19j1k01N9M5q6O9O8J9J8J9
$$ 2617 2572 2593 2614 2562 2510 2576 2643 2600 2558 2531 2505 2544 2583 2465 2346 2257 2386 2435 2483 2472 2461 2580 2569 2368 2427 2472 2386 2455 2523 2542 2560 2579
3834B579J9J3J4r5r5K6K6K6K6RJ0J0J0j8j7j8j7J1J0J1J0K7K7l9l8M8M8j8j7L3L3L3L3N5N6
$$ 2579 2598 2611 2625 2530 2435 2461 2487 2513 2539 2548 2558 2568 2578 2560 2543 2525 2508 2519 2529 2540 2550 2577 2604 2565 2527 2575 2623 2605 2588 2621 2654 2687 2720 2775 2831
3828B831r7r6ooO0N9P6P5l4l3M5M6k0k0p4p4rrJ03J04nnj4j5j5j4m9m9O0O0NMo0o1k1k1k1
$$ 2831 2734 2638 2632 2626 2686 2745 2821 2896 2862 2829 2874 2920 2900 2880 2806 2732 2723 2714 2817 2921 2916 2911 2897 2882 2867 2853 2804 2755 2815 2875 2880 2884 2824 2763 2742 2721 2700
3823B700k1K2K2m4m3J47J47L8L8R4R4J10J10J63M23M08J46l6k97k32j01O9K00K08P7k04k04
$$ 2700 2679 2701 2723 2679 2636 2783 2930 2968 3006 3100 3194 3304 3414 3577 4000 4408 4554 4518 4221 3989 3888 3957 4157 4365 4442 4238 4034
3819D034k11k12k46k46L6L7k1k0k1k0ppppooj4J17j0j0O3O4m8m7n5P4J83J82K24K23M48M48
$$ 4034 3823 3611 3365 3119 3155 3192 3171 3151 3130 3110 3103 3096 3089 3082 3076 3070 3056 3173 3163 3153 3216 3280 3232 3185 3130 3204 3387 3569 3793 4016 4464 4912
3814D912K51n4k03k02j2J17K21K21j75j75p8N3J67n1k82k83k17q7J49J50K55J26j77l07l15
$$ 4912 5163 5109 4906 4704 4692 4809 5030 5251 5076 4901 4823 4876 5043 4992 4710 4427 4210 4123 4272 4422 4677 4803 4626 4319 4004
3810D004j85j81j80n6n6j00L1p5p5M2M1M2M1m9m9r0M0Q7Q7j30%J00J01M3M3M6M6K06K06K71
$$ 4004 3819 3638 3458 3402 3346 3246 3277 3202 3127 3169 3210 3252 3293 3244 3195 3105 3145 3232 3319 3189 3189 3289 3390 3433 3476 3522 3568 3774 3980 4251
3805D251M02K98Q1j02j02j07j07J04K34q6l03l22l21k56j26m0l9j45j5J87N6j4j5MMn3n3o9
$$ 4251 4653 4951 5032 4930 4828 4721 4614 4718 4952 4866 4563 4241 3920 3664 3538 3498 3459 3314 3299 3486 3542 3528 3513 3517 3521 3468 3415 3346
3801C346O1mj34n9n8Q6Q5L3L2J%L9L9P1P2o9p0o1o1J6J47l5l4lkL0L0L5L5LKj6j7j6j7l9m0
$$ 3346 3407 3403 3269 3210 3152 3238 3323 3356 3388 3389 3389 3428 3467 3538 3610 3541 3471 3410 3349 3365 3512 3477 3443 3440 3438 3468 3498 3533 3568 3571 3573 3557 3540 3524 3507 3468 3428
3795C428J12J13k2k2j4j4l8R3K8K7k1J09L5L6k4k4k4k4LLLLRQp3N7Q4m6L5L6kjjjk9k8k9k8
$$ 3428 3540 3653 3631 3609 3595 3581 3543 3636 3664 3691 3670 3779 3814 3850 3826 3802 3778 3754 3757 3760 3763 3766 3775 3783 3710 3767 3851 3805 3840 3876 3874 3873 3872 3871 3842 3814 3785 3757
3790C757J0RJ0J0j1j0N4N5nnp7N2K6K6l2l1k7k7n1n2K0J50q3q4K44J13n2n2R4R4q8M3k4k3
$$ 3757 3767 3776 3786 3796 3785 3775 3829 3884 3879 3874 3797 3849 3875 3901 3869 3838 3811 3784 3733 3681 3701 3851 3768 3684 3928 4041 3989 3937 4031 4125 4037 4080 4056 4033
3784D033m8m8L9L9J04J04J3J2k0k0llP0P0j25Np6N4R8R8M1M1k1k1J1J1l4l4r1r1J6J46P3P3
$$ 4033 3985 3937 3976 4015 4119 4223 4236 4248 4228 4208 4205 4202 4272 4342 4217 4222 4146 4200 4298 4396 4437 4478 4457 4436 4447 4458 4424 4390 4299 4208 4224 4370 4443 4516
3779D516M9M9J13J14k8k7j58N9J5j14k0j9QJ39l0k9r9J19mmO5O5qJ22o5o5p4N7J19j1p6N4
$$ 4516 4565 4614 4727 4841 4813 4786 4628 4687 4702 4588 4568 4549 4557 4696 4666 4637 4538 4657 4653 4649 4714 4779 4771 4893 4828 4763 4689 4746 4865 4854 4778 4832
3774D832J96O6p7N2j8j8kkj42j1K3K4O6O6J23J23M9q0q1N0k4k5j6j6l1l1J21J21L8L8L9L8
$$ 4832 5028 5094 5017 5069 5051 5033 5031 5029 4887 4876 4899 4923 4989 5055 5178 5301 5350 5270 5189 5239 5215 5190 5174 5158 5127 5096 5217 5338 5376 5414 5453 5491
3769E491J2J1P6P7l8l8j11J9N3N3O1O2KLLKO0O0onM6M6o3o2J1J1J0J1J3J3j17R9J45J4l8R3
$$ 5491 5503 5514 5590 5667 5629 5591 5480 5499 5552 5605 5666 5728 5730 5733 5736 5738 5798 5858 5852 5847 5893 5939 5876 5814 5825 5836 5846 5857 5870 5883 5766 5865 6010 6024 5986 6079
3764F079P3P2Q1Q1K1K1m4m4L3L3L3L3m0m0nJ26M3M3N2N1J40J39P5P5q4q3K6K5J07J06J15j5
$$ 6079 6152 6224 6305 6386 6407 6428 6384 6340 6373 6406 6439 6472 6432 6392 6387 6513 6556 6599 6651 6702 6842 6981 7056 7131 7047 6964 6990 7015 7122 7228 7343 7328
3759G328R0R1j8j8l1J00J00l0J23J23N0M9k1k1N3N2j8J13M8M7j6J14J79M9K5K6JJ31K15Q5
$$ 7328 7418 7509 7491 7473 7442 7542 7642 7612 7735 7858 7908 7957 7936 7915 7968 8020 8002 8115 8163 8210 8194 8308 8487 8536 8561 8587 8588 8719 8934 9019
3755I019N8N8k0k1Q8Q8L7L7K0J50J39QK4K4O4O3O4O3O5O5J73J73J39J39J97J96R2l7k2J96
$$ 9019 9077 9135 9115 9094 9182 9270 9307 9344 9364 9514 9653 9661 9685 9709 9773 9836 9900 9963 10028 10093 10266 10439 10578 10717 10914 11110 11202 11165 11143 11339
3750A1339J04J03J17J17J07J07J07J07J63J64J42J2P6K93L01J70K08K07J99J99L05L05J97
$$ 11339 11443 11546 11663 11780 11887 11994 12101 12208 12371 12535 12677 12689 12765 13058 13359 13529 13737 13944 14143 14342 14647 14952 15149
3746A5149J96K50K49M37K19K44K45K95K96M58M59L93L94M22M21J084J996K099J100P42P42
$$ 15149 15345 15595 15844 16281 16500 16744 16989 17284 17580 18038 18497 18890 19284 19706 20127 21211 23207 25306 26406 27148 27890
3743B7890P05P04J139J876K669M102O718R192R618P057M430L519K745J659J730L077L316r82
$$ 27890 28595 29299 30438 32314 34983 39085 45803 54995 64613 71670 76100 79619 82364 84023 85753 88830 92146 91164
3740I1164n931p450n663m143k314l60K287M935P692R646J2943J9759L3573N9406J09324J80093
$$ 91164 85233 77783 72120 67977 65663 65303 67590 72525 80217 89863 102806 122565 156138 215544 324868 504961
3738E04961J81137J4158j47135j55558j08191p1635m9405l4557k3476j4531p737k614J001
$$ 504961 686098 700256 553121 397563 289372 217737 168332 133775 110299 95768 88031 85417 86418
3736H6418L866P498J4011K4332M0571O5594R1210Q6771N0388N904n2882r0881q0723n7589
$$ 86418 90284 97782 111793 136125 176696 242290 333500 420271 470659 476563 423681 332800 252077 194488
3734A94488m0483k8588j9991j3859r083m959j920P07L746P860J2288J8622L1560N5364Q8793
$$ 194488 154005 125417 105426 91567 82484 77525 75605 76312 80058 87918 100206 118828 150388 205752 294545
3732B94545J08193P3546Q020n2154q8658q4751o2240m3050k9689k0745j4004q708m140k33
$$ 294545 402738 476284 484304 432150 343492 258741 196501 153451 123762 103017 89013 80305 76165 75932
3730G5932L273N965J0429J8156L2680N8295J07978J79614J69271k4452j64361j42392r5437
$$ 75932 79205 85170 95599 113755 146435 204730 312708 492322 661593 637141 472780 330388 234951
3728B34951o2876m4324l0864k1856j4128r417n510l252j429n0L163O387P862M935O80j697
$$ 234951 172075 127751 96887 75031 60903 51486 45976 42724 41295 41245 44408 50795 58657 63592 64272 62575
3725F2575j089j115j549k344k214k330m154p028p809o861n211l963k834k080j125p47o17n91
$$ 62575 61486 60371 58822 56478 54264 51934 47780 40752 32943 26082 20871 16908 14074 11994 10869 10122 9505 8914
3722H914j56J64K95k41k41k01k00l66l66m31m31m79m80l41k10l37p7K4K3J44J43q8q7j19J1
$$ 8914 8758 8922 9217 8976 8735 8534 8334 7968 7602 7171 6740 6261 5781 5440 5230 4893 4816 4840 4863 5007 5150 5062 4975 4856 4867
3719D867RJ39K38J08j72j72j31ko1o1n2J64J49J8m9m9k75n7N7K74O3k41l77k46j86j86j84
$$ 4867 4876 5015 5253 5361 5189 5017 4886 4884 4823 4762 4710 4874 5023 5041 4992 4943 4668 4611 4668 4942 5005 4764 4387 4141 3955 3769 3585
3714C585j83j89K8j9J11j44j44K9L0p9p9l3l4L2L2Q9R0Q1Q1J1j20j52k2O0O0J47K77j24j23
$$ 3585 3402 3213 3241 3222 3333 3189 3045 3074 3104 3025 2946 2913 2879 2911 2943 3032 3122 3203 3284 3295 3175 3023 3001 3061 3121 3268 3545 3421 3298
3710C298j01j01MK21J00R9j6j7j55k4o7o6k46k46j47j7O1O2p6p7j16J3M9N0O5O6o7O3j1j0
$$ 3298 3197 3096 3100 3321 3421 3520 3504 3487 3332 3308 3241 3175 2929 2683 2536 2519 2580 2642 2566 2489 2373 2386 2435 2485 2550 2616 2549 2612 2601 2591
3705B591j0j0L2j00M2M1kj33q5q5J02J03N4N5q9q9o0P1llJ29J28o6o7k9k9P1P1J12j8j41j40
$$ 2591 2581 2571 2603 2503 2545 2586 2584 2451 2366 2281 2383 2486 2540 2595 2506 2417 2357 2428 2425 2422 2551 2679 2613 2546 2517 2488 2559 2630 2742 2724 2583 2443
3701B443j17j16P9P9Q0Q0j50O6k7k8O0p1MLmnj0j0j0j0L2L1J29q8j04K7R1R1n6n7n6n7j7j8
$$ 2443 2326 2210 2289 2368 2448 2528 2378 2444 2417 2389 2449 2378 2382 2385 2381 2376 2366 2356 2346 2336 2368 2399 2528 2440 2336 2363 2454 2545 2489 2432 2376 2319 2302 2284
3695B284J5J4k4k3M1M1n7n8n7n8N3N2J26mo3o3p1p1OPP1P2M0M1M1M1O2O1q2q2o9O1K0K0m0
$$ 2284 2299 2313 2289 2266 2307 2348 2291 2233 2176 2118 2171 2223 2349 2345 2282 2219 2148 2077 2083 2090 2161 2233 2273 2314 2355 2396 2458 2519 2437 2355 2286 2347 2367 2387 2347
3690B347m1j13J7J4J5J5J5O3o8L9L8N4N4n4n4J0J1KLM9q2m9Q1k8k8M6M5k4k4k3k4M0M0o9o8
$$ 2347 2306 2193 2210 2224 2239 2254 2269 2332 2264 2303 2341 2395 2449 2395 2341 2351 2362 2364 2367 2416 2334 2285 2366 2338 2310 2356 2401 2377 2353 2330 2306 2346 2386 2317 2249
3685B249R9R9K0j10q4q4R5R4K4j07l4l4j4j3k2J09N0N0ppj8j8K2K2p2N7N0M9k9k8j59k9K7
$$ 2249 2348 2447 2467 2357 2273 2189 2284 2378 2402 2295 2261 2227 2213 2200 2178 2287 2337 2387 2380 2373 2355 2337 2359 2381 2309 2366 2416 2465 2436 2408 2249 2220 2247
3680B247J56K7K6L4L5N9N8k4j54m9m8K9K9K8K9q2q2j2J19N4p5n9n9M7M8J2j18k0k1J1J2O4
$$ 2247 2403 2430 2456 2490 2525 2584 2642 2618 2464 2415 2367 2396 2425 2453 2482 2400 2318 2306 2425 2479 2404 2345 2286 2333 2381 2393 2275 2255 2234 2245 2257 2321
3675B321J94Q5m4m4m3j9j9j3j3j3j3J2J2J2J2J09J09N2N2j62l3M7M6p4p5o7o7j4J15KJ32N9
$$ 2321 2515 2600 2556 2512 2469 2450 2431 2418 2405 2392 2379 2391 2403 2415 2427 2536 2645 2697 2749 2587 2554 2601 2647 2573 2498 2431 2364 2350 2465 2467 2599 2658
3670B658N9q5q5m6m7N5N4R5l5l4l5M0r0q3q2J7J6J7J6j5j4j5j5L9M0M7M7MJ35nmL0K9j52k2
$$ 2658 2717 2632 2547 2501 2454 2509 2563 2658 2623 2589 2554 2594 2504 2421 2339 2356 2372 2389 2405 2390 2376 2361 2346 2385 2425 2472 2519 2523 2658 2653 2649 2679 2708 2556 2534
3665B534N3N3J02k8J5J5o7O4K6K6K7J56q0q0L6L7k8k7j01L0J57J57N6N6J93J94L78N08K53
$$ 2534 2587 2640 2742 2714 2729 2744 2677 2741 2767 2793 2820 2976 2896 2816 2852 2889 2861 2834 2733 2763 2920 3077 3133 3189 3382 3576 3954 4462 4715
3660D715j37k51j20n3J64K24R3j44k75l54l53k06p5j05K5j00L0l5l4J8J8K6K6p5N6mnm5J71
$$ 4715 4578 4327 4207 4154 4318 4542 4635 4491 4216 3862 3509 3303 3228 3123 3148 3048 3078 3043 3009 3027 3045 3071 3097 3022 3078 3074 3069 3024 3195
3656C195J63L3p6N3Q9Q9n8P2O7L70K33K33K51K52j46j45j35np1K33K66K66j28j28k5J93K26
$$ 3195 3358 3391 3315 3368 3457 3546 3488 3560 3627 3997 4230 4463 4714 4966 4820 4675 4540 4535 4464 4697 4963 5229 5101 4973 4948 5141 5367
3652E367Rk10q0j08j07J77L95Lk14n26l08k01k00j13J04nnn6n7PPj00L2k1k0k0J10p3p3j54
$$ 5367 5376 5166 5086 4978 4871 5048 5443 5446 5232 4706 4398 4197 3997 3884 3988 3983 3978 3922 3865 3872 3879 3779 3811 3790 3770 3750 3860 3787 3714 3560
3647C560O3J18J18m2Q9NJ35K30K31K58L88J64n4j07K4j23PJ59L77J92O1k51j21k59k60k25
$$ 3560 3623 3741 3859 3817 3906 3911 4046 4276 4507 4765 5153 5317 5263 5156 5180 5057 5064 5223 5600 5792 5853 5602 5481 5222 4962 4737
3643D737r6k59m1Q6Q5L4J64r8L3k0j9j12J04R1R0M9M8O5O5j97O3RK70j3j3j84K51J09k1j16
$$ 4737 4641 4382 4341 4427 4512 4546 4710 4612 4645 4625 4606 4494 4598 4689 4779 4828 4876 4941 5006 4809 4872 4881 5151 5138 5125 4941 5192 5301 5280 5164
3638E164J44r9J61Q3K12RK70p8N3J9K80j6j6k47L61J00J01M5L06l5K24J226K181L03j31l9
$$ 5164 5308 5209 5370 5453 5665 5674 5944 5866 5919 5938 6218 6202 6186 5939 6300 6400 6501 6546 6852 6817 7041 8267 10448 10751 10620 10581
3634A0581L95l86M8k66nl75K34K36O70K47O81M64Q98N18J126N54R89N01J108Q05J761J348
$$ 10581 10976 10590 10638 10372 10367 9992 10226 10462 11132 11379 12060 12524 13422 13940 15066 15620 16609 17110 18218 19023 20784 22132
3631B2132K478K079L555L620N792O070R979J3766K5141L9539P6094J47363K44007J10298j63831
$$ 22132 24610 26689 30244 33864 39656 45726 55705 69471 94612 134151 210245 357608 601615 711913 548082
3629E48082j84464j16301p3035n1066l6316k5983j6284j0988o578m929l306l175j952j691
$$ 548082 363618 247317 174282 123216 86900 60917 44633 33645 27067 22138 18832 15657 13705 12014
3627A2014j189j624j089j089n57o88p2l33q0l41r9k29l9m73l61l62k94n54l73k42M6M5M99
$$ 12014 10825 9201 8112 7023 6466 5778 5706 5373 5293 4952 4853 4624 4585 4112 3751 3389 3095 2541 2168 1926 1972 2017 2516
3623B516P60R22L14n7j88j34j34J05j56j88l18j60j61O2o8J02k7J80N1pj37o1o1mk21j67l6
$$ 2516 3276 4198 4512 4455 4267 4133 3999 4104 3948 3760 3442 3282 3121 3183 3115 3217 3190 3370 3421 3414 3277 3216 3155 3151 2930 2763 2727
3619B727J02k9l1l2j56j57l1j62k3k4M4M4l4j65M3M3LLk4k4k4k3K5K5j0j41L9L9P2n9JKJ32
$$ 2727 2829 2800 2769 2737 2581 2424 2393 2231 2208 2184 2228 2272 2238 2073 2116 2159 2162 2165 2141 2117 2093 2070 2095 2120 2110 1969 2008 2047 2119 2060 2061 2063 2195
3614B195Kk8k8j37j36n6P5J11J10J34J33p5k06j42j42m2m1K9L0L8L8n6P4J0j21J8J8oJ24J83
$$ 2195 2197 2169 2141 2004 1868 1812 1887 1998 2108 2242 2375 2300 2094 1952 1810 1768 1727 1756 1786 1824 1862 1806 1880 1890 1769 1787 1805 1799 1923 2106
3609B106N4o1o0j38j38j02K8P1P1J45J44l8l8q7J30m4Q5K6K6k7k6L8L9PPm9n0o4O7Kj29K6
$$ 2106 2160 2099 2039 1901 1763 1661 1689 1760 1831 1976 2120 2082 2044 1957 2087 2043 2128 2154 2180 2153 2127 2165 2204 2211 2218 2169 2119 2055 2122 2124 1995 2021
3605B021K6j29KJ07k3q9M2Pj24m2m2n0n0n0n0K9K9l7R4j7J13M9M8M3M2o5o6M4M4r5L6l5l4
$$ 2021 2047 1918 1920 2027 2004 1915 1957 1964 1840 1798 1756 1706 1656 1606 1556 1585 1614 1577 1671 1654 1767 1816 1864 1907 1949 1884 1818 1862 1906 1811 1847 1812 1778
3600A778l5R6J8J9j56k4J50J51N1N0L4L3JJm7m7J8J8q5q6j2j2o5O5%%j44j5k2k2N7N7n2n1
$$ 1778 1743 1839 1857 1876 1720 1696 1846 1997 2048 2098 2132 2165 2166 2167 2120 2073 2091 2109 2024 1938 1926 1914 1849 1914 1914 1914 1770 1755 1733 1711 1768 1825 1773 1722
3594A722QRk4k4ONn1n1o2O9k9k9l8R3Q5Q5PPj8j7r5L5O8o3K0K0J1J1j7j7J6J5N2N2%%j97K0
$$ 1722 1730 1739 1715 1691 1697 1702 1651 1600 1538 1607 1578 1549 1511 1604 1689 1774 1781 1788 1770 1753 1658 1693 1761 1698 1718 1738 1749 1760 1743 1726 1742 1757 1809 1861 1861 1861 1664 1684
3589A684OORRn6n6K5K5R0R0p7p8nmq0N0J0RK9K8m5Q5nnj36nK8K8k8k9L0L0OOj02K9l7l6l7
$$ 1684 1690 1696 1705 1714 1658 1602 1627 1652 1742 1832 1755 1677 1672 1668 1588 1638 1648 1657 1686 1714 1669 1754 1749 1744 1608 1603 1631 1659 1631 1602 1632 1662 1668 1674 1572 1601 1564 1528 1491
3583A491R3R3R3m0R0J6J7l1l1l1l1k2k2j4j4l4R6m2m3l2l3k4k5k3J07k3k3m6Q3P5P6l5l5m2
$$ 1491 1584 1677 1770 1730 1820 1836 1853 1822 1791 1760 1729 1707 1685 1671 1657 1623 1719 1677 1634 1602 1569 1545 1520 1497 1604 1581 1558 1512 1595 1670 1746 1711 1676 1634
3577A634Q7k7k6j1j0n3P8NMRQQRo7o7Q5Q5L5L6O8O8l4l3L2L2n9n8j60j59o4O6ppL0L1L0L1
$$ 1634 1721 1694 1668 1657 1647 1594 1672 1677 1681 1690 1698 1706 1715 1648 1581 1666 1751 1786 1822 1890 1958 1924 1891 1923 1955 1896 1838 1678 1519 1455 1521 1514 1507 1537 1568 1598 1629
3572A629q2q2P0P0J6J7n6P3P1P1k9l0%JQQj20Ro3o4R0Q9R0Q9j4j5J0J0rj40l1J00M0M0llj30
$$ 1629 1547 1465 1535 1605 1621 1638 1582 1655 1726 1797 1768 1738 1738 1739 1747 1755 1635 1644 1581 1517 1607 1696 1786 1875 1861 1846 1856 1866 1857 1717 1686 1786 1826 1866 1863 1860 1730
3566A730Q8J47J7l5l5j1j0k9k9j37j37P0O9j12J8K4K4R7R7K9K9M6q5p6N4j8j50L8L9p9p9p
$$ 1730 1818 1965 1982 1947 1912 1901 1891 1862 1833 1696 1559 1629 1698 1586 1604 1628 1652 1749 1846 1875 1904 1950 1865 1789 1843 1825 1675 1713 1752 1673 1594 1587
3561A587qj5J14k8k8j9k0Q6Q7n7n8n8P1l6j68R3R3k4k4J8J8K6K6j16J5J4J4l2R8K5K5NMo1
$$ 1587 1579 1564 1678 1650 1622 1603 1583 1669 1756 1699 1641 1583 1654 1618 1450 1543 1636 1612 1588 1606 1624 1650 1676 1560 1575 1589 1603 1571 1669 1694 1719 1724 1728 1667
3556A667o0mmml%%O6O5q1q1J14J14K1K2n2P8k6k6j23PM8M9q7q8j07K2K3K3KJ33K8K7l9l8K6
$$ 1667 1607 1603 1599 1595 1592 1592 1592 1658 1723 1642 1561 1675 1789 1810 1832 1780 1858 1832 1806 1683 1690 1738 1787 1700 1612 1505 1527 1550 1573 1575 1708 1736 1763 1724 1686 1712
3551A712K7k8k9k8k8kko7o7K7K7j4J17O5O6M6q3p0O0j3j4p6N3J18j1n3n2Q7m4j32jK6K5N2
$$ 1712 1739 1711 1682 1654 1626 1624 1622 1555 1488 1515 1542 1528 1645 1710 1776 1822 1739 1669 1729 1716 1702 1626 1679 1797 1786 1733 1681 1768 1724 1592 1591 1617 1642 1694
3545A694N1J8J9n5n5r6L5LLj70m1L0K9L8L8J03J03q4q3r3L7llL4L4L4L4qrqrK1K1jj31r4J23
$$ 1694 1745 1763 1782 1727 1672 1576 1611 1614 1617 1447 1406 1436 1465 1503 1541 1644 1747 1663 1580 1487 1524 1521 1518 1552 1586 1620 1654 1646 1637 1629 1620 1641 1662 1661 1530 1436 1559
3540A559J14j02N8N8M5M5o7o6kjj3j3p0p0k6J05L2L1J6J5m2m1m1Q9M9M8ppo4o4j15J6J37q0
$$ 1559 1673 1571 1629 1687 1732 1777 1710 1644 1642 1641 1628 1615 1545 1475 1449 1554 1586 1617 1633 1648 1606 1565 1524 1613 1662 1710 1703 1696 1632 1568 1453 1469 1606 1526
3535A526n2P8R9J00P5P5K76M06K60J31p0k88l22j93k00p1k0k0j99J8ONJ9K0p3p3qpR4R4J02
$$ 1526 1474 1552 1651 1751 1826 1901 2177 2583 2843 2974 2904 2616 2294 2101 1901 1830 1810 1790 1591 1609 1615 1620 1639 1659 1586 1513 1505 1498 1592 1686 1788
3530A788k8rqqj39llO2o8k4k5l2l3J9J9R2l8J9J9R2l8j44j3J3J4K2K1P9P9L9r2j15J4j7J13
$$ 1788 1760 1751 1743 1735 1596 1593 1590 1652 1584 1560 1535 1503 1470 1489 1508 1600 1562 1581 1600 1692 1654 1510 1497 1510 1524 1546 1567 1646 1725 1764 1672 1557 1571 1554 1667
3524A667J14J13J92J91J62M65Q50J371K98r16q68o08m34j73k55k56q7q7n5n4J0J1J19J19j20
$$ 1667 1781 1894 2086 2277 2439 2904 3754 5125 5423 4507 3639 3031 2597 2424 2169 1913 1826 1739 1684 1630 1640 1651 1770 1889 1769
3521A769j20o5o6M3M3L7L7p1p2O3O3O3O2q7q6K1K2j9j9j9j9N9O0m9m9M2M1M1M2m5m4j1j2p6
$$ 1769 1649 1584 1518 1561 1604 1641 1678 1607 1535 1598 1661 1724 1786 1699 1613 1634 1656 1637 1618 1599 1580 1639 1699 1650 1601 1643 1684 1725 1767 1722 1678 1667 1655 1579
3515A579p6J19J20p8p7j2j2K7K7K7K7n5n5J0J0l5l6klN3N3n5n6MMLMQ8Q8K4K3J1J1J1J1n2
$$ 1579 1503 1622 1742 1664 1587 1575 1563 1590 1617 1644 1671 1616 1561 1571 1581 1546 1510 1508 1505 1558 1611 1556 1500 1504 1508 1511 1515 1603 1691 1715 1738 1749 1760 1771 1782 1730
3510A730n2n2n2l9m0m0l9P6P7J1J2k5k4M0M1l1l1KKQQQQN3N2n6n6J6J7m9m9K0K0N3N3J4J4
$$ 1730 1678 1626 1574 1535 1495 1455 1416 1492 1569 1580 1592 1567 1543 1583 1624 1593 1562 1564 1566 1574 1582 1590 1598 1651 1703 1647 1591 1607 1624 1575 1526 1546 1566 1619 1672 1686 1700
3504A700J4J4MLMMNOOOj7j7J5J6k5k6L2L2O5o6r8L1LKJ0J0k8k8NNQ6Q6o5o6rrm2m1k9k9J10
$$ 1700 1714 1728 1732 1735 1739 1743 1748 1754 1760 1766 1749 1732 1747 1763 1738 1712 1744 1776 1841 1775 1677 1708 1711 1713 1723 1733 1705 1677 1682 1687 1773 1859 1794 1728 1719 1710 1668 1627 1598 1569 1679
3498A679k1k1k1k1k1j10K0J9j10OPN5N6R0m0L3L3K3K3P3n9j01L0Q6m4k0k0M5q5M1M0L3L3K1
$$ 1679 1658 1637 1616 1595 1574 1464 1484 1503 1393 1399 1406 1461 1517 1607 1567 1600 1633 1656 1679 1752 1693 1592 1622 1708 1664 1644 1624 1669 1584 1625 1665 1698 1731 1752
3493A752K0K1K0l0l0L4L5m1m1j39P9J00k9j6j6N2p8nnk0k0l7R3M2q8m0l9L6L6p3p3JJj30Q8
$$ 1752 1772 1793 1813 1783 1753 1787 1822 1781 1740 1601 1680 1780 1751 1735 1719 1771 1693 1688 1683 1663 1643 1606 1699 1741 1653 1613 1574 1610 1646 1573 1500 1501 1502 1372 1460
3488A460J35NK7K6L3L2M0r0L2L3K4K4L5L5L6L5k1k1n4n3RJ0J7j12O0O0o4o4Qj22J7J7j2j2
$$ 1460 1595 1600 1627 1653 1686 1718 1758 1668 1700 1733 1757 1781 1816 1851 1887 1922 1901 1880 1826 1773 1782 1792 1809 1697 1757 1817 1753 1689 1697 1575 1592 1609 1597 1585
3482A585M5M5M9q1r5L6J57n9l8l7K1K2K2K2j3j3j4j3l6l5J16J16o9p0nmkkPj24j3j2J17j2
$$ 1585 1630 1675 1724 1643 1548 1584 1741 1682 1644 1607 1628 1650 1672 1694 1681 1668 1654 1641 1605 1570 1686 1802 1733 1663 1658 1654 1652 1650 1657 1533 1520 1508 1625 1613
3477A613m3m3J5J4k1k0M4M4Q3Q2J8J7k1k1q6q7J0J0k2k3OOM7q4n2n2NNL1L1O7J97p8p8p8N3
$$ 1613 1570 1527 1542 1556 1535 1515 1559 1603 1686 1768 1786 1803 1782 1761 1675 1588 1598 1608 1586 1563 1569 1575 1622 1538 1486 1434 1439 1444 1475 1506 1573 1770 1692 1614 1536 1589
3472A589P1P0L8L9J1j20m6m5k9l0k9k9j4j5q8M2M0L9M8M8l6l5M7q4nJ26J34q4o3o4P0o1p9
$$ 1589 1660 1730 1768 1807 1818 1698 1652 1607 1578 1548 1519 1490 1476 1461 1373 1415 1455 1494 1542 1590 1554 1519 1566 1482 1477 1603 1737 1653 1590 1526 1596 1535 1456
3467A456N1j11J9J15j5J0J0p0O0J2J2P1n9J4J4J1J2j3j3RJ39m2m3n3n2N6N5m7m7K6j04n2n3
$$ 1456 1507 1396 1415 1530 1515 1525 1535 1465 1525 1537 1549 1620 1561 1575 1589 1600 1612 1599 1586 1595 1734 1692 1649 1596 1544 1600 1655 1608 1561 1587 1483 1431 1378
3462A378NMK2K2K2K2J8J9q8M3l6l7K8K8O3o8L1L0R3l7P7P7j32jO3o7n5n5p2N9L2L1k5k6L9
$$ 1378 1383 1387 1409 1431 1453 1475 1493 1512 1424 1467 1431 1394 1422 1450 1513 1445 1476 1506 1599 1562 1639 1716 1584 1583 1646 1579 1524 1469 1397 1456 1488 1519 1494 1468 1507
3456A507L8R6R5K5j06l2l2opKKm0R0J7J7l8l7J00k9l6l6k0k0O3o7L9L9J3J2k0k0O1O2llk9
$$ 1507 1545 1641 1736 1761 1655 1623 1591 1585 1578 1580 1582 1542 1632 1649 1666 1628 1591 1691 1662 1626 1590 1570 1550 1613 1546 1585 1624 1637 1649 1629 1609 1670 1732 1729 1726 1697
3451A697k9LMmmo9p0K8K7K7K7J2J2k0k0K5K5q3q4LLJ41J1q0q0K1K0j4j5j4j5N9O0r3r2L7L8
$$ 1697 1668 1671 1675 1671 1667 1598 1528 1556 1583 1610 1637 1649 1661 1641 1621 1646 1671 1588 1504 1507 1510 1651 1662 1582 1502 1523 1543 1529 1514 1500 1485 1544 1604 1511 1419 1456 1494
3445A494NNQ3Q3k6k5nnnnj18j18NJ35O4O4P2n7K2j08j00J17L0L1M4M4k7k8L7L8j52j51p3N7
$$ 1494 1499 1504 1587 1670 1644 1619 1614 1609 1604 1599 1481 1363 1368 1503 1567 1631 1703 1646 1668 1560 1460 1577 1607 1638 1682 1726 1699 1671 1708 1746 1594 1443 1370 1427
3440A427K8K7j43P4L0J61qqrj0K3K3j0j0r1L9K4j05Q4Q5j6j5q1q1P6P5M0r0MLj27R0j1j1j6
$$ 1427 1455 1482 1339 1413 1443 1604 1596 1588 1579 1569 1592 1615 1605 1595 1504 1543 1567 1462 1546 1631 1615 1600 1519 1438 1514 1589 1629 1539 1543 1546 1419 1509 1498 1487 1471
3435A471j6k21lJ57J56m7m7J7J8O0N9noL6L6k1k1n6P4L3L4n8n8n8n8j5j5N0N1J5J6J6J6lk
$$ 1471 1455 1234 1231 1388 1544 1497 1450 1467 1485 1545 1604 1599 1593 1629 1665 1644 1623 1567 1641 1674 1708 1650 1592 1534 1476 1461 1446 1496 1547 1562 1578 1594 1610 1607 1605
3429A605L0L1m4m4n1P8K9K9L8L7j12j12lmL9M0L1L1m5j76k4J06j3j4K8K7m8m7J8J7R0Q9N7
$$ 1605 1635 1666 1622 1578 1527 1605 1634 1663 1701 1738 1626 1514 1511 1507 1546 1586 1617 1648 1603 1427 1403 1509 1496 1482 1510 1537 1489 1442 1460 1477 1567 1656 1713
3424A713N7q8q9k4k4ooN8N9N6N6n2n3j11j11p5N4O6O5p8p8k6k5Q3Q3l1l1P8P7N3N3k6j56n3
$$ 1713 1770 1682 1593 1569 1545 1539 1533 1591 1650 1706 1762 1710 1657 1546 1435 1360 1414 1480 1545 1467 1389 1363 1338 1421 1504 1473 1442 1520 1597 1650 1703 1677 1521 1468
3419A468n4M7M6J4J3O7o3j29Q8O3o7K4K4o5O5N1q0KKK0J9K8K8j05K5J7J6k3k3q8J29O9o0l9
$$ 1468 1414 1461 1507 1521 1534 1601 1538 1409 1497 1560 1493 1517 1541 1476 1541 1592 1512 1514 1516 1536 1555 1583 1611 1506 1531 1548 1564 1541 1518 1430 1559 1628 1568 1529
3414A529l9mmK9K8L6L6l0k9o1o2Q3Q2L8r3k8J03J4J4K3K2q5q5j9k0J03J02m3Q6N1p9j41j42
$$ 1529 1490 1486 1482 1511 1539 1575 1611 1581 1552 1491 1429 1512 1594 1632 1539 1511 1614 1628 1642 1665 1687 1602 1517 1498 1478 1581 1683 1640 1726 1777 1698 1557 1415
3409A415J9J49J0J1L8L9p0p1j1j1K1K2K1K2q7q8J1J1M4M3L7L7k9k8J8J8j5j4n8n7N1N2NNo0
$$ 1415 1434 1583 1593 1604 1642 1681 1611 1540 1529 1518 1539 1561 1582 1604 1517 1429 1440 1451 1495 1538 1575 1612 1583 1555 1573 1591 1576 1562 1504 1447 1498 1550 1555 1560 1500
3403A500J58R6l3j2j1RRk4k3m8m7m7m7k6k5k5k5K1K2K1K2K2K2j1j0k9k9L6L6l3l3l3l2K6K7
$$ 1500 1658 1754 1721 1709 1698 1707 1716 1692 1669 1621 1574 1527 1480 1454 1429 1404 1379 1400 1422 1443 1465 1487 1509 1498 1488 1459 1430 1466 1502 1469 1436 1403 1371 1397 1424
3398A424K7K7J3J2n2n3J7J6Q2Q2r0q9O2O2J8J7m7m8K9K8K9K8j01j01N1N1M4M5J2J2M6M5J4
$$ 1424 1451 1478 1491 1503 1451 1398 1415 1431 1513 1595 1505 1416 1478 1540 1558 1575 1528 1480 1509 1537 1566 1594 1493 1392 1443 1494 1538 1583 1595 1607 1653 1698 1712
3393A712J3KJo3o3j6j6J6J7m4m4K1K1L0L0l5l6j63j63P5P6L3L4L3L4Q3Q3k5k6L3L3l2l3o2
$$ 1712 1725 1727 1728 1665 1602 1586 1570 1586 1603 1559 1515 1536 1557 1587 1617 1582 1546 1383 1220 1295 1371 1404 1438 1471 1505 1588 1671 1646 1620 1653 1686 1654 1621 1559
3388A559o3Q9Q9J2J2r7r6j0j0O3o7K6K7J8J9j7j7j8j7K2K3o0P1M5q5k0J10J47J6n4n4J9J9
$$ 1559 1496 1585 1674 1686 1698 1601 1505 1495 1485 1548 1481 1507 1534 1552 1571 1554 1537 1519 1502 1524 1547 1487 1558 1603 1518 1498 1608 1755 1771 1717 1663 1682 1701
3383A701m6m6k8k8k9k8O5O6q7q6P4P5M3M2l8l8o3o2k7J03K17jq5q6JJR0m1l2l2P8P9M5M6r7
$$ 1701 1655 1609 1581 1553 1524 1496 1561 1627 1540 1454 1528 1603 1646 1688 1650 1612 1549 1487 1460 1563 1780 1779 1694 1608 1609 1610 1700 1659 1627 1595 1673 1752 1797 1843 1746
3377A746r7l3l2K1K1q8q8K3K3j0j0J8J7R1l9M6M6o8O2J5J4m2m2n0m9p3p4RJ39O6O6m8m8J7
$$ 1746 1649 1616 1584 1605 1626 1538 1450 1473 1496 1486 1476 1494 1511 1602 1563 1609 1655 1587 1649 1664 1678 1636 1594 1544 1495 1422 1348 1357 1496 1562 1628 1580 1532 1549
3372A549J7M6M5NNJ8j11l8l8jj%jQ1Q0QPM3q6J3J44l2j63P1P1n8n7Q6Q6K5j05l1l2p4p4J21
$$ 1549 1566 1612 1657 1662 1667 1685 1574 1536 1498 1497 1496 1496 1495 1576 1656 1664 1671 1714 1628 1641 1785 1753 1590 1661 1732 1674 1617 1703 1789 1814 1709 1678 1646 1572 1498 1619
3367A619J22l4l4o6o7J0J0o4o3J39Rk6k6n0m9N9N8P9P8p3p4llL0L0L8L9m1m0Q5j33j41P7K2
$$ 1619 1741 1707 1673 1607 1540 1550 1560 1496 1433 1572 1581 1555 1529 1479 1430 1489 1547 1626 1704 1631 1557 1554 1551 1581 1611 1649 1688 1647 1607 1692 1559 1418 1495 1517
3362A517j09M4M4M6M6J20j1j18j18j8j8Q4Q3o1o0l1J00R1R2j15j14r2J24J06k4j20J1L8L9
$$ 1517 1408 1452 1496 1542 1588 1708 1697 1579 1461 1443 1425 1509 1592 1531 1471 1440 1540 1631 1723 1608 1494 1402 1526 1632 1608 1488 1499 1537 1576
3357A576o2o2J7J6n6P4onQ3m6m1Q8M0M0MNn3n2n1Q0Q0n1n2n3M8M8o5o4M3M4OOj02j03M6M7
$$ 1576 1514 1452 1469 1485 1429 1503 1497 1492 1575 1529 1488 1576 1616 1656 1660 1665 1612 1560 1509 1589 1669 1618 1566 1513 1561 1609 1544 1480 1523 1567 1573 1579 1477 1374 1420 1467
3352A467P8P9o1o1L9L9R2l9p4p4J7J7j64l4J21J21Pj24j4j5J0J0M3M3L4L5R1l9j48j8%%QQ
$$ 1467 1545 1624 1563 1502 1541 1580 1672 1633 1559 1485 1502 1519 1355 1321 1442 1563 1570 1446 1432 1417 1427 1437 1480 1523 1557 1592 1683 1644 1496 1478 1478 1478 1486 1494
3347A494NONNK2K2K9L0o0P0J19r8n5n4M0M0P3P2p1p1j13J7R0m0o7O3N5p5J0J0q0N1P4n7K5
$$ 1494 1499 1505 1510 1515 1537 1559 1588 1618 1558 1628 1747 1649 1594 1540 1580 1620 1693 1765 1694 1623 1510 1527 1617 1577 1510 1573 1628 1553 1563 1573 1493 1544 1618 1561 1586
3341A586K4mlmmL7L7k8k8l8l8n1J66M4M3L0j00j49j9QRn3n2J3J3L2L2L2L2j2j3mmn0Q0PPJ2
$$ 1586 1610 1606 1603 1599 1595 1632 1669 1641 1613 1575 1537 1486 1652 1696 1739 1769 1669 1520 1501 1509 1518 1465 1413 1426 1439 1471 1503 1535 1567 1555 1542 1538 1534 1484 1564 1571 1578 1590
3335A590J2J3J2K8K9L6r3j55j55O8O8M0q9M9M8P0P1l9l8k1k1k1k0Q5Q6o6o6o7o6jjKLKLJ52
$$ 1590 1602 1615 1627 1655 1684 1720 1627 1472 1317 1385 1453 1493 1404 1453 1501 1571 1642 1603 1565 1544 1523 1502 1482 1567 1653 1587 1521 1454 1388 1387 1386 1388 1391 1393 1396 1548
3330A548J51%%p1p1o3o2K7J57J9J8J2J1J2J1r8r9J1J0Q5Q6k4k3K3K3m2m2r0r0J05J05Q7Q8
$$ 1548 1699 1699 1699 1628 1557 1494 1432 1459 1616 1635 1653 1665 1676 1688 1699 1601 1502 1513 1523 1608 1694 1670 1647 1670 1693 1651 1609 1519 1429 1534 1639 1726 1814
3325A814j51j52kllkK0K1m5m4p5p5P7P8K5K6K6K5jkjjl6l5l5l6j2j2N2N3K0K1K0K0L5L4l1
$$ 1814 1663 1511 1509 1506 1503 1501 1521 1542 1497 1453 1378 1303 1380 1458 1483 1509 1535 1560 1559 1557 1556 1555 1519 1484 1449 1413 1401 1389 1441 1494 1514 1535 1555 1575 1610 1644 1613
3319A613l1K7K6K6K6j8j7M7M7qrp3p4n6n7RRK3K4K3K4n7n6N2N2J4J4J4J4L6L5k9k9J0J0n6
$$ 1613 1582 1609 1635 1661 1687 1669 1652 1699 1746 1738 1729 1656 1582 1526 1469 1478 1487 1510 1534 1557 1581 1524 1468 1520 1572 1586 1600 1614 1628 1664 1699 1670 1641 1651 1661 1605
3314A605n5K1K1Q6Q6n2n1J4J4o8o8o8o8J7J8L9J69J44p3j38j39PPPPm4m3J95J96l9m0j04j04
$$ 1605 1550 1571 1592 1678 1764 1712 1661 1675 1689 1621 1553 1485 1417 1434 1452 1491 1660 1804 1731 1593 1454 1461 1468 1475 1482 1438 1395 1590 1786 1747 1707 1603 1499
3309A499r0r0O2O2L2L2L2L3K6K7K7K7j4j3j3j4k7k7o0o0j01j02L8L7K31J5n8n9J6J6J6J6P
$$ 1499 1409 1319 1381 1443 1475 1507 1539 1572 1598 1625 1652 1679 1665 1652 1639 1625 1598 1571 1511 1451 1350 1248 1286 1323 1554 1569 1511 1452 1468 1484 1500 1516 1523
3304A523On9n8P6P6M4M4M8M9j47j47O2O2O2O3k9k9o2o2M9M9n9o0NNP0P0M1M1o8o7kkL1L0j3
$$ 1523 1529 1470 1412 1488 1564 1608 1652 1700 1749 1602 1455 1517 1579 1641 1704 1675 1646 1584 1522 1571 1620 1561 1501 1506 1511 1581 1651 1692 1733 1665 1598 1596 1594 1625 1655 1642
3298A642j3p9p8k5k5M1M0L0L0p9p9n1n1N7N8N7N8n1n1k5k5Q4Q3j9j8n2n1MLJ13J12j04j04
$$ 1642 1629 1550 1472 1447 1422 1463 1503 1533 1563 1484 1405 1354 1303 1360 1418 1475 1533 1482 1431 1406 1381 1465 1548 1529 1511 1459 1408 1412 1415 1528 1640 1536 1432
3293A432NMJ7J6J7J6J6J7J6J7R9R9j0rj18j17L4L5J1J1k1k2M1M0M0M1lln4n4n9J59N3p7j10
$$ 1432 1437 1441 1458 1474 1491 1507 1523 1540 1556 1573 1672 1771 1761 1752 1634 1517 1551 1586 1597 1608 1587 1565 1606 1646 1686 1727 1724 1721 1667 1613 1554 1713 1766 1689 1579
3288A579K0MLJ0RRRk3k4k3k3j4j4j36Q1O5O4J3J3m3m2O5O6m4m5O4O4rrrqonl8l8o9o9Q3Q3
$$ 1579 1599 1603 1606 1616 1625 1634 1643 1620 1596 1573 1550 1536 1522 1386 1467 1532 1596 1609 1622 1579 1537 1602 1668 1624 1579 1643 1707 1698 1689 1680 1672 1666 1661 1623 1585 1516 1447 1530 1613
3282A613l0l1o2o3K8K7R3R3QRn7n6k9k8Q1Q0l4l5l5l5k9k9P9P9l6l7l6l7Q7Q6K1K1mml6l7
$$ 1613 1583 1552 1490 1427 1455 1482 1575 1668 1676 1685 1628 1572 1543 1515 1596 1676 1642 1607 1572 1537 1508 1479 1558 1637 1601 1564 1528 1491 1578 1664 1685 1706 1702 1698 1662 1625
3276A625n4n5J0J0k0j9M5M5k9l0k9l0L2L2l4l4N8N8ppk6k6OPj7j8R1R2n9n8m5m5q5J32P5P6
$$ 1625 1571 1516 1526 1536 1516 1497 1542 1587 1558 1528 1499 1469 1501 1533 1499 1465 1523 1581 1574 1567 1541 1515 1521 1528 1511 1493 1584 1676 1617 1559 1514 1469 1384 1516 1591 1667
3271A667k2k1m1m0p3J44J27kr5r5Q4Q4O3o8j07J09q0N0kjp1O0j4j4J5J4n1n1P5P5l3l3p3p3
$$ 1667 1645 1624 1583 1543 1470 1614 1741 1739 1644 1549 1633 1717 1780 1712 1605 1714 1634 1684 1682 1681 1610 1670 1656 1642 1657 1671 1620 1569 1644 1719 1686 1653 1580 1507
3266A507J22J22j11j11klQ5Q5k4k4o5o5J%o1o1R1R1P2P2L7r4j34j33o3O7j1j0kkO1O1mnP4
$$ 1507 1629 1751 1640 1529 1527 1524 1609 1694 1670 1646 1581 1516 1517 1517 1456 1395 1486 1577 1649 1721 1758 1664 1530 1397 1334 1401 1390 1380 1378 1376 1437 1498 1494 1489 1563
3260A563P3J6J6j37pj5j5J27J26p0o9k9l0m6Q5M9q1j82n1J15J15J37q0j8j8k3k4n7P3%%k6
$$ 1563 1636 1652 1668 1531 1524 1509 1494 1621 1747 1677 1608 1579 1549 1503 1588 1637 1556 1374 1323 1438 1553 1690 1610 1592 1574 1551 1527 1470 1543 1543 1543 1517
3255A517k6k6k6L0L1J4J44L5r6q8M3J1J2J9K0n5n5n5n6M2M1r7L4L7L7J03J02N4p7o8o9k1k1
$$ 1517 1491 1465 1439 1469 1500 1514 1658 1693 1597 1509 1552 1563 1575 1594 1614 1559 1504 1449 1393 1435 1476 1379 1413 1450 1487 1590 1692 1746 1669 1601 1532 1511 1490
3250A490k9k9K06P7m7m6k1k2k1k2j5j4k3J08P6P7o8o7R2R1j7j7q7q7k3k2M0M0k6k5nnO0O0
$$ 1490 1461 1432 1638 1715 1668 1622 1601 1579 1558 1536 1521 1507 1484 1592 1668 1745 1677 1610 1702 1793 1776 1759 1672 1585 1562 1540 1580 1620 1594 1569 1564 1559 1619 1679
3245A679j9j8j9j9o3o4o3o4P2P2P3P2QRQQp3p4K7K6Q8m2l5l4J5J5L2r9q4M6J04k7kkj8j9P7
$$ 1679 1660 1642 1623 1604 1541 1477 1414 1350 1422 1494 1567 1639 1647 1656 1664 1672 1599 1525 1552 1578 1666 1624 1589 1555 1570 1585 1617 1518 1434 1480 1584 1557 1555 1553 1535 1516 1593
3240A593n4j32kJ09j08n2Q0j2j2mmQPQPN6N7n2n3k6k6L9L9Q0P9k8k9O6O6p2N8l8l9l0l0M6
$$ 1593 1539 1407 1405 1514 1406 1354 1434 1422 1410 1406 1402 1410 1417 1425 1432 1488 1545 1493 1440 1414 1388 1427 1466 1546 1625 1597 1568 1634 1700 1628 1686 1648 1609 1579 1549 1595
3234A595M7j9j9L4L4j56k6K7j04J4J43jkjkM3q7p1J47K4K4j00K9J3J3K1K2l1l2n5n6n4P6O7
$$ 1595 1642 1623 1604 1638 1672 1516 1490 1517 1413 1427 1570 1569 1567 1566 1564 1607 1520 1449 1596 1620 1644 1544 1573 1586 1599 1620 1642 1611 1579 1524 1468 1414 1490 1557
3229A557O8m1m1qrlmmlL8L8L1L0J4j16j1j0M8M9j7j6K4K4K4K5n7n8n7n7PPP1P2j2j1n3P8j12
$$ 1557 1625 1584 1543 1535 1526 1523 1519 1515 1512 1550 1588 1619 1649 1663 1547 1536 1526 1574 1623 1606 1590 1614 1638 1662 1687 1630 1572 1515 1458 1465 1472 1543 1615 1603 1592 1539 1617 1505
3223A505j12J8J49Q4Q4o0o0k6k6L9L8L2L1m2m1Oj23r1L9M4M4J09j08r9r9J14J13R8j19p0O0
$$ 1505 1393 1411 1560 1644 1728 1668 1608 1582 1556 1595 1633 1665 1696 1654 1613 1619 1496 1405 1444 1488 1532 1641 1533 1434 1335 1449 1562 1660 1541 1471 1531
3218A531N6N5j18J2L9L9k6J05N7N8m2m3K8K8l7l7m5m6m5m5o3o4M5M5O9O9K9K8N2p9j87n8m
$$ 1531 1587 1642 1524 1536 1575 1614 1588 1693 1750 1808 1766 1723 1751 1779 1742 1705 1660 1614 1569 1524 1461 1397 1442 1487 1556 1625 1654 1682 1734 1655 1468 1410 1406
3213A406mK9K8L8r2M6M6L7L6P7n3p0o9L0L1K5K6qpj24j23P2P2p9p9L0L0M9M9j6j6O0O1J26
$$ 1406 1402 1431 1459 1497 1405 1451 1497 1534 1570 1647 1594 1524 1455 1485 1516 1541 1567 1559 1552 1428 1305 1377 1449 1370 1291 1321 1351 1400 1449 1433 1417 1477 1538 1664
3208A664J26l9m0m0l9o8o8o8o8K1K0N4N3%%O5O5J4J4J4J4%J%Jn3n2J2J3j9j8j9j9N6N6n3n2
$$ 1664 1790 1751 1711 1671 1632 1564 1496 1428 1360 1381 1401 1455 1508 1508 1508 1573 1638 1652 1666 1680 1694 1694 1695 1695 1696 1643 1591 1603 1616 1597 1579 1560 1541 1597 1653 1600 1548
3202A548O4O4m5m4n4n4J1J1OONON8N9N8N9q2q2q2q2K8K8K8K8r3r4J5J5llO2O2j7j6m9m9J1
$$ 1548 1612 1676 1631 1587 1533 1479 1490 1501 1507 1513 1518 1524 1582 1641 1699 1758 1676 1594 1512 1430 1458 1486 1514 1542 1449 1355 1370 1385 1382 1379 1441 1503 1486 1470 1421 1372 1383
3197A383J2J19J20n6n6N3N3NNNNj34j35k6k6J10J10m1m2J3J2k0k0N0N0n9n8K2K3K2K3N3N4
$$ 1383 1395 1514 1634 1578 1522 1575 1628 1633 1638 1643 1648 1514 1379 1353 1327 1437 1547 1506 1464 1477 1489 1469 1449 1499 1549 1490 1432 1454 1477 1499 1522 1575 1629
3192A629N3N4j5j6q8M2q0p9j44j4R9R9P1n9j07j08K02j5j5j4k0k0K6J57J8J8k6k7k6k6K2K3
$$ 1629 1682 1736 1721 1705 1617 1659 1579 1500 1356 1342 1441 1540 1611 1552 1445 1337 1539 1524 1509 1495 1475 1455 1481 1638 1656 1674 1648 1621 1595 1569 1591 1614
3187A614j3j43M6M6K9L0O6o4p3N8M4q7onm1m0R7l2J24J23l6l6m9m8j22QrrO4O4NMo1o0J6J6
$$ 1614 1601 1458 1504 1550 1579 1609 1675 1611 1538 1596 1640 1553 1547 1542 1501 1461 1558 1526 1650 1773 1737 1701 1652 1604 1482 1490 1481 1472 1536 1600 1605 1609 1548 1488 1504 1520
3181A520n7P3L8L8J19j1j28j28j4J15L0K9k0k0o5O5O5o5l2l3m0m1l5l5J6J7J56o1m0l9j05
$$ 1520 1463 1536 1574 1612 1731 1720 1592 1464 1450 1565 1595 1624 1604 1584 1519 1584 1649 1584 1552 1519 1479 1438 1403 1368 1384 1401 1557 1496 1456 1417 1312
3177A312K4R0R0M5j73j07J10R5R4J82N1j69j69k5k5J5J5J4J5M0M0M1M0k8k8N9p2j86L2R7l4
$$ 1312 1336 1426 1516 1561 1388 1281 1391 1486 1580 1762 1813 1644 1475 1450 1425 1440 1455 1469 1484 1524 1564 1605 1645 1617 1589 1648 1576 1390 1422 1519 1485
3172A485j42P5Q3m8M2M3l1l1N1N2j3j4%JO5O5L9L8j14j13o2o2k7J03J47J46k8k7j63N4P0o0
$$ 1485 1343 1418 1501 1453 1495 1538 1507 1476 1527 1579 1566 1552 1552 1553 1618 1683 1722 1760 1646 1533 1471 1409 1382 1485 1632 1778 1750 1723 1560 1614 1684 1624
3167A624QPo6o6K7K6J08k2q7M3l8l8K6K6R9l1j22j22J09J09k7k7O8O8P5j42j42P5M2M3M7M8
$$ 1624 1632 1639 1573 1507 1534 1560 1668 1646 1559 1602 1564 1526 1552 1578 1677 1646 1524 1402 1511 1620 1593 1566 1634 1702 1777 1635 1493 1568 1610 1653 1700 1748
3162A748m5j76L6r5k8k8P3P2K8K8M4q7j42j1J5J6J2J3J3J2q1q1J14J15kkj10j10Q4Q4P5P6
$$ 1748 1703 1527 1563 1468 1440 1412 1485 1557 1585 1613 1657 1570 1428 1417 1432 1448 1460 1473 1486 1498 1417 1336 1450 1565 1563 1561 1451 1341 1425 1509 1584 1660
3157A660O7o3n5n5n6n7k1J09J71J71P0j46j69l8qqj36nL0L1J7J8J8J8m5m5N5N5J18j2j20J0
$$ 1660 1727 1664 1609 1554 1498 1441 1420 1529 1700 1871 1941 1795 1626 1588 1580 1572 1436 1431 1461 1492 1509 1527 1545 1563 1518 1473 1528 1583 1701 1689 1569 1579
3152A579J0Rj4j5j10j10J28J29j0j0j0j0m5m6m6m6K9K8mnp2p3J22J23M0M1k5k4J5J5j7j7j3
$$ 1579 1589 1598 1584 1569 1459 1349 1477 1606 1596 1586 1576 1566 1521 1475 1429 1383 1412 1440 1436 1431 1359 1286 1408 1531 1571 1612 1587 1563 1578 1593 1576 1559 1546
3147A546j3j4j3K3K3K2K3J2J2J2J1mmnml1l2j53O3K1K1L5L4KKl1l0m9m8O0O1L4L4KJl3l4j
$$ 1546 1533 1519 1506 1529 1552 1574 1597 1609 1621 1633 1644 1640 1636 1631 1627 1596 1564 1411 1474 1495 1516 1551 1585 1587 1589 1558 1528 1479 1431 1491 1552 1586 1620 1622 1623 1590 1556 1555
3142A555jK6K5m0l9N1N1J9J9K1K1m4m4O7O6j28j29N7N7n1n2LLO8O8N8N7n1n1L8L8j15j14N0
$$ 1555 1554 1580 1605 1565 1526 1577 1628 1647 1666 1687 1708 1664 1620 1687 1753 1625 1496 1553 1610 1559 1507 1510 1513 1581 1649 1707 1764 1713 1662 1700 1738 1623 1509 1559
3136A559N0J8J7L4L3l1l1M5M6J3J3j12j12m7m8O7O7O7O7L8L8l5l5l2j63L3J63k8k9n3n2o4
$$ 1559 1609 1627 1644 1678 1711 1680 1649 1694 1740 1753 1766 1654 1542 1495 1447 1514 1581 1648 1715 1753 1791 1756 1721 1689 1526 1559 1722 1694 1665 1612 1560 1496
3132A496o4l1l1P0O9P0O9L1L2l4l4l1l1l1l1N3N3n5n6M7M7J5J4l3l3j2J19rk27j04K6N5N6
$$ 1496 1432 1401 1370 1440 1509 1579 1648 1679 1711 1677 1643 1612 1581 1550 1519 1572 1625 1570 1514 1561 1608 1623 1637 1604 1571 1559 1678 1669 1442 1338 1364 1419 1475
3126A475jjopL5L5p0O0J09j08o0o0M3M3r4L6K7K8k4k4Q5Q5K5K6p5p4l6R5m3m4K3K3K2K3KL
$$ 1475 1474 1473 1467 1460 1495 1530 1460 1520 1629 1521 1461 1401 1444 1487 1393 1429 1456 1484 1460 1436 1521 1606 1631 1657 1582 1508 1472 1567 1524 1480 1503 1526 1548 1571 1573 1576
3121A576ooM9q2q1M8K7K7L5L5l9l8l8l8J9J9q6M4Q4Q4j6j6J7J6qqr5L5K6K7l8l7P0P1k7k7
$$ 1576 1570 1564 1613 1531 1450 1498 1525 1552 1587 1622 1583 1545 1507 1469 1488 1507 1421 1465 1549 1633 1617 1601 1618 1634 1626 1618 1523 1558 1584 1611 1573 1536 1606 1677 1650 1623
3115A623j00K9POL8L9R2l8j16j17MLO9O8n0n0N9N9J8J8m8m7J3J4n2n2p8p8P4P5N4N3N4N4m8
$$ 1623 1523 1552 1559 1565 1603 1642 1734 1696 1580 1463 1467 1470 1539 1607 1557 1507 1566 1625 1643 1661 1613 1566 1579 1593 1541 1489 1411 1333 1407 1482 1536 1589 1643 1697 1649
3110A649m8J8J7K7K7l8l8N2N1n7n7m5m5K0K0L4L4p5p5P5P5RJ0J9J9q9r0M9M9M9M9l5l5l5l5
$$ 1649 1601 1619 1636 1663 1690 1652 1614 1666 1717 1660 1603 1558 1513 1533 1553 1587 1621 1546 1471 1546 1621 1630 1640 1659 1678 1589 1499 1548 1597 1646 1695 1660 1625 1590 1555
3105A555k5k5M0M0o2o1P7P6J18r9q5q5N8N8n0n0J27J27o9o8M0M0k5k5N5N6j0j0kjo7o7o1o1
$$ 1555 1530 1505 1545 1585 1523 1462 1539 1615 1733 1634 1549 1464 1522 1580 1530 1480 1607 1734 1665 1597 1637 1677 1652 1627 1682 1738 1728 1718 1716 1715 1648 1581 1520 1459
3100A459R1R2o9o9mmN4N5n4n4M0L9k5k6K0J9K0J9m1m2K4K3M7M7j8j9N6N5r7r7nno9p0O0O1
$$ 1459 1550 1642 1573 1504 1500 1496 1550 1605 1551 1497 1537 1576 1551 1525 1545 1564 1584 1603 1562 1520 1544 1567 1614 1661 1643 1624 1680 1735 1638 1541 1536 1531 1462 1392 1452 1513
3094A513O0O1m8m8L8r1j35Q2O1O0m8m9O0N9K2K2q7q6P6P6l2l2k7k7k6k7K6K5K6K6m5m5O4O4
$$ 1513 1573 1634 1586 1538 1576 1485 1350 1432 1493 1553 1505 1456 1516 1575 1597 1619 1532 1446 1522 1598 1566 1534 1507 1480 1454 1427 1453 1478 1504 1530 1485 1440 1504 1568
3089A568O2O2q9r0M3M3o5o5N0N0j5j5l0l0l0l0j8j8M7M8P8P9l0l0o1o1M8M8k3k3M3M2K5K5
$$ 1568 1630 1692 1603 1513 1556 1599 1534 1469 1519 1569 1554 1539 1509 1479 1449 1419 1401 1383 1430 1478 1556 1635 1605 1575 1514 1453 1501 1549 1526 1503 1546 1588 1613 1638
3084A638m0l9l2l2L3L3J6J5n0n0o6o6M3M2P4P3RQK2K3m3m4m6m7J8J8J5J6KKJ15j02K0K0j0
$$ 1638 1598 1559 1527 1495 1528 1561 1577 1592 1542 1492 1426 1360 1403 1445 1519 1592 1601 1609 1631 1654 1611 1567 1521 1474 1492 1510 1525 1541 1543 1545 1660 1558 1578 1598 1588
3078A588j0j0j0L7L7L7L7k1k2k1k1j09j09Q6Q6K1K2K1K1p4p3L4L5l4l5r9j00L5L4R2R2Q6m4
$$ 1588 1578 1568 1558 1595 1632 1669 1706 1685 1663 1642 1621 1512 1403 1489 1575 1596 1618 1639 1660 1586 1513 1547 1582 1548 1513 1414 1314 1349 1383 1475 1567 1653 1609
3073A609l6l6J2J2n4n3J09J09Q2m8j18J1L9L9k7k6P4P4m3j73%JJ9j11j11K0N8N8O6O6j8j9
$$ 1609 1573 1537 1549 1561 1507 1454 1563 1672 1754 1706 1588 1599 1638 1677 1650 1624 1698 1772 1729 1556 1556 1557 1576 1465 1354 1374 1432 1490 1556 1622 1604 1585
3069A585J4J4m1m2K4K4qqp4p3J3J3P9P8J4J5OOLj28o2O7m0m0L3L3K8K7O8o2l7l7O3O3O7O6
$$ 1585 1599 1613 1572 1530 1554 1578 1570 1562 1488 1415 1428 1441 1520 1598 1612 1627 1633 1639 1642 1514 1452 1519 1479 1439 1472 1505 1533 1560 1628 1566 1529 1492 1555 1618 1685 1751
3063A751q6q5m8m9j5j6P4P4o9p0o3O7N8N9P3P4p1p0j09K2J00J00J2J2r7r7k7k6k7k6j1j1j0
$$ 1751 1665 1580 1532 1483 1468 1452 1526 1600 1531 1461 1398 1465 1523 1582 1655 1729 1658 1588 1479 1501 1601 1701 1713 1725 1628 1531 1504 1478 1451 1425 1414 1403 1393
3058A393j1K8K8k4k4r9J19J10k0j7J13l3l4ooM0M0j14J04M6M6k1k0k9k9J17j2q4q3k6J04J04
$$ 1393 1382 1410 1438 1414 1390 1291 1410 1520 1500 1483 1596 1563 1529 1523 1517 1557 1597 1483 1587 1633 1679 1658 1638 1609 1580 1697 1685 1601 1518 1492 1596 1700
3053A700k6J4J5j02j02N6N6J38Pq5M6L7r3RJ0j08j07J9J9L5r5r7L3J04J04L0L0l6l5K7K7n
$$ 1700 1674 1688 1703 1601 1499 1555 1611 1749 1756 1671 1717 1754 1661 1670 1680 1572 1465 1484 1503 1538 1443 1346 1379 1483 1587 1617 1647 1611 1576 1603 1630 1625
3048A625on7n8o6O5K3K4L1L2L5L6m3j74k8k9L7L7m4Q6n2n3M1M1P3P3m9n0J6J5l0l0NJ35ll
$$ 1625 1619 1562 1504 1438 1503 1526 1550 1581 1613 1648 1684 1641 1467 1439 1410 1447 1484 1440 1526 1474 1421 1462 1503 1576 1649 1600 1550 1566 1581 1551 1521 1526 1661 1658 1655
3043A655o0o0j07j06J19J19J14j02m6m6j0j0K2K2L0L0m4m3J48J8j7j7l2l2M1q9l5l4n1Q0p
$$ 1655 1595 1535 1428 1322 1441 1560 1674 1572 1526 1480 1470 1460 1482 1504 1534 1564 1520 1477 1625 1643 1626 1609 1577 1545 1586 1497 1462 1428 1377 1457 1450
3038A450pK6K6J45J4k1k1m7m7O1O1K9K8L7r3jjm1m1NNo1o0L8L8m3Q7Q7m4k7k7P7P7l2l2j7
$$ 1450 1443 1469 1495 1640 1654 1633 1612 1565 1518 1579 1640 1669 1697 1734 1641 1640 1639 1598 1557 1562 1567 1506 1446 1484 1522 1479 1566 1653 1609 1582 1555 1632 1709 1677 1645 1628
3033A628j7j79L7K5j05j8j8P1P1J12j8o9o9L1L2L4L5J07k2K6K7J8J8RRm8m8q1M9J7j14R0Q9
$$ 1628 1611 1432 1469 1494 1389 1371 1353 1424 1495 1607 1589 1520 1451 1482 1514 1548 1583 1690 1668 1694 1721 1739 1757 1766 1775 1727 1679 1598 1647 1664 1550 1640 1729
3028A729M7q4n7n7o5o5N7N8m9Q2M0M1l0j61%%p3p4%%N7N7J42J2J5j16m6Q4KLj4j3k2J09j3
$$ 1729 1776 1692 1635 1578 1513 1448 1505 1563 1514 1596 1636 1677 1647 1486 1486 1486 1413 1339 1339 1339 1396 1453 1595 1607 1622 1506 1460 1544 1546 1549 1535 1522 1500 1609 1596
3022A596j3N2N2P1o0k7k7Nj25J4J4k1k0m5m5m5Q6J18j3k7k8P2P3j25j25M1J71m0l9L4L4l7
$$ 1596 1583 1635 1687 1758 1698 1671 1644 1649 1524 1538 1552 1531 1511 1466 1421 1376 1462 1580 1567 1540 1512 1584 1657 1532 1407 1448 1619 1579 1540 1574 1608 1571
3017A571l6l7l7K3K3K4K3kklk%jK3K4J01k9l0k9J04k5P9Q0j3j3r4L6M8q2jjJ8J8m7m7r3r3
$$ 1571 1535 1498 1461 1484 1507 1531 1554 1552 1550 1547 1545 1545 1544 1567 1591 1692 1663 1633 1604 1708 1683 1762 1842 1829 1816 1722 1758 1806 1724 1723 1722 1740 1758 1711 1664 1571 1478
3012A478J5J6L6L5L6L6n5n6J0J0k8k8J9J8k6J92q3q3Q6Q6k3k2m5m6O4O3j0j0p5p5K8K9k9k9
$$ 1478 1493 1509 1545 1580 1616 1652 1597 1541 1551 1561 1533 1505 1524 1542 1516 1708 1625 1542 1628 1714 1691 1669 1624 1578 1642 1705 1695 1685 1610 1535 1563 1592 1563 1534
3007A534p1N9J8J8j9k0O2o9j1J19Q6m4j14J6M4M3KKo3o3lmO2O2l2l2l2l2P6P5J1J1o7o6N0
$$ 1534 1463 1522 1540 1558 1539 1519 1581 1512 1501 1620 1706 1662 1548 1564 1608 1651 1653 1655 1592 1529 1526 1522 1584 1646 1614 1582 1550 1518 1594 1669 1680 1691 1624 1558 1608
3001A608N0j57k7RRJ5J5n8P3Q6Q5K9K9n0n1m2m2l8R3O0p0m2m2J02J03ppl9m0m4m4o0P0O9o2
$$ 1608 1658 1501 1474 1483 1492 1507 1522 1464 1537 1623 1708 1737 1766 1716 1665 1623 1581 1543 1636 1696 1626 1584 1542 1644 1747 1740 1733 1694 1654 1610 1566 1506 1576 1645 1583
2996A583m5m5M9N0j6j5o8o8P6P6M6q5j93o2J69J69j0j0j51k1N8N8n0n0j5J16O2O1l9l9j15
$$ 1583 1538 1493 1542 1592 1576 1561 1493 1425 1501 1577 1623 1538 1345 1283 1452 1621 1611 1601 1450 1429 1487 1545 1495 1445 1430 1546 1608 1669 1630 1591 1476
2991A476j15J68J67q5q6n3n3J11J11L2r8j8j9j9j8o7O4rrK6K6K6K6m2m2m2m2L0L1L0L0o3o3
$$ 1476 1361 1529 1696 1611 1525 1472 1419 1530 1641 1673 1575 1557 1538 1519 1501 1434 1498 1489 1480 1506 1532 1558 1584 1542 1500 1458 1416 1446 1477 1507 1537 1474 1411
2986A411J32J33J7J7j0j40j43j3K0J50R4l6K0K1n3P8o1o1m4m4m4m3J18J18l4l3n2n1J4J4Q8
$$ 1411 1543 1676 1693 1710 1700 1560 1417 1404 1424 1574 1668 1632 1652 1673 1620 1698 1637 1576 1532 1488 1444 1401 1519 1637 1603 1570 1518 1467 1481 1495 1583
2981A583Q8k0k1j07j07Q8Q9L7L7j01K9%%k5k5j0j1j9J12K0K0M4q6o3O6j4j5L1L1POj32lM1
$$ 1583 1671 1651 1630 1523 1416 1504 1593 1630 1667 1566 1595 1595 1595 1570 1545 1535 1524 1505 1617 1637 1657 1701 1615 1552 1618 1604 1589 1620 1651 1658 1664 1532 1529 1570
2976A570M2NJ37L0L0k5k4j25j25q3M8J57K6j29j28N8N9R4R3n8n8p9p9p9N1%J31J06k4o4o4
$$ 1570 1612 1617 1754 1784 1814 1789 1765 1640 1515 1432 1480 1637 1663 1534 1406 1464 1523 1617 1710 1652 1594 1515 1436 1357 1408 1408 1539 1645 1621 1557 1493
2971A493L6L7l2l2L3L3P0O9l9l8jjPPj03K7L5r5m1R0J30q7K8K8J5J5j7j6j7j6J6J7m9m9l3
$$ 1493 1529 1566 1534 1502 1535 1568 1638 1707 1668 1630 1629 1628 1635 1642 1539 1566 1601 1506 1465 1555 1685 1598 1626 1654 1669 1684 1667 1651 1634 1618 1634 1651 1602 1553 1520
2966A520l2L2L3jjj%p4p4L4L5N5N6N5N5N8N8j37j37N1N0J24ol8l7m6m6j5j5j6j5J9J9J8J9
$$ 1520 1488 1520 1553 1552 1551 1550 1550 1476 1402 1436 1471 1526 1582 1637 1692 1750 1808 1671 1534 1585 1635 1759 1753 1715 1678 1632 1586 1571 1556 1540 1525 1544 1563 1581 1600
2961A600J5J5n0n0J4J4j8j8O5O4m3m4n0m9N8N9J6J7K4j05onN2N1j3j2N2N3J1J2n3n4l4l4m3
$$ 1600 1615 1630 1580 1530 1544 1558 1540 1522 1587 1651 1608 1564 1514 1465 1523 1582 1598 1615 1639 1534 1528 1523 1575 1626 1613 1601 1653 1706 1717 1729 1676 1622 1588 1554 1511
2955A511Q8q1q0P9Q0p3p4qql6l5P3P3P9P9Rj22MJ34J09j07l1l1q6M5M1M2j6j5J%o4o5N3N2
$$ 1511 1599 1518 1438 1517 1597 1524 1450 1442 1434 1398 1363 1436 1509 1588 1667 1676 1554 1558 1692 1801 1694 1663 1632 1546 1591 1632 1674 1658 1643 1644 1644 1580 1515 1568 1620
2950A620n6n7l1l2P6P7NNNMm5m6K0J9K9K9k8k8j57k7N2N2NOJ06J06J21rm5m4n0n1r1L9n3n4
$$ 1620 1564 1507 1476 1444 1520 1597 1602 1607 1612 1616 1571 1525 1545 1564 1593 1622 1594 1566 1409 1382 1434 1486 1491 1497 1603 1709 1830 1821 1776 1732 1682 1631 1540 1579 1526 1472
2945A472o1O8J07k4ppnml8l7N4N4j2j1kjL1L1L3L3o7o7O5J96k9k9k8k8k8k8m8m8j3J17R5R5
$$ 1472 1411 1479 1586 1562 1555 1548 1543 1539 1501 1464 1518 1572 1560 1549 1547 1546 1577 1608 1641 1674 1607 1540 1605 1801 1772 1743 1715 1687 1659 1631 1583 1535 1522 1639 1734 1829
2939A829nok1k1J1J1rj0j0j0q6q7k1k2M2M3k3k3L2L2p7p7kkkkJ26J27k6k5j28j27O8O8P2P1
$$ 1829 1824 1818 1797 1776 1787 1798 1789 1779 1769 1759 1673 1586 1565 1543 1585 1628 1605 1582 1614 1646 1569 1492 1490 1488 1486 1484 1610 1737 1711 1686 1558 1431 1499 1567 1639 1710
2934A710l7l7j5j6q0q1qrN7N7P2P3QQm0l9K6K6q1q0j01K8J77l9o2o1L7L7MNKLO8O8k7k6k7
$$ 1710 1673 1636 1621 1605 1525 1444 1436 1427 1484 1541 1613 1686 1694 1702 1662 1623 1649 1675 1594 1514 1413 1441 1618 1579 1517 1456 1493 1530 1534 1539 1541 1544 1612 1680 1653 1627 1600
2928A600k6KJO7O7PPn8n8k0k0k0k0LLLLJ2J2J2J1j6j7M8M9n5n4n4n4J6J6J7J6j0j0R9R9n9
$$ 1600 1574 1576 1577 1644 1711 1718 1725 1667 1609 1589 1569 1549 1529 1532 1535 1538 1541 1553 1565 1577 1588 1572 1555 1603 1652 1597 1543 1489 1435 1451 1467 1484 1500 1490 1480 1579 1678 1619
2922A619n9POn9n8n9n9J02J01n0n1K7K8K7K8J9J9Q5Q4onooo1o2n3n3l1J00K6K6o6o6%jJ1J1
$$ 1619 1560 1567 1573 1514 1456 1397 1338 1440 1541 1491 1440 1467 1495 1522 1550 1569 1588 1673 1757 1751 1746 1740 1734 1673 1611 1558 1505 1474 1574 1600 1626 1560 1494 1494 1493 1504 1515
2917A515J9j11K3K4K02j5j7j7l1l1q8q7J2J3J20j1O3O3j8j8nmj21R5kkM2q9k3J07n5n5J7J8
$$ 1515 1534 1423 1446 1470 1672 1657 1640 1623 1592 1561 1473 1386 1398 1411 1531 1520 1583 1646 1628 1610 1605 1601 1480 1575 1573 1571 1613 1524 1501 1608 1553 1498 1515 1533
2911A533opN9N8N9N9ooq6q5j27MjkP2P2m8m7R1m0PPl3l4JJO6O6l4l4l4l4J7J7J7J7J5J5j7
$$ 1533 1527 1520 1579 1637 1696 1755 1749 1743 1657 1572 1445 1449 1448 1446 1518 1590 1542 1495 1586 1546 1553 1560 1527 1493 1494 1495 1561 1627 1593 1559 1525 1491 1508 1525 1542 1559 1574 1589 1572
2905A572j8M4M5k1k1j5j4R4R4KKJKl8l8j11J9K1K0l6l7rj0rrN9O0noo4o5Q0P9O1o9k9k9M2
$$ 1572 1554 1598 1643 1622 1601 1586 1572 1666 1760 1762 1764 1765 1767 1729 1691 1580 1599 1620 1640 1604 1567 1558 1548 1539 1530 1589 1649 1644 1638 1574 1509 1589 1668 1729 1660 1631 1602 1644
2900A644M1k4k4K9L0l7l6opm0l9M5M6k0k0k0k1Q9Q8n1n1j9j8L8L7p1p1L4L5L4L4O5O6m3m3
$$ 1644 1685 1661 1637 1666 1696 1659 1623 1617 1610 1570 1531 1576 1622 1602 1582 1562 1541 1630 1718 1667 1616 1597 1579 1617 1654 1583 1512 1546 1581 1615 1649 1714 1780 1737 1694
2894A694m6m6J9J9LKKKl4l4l3l4L5L4LKN5N6n3n2M8M8j03j04M5M6k0j9P3P4QQm6m6J9J9j03
$$ 1694 1648 1602 1621 1640 1643 1645 1647 1649 1615 1581 1548 1514 1549 1583 1586 1588 1643 1699 1646 1594 1642 1690 1587 1483 1528 1574 1554 1535 1608 1682 1690 1698 1652 1606 1625 1644 1541
2889A541j04M8M8J2J2M4M5L8L8p0p0O0O1m8m8o2o1M7M7RJ0k3k3O1O1mmK8K8mmL9L9k6k7j2
$$ 1541 1437 1485 1533 1545 1557 1601 1646 1684 1722 1652 1582 1642 1703 1655 1607 1545 1484 1531 1578 1587 1597 1574 1551 1612 1673 1669 1665 1693 1721 1717 1713 1752 1791 1765 1738 1726
2883A726j1j2j2j08j08JJk1k0k1k1l4l4J61J61K0J9j3j3j02j02N1N0QPQPm8m9O1O0jjjjm3
$$ 1726 1715 1703 1691 1583 1475 1476 1477 1456 1436 1415 1394 1360 1326 1487 1648 1668 1687 1674 1661 1559 1457 1508 1558 1566 1573 1581 1588 1540 1491 1552 1612 1611 1610 1609 1608 1565
2878A565m4m4m3J2J2P7P7J5J5J6J5J9J9K0J9o7o7o8o7K9K9L0K9k2k1M3M4m6m6m6m6K3K2J91
$$ 1565 1521 1477 1434 1446 1458 1535 1612 1627 1642 1658 1673 1692 1711 1731 1750 1683 1616 1548 1481 1510 1539 1569 1598 1576 1555 1598 1642 1596 1550 1504 1458 1481 1503 1694
2872A694O1J13j03n5n5mmJ7j13j09J08l0J00p0p0o2o2L4L4L4L5L9L9r6J21J35q3j29KqpO6
$$ 1694 1755 1868 1765 1710 1655 1651 1647 1664 1551 1442 1550 1520 1620 1550 1480 1418 1356 1390 1424 1458 1493 1532 1571 1475 1596 1731 1648 1519 1521 1513 1506 1572
2868A572O6M7M7o2o1L3L3j18j19J77J78K5K5q7q8K1K1n4n4n4n3P2P2POjjjjl0k9L6L5o4o5
$$ 1572 1638 1685 1732 1670 1609 1642 1675 1557 1438 1615 1793 1818 1843 1756 1668 1689 1710 1656 1602 1548 1495 1567 1639 1646 1652 1651 1650 1649 1648 1618 1589 1625 1660 1596 1531
2862A531o5o4O4O4jjK3K3K4K3j7j6M8M9k2k2k3k2JJO6O5r9j00k6k7n0Q0OOJ9J9J9J8j5j5N8
$$ 1531 1466 1402 1466 1530 1529 1528 1551 1574 1598 1621 1604 1588 1636 1685 1663 1641 1618 1596 1597 1598 1664 1729 1630 1530 1504 1477 1427 1507 1513 1519 1538 1557 1576 1594 1579 1564 1622
2857A622p2J8J7J0Rk3k3j4j5p2N9poq6M4N9p3j26R1K5K6o6o5J16j3O2O2N4N4k4k5k4k4k6k5
$$ 1622 1550 1568 1585 1595 1604 1581 1558 1544 1529 1457 1516 1509 1503 1417 1461 1520 1447 1321 1412 1437 1463 1397 1332 1448 1435 1497 1559 1613 1667 1643 1618 1594 1570 1544 1519
2851A519Q3Q3l3l3l3l3O2O2l9l8l4R7K3K3o0o1K1j10m4Q5O2O1P6n4m6m5l7l6K8K9l5l5l5l5
$$ 1519 1602 1685 1652 1619 1586 1553 1615 1677 1638 1600 1566 1663 1686 1709 1649 1588 1609 1499 1455 1540 1602 1663 1739 1685 1639 1594 1557 1521 1549 1578 1543 1508 1473 1438
2846A438O2O3J27J28j6j6j25j24nmnmL7L8L7L8k1k1r5L6lmP0P0qrqqmmMMp9N1N1p9L9L9l4
$$ 1438 1500 1563 1690 1818 1802 1786 1661 1537 1532 1528 1523 1519 1556 1594 1631 1669 1648 1627 1532 1568 1565 1561 1631 1701 1693 1684 1676 1668 1664 1660 1664 1668 1589 1640 1691 1612 1651 1690 1656
2840A656l5%j%%KKKLl2l1P7P7n4n4n5n4M7M7M7M7o2o3J32J33o4o3o4o4N2N1L8L8Q1j36q8M3
$$ 1656 1621 1621 1620 1620 1620 1622 1624 1626 1629 1597 1566 1643 1720 1666 1612 1557 1503 1550 1597 1644 1691 1629 1566 1698 1831 1767 1704 1640 1576 1628 1679 1717 1755 1836 1700 1612 1655
2834A655K6K7L5L4oopopoopK1K0K0K1q6q5k0k1R9R9n3n3J6J6J6J6j9j9q3q4q7q6J09J09j1
$$ 1655 1681 1708 1743 1777 1771 1765 1758 1752 1745 1739 1733 1726 1747 1767 1787 1808 1722 1637 1617 1596 1695 1794 1741 1688 1704 1720 1736 1752 1733 1714 1631 1547 1460 1374 1483 1592 1581
2829A581j0j1j0O9P0l9l9n0m9N9N9L2L2l3l3o9p0nml6l6N4N4J27j76j19R8l3R8J04J03n6n6
$$ 1581 1571 1560 1550 1619 1689 1650 1611 1561 1512 1571 1630 1662 1694 1661 1628 1559 1489 1484 1480 1444 1408 1462 1516 1643 1467 1348 1446 1413 1511 1615 1718 1662 1606
2824A606n6n7R5R4j00j01o8o8Q4Q4jjkjJ02J02L6L7l4l4k6k5j38pK8K8Q2Q3J7J7p3p3%j30
$$ 1606 1550 1493 1588 1682 1582 1481 1413 1345 1429 1513 1512 1511 1509 1508 1610 1712 1748 1785 1751 1717 1691 1666 1528 1521 1549 1577 1659 1742 1759 1776 1703 1630 1630 1500
2819A500L6L5l7l8L6L7L7L6n6n5N3N2k7k6M6q4l5l5m3m3M6M7j8j9O2O1lmn0n0j5J15O2O2O
$$ 1500 1536 1571 1534 1496 1532 1569 1606 1642 1586 1531 1584 1636 1609 1583 1629 1545 1510 1475 1432 1389 1435 1482 1464 1445 1507 1568 1565 1561 1511 1461 1446 1561 1623 1685 1691
2813A691NrqJ13j03k1k1n6P4J34q4o2o2O3O3L6r4j75m5o0o1L9M0L9M0K6K6J8J8P4n5J8J8L5
$$ 1691 1696 1687 1679 1792 1689 1668 1647 1591 1665 1799 1715 1653 1591 1654 1717 1753 1659 1484 1439 1379 1318 1357 1397 1436 1476 1502 1528 1546 1564 1638 1583 1601 1619 1654
2808A654L6l8R3m2m1l4l3p7p6P6P5Q3Q2k6k6Q1Q1M6q5RRp2p3J5j15m2m2OONOjjQ0n0k9J00
$$ 1654 1690 1652 1745 1703 1662 1628 1595 1518 1442 1518 1593 1676 1758 1732 1706 1787 1868 1914 1829 1838 1847 1775 1702 1717 1602 1560 1518 1524 1530 1535 1541 1540 1539 1619 1569 1540 1640
2802A640m5m6QPp3N6P3n7K4K4k8k9M5M5m4Q6P8P8o6o6r9r8K8K8nnk6k7L9L8M9M9j6j7M4M3
$$ 1640 1595 1549 1557 1564 1491 1547 1620 1563 1587 1611 1583 1554 1599 1644 1600 1686 1764 1842 1776 1710 1611 1513 1541 1569 1564 1559 1533 1506 1545 1583 1632 1681 1665 1648 1692 1735
2797A735O0p1j02K9K8j02r6L4J7J8L4L4L3L4L9L8k6k7O7O6q5q6k0k1n2n3R1R1j05j04K3K3
$$ 1735 1795 1724 1622 1651 1679 1577 1481 1515 1532 1550 1584 1618 1651 1685 1724 1762 1736 1709 1776 1842 1757 1671 1651 1630 1578 1525 1616 1707 1602 1498 1521 1544
2792A544q2M7L8L8o7O2R3l8j38pK3K4O4O4J5J5j38j37N3N4N3N4nmnmK3K4j0rK1K2q7q8J33
$$ 1544 1462 1509 1547 1585 1518 1580 1673 1635 1497 1490 1513 1537 1601 1665 1680 1695 1557 1420 1473 1527 1580 1634 1629 1625 1620 1616 1639 1663 1653 1644 1665 1687 1600 1512 1645
2787A645J33j50j50J4J3M6M6lkO3o7R7l2j06K5k7k8j8j9R4R5j4j4J3J3J3J3o4o3JJM6M6j9
$$ 1645 1778 1628 1478 1492 1505 1551 1597 1594 1592 1655 1588 1685 1653 1547 1572 1545 1517 1499 1480 1574 1669 1655 1641 1654 1667 1680 1693 1629 1566 1567 1568 1614 1660 1641
2781A641j9N0N0k3k3M8q3j15J6Q9R0r8r8RRj10K1J28q9M1M2j2j2m4m4P7P6l1l2k0k0R7R7N
$$ 1641 1622 1672 1722 1699 1676 1724 1641 1526 1542 1631 1721 1623 1525 1534 1543 1433 1454 1582 1493 1534 1576 1564 1552 1508 1464 1541 1617 1586 1554 1534 1514 1611 1708 1713
2776A713J34K9K9j29j29O6O6k2k2k2k2m2m2O7O7RJ0M2M2j0rj0rlkL8r3j7j7M0M0l1l1j01J15
$$ 1713 1847 1876 1905 1776 1647 1713 1779 1757 1735 1713 1691 1649 1607 1674 1741 1750 1760 1802 1844 1834 1825 1815 1806 1803 1801 1839 1746 1729 1712 1752 1792 1761 1730 1629 1744
2771A744J48o9j29j28ppN8N8o5o6%%L6L7L6L7j9j8R0R0m2m2k3k3J08j09j17J00P9n1j15j16
$$ 1744 1892 1823 1694 1566 1559 1552 1610 1668 1603 1537 1537 1537 1573 1610 1646 1683 1664 1646 1736 1826 1784 1742 1719 1696 1804 1695 1578 1678 1757 1706 1591 1475
2766A475O7O7j28Q9J46J5L6L7n5n4KKJ9j11noP2P2q0q0K6K5POj19R9M9q1j0j0q3q3L3L3Q9
$$ 1475 1542 1609 1481 1570 1716 1731 1767 1804 1749 1695 1697 1699 1718 1607 1602 1596 1668 1740 1660 1580 1606 1631 1638 1644 1525 1624 1673 1592 1582 1572 1489 1406 1439 1472 1561
2761A561R0L3r8QQNNk7k8O0O0m8m9j4j3N1N1K0K0m6m5J0Rk2k3O1O1mlj03j02K0J50llo0o0
$$ 1561 1651 1684 1586 1594 1602 1607 1612 1585 1557 1617 1677 1629 1580 1566 1553 1604 1655 1675 1695 1649 1604 1614 1623 1601 1578 1639 1700 1696 1693 1590 1488 1508 1658 1655 1652 1592 1532
2755A532j55j54K14K14m5m5K1K0l6l7m5Q6O5O4L8r3llp7p6M0M0k6k5J02J02ooJ8J8m7m7o1
$$ 1532 1377 1223 1437 1651 1606 1561 1582 1602 1566 1529 1484 1570 1635 1699 1737 1644 1641 1638 1561 1485 1525 1565 1539 1514 1616 1718 1712 1706 1724 1742 1695 1648 1587
2750A587o1NMj6j6J27J28J8j13m7m7J33Ko2o2j02J15J0j21n9P2J28kK9K9r8L2R9j17k7J02
$$ 1587 1526 1531 1535 1519 1503 1630 1758 1776 1663 1616 1569 1702 1704 1642 1580 1478 1593 1603 1482 1423 1495 1623 1621 1650 1679 1581 1613 1712 1595 1568 1670
2745A670QQJ5J6K0K0n3n3P4n6J7J8n9n8J02J02k38j08N8N8k7k7klQ5m5j10J9O1O1O9O9ooj4
$$ 1670 1678 1686 1701 1717 1737 1757 1704 1651 1725 1669 1686 1704 1645 1587 1689 1791 1553 1445 1503 1561 1534 1507 1505 1502 1587 1542 1432 1451 1512 1573 1642 1711 1705 1699 1685
2740A685j3N5p5j0j0J01l1k2k2n0n0n0n0M7M6j79m8J57J57K2K2p6N4O2o8o1O9j2j2p8p7L1
$$ 1685 1672 1727 1652 1642 1632 1733 1702 1680 1658 1608 1558 1508 1458 1505 1551 1372 1324 1481 1638 1660 1682 1606 1660 1722 1654 1593 1662 1650 1638 1560 1483 1514
2735A514L1jjk2J07R1j26n2n3q8M3J21J21m4m4m4m4MMk9k9m0m0O8O8mnO1O1NNo8O2O3O3L7
$$ 1514 1545 1544 1543 1521 1628 1719 1593 1541 1488 1400 1443 1564 1685 1641 1597 1553 1509 1513 1517 1488 1459 1419 1379 1447 1515 1511 1506 1567 1628 1633 1638 1570 1632 1695 1758 1795
2730A795r4l2l1j13J7J02J02L2r9m4m5p7p7m1R0M8M9Q5Q5j5j5j20J1KLJ0J1k2k2j4j4m7m6
$$ 1795 1701 1669 1638 1525 1542 1644 1746 1778 1679 1635 1590 1513 1436 1395 1485 1533 1582 1667 1752 1737 1722 1602 1613 1615 1618 1628 1639 1617 1595 1581 1567 1520 1474
2725A474K3K2L1L1j19J2Q5m5p0O0J9j11JJO3J94K3j08j31kQ2Q2j8j8M9M9n9o0k5k5Q3Q3J1
$$ 1474 1497 1519 1550 1581 1462 1474 1559 1514 1444 1504 1523 1412 1413 1414 1477 1671 1694 1586 1455 1453 1535 1617 1599 1581 1630 1679 1620 1560 1535 1510 1593 1676 1687
2720A687J1J2J1n4n4J2J1OOOOk2k1M3M3p8p9j4j3N8N8N9N8J2J2J2J3r0q9O2O3J5J5J5J5kl
$$ 1687 1698 1710 1721 1667 1613 1625 1636 1642 1648 1654 1660 1638 1617 1660 1703 1625 1546 1532 1519 1577 1635 1694 1752 1764 1776 1788 1801 1711 1622 1684 1747 1762 1777 1792 1807 1805 1802
2714A802P1n9J3J4j38j38r8L3O0O0J30%l5l6Q0P9j46j6RRm9m8n0n0K0J51J02k9r1r1q4M5M6
$$ 1802 1873 1814 1827 1841 1703 1565 1467 1500 1560 1620 1750 1750 1715 1679 1759 1838 1692 1676 1685 1694 1645 1597 1547 1497 1517 1668 1770 1741 1650 1559 1475 1520 1566
2709A566M5q6M4N2p8p6N5L7L8M2M2J0RJKj13J8J48J8n2n2k1k0o9O2L8r2K2K2n0n0N0N1Q5m5
$$ 1566 1611 1525 1569 1621 1543 1467 1522 1559 1597 1639 1681 1691 1700 1701 1703 1590 1608 1756 1774 1722 1670 1649 1629 1560 1622 1660 1568 1590 1612 1562 1512 1562 1613 1698 1653
2704A653l7l7L7L7L7L7J25J25j57j57o0n9OON4N5j1j0q8q8K0K1MMNMO2O2O1O2j49j49M7M6
$$ 1653 1616 1579 1616 1653 1690 1727 1852 1977 1820 1663 1603 1544 1550 1556 1610 1665 1654 1644 1556 1468 1488 1509 1513 1517 1522 1526 1588 1650 1711 1773 1624 1475 1522 1568
2698A568j9j9J3J4l1l0l1l0K0K0K0K1Q9R0o3o2K3K4K3K4p6p5j0j1R6R6j42j43Q3Q2J8J7J18
$$ 1568 1549 1530 1543 1557 1526 1496 1465 1435 1455 1475 1495 1516 1605 1695 1632 1570 1593 1617 1640 1664 1588 1513 1503 1492 1588 1684 1542 1399 1482 1564 1582 1599 1717
2693A717J18l4l4%Jo5o5J3J2k0k0qpppo2o2M7M6J9J9j4j3n1n0N8N8J9J9m5m6KKo4o3N9O0N9
$$ 1717 1835 1801 1767 1767 1768 1703 1638 1651 1663 1643 1623 1615 1608 1601 1594 1532 1470 1517 1563 1582 1601 1587 1574 1523 1473 1531 1589 1608 1627 1582 1536 1538 1540 1476 1413 1472 1532 1591
2687A591O0M1M2RRp8p9L0L0m1m1K4K4JJJ%N8N7r5r5j4j3j4j3%JO5O6noO0N9k3k3KJM2q8j21
$$ 1591 1651 1692 1734 1743 1752 1674 1595 1625 1655 1614 1573 1597 1621 1622 1623 1624 1624 1682 1739 1644 1549 1535 1522 1508 1495 1495 1496 1561 1627 1622 1616 1676 1735 1712 1689 1691 1692 1734 1646 1525
2681A525J0J%O6O6Qj22n7P4N5N5j0j0Q8m1j55j55K1J53P9P8n5n5RJ0n5n5R8R7m3m2M4q6j67
$$ 1525 1535 1536 1536 1602 1668 1676 1554 1497 1571 1626 1681 1671 1661 1749 1708 1553 1398 1419 1572 1651 1729 1674 1619 1628 1638 1583 1528 1626 1723 1680 1638 1682 1596 1429
2676A429N0P2P2l0l0P0P1J26nl9m0l0l1l1l0qpm0m0l1l1M2M2l6R4J01k8p2N9m0R1J8j13r6
$$ 1429 1479 1551 1623 1593 1563 1633 1704 1830 1825 1786 1746 1716 1685 1654 1624 1616 1609 1569 1529 1498 1467 1509 1551 1515 1609 1710 1682 1610 1669 1629 1720 1738 1625 1529
2671A529L3l9R2N1N0P4n7r2r2L3L3L4L3klp5N4m1m1j%k4k4q9q9N6N6J12J13Rj21k0J09Oj24
$$ 1529 1562 1523 1615 1666 1716 1790 1733 1641 1549 1582 1615 1649 1682 1680 1677 1602 1656 1615 1574 1573 1573 1549 1525 1436 1347 1403 1459 1571 1684 1693 1572 1552 1661 1667 1543
2666A543q3M6l2l2J20J20J15j5n0n0r8r7l3l3O0O0noM4M4k2k1KKO6O7rrrrNMNMn6n5R6R7r9
$$ 1543 1460 1506 1474 1442 1562 1682 1797 1782 1732 1682 1584 1487 1454 1421 1481 1541 1536 1530 1574 1618 1596 1575 1577 1579 1645 1712 1703 1694 1685 1676 1681 1685 1690 1694 1638 1583 1679 1776 1677
2660A677r9RJ0N1N1N0N1n6n5q9q8j5j5M9N0MNMML2L2o4o3q4J33J42J1N8p1j16j15L7L6J02
$$ 1677 1578 1587 1597 1648 1699 1749 1800 1744 1689 1600 1512 1497 1482 1531 1581 1585 1590 1594 1598 1630 1662 1598 1535 1451 1584 1726 1737 1795 1724 1608 1493 1530 1566 1668
2655A668J02r6r7J2J2K8K8l8l7O6O6L4L4m1m2K4K3JKo4o4K6K5l9m0R0R0K5K5q3q4j8j9N6N5
$$ 1668 1770 1674 1577 1589 1601 1629 1657 1619 1582 1648 1714 1748 1782 1741 1699 1723 1746 1747 1749 1685 1621 1647 1672 1633 1593 1683 1773 1798 1823 1740 1656 1638 1619 1675 1730
2649A730K79M08K82j96k74j44r1r2q3q4l4l4jkl2l3L2L3%%l3l3M4M3M3M4m2m3m2m2m0m0p2
$$ 1730 2009 2417 2699 2503 2229 2085 1994 1902 1819 1735 1701 1667 1666 1664 1632 1599 1631 1664 1664 1664 1631 1598 1642 1685 1728 1772 1730 1687 1645 1603 1563 1523 1451
2644A451p3M4M4O6j51l6R4L9M0L4L5JKO3O3m5m5JJKJrqN6N6K4K4K4K4r3r3k8k7K2K3N5N5l1
$$ 1451 1378 1422 1466 1532 1381 1345 1439 1478 1518 1552 1587 1588 1590 1653 1716 1671 1626 1627 1628 1630 1631 1622 1614 1670 1726 1750 1774 1798 1822 1729 1636 1608 1581 1603 1626 1681 1736 1705
2638A705l1KKJ2J2P8P8q1q1j5j5q5q4k0j9PPJ6J5J4J45J28q9j03j03qqN0N1J8J7k8k8NNL7
$$ 1705 1674 1676 1678 1690 1702 1780 1858 1777 1696 1681 1666 1581 1497 1477 1458 1465 1472 1488 1503 1517 1662 1790 1701 1598 1495 1487 1479 1529 1580 1598 1615 1587 1559 1564 1569 1606
2633A606L7L7L7L7L7p2p2n4n4J1J1O6O5m3m2RRk3k3QRn7n6m3m3O5O6l8l7nnQ1Q1k7k8m5m5
$$ 1606 1643 1680 1717 1754 1791 1719 1647 1593 1539 1550 1561 1627 1692 1649 1607 1616 1625 1602 1579 1587 1596 1539 1483 1440 1397 1462 1528 1490 1453 1448 1443 1524 1605 1578 1550 1505 1460
2627A460J07J07o1o2MMr0r1O2O1L4L5p4p5Q3Q2k6k6Q8Q8N2p8p3p2o0P1J77m1j35nM6M7O8j49
$$ 1460 1567 1674 1613 1551 1555 1559 1469 1378 1440 1501 1535 1570 1496 1421 1504 1586 1560 1534 1622 1710 1762 1684 1611 1539 1479 1550 1727 1686 1551 1546 1592 1639 1707 1558
2622A558K6K5n3n4L1L1O4O3l3l3o5o6M7M8N5N5o8O2m4m4q2q2J56J56n4n5J9j12L9L8p0p0m9
$$ 1558 1584 1609 1556 1502 1533 1564 1628 1691 1658 1625 1560 1494 1541 1589 1644 1699 1631 1693 1649 1605 1523 1441 1597 1753 1699 1644 1663 1551 1590 1628 1558 1488 1439
2617A439Q2R0m0q7M3J00l0k9k8K8K8N6N7n2n2OOOPP2P3l6l6k7k8L8L7j2j2j1j2k0k0k0k0l0
$$ 1439 1521 1611 1571 1484 1527 1627 1597 1568 1540 1568 1596 1652 1709 1657 1605 1611 1617 1623 1630 1702 1775 1739 1703 1676 1648 1686 1723 1711 1699 1688 1676 1656 1636 1616 1596 1566
2612A566k9l8R3K5K5L3L3m7m7J9J8NNNNp4p5l9R1LKl0J00OOn1n1o4o3M5M4J27J26R1m0q0q0
$$ 1566 1537 1499 1592 1617 1642 1675 1708 1661 1614 1633 1651 1656 1661 1666 1671 1597 1522 1483 1574 1577 1579 1549 1649 1655 1661 1610 1559 1495 1432 1477 1521 1648 1774 1865 1825 1745 1665
2606A665n2P7MNn3n2n0n0N9N9O3O3m6m6k2k3q8q8NNNMK8K8K8K8QRQRMMNMK0J9m6m6L0L0ll
$$ 1665 1613 1690 1694 1699 1646 1594 1544 1494 1553 1612 1675 1738 1692 1646 1624 1601 1513 1425 1430 1435 1440 1444 1472 1500 1528 1556 1564 1573 1581 1590 1594 1598 1603 1607 1627 1646 1600 1554 1584 1614 1611 1608
2599A608LMO9O9ONj02j03o9o8L9M0J8J8m7m7j8j8J34J34J1J2k1k1POk6k6M0L9k6k6K8K8l7
$$ 1608 1611 1615 1684 1753 1759 1764 1662 1559 1490 1422 1461 1501 1519 1537 1490 1443 1425 1407 1541 1675 1686 1698 1677 1656 1663 1669 1643 1617 1657 1696 1670 1644 1672 1700 1663
2594A663l7l6l6l6l5M0M1k4k4k6k7L9L9NNk7k7OOJ14J15L7L7j15j15O2O2m7m7p9p9L0K9j1
$$ 1663 1626 1590 1554 1518 1483 1523 1564 1540 1516 1490 1463 1502 1541 1546 1551 1524 1497 1503 1509 1623 1738 1775 1812 1697 1582 1644 1706 1659 1612 1533 1454 1484 1513 1502
2589A502j1R8R7P0O9NMj07j07m1m2L4L3l1l2L0K9L0K9m4m5K9K9PJ38P2n8J2J3Q6m5j42j1j2
$$ 1502 1491 1589 1686 1756 1825 1830 1834 1727 1620 1579 1537 1571 1604 1573 1541 1571 1600 1630 1659 1615 1570 1599 1628 1635 1773 1845 1787 1799 1812 1898 1853 1711 1700 1688
2584A688j42j4J16l0l0M0L9N5p4j53k3Q3Q3N1p8O0O0j3j2j2j2P3P3nj36n5n4ooJ43J4k3k2
$$ 1688 1546 1532 1648 1618 1588 1628 1667 1722 1648 1495 1472 1555 1638 1689 1611 1671 1731 1718 1706 1694 1682 1755 1828 1823 1687 1632 1578 1572 1566 1709 1723 1700 1678
2579A678q6q6R6R6P5j41r3L7l6l5L7L8MMj8K00K1j09J1J1n8n8j24j23Q2Q2J7J7RRP4P4m0m1
$$ 1678 1592 1506 1602 1698 1773 1632 1539 1576 1540 1505 1542 1580 1584 1588 1570 1770 1791 1682 1693 1704 1646 1588 1464 1341 1423 1505 1522 1539 1548 1557 1631 1705 1665 1624
2574A624L3L3r9L0K3K3j0j0L5L6k05J1P2n9J3J4L8L8l8l7l7l8R8R7J06k4k9k8O3O4J7j14j05
$$ 1624 1657 1690 1591 1621 1644 1667 1657 1647 1682 1718 1513 1524 1596 1537 1550 1564 1602 1640 1602 1565 1528 1490 1588 1685 1791 1767 1738 1710 1773 1837 1854 1740 1635
2568A635j05K3K2rj0Q0Q0M5q5n0m9%jP6n5J8J9J4J5OPL2r8k5k5J00J00K9j00j23PK6K6M1q9
$$ 1635 1530 1553 1575 1566 1556 1636 1716 1761 1676 1626 1577 1577 1576 1652 1597 1615 1634 1648 1663 1669 1676 1708 1610 1585 1560 1660 1760 1789 1689 1566 1573 1599 1625 1666 1577
2563A577qpj01K9K1K1M0M0M1M0k6k6M4J75P8n3l7l7oopoo2o2j35nMLJ2J1j5j6j5j6M1M1l3
$$ 1577 1569 1562 1461 1490 1511 1532 1572 1612 1653 1693 1667 1641 1685 1860 1938 1885 1848 1811 1805 1799 1792 1786 1724 1662 1527 1522 1526 1529 1541 1552 1537 1521 1506 1490 1531 1572 1539
2557A539R8r5r5K2J52J83l3m8m7n1P9ONO0O0K5j05l5l5K2K2l5l4l4l4L2L3M0r0M3M4l1l0J9
$$ 1539 1637 1542 1447 1469 1621 1804 1771 1723 1676 1625 1704 1710 1715 1775 1835 1860 1755 1720 1685 1707 1729 1694 1660 1626 1592 1624 1657 1697 1607 1650 1694 1663 1633 1652
2552A652J9J9J8JJJJN9N9r3r3j3j3j4j3O9P0l1l1j06K6QRJ60K9m9n0l4l3l4l3M2M3k3k3J6
$$ 1652 1671 1690 1708 1709 1710 1711 1712 1771 1830 1737 1644 1631 1618 1604 1591 1660 1730 1699 1668 1562 1588 1596 1605 1765 1794 1745 1695 1661 1628 1594 1561 1603 1646 1623 1600 1616
2547A616J5J6J5j02j03R3R3K6K5l9l9n0n0N8N8J18J17RRr5r5l1l0l7l8l7l8j7j7M8M8k4k4
$$ 1616 1631 1647 1662 1560 1457 1550 1643 1669 1694 1655 1616 1566 1516 1574 1632 1750 1867 1876 1885 1790 1695 1664 1634 1597 1559 1522 1484 1467 1450 1498 1546 1522 1498
2542A498M1M1J6J7J6J7k7k6k6k7O4O3kkn7n7QQj7j6j6j7J4J4J4J4k3k3M2M3k2k2k1k2LLJ11
$$ 1498 1539 1580 1596 1613 1629 1646 1619 1593 1567 1540 1604 1667 1665 1663 1606 1549 1557 1565 1548 1532 1516 1499 1513 1527 1541 1555 1532 1509 1551 1594 1572 1550 1529 1507 1510 1513 1624
2536A624J11k8k8k8k8M3M2k3k2j4j4j4j3RRn6n6m5m5O3O3N9N9m9n0j7j8j7j7N3N3N3N3kko8
$$ 1624 1735 1707 1679 1651 1623 1666 1708 1685 1663 1649 1635 1621 1608 1617 1626 1570 1514 1469 1424 1487 1550 1609 1668 1619 1569 1552 1534 1517 1500 1553 1606 1659 1712 1710 1708 1640
2531A640o7o3o4KKQ6Q5K1K0o3o4M5M5J%o4o5J9J8K7K7l7R3N3N2O0O0j35j35j8j8j0j0p2N8
$$ 1640 1573 1510 1446 1448 1450 1536 1621 1642 1662 1599 1535 1580 1625 1626 1626 1562 1497 1516 1534 1561 1588 1551 1644 1697 1749 1809 1869 1734 1599 1581 1563 1553 1543 1471 1529
2525A529M1M2O4o6PPj9k0M6M6qqm0m1L1L1p8p8J22J22Qj22j05K5Q8Q8N9p1JKj6j6q1q1J17
$$ 1529 1570 1612 1676 1610 1617 1624 1605 1585 1631 1677 1669 1661 1621 1580 1611 1642 1564 1486 1608 1730 1738 1616 1511 1536 1624 1712 1771 1700 1701 1703 1687 1671 1590 1509 1626
2520A626J17QQn0n1J4J5LMK8K9L2r8o5O5K7K8n8n9j32Q5nnm0m0K5K5P6P7Q5m6j5j5n6n6PQ
$$ 1626 1743 1751 1759 1709 1658 1672 1687 1690 1694 1722 1751 1783 1685 1620 1685 1712 1740 1682 1623 1491 1576 1571 1566 1526 1486 1511 1536 1612 1689 1774 1728 1713 1698 1642 1586 1593 1601
2514A601j5J16P4j43j44j3M0J70L2L2k5j55j55k5J44J44j%j3j3nno1P0o9o9m9m8j4J17J41
$$ 1601 1586 1702 1776 1633 1489 1476 1516 1686 1718 1750 1725 1570 1415 1390 1534 1678 1677 1677 1664 1651 1646 1641 1580 1650 1581 1512 1463 1415 1401 1518 1659
2510A659J41m6m6l8l8L5L5r3L7mmL9L9k6k6M8M7P0o1j88K9PQk0k0Q9Q9j15j14m9m9kkP1n8
$$ 1659 1800 1754 1708 1670 1632 1667 1702 1609 1646 1642 1638 1677 1716 1690 1664 1712 1759 1829 1768 1580 1609 1616 1624 1604 1584 1673 1762 1647 1533 1484 1435 1433 1431 1502 1444
2504A444J29J29MNO5o5o5o5R0m0q3q4P9n2o8J49N4N5J0J1q6M4L5L6M1M1j10j11M5M5N3p7j1
$$ 1444 1573 1702 1706 1711 1776 1711 1646 1581 1671 1631 1548 1464 1543 1491 1423 1572 1626 1681 1691 1702 1616 1660 1695 1731 1772 1813 1703 1592 1637 1682 1735 1658 1647
2499A647j2r3L7k9k8M5M6L9L9M0L9NNM5M6j47j6J1J1jj31n7n8PPj0J21N7p3QQRJ0p3N8P7n4
$$ 1647 1635 1542 1579 1550 1522 1567 1613 1652 1691 1731 1770 1775 1780 1825 1871 1724 1708 1719 1730 1729 1598 1541 1483 1490 1497 1487 1608 1665 1592 1600 1608 1617 1627 1554 1612 1689 1635
2494A635K7K8k0j9K1K2j25OM9M9r9L1J40J0k6k7jkm3m3K2K3rqqrm1m2K3K3n2n2j9k0O2O2p6
$$ 1635 1662 1690 1670 1651 1672 1694 1569 1575 1624 1673 1574 1605 1745 1755 1729 1702 1701 1699 1656 1613 1635 1658 1649 1641 1633 1624 1583 1541 1564 1587 1535 1483 1464 1444 1506 1568 1492
2488A492N3l7l7LM%%%%P7P6M3M4L6L6k9k8QQm8m9j19J0P6n5RRJJN6N5j0rn8n8Q9m1j4J17P6
$$ 1492 1545 1508 1471 1474 1478 1478 1478 1478 1478 1555 1631 1674 1718 1754 1790 1761 1733 1741 1749 1701 1652 1533 1543 1619 1564 1573 1582 1583 1584 1640 1695 1685 1676 1618 1560 1649 1608 1594 1711 1787
2482A787n4l1l2K5K5n2n3J2J3M1M1o8o8%jjjJ7J7j22RQ2Q2K6K5l8l8nnR3R4N9p2p5p6q3q3
$$ 1787 1733 1702 1670 1695 1720 1668 1615 1627 1640 1681 1722 1654 1586 1586 1585 1584 1583 1600 1617 1495 1504 1586 1668 1694 1719 1681 1643 1638 1633 1726 1820 1879 1807 1732 1656 1573 1490
2476A490O0N9nnl5l5l6l5MLO1O0R3l7j02K8noP6n4jjjjo8O3j1j1O1O2O1O1p7p6mlk2J07J08
$$ 1490 1550 1609 1604 1599 1564 1529 1493 1458 1462 1465 1526 1586 1679 1642 1540 1568 1563 1557 1633 1579 1578 1577 1576 1575 1507 1570 1559 1548 1609 1671 1732 1793 1716 1640 1636 1633 1611 1718 1826
2470A826k2q6q6J4J4m9n0J6J5k2k3Q6Q6K9K9j15j15r6L5J43J3l4l4m2m2j7j8K4K3k5J05l3
$$ 1826 1804 1718 1632 1646 1660 1611 1561 1577 1592 1570 1547 1633 1719 1748 1777 1662 1547 1451 1486 1629 1642 1608 1574 1532 1490 1473 1455 1479 1502 1477 1582 1549
2465A549l3m4m3O5O5k7k7L8L8l2l1J06J06J39p9j00j01m0R0O5o5o4O6J7J8k3k4mmJ64n3j12
$$ 1549 1516 1472 1429 1494 1559 1532 1505 1543 1581 1549 1518 1624 1730 1869 1790 1690 1589 1549 1639 1704 1639 1575 1641 1658 1676 1653 1629 1625 1621 1785 1732 1620
2460A620J7K3K3p7p7q3q3J51K0n3P7J05J04NOo0o0KKKKn7n7l0J00O4o6j8j7m7m6J0J0J27m
$$ 1620 1637 1660 1683 1606 1529 1446 1363 1514 1534 1481 1558 1663 1767 1772 1778 1718 1658 1660 1662 1664 1666 1609 1552 1522 1622 1686 1620 1602 1585 1538 1492 1502 1512 1639 1635
2455A635q3q3llllK7K8nnj6j6M8M9j2j3J69L9q6q6J5J4O9O9q3q3nmK7K8k9k8m4Q5J11k0ll
$$ 1635 1552 1469 1466 1463 1460 1457 1484 1512 1507 1502 1486 1470 1518 1567 1555 1542 1711 1750 1664 1578 1593 1607 1676 1745 1662 1579 1574 1570 1597 1625 1596 1568 1524 1609 1720 1700 1697 1694
2449A694L5L6l0l0k0j9M5M5l3l4n9n8M5J76O7o3j09j09l9R1Q1Q1o4o3J01J01k1j52n7n6%J
$$ 1694 1729 1765 1735 1705 1685 1666 1711 1756 1723 1689 1630 1572 1617 1793 1860 1797 1688 1579 1540 1631 1712 1793 1729 1666 1767 1868 1847 1695 1638 1582 1582 1583
2444A583M0M0k5k5NONOMNN3p7j00L0J9J49L1r9n0n0R9J00n3n2o7o6l2R9L2L3M0M1r9r8p2N9
$$ 1583 1623 1663 1638 1613 1618 1624 1629 1635 1639 1644 1697 1620 1520 1550 1569 1718 1749 1650 1600 1550 1649 1749 1696 1644 1577 1511 1479 1578 1610 1643 1683 1724 1625 1527 1455 1514
2439A514P5n5K7K6l8l8kJ27J0J0j5j5K3K4j0ro6o7M3M2o5o4%Jj3j4M4M4J40J0k6k6JKO6O7
$$ 1514 1589 1534 1561 1587 1549 1511 1509 1636 1646 1656 1641 1626 1649 1673 1663 1654 1588 1521 1564 1606 1541 1477 1477 1478 1465 1451 1495 1539 1679 1689 1663 1637 1638 1640 1706 1773
2433A773N7N8q7q6p0O0O0p0l5l6m4m3j7j7M9M8lmO2O1o7o7klL6L6M4M4j10K1k1k0N9N9K3j06
$$ 1773 1830 1888 1801 1715 1645 1705 1765 1695 1660 1624 1580 1537 1520 1503 1552 1600 1597 1593 1655 1716 1649 1582 1580 1577 1613 1649 1693 1737 1627 1648 1627 1607 1666 1725 1748 1642
2428A642l3l4qrj1j0N5N5J51J50j23j24j25MQ4Q3O0N9L3r8p2N7RRj01j00QQkln9n9o4O5N8
$$ 1642 1609 1575 1567 1558 1547 1537 1592 1647 1798 1948 1825 1701 1576 1580 1664 1747 1807 1866 1899 1801 1729 1786 1795 1804 1703 1603 1611 1619 1617 1614 1555 1496 1432 1497 1555
2423A555N8j09j08J3J44P7P7Q5Q4q4q5j09j09j3J17J10J09l3l3o5o6j7j6J5J6J3J2m4m5q6
$$ 1555 1613 1504 1396 1409 1553 1630 1707 1792 1876 1792 1707 1598 1489 1476 1593 1703 1812 1779 1746 1681 1615 1598 1582 1597 1613 1626 1638 1594 1549 1463
2418A463M5J17j2r2L9m3m3M3M4J0J1RRn7n6k1k0M5M4K3K3K3K3m3m4K2K1J01J00qqj17j17l8
$$ 1463 1508 1625 1613 1521 1560 1517 1474 1517 1561 1571 1582 1591 1600 1543 1487 1466 1446 1491 1535 1558 1581 1604 1627 1584 1540 1562 1583 1684 1784 1776 1768 1651 1534 1496
2413A496R2L6L6N3p8J4J4J5J4q6M4M4q6p1p1j53k2R7R7L9M0K8K7K8K7N9N9N9N8q7q8q8q8K2
$$ 1496 1588 1624 1660 1713 1635 1649 1663 1678 1692 1606 1650 1694 1608 1537 1466 1313 1291 1388 1485 1524 1564 1592 1619 1647 1674 1733 1792 1851 1909 1822 1734 1646 1558 1580
2408A580K2K2K2O7O7m2m2k1k1k0k1L1L1j22j21L2L2L1L2m1m2J81J81P9j81j81P9k4k4pqO5
$$ 1580 1602 1624 1646 1713 1780 1738 1696 1675 1654 1634 1613 1644 1675 1553 1432 1464 1496 1527 1559 1518 1476 1657 1838 1917 1736 1555 1634 1610 1586 1579 1571 1636
2403A636O6%%n6n6n5n6P9P9P9P8k0k0k1k0J0J1r8r8N9N9O0N9o0o0NNo5o6o6o5Q5Q5k4k3P9
$$ 1636 1702 1702 1702 1646 1590 1535 1479 1558 1637 1716 1794 1774 1754 1733 1713 1723 1734 1636 1538 1597 1656 1716 1775 1715 1655 1660 1665 1600 1534 1468 1403 1488 1573 1549 1526 1605
2397A605Q0O3O3J19j42j03j04JJ%JM9M8M8M9m0l9j05j05M0M0M1M0k3k4k3k4M5M4M4M4q4q5
$$ 1605 1685 1748 1811 1930 1788 1685 1581 1582 1583 1583 1584 1633 1681 1729 1778 1738 1699 1594 1489 1529 1569 1610 1650 1627 1603 1580 1556 1601 1645 1689 1733 1649 1564
2392A564k0j9LMLMO7O7O0N9K7j04l0k9J7J8P4P5M7q3p5N6j16J5m2m2KJ32ooo8o9j1j2Q3m8
$$ 1564 1544 1525 1528 1532 1535 1539 1606 1673 1733 1792 1819 1715 1685 1656 1673 1691 1765 1840 1887 1804 1729 1785 1669 1684 1642 1600 1602 1734 1728 1722 1654 1585 1574 1562 1645 1597
2387A597m7Q3k2k2j3j4j0j0j0j0J3J3P8P8jjkj%%j08j09Q2Q1R8l3m7Q3JJm3m4K2K2j0rN5N6
$$ 1597 1550 1633 1611 1589 1576 1562 1552 1542 1532 1522 1535 1548 1626 1704 1703 1702 1700 1699 1699 1699 1591 1482 1564 1645 1743 1710 1663 1746 1747 1748 1705 1661 1683 1705 1695 1686 1741 1797
2381A797l9l9m7Q3Q2Q1J2j19j4j4k2k2M9N0N0N0m8m8m8m8L4L3j48j8J1J1l7l8l6R4m5m4K1
$$ 1797 1758 1719 1672 1755 1837 1918 1930 1811 1797 1783 1761 1739 1788 1838 1888 1938 1890 1842 1794 1746 1780 1813 1665 1647 1658 1669 1632 1594 1558 1652 1607 1563 1584
2376A584K1J2J3J23qP4n7j22j23O5O4n7n7l1J00J08k3ooJ2J3J3J2j5j5j5j5q7q7J08J08j3
$$ 1584 1605 1617 1630 1753 1745 1819 1762 1640 1517 1582 1646 1589 1532 1501 1601 1709 1686 1680 1674 1686 1699 1712 1724 1709 1694 1679 1664 1577 1490 1598 1706 1693
2371A693j3j3j3K6K6K7K6j5j6j5j6m5m5J9K0l0l0P9P9j14j14QJ38J7J6kj33r1L8J39Qo5o5
$$ 1693 1680 1667 1654 1680 1706 1733 1759 1744 1728 1713 1697 1652 1607 1626 1646 1616 1586 1665 1744 1630 1516 1524 1662 1679 1695 1693 1560 1469 1507 1646 1654 1589 1524
2366A524P9P9l7l8O3O3P5n4j27KJ12j9r0r0ppN9N8L9L9j07K3J73M4q4k14k9k8P2P2l7l7l7
$$ 1524 1603 1682 1645 1607 1670 1733 1808 1754 1627 1629 1741 1722 1632 1542 1535 1528 1587 1645 1684 1723 1616 1639 1812 1856 1772 1558 1529 1501 1573 1645 1608 1571 1534
2361A534l7M7M7N5p5QPj%M4M4N2p8O4O4n2n2J1J1J2J1n7n8k2J08J9J8M3q7q8M3L5r6J6J6R4
$$ 1534 1497 1544 1591 1646 1571 1579 1586 1585 1585 1629 1673 1725 1647 1711 1775 1723 1671 1682 1693 1705 1716 1659 1601 1579 1687 1706 1724 1767 1680 1592 1635 1670 1574 1590 1606 1700
2355A700l5j06J11M6M7L5L6p4p3q0q1q0q1M4M5M4M4L3L3j06K5K6K6L4L4k4k4k4k4M4M4J74
$$ 1700 1665 1559 1670 1716 1763 1798 1834 1760 1687 1607 1526 1446 1365 1409 1454 1498 1542 1575 1608 1502 1527 1553 1579 1613 1647 1623 1599 1575 1551 1595 1639 1813
2351A813m3m2Q8j2j3M6j71j22QJ19J20k4k5o3o4KJL0L0p8p9jjkjJ2J1n4n3k0k0J32J32r2r2
$$ 1813 1770 1728 1816 1804 1791 1837 1666 1544 1552 1671 1791 1767 1742 1679 1615 1617 1618 1648 1678 1600 1521 1520 1519 1517 1516 1528 1539 1485 1432 1412 1392 1524 1656 1564 1472
2345A472J03J03J2J2n3n3l7l7l7l6J19J19J1J1K6K6m0l9n2n3J2J3N0M9n8n9j0j0j0j0N0M9
$$ 1472 1575 1678 1690 1702 1649 1596 1559 1522 1485 1449 1568 1687 1698 1709 1735 1761 1721 1682 1630 1577 1589 1602 1652 1701 1643 1584 1574 1564 1554 1544 1594 1643
2340A643N0M9M2M1j11j10j10j11M2M2J3J3J3J3L3L2l2l3K7K7K7K8n7n6N2N2P6P7p5p6k1k1
$$ 1643 1693 1742 1784 1825 1714 1604 1494 1383 1425 1467 1480 1493 1506 1519 1552 1584 1552 1519 1546 1573 1600 1628 1571 1515 1567 1619 1695 1772 1697 1621 1600 1579
2335A579k0k1pqN8N8J8J8J8J8p0p0L8L9n2n2N7N6L2L3p7p6J5J5j96O4J19J20j03j03P3P3P4
$$ 1579 1559 1538 1531 1523 1581 1639 1657 1675 1693 1711 1641 1571 1609 1648 1596 1544 1601 1657 1689 1722 1645 1569 1584 1599 1403 1467 1586 1706 1603 1500 1573 1646 1720
2330A720P3n9o0ONj8j8j7j8k1k2M4M4k1k1J1J1j9j9M6M6k2k1M3M4NOo0n9Q1Q1J5J6m8m8m8
$$ 1720 1793 1734 1674 1680 1685 1667 1649 1632 1614 1593 1571 1615 1659 1638 1617 1628 1639 1620 1601 1647 1693 1671 1650 1693 1737 1742 1748 1688 1629 1710 1791 1806 1822 1774 1726 1678
2325A678m8k0k1Q8Q8p1p0L8L9m7m7j4j4O3O4jjl7l6K9K8l7l7mnJ10J10KJl9l9K7K6k7k8L8
$$ 1678 1630 1610 1589 1677 1765 1694 1624 1662 1701 1654 1607 1593 1579 1642 1706 1705 1704 1667 1631 1660 1688 1651 1614 1610 1605 1715 1825 1827 1828 1789 1750 1777 1803 1776 1748 1786
2319A786L8j17j16K0J9J06j54K5K4KKKJj2j3J9K0l9l9K5K6JJo5o4k1k1M4M4J06J06m6m6KJ
$$ 1786 1824 1707 1591 1611 1630 1736 1582 1607 1631 1633 1635 1637 1638 1626 1613 1632 1652 1613 1574 1599 1625 1626 1627 1562 1498 1477 1456 1500 1544 1650 1756 1710 1664 1666 1667
2314A667KJk06k06P5P6J14J14NNOOo7O3j5j5k0k1R4j24L1L1k5k5M0M0K2K2L9r2q3M7J03k6
$$ 1667 1669 1670 1464 1258 1333 1409 1523 1637 1642 1647 1653 1659 1592 1655 1640 1625 1605 1584 1678 1554 1585 1616 1591 1566 1606 1646 1668 1690 1729 1637 1554 1601 1704 1678
2309A678j24j24P1P2m5Q5Q5m5L3L3K5K5j10j10Q6Q5o9p0l7l7R1R2o1o1K7K6J00l1o4o5Q0P9
$$ 1678 1554 1430 1501 1573 1528 1613 1698 1653 1686 1719 1744 1769 1659 1549 1635 1720 1651 1581 1544 1507 1598 1690 1629 1568 1595 1621 1721 1690 1626 1561 1641 1720
2304A720L5L5l0k48o5O5l1J00Q9Q9j2j2O7O7j20j20j21J0L7L7J72M1p3p3q3M8N5p5n4P7N2
$$ 1720 1755 1790 1760 1512 1447 1512 1481 1581 1670 1759 1747 1735 1802 1869 1749 1629 1508 1518 1555 1592 1764 1805 1732 1659 1576 1624 1679 1604 1550 1627 1679
2299A679N2J3j18j2j1nmO1O1nnp0p0L5L6k9l0O5O5q7q7o8o8P6P6R1l8k3k2n7P2l3l3R9R9J40
$$ 1679 1731 1744 1626 1614 1603 1598 1594 1655 1716 1711 1706 1636 1566 1601 1637 1608 1578 1643 1708 1621 1534 1466 1398 1474 1550 1641 1603 1580 1558 1501 1573 1540 1507 1606 1705 1845
2294A845J0j02j01j10K0K9J58J51o7q6q5l4l4rqN7N7j3j2O9o1j63l3L8L8m7m8O1O1N8N8L0
$$ 1845 1855 1753 1652 1542 1562 1591 1749 1900 1833 1747 1662 1628 1594 1585 1577 1634 1691 1678 1666 1735 1674 1511 1478 1516 1554 1507 1459 1520 1581 1639 1697 1727
2289A727r9j21J1L7L7K3K3K3K3qrj03j03k4J93L6r4j06j05L9L8RRP4P4O6O6m3m3J5J5n1n0
$$ 1727 1628 1507 1518 1555 1592 1615 1638 1661 1684 1676 1667 1564 1461 1437 1630 1666 1572 1466 1361 1400 1438 1447 1456 1530 1604 1670 1736 1693 1650 1665 1680 1629 1579
2284A579n9n9M2M2J10k0q5M6%JQRL1L2p7p8J1J1J1J1l5l5l6l5RRP5P4K8K8n4P6J27mj04K7
$$ 1579 1520 1461 1503 1545 1655 1635 1550 1596 1596 1597 1605 1614 1645 1677 1600 1522 1533 1544 1555 1566 1531 1496 1460 1425 1434 1443 1518 1592 1620 1648 1594 1670 1797 1793 1689 1716
2278A716p7p6P0o0n8n7M3M3K8K9l6l7M5M5M5M5l3l4l4l3j8j7M0L9K8j02L6L5L2L2k5k5m7Q3
$$ 1716 1639 1563 1633 1573 1515 1458 1501 1544 1572 1601 1565 1528 1573 1618 1663 1708 1675 1641 1607 1574 1556 1539 1579 1618 1646 1544 1580 1615 1647 1679 1654 1629 1582 1665
2273A665J9J8o3O7o3o4n2P7P8n3j3j3k2k1M1M2L3L4K6j03NJ35l1l1k3k3L7L6k8k8M6M7L8L8
$$ 1665 1684 1702 1639 1706 1643 1579 1527 1604 1682 1629 1616 1603 1581 1560 1601 1643 1676 1710 1736 1633 1638 1773 1742 1711 1688 1665 1702 1738 1710 1682 1728 1775 1813 1851
2268A851N2p8p1p0MMLMM4M5n1n0j23R4k7k8J3J3J3J3J9J9m6m6k4k4J27J28ppopm5m5j18J2
$$ 1851 1903 1825 1754 1684 1688 1692 1695 1699 1743 1788 1737 1687 1564 1658 1631 1603 1616 1629 1642 1655 1674 1693 1647 1601 1577 1553 1680 1808 1801 1794 1788 1781 1736 1691 1573 1585
2263A585K6K6R0R1l2j63r8L3N4N5K7j03j3j4k9J00K8K8l0k9n1n1J31%l4l4O6O6L0L1L9r1q1
$$ 1585 1611 1637 1727 1818 1786 1623 1525 1558 1612 1667 1694 1591 1578 1564 1535 1635 1663 1691 1661 1632 1581 1530 1661 1661 1627 1593 1659 1725 1755 1786 1825 1734 1653
2257A653q1o2O9J55K5q9q9J9J9q1q2L0J61Q7Q7p4p4p4p4J0J0RJ0m4m4q4M5Q6Q6j5j4L5L4L5
$$ 1653 1572 1510 1579 1734 1759 1670 1581 1600 1619 1538 1456 1486 1647 1734 1821 1747 1673 1599 1525 1535 1545 1554 1564 1520 1476 1392 1437 1523 1609 1594 1580 1615 1649 1684
2252A684L5K4K3r1M0P1o0m4m3j0j1j0j0J25J25k8k7j9j9j9j9k9k9m6Q5L9r0m3m2l2l3l2l3
$$ 1684 1719 1743 1766 1675 1715 1786 1726 1682 1639 1629 1618 1608 1598 1723 1848 1820 1793 1774 1755 1736 1717 1688 1659 1613 1698 1737 1647 1604 1562 1530 1497 1465 1432
2247A432R0R1j9j8J3J4O5O5J27r0o8o8j48j9P4K04l8l8l0l0n2n1j1j0N5J85J29kj55k4l2l3
$$ 1432 1522 1613 1594 1576 1589 1603 1668 1733 1860 1770 1702 1634 1486 1467 1541 1745 1707 1669 1639 1609 1557 1506 1495 1485 1540 1725 1854 1852 1697 1673 1641 1608
2242A608n0Q1J5J5j33lL3L3K6K7J8J8O5o6j06K3J34Lo7o7J7J8j6j5M2M2N1q0KKO0N9n8n8P
$$ 1608 1558 1639 1654 1669 1536 1533 1566 1599 1625 1652 1670 1688 1753 1687 1581 1604 1738 1741 1674 1607 1624 1642 1626 1611 1653 1695 1746 1666 1668 1670 1730 1789 1731 1673 1680
2237A680PL4L5KKq1q1K7K7M1M1o0n9p9N2M3M4m3m2O6O6j0j0M7M7J06k3j03j02r1r0J9J8J0
$$ 1680 1687 1721 1756 1758 1760 1679 1598 1625 1652 1693 1734 1674 1615 1536 1588 1631 1675 1632 1590 1656 1722 1712 1702 1749 1796 1902 1879 1776 1674 1583 1493 1512 1530 1540
2232A540J0J0J0k4k4M1M1K8K9l7l7j5j5PJ37J44p3j39P9P1n9j12K0P8P8k2k2N3N4r8r8n5n6
$$ 1540 1550 1560 1570 1546 1522 1563 1604 1632 1661 1624 1587 1572 1557 1564 1701 1845 1772 1633 1712 1783 1724 1612 1632 1710 1788 1766 1744 1797 1851 1753 1655 1600 1544
2227A544o3O7noJ6J6r4J22R0j27m5m6OON7N7Q1Q2J8j12r6J22P5P4k0k0j12j12L9M0o5o4P9
$$ 1544 1481 1548 1543 1537 1553 1569 1475 1597 1687 1560 1515 1469 1475 1481 1538 1595 1676 1758 1776 1664 1568 1690 1765 1839 1819 1799 1687 1575 1614 1654 1589 1525 1604
2222A604Q0J44J4k9k9m5j74o6O4Q3Q3j8j7j2j2j20j21J5J4M7M7M6M6k0j9l3l3j%k5k6M0M0
$$ 1604 1684 1828 1842 1813 1784 1739 1565 1499 1563 1646 1729 1711 1694 1682 1670 1550 1429 1444 1458 1505 1552 1598 1644 1624 1605 1572 1539 1538 1538 1513 1487 1527 1567
2217A567MNO9P0J9J9k2k2K4j05l2l2KJKKj5j4N1N0RRj00r9N7N8n1n0k0k0L7L7J0j21O2O1m4
$$ 1567 1571 1576 1645 1715 1734 1753 1731 1709 1733 1628 1596 1564 1566 1567 1569 1571 1556 1542 1593 1643 1652 1661 1561 1462 1519 1577 1526 1476 1456 1436 1473 1510 1520 1399 1461 1522 1478
2211A478m4o0P0J22rl6l6QQO4O5O5o4QRk0j9n2n2k8k8L6L7j1j1M0M1Q3j33k8J03o3j94M0L9
$$ 1478 1434 1374 1444 1566 1557 1521 1485 1493 1501 1565 1630 1695 1631 1639 1648 1628 1609 1557 1505 1477 1449 1485 1522 1511 1500 1540 1581 1664 1531 1503 1606 1543 1349 1389 1428
2206A428N6N6J29jL6L6L5L6j38qpj38J0J1KLL5L5l0l0L5L5l8l8O3o7jkJ04k7r2L8kkNOK3K3
$$ 1428 1484 1540 1669 1668 1704 1740 1775 1811 1673 1665 1658 1520 1530 1541 1543 1546 1581 1616 1586 1556 1591 1626 1588 1550 1613 1546 1545 1543 1647 1620 1528 1566 1564 1562 1567 1573 1596 1619
2200A619j16J4R7R7mmj8j8n1n1K8K7K7K7n6n6L9L9N9j58n2P8J34Mj11j10K7K7j4J17m2m3L1
$$ 1619 1503 1517 1614 1711 1707 1703 1685 1667 1616 1565 1593 1620 1647 1674 1618 1562 1601 1640 1699 1541 1489 1567 1701 1705 1594 1484 1511 1538 1524 1641 1599 1556 1587
2195A587L1k8k8K9K9L8r2k7J04j6j6N7N7lkJ35Oj3j3n4n4K9K9j52k3NNM5M5k7k8k7k7J0J1
$$ 1587 1618 1590 1562 1591 1620 1658 1566 1539 1643 1627 1611 1668 1725 1722 1720 1855 1861 1848 1835 1781 1727 1756 1785 1633 1610 1615 1620 1665 1710 1683 1655 1628 1601 1611 1622
2190A622P5P6p8p9j19J2Q1Q1K4K4r0r0J9J9N7N8r5r5L2L2O4O4l6l7K9K9k8k9MMQ8Q8j50j51
$$ 1622 1697 1773 1695 1616 1497 1509 1590 1671 1695 1719 1629 1539 1558 1577 1634 1692 1597 1502 1534 1566 1630 1694 1658 1621 1650 1679 1651 1622 1626 1630 1718 1806 1656 1505
2184A505j3j3K0J9L4L3L3L3O0O0K7K7j0j0p5p6kkkkJ0RJ24pj33kj9j9l5l5L0L0M8M8J5J5j6
$$ 1505 1492 1479 1499 1518 1552 1585 1618 1651 1711 1771 1798 1825 1815 1805 1730 1654 1652 1650 1648 1646 1656 1665 1789 1782 1649 1647 1628 1609 1574 1539 1569 1599 1647 1695 1710 1725 1709
2179A709j6q9M0j7j8m2m2m0m0O0O0R0m1M9q1l0J01R3l7m8m8q9q8N8N9ppK7K7L5L5n9P2P1n8
$$ 1709 1693 1604 1644 1627 1609 1567 1525 1485 1445 1505 1565 1655 1614 1663 1582 1552 1653 1746 1709 1661 1613 1524 1436 1494 1553 1546 1539 1566 1593 1628 1663 1604 1676 1747 1689
2173A689PQ%%NNj2J20M4q5p0o9n9o0OOK6K6ppL4L4JJj1j1j1j1k6k5m2Q8R0m0M2M1k6k7L9L8
$$ 1689 1696 1704 1704 1704 1709 1714 1702 1822 1866 1781 1711 1642 1583 1523 1529 1535 1561 1587 1580 1573 1607 1641 1642 1643 1632 1621 1610 1599 1573 1548 1506 1594 1684 1644 1686 1727 1701 1674 1713 1751
2167A751j3j3j2j3m0m1m0m0M5M5k0k0K0K0L6r4o0P0K1K1N3N4j8j48m3Q7n2n1k3J07K6K6L5
$$ 1751 1738 1725 1713 1700 1660 1619 1579 1539 1584 1629 1609 1589 1609 1629 1665 1571 1511 1581 1602 1623 1676 1730 1712 1564 1521 1608 1556 1505 1482 1589 1615 1641 1676
2162A676r5q7q6L4L5J16j4m8Q2l1l2LLK0j11K6J56J0J0l4l5POp7N3M5M4M6M5M6M5n1n1n0n1
$$ 1676 1581 1494 1408 1442 1477 1593 1579 1531 1613 1582 1550 1553 1556 1576 1465 1491 1647 1657 1667 1633 1598 1605 1611 1534 1587 1632 1676 1722 1767 1813 1858 1807 1756 1706 1655
2157A655J5J6PQO7o3j28LO3O3p2p3r6L3L3L4l7R3P7P7L0r9r1r2J19J19l3l3J7J7K6K5j19J1
$$ 1655 1670 1686 1693 1701 1768 1705 1577 1580 1643 1706 1634 1561 1465 1498 1531 1565 1528 1621 1698 1775 1805 1706 1615 1523 1642 1761 1728 1695 1712 1729 1755 1780 1661 1672
2152A672LLp1p1m7m6Q8m1l4J83J2j18P7P7n0n0J5J5J%L4L3j5j5q9M2O9P0J2J2k8k7p7N4jj32
$$ 1672 1675 1678 1607 1536 1489 1443 1531 1490 1456 1639 1651 1533 1610 1687 1637 1587 1602 1617 1618 1618 1652 1685 1670 1655 1566 1608 1677 1747 1759 1771 1743 1716 1639 1693 1692 1560
2146A560J6J5j2j3j2j3n8n8k3J07J9J8N1N2J08k1j30%K4K4K4K4Mj26J1J2LLLLN6N6J0RJ23
$$ 1560 1576 1591 1579 1566 1554 1541 1483 1425 1402 1509 1528 1546 1597 1649 1757 1736 1606 1606 1630 1654 1678 1702 1706 1580 1591 1603 1606 1609 1612 1615 1671 1727 1737 1746 1869
2141A869r4q0q1O6O6m3m2K1K1m4m4KKp1N9N4N5m6m5M8M8j7j7L5L6p3p2K4K4R7l3q1q0J1J2
$$ 1869 1775 1695 1614 1680 1746 1703 1661 1682 1703 1659 1615 1617 1619 1548 1607 1661 1716 1670 1625 1673 1721 1704 1687 1722 1758 1685 1613 1637 1661 1758 1725 1644 1564 1575 1587
2136A587Mj26M8M8J56K6j34mJ30jj14j14l5l4O6O6Q5m6r4J23nnRRL1L1l4l4N2N1j4j3j9j9
$$ 1587 1591 1465 1513 1561 1717 1743 1609 1605 1735 1734 1620 1506 1471 1437 1503 1569 1654 1608 1514 1637 1632 1627 1636 1645 1676 1707 1673 1639 1691 1742 1728 1715 1696 1677
2130A677M6M6k6k5M7q3m8m9J6J6M1J71n4n5m0m1m1m0j7j6M1M1L7r2r3L8K4K4L2L3ooN1N2M3
$$ 1677 1723 1769 1743 1718 1765 1682 1634 1585 1601 1617 1658 1829 1775 1720 1680 1639 1598 1558 1541 1525 1566 1607 1644 1552 1459 1497 1521 1545 1577 1610 1604 1598 1649 1701 1744
2125A744q7j%j59N8RRr4L6J01k8l0l0l8l9Q7Q7j4j3n0Q0PP%%P4n7jkrronLKj06K5J46J46n1
$$ 1744 1657 1656 1656 1497 1555 1564 1573 1479 1515 1616 1588 1558 1528 1490 1451 1538 1625 1611 1598 1548 1628 1635 1642 1642 1642 1716 1659 1658 1656 1647 1638 1632 1627 1630 1632 1526 1551 1697 1843 1792
2119A792n2m3m4%J30rqk0j9j06K4K08j0j91o1Q3Q3K5K6l5l4l5l5K5K4K5K5m0m0J6J7lj34q2
$$ 1792 1740 1697 1653 1653 1783 1774 1766 1746 1727 1621 1645 1853 1843 1652 1591 1674 1757 1782 1808 1773 1739 1704 1669 1694 1718 1743 1768 1728 1688 1704 1721 1718 1584 1502
2114A502J35R8l3q9q9r1L9P5P5POjkP6n4j11J05R7l3N3N4mlJ2j17j20J0ooK1K1l6l6p8N1J4
$$ 1502 1637 1735 1702 1613 1524 1433 1472 1547 1622 1629 1635 1634 1632 1708 1654 1543 1648 1745 1712 1765 1819 1815 1812 1824 1707 1587 1597 1591 1585 1606 1627 1591 1555 1477 1528 1542
2108A542J44lln9o0k5k5P6P5N1p9p1J46j2j43k9J01Q1m9p7p6L3L3M2M1m1Q9L7j80r7L4Q5Q4
$$ 1542 1686 1683 1680 1621 1561 1536 1511 1587 1662 1713 1634 1563 1709 1697 1554 1525 1626 1707 1658 1581 1505 1538 1571 1613 1654 1613 1702 1739 1559 1462 1496 1581 1665
2103A665R6j21%JK9K9K1K1l1j61j01J16O3O4l1l2qqrqQ0P9M4q6k2k2l0l1K6K6K6K6p3p3o5
$$ 1665 1761 1640 1640 1641 1670 1699 1720 1741 1710 1549 1448 1564 1627 1691 1660 1628 1620 1612 1603 1595 1675 1754 1798 1712 1690 1668 1638 1607 1633 1659 1685 1711 1638 1565 1500
2098A500o5m3Q7P9Q0rj0rrMMo9O1LMJ2J2N2N2N2N2p3p3qqN4N5J8j11j7j8j8j8r1L9L1L1M3
$$ 1500 1435 1392 1479 1558 1638 1629 1619 1610 1601 1605 1609 1540 1601 1604 1608 1620 1632 1684 1736 1788 1840 1767 1694 1686 1678 1732 1787 1805 1694 1677 1659 1641 1623 1532 1571 1602 1633 1676
2092A676M3N9p1j75m4P0P0L2L1l3l3j4j3N2N1j3j3j49O8R4j23J3J2j%jjJ1J2J2J1L2L2k5k5
$$ 1676 1719 1778 1707 1532 1488 1558 1628 1660 1691 1658 1625 1611 1598 1650 1701 1688 1675 1526 1594 1688 1565 1578 1590 1589 1589 1588 1587 1598 1610 1622 1633 1665 1697 1672 1647
2087A647o1O8mmj7j6j7j7K0J9K7K8r1M0l4l3j3j3k8J01M2q9ppP9Q0k9k9n7n7K1K2j53O4N1
$$ 1647 1586 1654 1650 1646 1629 1613 1596 1579 1599 1618 1645 1673 1582 1622 1588 1555 1542 1529 1501 1602 1644 1555 1548 1541 1620 1700 1671 1642 1585 1528 1549 1571 1418 1482 1533
2081A533N0O9O8M1q9o9O1N3p7m0l9K6K6m5Q5J2J2M3M4j09j09j7j7M9M8L9L8J2j19l4R6J4J4
$$ 1533 1583 1652 1720 1761 1672 1603 1664 1717 1640 1600 1561 1587 1613 1568 1653 1665 1677 1720 1764 1655 1546 1529 1512 1561 1609 1648 1686 1698 1579 1545 1641 1655 1669
2076A669K8K8Q5Q5K7j03l0l0j1j1llj63l4ooQ5m6J4J5Q9j28j28Q9L0L1J10J09m4m3P9j39M
$$ 1669 1697 1725 1810 1895 1922 1819 1789 1759 1748 1737 1734 1731 1568 1534 1528 1522 1607 1561 1575 1590 1679 1551 1423 1512 1542 1573 1683 1792 1748 1705 1784 1645 1649
2071A649Mj0rj5j5j5j5j1j1klp9N1M4M3p8p8L1L1k5k6lJ26J69m8o2o2m5Q6J3J3j9j9r1L8M0
$$ 1649 1653 1643 1634 1619 1604 1589 1574 1563 1552 1550 1547 1468 1519 1563 1606 1528 1450 1481 1512 1487 1461 1458 1584 1753 1705 1643 1581 1536 1622 1635 1648 1629 1610 1519 1557 1597
2066A597M0M8M8p5p6P7P6j8j9j0j1p0O0j3j3M9M9O5o6j73m4K7K7PPPPk9l0J17j3j29%K9K8
$$ 1597 1637 1685 1733 1658 1582 1659 1735 1717 1698 1688 1677 1607 1667 1654 1641 1690 1739 1804 1738 1565 1521 1548 1575 1582 1589 1596 1603 1574 1544 1661 1648 1519 1519 1548 1576
2061A576K0J9K9j03K8K8m5m6N4N4J19J18m3m4m4m3j0j0O3O4j47j6R2l7m7m6o2O8K3K3l4l4
$$ 1576 1596 1615 1644 1541 1569 1597 1552 1506 1560 1614 1733 1851 1808 1764 1720 1677 1667 1657 1720 1784 1637 1621 1713 1676 1629 1583 1521 1589 1612 1635 1601 1567
2056A567JJO6O7k9k9J09k0q4q3J47J48o4o5Q2m8j34nO6O6M2M3o6o6q1q1P1P1k4k5k4k4P0P1
$$ 1567 1568 1569 1635 1702 1673 1644 1753 1733 1649 1566 1713 1861 1797 1732 1814 1766 1632 1627 1693 1759 1801 1844 1778 1712 1631 1550 1621 1692 1668 1643 1619 1595 1665 1736
2050A736P1P1p3p3qpO1O2r1r0llO2O3p4p3qqL4L4M2q8j0j1M7M6NNJ4J3p2N8k3k4M6q5j1j2
$$ 1736 1807 1878 1805 1732 1724 1717 1778 1840 1749 1659 1656 1653 1715 1778 1704 1631 1623 1615 1649 1683 1725 1637 1627 1616 1663 1709 1714 1719 1733 1746 1674 1732 1709 1685 1731 1646 1635 1623
2045A623JJ%JP2P3m5m4K7j03l7R2j4j4N0N1J03k8r3L7J4J4j3j43n0n0PQJ5J5o6O5J52K2RQ
$$ 1623 1624 1625 1625 1626 1698 1771 1726 1682 1709 1606 1569 1661 1647 1633 1683 1734 1837 1809 1716 1753 1767 1781 1768 1625 1575 1525 1532 1540 1555 1570 1504 1569 1721 1743 1752 1760
$$ [...]
##END=	
##END=	
