##TITLE=	kmi-PhI-1.10.fid


##JCAMP-DX=	6.0	$$ MestReNova 14.1.1-24571
##DATA TYPE=	LINK
##BLOCK_ID=	1
##BLOCKS=	1    
##ORIGIN=	Mestrelab Research S.L.
##OWNER=	hrzepa
##$MNOVA/LINK_BLOCK_TYPE=	ITEM	$$ NMR Spectrum
##$MNOVA/ITEM/POLYGON=	(XY..XY)
5321,5835
8722,5835
8722,8208
5321,8208
5321,5835
##$MNOVA/ITEM/Z=	0
##$MNOVA/ITEM/ANGLE=	0
##TITLE=	kmi-PhI-1.10.fid
##JCAMP-DX=	6.0	$$ MestReNova 14.1.1-24571
##BLOCK_ID=	2
##DATA TYPE=	NMR SPECTRUM
##DATA CLASS=	XYDATA
##NUMDIM=	1
##ORIGIN=	Bruker BioSpin GmbH
##OWNER=	root
##.OBSERVE FREQUENCY=	500.13308850747802126
##.OBSERVE NUCLEUS=	^1H
##.SOLVENT NAME=	CDCl3
##.PULSE SEQUENCE=	zg30
##LONGDATE=	2022/03/10 12:39:00.000
##.ACQUISITIONMODE=	SIMULTANEOUS (DQD)
##$ORIGINAL FORMAT=	Bruker XWIN-NMR
##$MNOVA/SCALES_VERSION=	9
##$PARAMETER FILE=	(acqus, ASCII, /Users/hrzepa/Library/Mobile%20Documents/com~apple~CloudDocs/C2/Pure%20samples/kmi-PhI-1/iodobenzene/acqus, 0)
$$ ##TITLE= Parameter file, TOPSPIN		Version 3.2
$$ ##JCAMPDX= 5.0
$$ ##DATATYPE= Parameter Values
$$ ##NPOINTS= 1	$$ modification sequence number
$$ ##ORIGIN= Bruker BioSpin GmbH
$$ ##OWNER= root
$$ $$ 2022-03-10 12:39:21.502 +0900  root@CZC31189P3
$$ $$ Z:/miyamoto/kmi-PhI-1/10/acqus
$$ $$ process C:\Bruker\TopSpin3.2\prog\mod\dirdata.exe
$$ ##$ACQT0= -2.52100840336134
$$ ##$AMP= (0..31)
$$ 100 100 100 100 100 100 100 100 100 100 100 100 100 100 100 100 100 100
$$ 100 100 100 100 100 100 100 100 100 100 100 100 100 100
$$ ##$AMPCOIL= (0..19)
$$ 0 0 0 0 0 0 0 0 0 0 0 0 0 0 0 0 0 0 0 0
$$ ##$ANAVPT= -1
$$ ##$AQSEQ= 0
$$ ##$AQ_mod= 3
$$ ##$AUNM= <au_zg>
$$ ##$AUTOPOS= <20 >
$$ ##$BF1= 500.13
$$ ##$BF2= 500.13
$$ ##$BF3= 500.13
$$ ##$BF4= 500.13
$$ ##$BF5= 500.13
$$ ##$BF6= 500.13
$$ ##$BF7= 500.13
$$ ##$BF8= 500.13
$$ ##$BYTORDA= 0
$$ ##$CAGPARS= (0..11)
$$ 0 0 0 0 0 0 0 0 0 0 0 0
$$ ##$CFDGTYP= 0
$$ ##$CFRGTYP= 9
$$ ##$CHEMSTR= <none>
$$ ##$CNST= (0..63)
$$ 1 1 1 1 1 1 1 1 1 1 1 1 1 1 1 1 1 1 1 1 1 1 1 1 1 1 1 1 1 1 1 1 1 1 1 1
$$ 1 1 1 1 1 1 1 1 1 1 1 1 1 1 1 1 1 1 1 1 1 1 1 1 1 1 1 1
$$ ##$CPDPRG= (0..8)
$$ <> <> <> <> <> <> <> <> <>
$$ ##$D= (0..63)
$$ 0 1 0 0 0 0 0 0 0 0 0 0 0 0 0 0 0.0002 0 0 0 0 0 0 0 0 0 0 0 0 0 0 0 0
$$ 0 0 0 0 0 0 0 0 0 0 0 0 0 0 0 0 0 0 0 0 0 0 0 0 0 0 0 0 0 0 0
$$ ##$DATE= 1646883558
$$ ##$DE= 6.5
$$ ##$DECBNUC= <off>
$$ ##$DECIM= 2000
$$ ##$DECNUC= <off>
$$ ##$DECSTAT= 4
$$ ##$DIGMOD= 1
$$ ##$DIGTYP= 12
$$ ##$DQDMODE= 0
$$ ##$DR= 22
$$ ##$DS= 2
$$ ##$DSPFIRM= 0
$$ ##$DSPFVS= 20
$$ ##$DTYPA= 0
$$ ##$EXP= <A.Proton>
$$ ##$F1LIST= <>
$$ ##$F2LIST= <>
$$ ##$F3LIST= <>
$$ ##$FCUCHAN= (0..9)
$$ 0 2 0 0 0 0 0 0 0 0
$$ ##$FL1= 90
$$ ##$FL2= 90
$$ ##$FL3= 90
$$ ##$FL4= 90
$$ ##$FOV= 20
$$ ##$FQ1LIST= <>
$$ ##$FQ2LIST= <>
$$ ##$FQ3LIST= <>
$$ ##$FQ4LIST= <>
$$ ##$FQ5LIST= <>
$$ ##$FQ6LIST= <>
$$ ##$FQ7LIST= <>
$$ ##$FQ8LIST= <>
$$ ##$FRQLO3= 23161.4925220013
$$ ##$FRQLO3N= 2
$$ ##$FS= (0..7)
$$ 83 83 83 83 83 83 83 83
$$ ##$FTLPGN= 0
$$ ##$FW= 125000
$$ ##$FnMODE= 0
$$ ##$FnTYPE= 0
$$ ##$GPNAM= (0..31)
$$ [...]
$$ 130000 130000 130000 130000 130000 130000 130000 130000 130000 130000 130000
$$ 130000 130000 130000 130000 130000 130000 130000 130000 130000 130000 130000
$$ 130000 130000 130000 130000 130000 130000 130000 0 0 0 0 0 0 0 0 0 0 0
$$ 0 0 0 0 0 0 0 0 0 0 0 0 0
$$ ##$ShimPowMaxUC= (0..63)
$$ 130000 130000 130000 130000 130000 130000 130000 130000 130000 130000 130000
$$ 130000 130000 130000 130000 130000 130000 130000 130000 130000 130000 130000
$$ 130000 130000 130000 130000 130000 130000 130000 130000 130000 130000 130000
$$ 130000 130000 130000 130000 130000 130000 130000 0 0 0 0 0 0 0 0 0 0 0
$$ 0 0 0 0 0 0 0 0 0 0 0 0 0
$$ ##$ShimPowMaxUG= (0..63)
$$ 524287 524287 524287 524287 524287 524287 524287 524287 524287 524287 524287
$$ 524287 524287 524287 524287 524287 524287 524287 524287 524287 524287 524287
$$ 524287 524287 524287 524287 524287 524287 524287 524287 524287 524287 524287
$$ 524287 524287 524287 524287 524287 524287 0 0 0 0 0 0 0 0 0 0 0 0 0 0 0
$$ 0 0 0 0 0 0 0 0 0 0
$$ ##$ShimPowRcbType= 3
$$ ##$ShimPowRes= (0..63)
$$ 1e-020 1e-020 1e-020 1e-020 1e-020 1e-020 1e-020 1e-020 1e-020 1e-020 1e-020
$$ 1e-020 1e-020 1e-020 1e-020 1e-020 1e-020 1e-020 1e-020 1e-020 1e-020 1e-020
$$ 1e-020 1e-020 1e-020 1e-020 1e-020 1e-020 1e-020 1e-020 1e-020 1e-020 1e-020
$$ 1e-020 1e-020 1e-020 1e-020 1e-020 1e-020 1e-020 0 0 0 0 0 0 0 0 0 0 0
$$ 0 0 0 0 0 0 0 0 0 0 0 0 0
$$ ##$ShimPowRng0= (0..63)
$$ 1 1 1 1 1 1 1 1 1 1 1 1 1 1 1 1 1 1 1 1 1 1 1 1 1 1 1 1 1 1 1 1 1 1 1 1
$$ 1 1 1 1 0 0 0 0 0 0 0 0 0 0 0 0 0 0 0 0 0 0 0 0 0 0 0 0
$$ ##$ShimPowRng1= (0..63)
$$ 1 1 1 1 1 1 1 1 1 1 1 1 1 1 1 1 1 1 1 1 1 1 1 1 1 1 1 1 1 1 1 1 1 1 1 1
$$ 1 1 1 1 0 0 0 0 0 0 0 0 0 0 0 0 0 0 0 0 0 0 0 0 0 0 0 0
$$ ##$ShimPowRng2= (0..63)
$$ 1 1 1 1 1 1 1 1 1 1 1 1 1 1 1 1 1 1 1 1 1 1 1 1 1 1 1 1 1 1 1 1 1 1 1 1
$$ 1 1 1 1 0 0 0 0 0 0 0 0 0 0 0 0 0 0 0 0 0 0 0 0 0 0 0 0
$$ ##$ShimPowRng3= (0..63)
$$ 1 1 1 1 1 1 1 1 1 1 1 1 1 1 1 1 1 1 1 1 1 1 1 1 1 1 1 1 1 1 1 1 1 1 1 1
$$ 1 1 1 1 0 0 0 0 0 0 0 0 0 0 0 0 0 0 0 0 0 0 0 0 0 0 0 0
$$ ##$ShimSysFunc= (0..63)
$$ 1 2 3 4 5 6 7 8 9 10 0 37 38 35 16 15 14 13 12 11 28 27 26 25 24 23 36
$$ 22 30 29 20 21 34 33 32 31 17 18 19 0 0 0 0 0 0 0 0 0 0 0 0 0 0 0 0 0 0
$$ 0 0 0 0 0 0 0
$$ ##$ShimSysMatrix= 0
$$ ##$ShimSysType= 4
$$ ##$TFXNUM= 0
$$ ##$TRIPLO2= 0
$$ ##$VTU= 2
$$ ##$VTUETH= <149.236.99.20>
$$ ##$VTUTY= <no>
$$ ##$WBREFAM= (0..15)
$$ 100 100 100 100 100 100 100 100 100 100 100 100 100 100 100 100
$$ ##$WBREFLM= (0..15)
$$ 1 0 0 0 0 0 0 0 0 0 0 0 0 0 0 0
$$ ##$WBREFPH= (0..15)
$$ 0.03 0 0 0 0 0 0 0 0 0 0 0 0 0 0 0
$$ ##$WBSGU= (0..15)
$$ 0 0 0 0 0 0 0 0 0 0 0 0 0 0 0 0
$$ ##$XFAC= 2
$$ ##END=
$$ 
##$DECIM=	2000
##$DSPFVS=	20
##XUNITS=	HZ
##YUNITS=	ARBITRARY UNITS
##FIRSTX=	8075.7250530086803337
##LASTX=	-1924.1223591006948936
##DELTAX=	-0.152587890625
##XFACTOR=	1
##YFACTOR=	0.0099445990581968866928
##FIRSTY=	13.618413925170898438
##MINY=	6.0131359100341796875
##MAXY=	11015.236328125
##NPOINTS=	65536
##XYDATA=	(X++(Y..Y))
$$ [...]
5047A196lkj5j4L7L6j4j4P0P1RJ0m1m1m2m2M2M3j3j2j2j3l0l0p5R5J12J11L8L8j50j50L6L6
5042A267K6K6r3r2J18J19l3l3o2o1K3K3qrqrJ3J2J3J3J2J3O3O3k2k2K8K9k3k2k2k3k5k6k5
5037A243k6L4L4L3L4p0o9p0o9L2L1j8j9K3K2j7j7l1J38M3M2J7J6l4l5Q5Q5Jj69k7P3j01%Q4
5032A298Q5OOJ%p3p4j35L3P9Q0P0r9o7L5P2k9J04Kj06R7J40o2l6l7l6l7j23Q0J36o6q7J4Q
5027A279r4k7P4J25K4j67o7R1R0J5J5j05mJ24p9p2J30Q2Q3n7n7m4m5M0M1m7m7m7m7P0P0K0
5022A367J9q8q8L0L0J1J2p4p3J2J1O3O2j8j8o6j68n4J49J36L5o0o1j5j6o3o2Q9R0J9K0K0K0
5017A271J0RJ0J0N2N2l1j31j30P3L7L7qpqpQ0Q0P3P4q9j91j29P4M2M2k9l0m5m5NOJ4J4J5J4
5011A214k4k5k5k4K1K1K1K2nmmmM5M4M4M5M7M8M7M8m6m6NNl3l3l3l3n4n5mmp5p4J11J11m0
$$ y = [1196, 1193, 1191, 1176, 1162, 1199, 1235, 1221, 1207, 1277, 1348, 1357, 1367, 1326, 1285, 1243, 1201, 1243, 1286, 1273, 1261, 1249, 1236, 1206, 1176, 1101, 1196, 1308, 1419, 1457, 1495, 1345, 1195, 1231, 1267, 1293, 1319, 1226, 1134, 1252, 1371, 1338, 1305, 1243, 1182, 1205, 1228, 1220, 1211, 1203, 1194, 1207, 1219, 1232, 1245, 1257, 1270, 1333, 1396, 1374, 1352, 1380, 1409, 1386, 1364, 1342, 1319, 1294, 1268, 1243, 1217, 1251, 1285, 1318, 1352, 1282, 1213, 1143, 1074, 1106, 1137, 1119, 1100, 1123, 1145, 1128, 1111, 1080, 1218, 1261, 1303, 1320, 1336, 1302, 1267, 1352, 1437, 1438, 1269, 1242, 1315, 1214, 1214, 1298, 1383, 1389, 1395, 1396, 1396, 1323, 1249, 1114, 1147, 1226, 1306, 1376, 1277, 1210, 1245, 1317, 1288, 1392, 1394, 1288, 1385, 1525, 1463, 1427, 1390, 1354, 1317, 1194, 1274, 1410, 1344, 1257, 1271, 1279, 1185, 1158, 1232, 1357, 1381, 1214, 1147, 1238, 1328, 1343, 1358, 1253, 1249, 1373, 1294, 1222, 1352, 1434, 1517, 1460, 1403, 1359, 1314, 1354, 1395, 1348, 1301, 1254, 1207, 1277, 1347, 1367, 1386, 1298, 1210, 1240, 1270, 1281, 1293, 1219, 1146, 1158, 1169, 1232, 1294, 1276, 1258, 1192, 1024, 970, 1119, 1255, 1290, 1230, 1169, 1154, 1138, 1075, 1013, 1102, 1192, 1211, 1231, 1251, 1271, 1281, 1290, 1300, 1310, 1362, 1414, 1383, 1252, 1122, 1195, 1232, 1269, 1261, 1254, 1246, 1239, 1319, 1399, 1472, 1546, 1457, 1266, 1137, 1211, 1253, 1295, 1266, 1236, 1191, 1146, 1151, 1157, 1171, 1185, 1200, 1214, 1190, 1165, 1140, 1116, 1137, 1158, 1179, 1201, 1196, 1192, 1188, 1184, 1229, 1273, 1317, 1362, 1409, 1457, 1504, 1552, 1506, 1460, 1465, 1470, 1437, 1404, 1371, 1338, 1284, 1229, 1225, 1221, 1146, 1072, 1183, 1294, 1254]
5006A254l9J1J1o1o0L4L4PJ75l7l8LKLKj9j9j9k0%%Q4Q5j17j16JKK9K9Q4q5l2J37Rr1m9N2
5000A246R6nm5m6L3J34O8j00q4q3k2k3R6R6J0Rpj09p8R1R7mj1j2K7K6M1o1r9P0k2k3r7r7J0
4995A122J0J0RJ06J06j3j2M7M6p1p2J6J6J6J7o3o2j2j1RJ0RJ0l4l4Q4Q5J15J15j39j38L7L8
4989A372j4j3o0o0rrN1N1l4l3L4L4n0n0O8O8j6j6l8l8l8l9K1K1N7j46QJ10J54m9r8r8n9o0
4984A022Q9Q9MNk2k2K9K9m7m6P2P2M4M4p7J26K2p9K9K9N1j51l7l7k8k7N6N7o2o3N6N6K3K3
4979A329k8k8rrrrk2k2J30J30o9o9o9o9j4j4P0P0rrrrmmmmj9j8j9j8K2K3k8k8J2J2J3J2L4
4973A235L5L4L5l2l3l2l2j3j2j2j2L2L2n2n3R2R3k6k6n9n8K6K6N6N5NNKKJ8q3j01O7J11n7
4968A268k2k2Q5Q5O8O7O8O7j02j03n2n2k2k1O3O3nmn5n5MMq0q1O6O6q7q6n2n1J34J34K7K7
$$ y = [1254, 1215, 1226, 1237, 1176, 1116, 1150, 1184, 1191, 1366, 1329, 1291, 1294, 1296, 1299, 1301, 1282, 1263, 1244, 1224, 1224, 1224, 1308, 1393, 1276, 1160, 1161, 1163, 1192, 1221, 1305, 1220, 1188, 1325, 1334, 1243, 1194, 1246, 1342, 1337, 1292, 1246, 1279, 1413, 1481, 1381, 1297, 1214, 1192, 1169, 1265, 1361, 1371, 1380, 1373, 1264, 1186, 1277, 1374, 1370, 1359, 1347, 1374, 1400, 1441, 1380, 1281, 1351, 1329, 1306, 1209, 1112, 1122, 1132, 1142, 1151, 1257, 1363, 1350, 1338, 1385, 1431, 1360, 1288, 1304, 1320, 1336, 1353, 1290, 1228, 1216, 1205, 1214, 1224, 1233, 1243, 1209, 1175, 1259, 1344, 1459, 1574, 1435, 1297, 1334, 1372, 1358, 1345, 1285, 1225, 1216, 1207, 1258, 1309, 1275, 1242, 1276, 1310, 1260, 1210, 1278, 1346, 1330, 1314, 1276, 1238, 1200, 1161, 1182, 1203, 1260, 1114, 1122, 1232, 1386, 1337, 1239, 1141, 1082, 1022, 1111, 1200, 1204, 1209, 1187, 1165, 1194, 1223, 1176, 1130, 1202, 1274, 1318, 1362, 1285, 1411, 1433, 1354, 1383, 1412, 1463, 1312, 1275, 1238, 1210, 1183, 1239, 1296, 1234, 1171, 1227, 1283, 1306, 1329, 1301, 1273, 1264, 1255, 1246, 1237, 1215, 1193, 1323, 1453, 1384, 1315, 1246, 1177, 1163, 1149, 1219, 1289, 1280, 1271, 1262, 1253, 1249, 1245, 1241, 1237, 1218, 1200, 1181, 1163, 1185, 1208, 1180, 1152, 1164, 1176, 1189, 1201, 1235, 1270, 1304, 1339, 1307, 1274, 1242, 1210, 1197, 1185, 1173, 1161, 1193, 1225, 1173, 1120, 1212, 1305, 1279, 1253, 1194, 1136, 1162, 1188, 1244, 1299, 1304, 1309, 1311, 1313, 1331, 1248, 1147, 1214, 1325, 1268, 1246, 1224, 1309, 1394, 1462, 1529, 1597, 1664, 1562, 1459, 1407, 1355, 1333, 1312, 1375, 1438, 1433, 1429, 1374, 1319, 1323, 1327, 1247, 1166, 1232, 1298, 1211, 1125, 1073, 1022, 1156, 1290, 1317, 1344]
4963A344K7K7j07j06M6M6k6k5k5k6K2K2k8k9o8o9Q4Q3N4N4N4N4k5k6k5k5L3L4L4L3k9l0k9
4958A353k9p2p2J3J3O8O9n0n0R3R4n9n8p7p8J09J08m6m7MMj4j4j19N0J57j2M4M3o3o4o3o3
4953A172R2R3k5k5n0n0m9n0L6L6m9m8K7K7P7P8QPm2m3Q4Q4j%o6o6J8J8N6N5NNk8k8k8k8P8
4947A380P9m0l9L0L0k1k1K2K1K1K1r4r4rj0L0K9n4n5n6n6O2O3J9J9J9J9J6J5O7O7q8q8llO6
4941A364O5N5N5n1k20j38l6Q6j5j03j04N5N5N5N5ppP7P7k0k0j05j04J38J38K0K0MLm7m8n5
4937A242n6K9K8J4J4R8R8m1m1j60j59R1R1M0M1J6J6n8n8r5P4M3o0j38l7Q6Q5R3R3QRl4l4r0
4931A248r1J16J6K1K2m3m3q9J2M6K15L9j97n7n8Q6Q6m2O0KKJ3J3L4j35k2J47R2rn9j60KLQ6
4926A356j5j67o6L1L2m7m7M7M7J9q2L0L0J8J7N9m2q0Q8j2j3M8M9j6j6k2P9L3L2j2j1ooq4q3
$$ y = [1344, 1371, 1398, 1291, 1185, 1231, 1277, 1251, 1226, 1201, 1175, 1197, 1219, 1191, 1162, 1094, 1025, 1109, 1192, 1246, 1300, 1354, 1408, 1383, 1357, 1332, 1307, 1340, 1374, 1408, 1441, 1412, 1382, 1353, 1324, 1252, 1180, 1193, 1206, 1274, 1343, 1293, 1243, 1336, 1430, 1371, 1313, 1236, 1158, 1267, 1375, 1329, 1282, 1286, 1290, 1276, 1262, 1143, 1193, 1350, 1338, 1382, 1425, 1362, 1298, 1235, 1172, 1264, 1357, 1332, 1307, 1257, 1207, 1158, 1108, 1144, 1180, 1131, 1083, 1110, 1137, 1214, 1292, 1300, 1307, 1265, 1222, 1306, 1390, 1389, 1389, 1323, 1257, 1275, 1293, 1349, 1404, 1409, 1414, 1386, 1358, 1330, 1302, 1380, 1459, 1419, 1380, 1410, 1440, 1419, 1398, 1420, 1441, 1462, 1483, 1389, 1295, 1286, 1276, 1306, 1335, 1281, 1226, 1170, 1114, 1176, 1239, 1258, 1277, 1296, 1315, 1331, 1346, 1413, 1480, 1392, 1304, 1301, 1298, 1364, 1429, 1484, 1539, 1488, 1268, 1130, 1094, 1180, 1165, 1062, 958, 1013, 1068, 1123, 1178, 1171, 1164, 1241, 1318, 1298, 1278, 1173, 1069, 1207, 1345, 1365, 1385, 1389, 1392, 1345, 1297, 1242, 1186, 1215, 1243, 1257, 1271, 1369, 1467, 1426, 1385, 1225, 1066, 1157, 1248, 1288, 1329, 1345, 1361, 1303, 1245, 1150, 1224, 1267, 1207, 1069, 1032, 1118, 1203, 1296, 1389, 1397, 1406, 1372, 1338, 1248, 1157, 1273, 1289, 1310, 1332, 1289, 1246, 1157, 1169, 1215, 1430, 1469, 1272, 1215, 1157, 1243, 1329, 1287, 1347, 1349, 1351, 1364, 1377, 1411, 1276, 1254, 1401, 1493, 1484, 1425, 1265, 1267, 1270, 1356, 1341, 1174, 1108, 1139, 1171, 1124, 1077, 1124, 1171, 1190, 1108, 1138, 1168, 1186, 1203, 1262, 1220, 1140, 1228, 1216, 1203, 1251, 1300, 1284, 1268, 1246, 1325, 1358, 1390, 1378, 1367, 1361, 1355, 1271, 1188]
4921A188l8O4PPL2L2L2L2l8l7Q0Q1j3j3o4o4N3N4M7M7k3j25m6N5L2o8o2L9nnKKqqJ06Nl1P0
4915A419PPp2p1o0o1n2J18J64O3JKn0m9p2K8k8k8O3O2J2J2o9p0o9p0M4M3J39l0j6j6k6k6K7
4910A276K8k3k3ONOOjjN0N0j%jjK4K3r5r4N2N2j0rJ40k8n2n1m4m5J08J08K5K6n9n9p2p3J2
4904A255J2N7N6k8k8P5P6p7p6L1L1m3m3r8P0N9O0l6l7J5J4k0j9k0j9q4q4l3l3N4N4J06J05
4899A352j0j0j0j0k8k8K2K3LLN3N3%Jq5q4j5j6j6j5Q1Q2l6l7K8K8n7n6n4n4R8R8M6M5noJ7
4893A401J7k3k4q3Q5lj05kkrqm4m3O2O2K05Jklj7j7j02j02K0J9P0P0K3K2k8k8m1m0k8k9j56
4888A118M5J18J17m1m1m2m1O5O5J5J4q8q9L0L0j5j4o5o5L8L9j3j2j8j9O6O6M0M1j12j12N5
4883A175N5MM%JQ5Q4m1m2m2m2K8K8K8K8j8j9K0K0J10r3o3o4l0l1N4N4%jJ3J2j56M7N2N1PQ
$$ y = [1188, 1150, 1214, 1221, 1228, 1260, 1292, 1324, 1356, 1318, 1281, 1361, 1442, 1429, 1416, 1352, 1288, 1341, 1395, 1442, 1489, 1466, 1341, 1295, 1350, 1382, 1314, 1252, 1291, 1286, 1281, 1283, 1285, 1277, 1269, 1375, 1380, 1349, 1419, 1426, 1433, 1361, 1290, 1230, 1169, 1117, 1235, 1399, 1462, 1463, 1465, 1415, 1366, 1294, 1322, 1294, 1266, 1329, 1391, 1403, 1415, 1346, 1276, 1207, 1137, 1181, 1224, 1363, 1333, 1317, 1301, 1275, 1249, 1276, 1304, 1281, 1258, 1264, 1269, 1275, 1281, 1280, 1279, 1329, 1379, 1378, 1378, 1377, 1376, 1400, 1423, 1328, 1234, 1286, 1338, 1328, 1319, 1459, 1431, 1379, 1328, 1284, 1239, 1347, 1455, 1480, 1506, 1447, 1388, 1316, 1243, 1255, 1267, 1324, 1380, 1352, 1324, 1399, 1475, 1398, 1322, 1353, 1384, 1341, 1298, 1200, 1270, 1329, 1389, 1353, 1316, 1331, 1345, 1325, 1306, 1286, 1267, 1183, 1099, 1066, 1033, 1087, 1141, 1247, 1352, 1342, 1332, 1322, 1312, 1284, 1256, 1278, 1301, 1304, 1307, 1360, 1413, 1413, 1414, 1329, 1245, 1230, 1214, 1198, 1183, 1264, 1346, 1310, 1273, 1301, 1329, 1272, 1216, 1162, 1108, 1206, 1304, 1350, 1395, 1390, 1384, 1401, 1418, 1395, 1371, 1288, 1373, 1370, 1265, 1263, 1261, 1252, 1244, 1200, 1157, 1219, 1281, 1486, 1487, 1485, 1482, 1465, 1448, 1346, 1244, 1264, 1283, 1353, 1423, 1446, 1468, 1440, 1412, 1371, 1331, 1303, 1274, 1118, 1163, 1281, 1398, 1357, 1316, 1274, 1233, 1298, 1363, 1378, 1392, 1304, 1215, 1245, 1275, 1260, 1246, 1181, 1116, 1154, 1193, 1180, 1168, 1150, 1131, 1197, 1263, 1303, 1344, 1232, 1120, 1175, 1230, 1234, 1238, 1238, 1239, 1324, 1408, 1367, 1325, 1283, 1241, 1269, 1297, 1325, 1353, 1335, 1316, 1336, 1356, 1466, 1373, 1310, 1246, 1216, 1185, 1239, 1293, 1293, 1292, 1305, 1317, 1161, 1208, 1260, 1311, 1318, 1326]
4877A326p7p7M7M7M6M7m1m1R9R9K8j75j0j0q8q7llK9K8K9K9OOPOk8k7K3K3J3J3p1p2L4L4j6
4872A193j7N1N0%%mnM7M6M4M3p5p4J2J3J3J3k5k6N9N9k5k5O0O0o7o8J7J7O3O3k1k1p8p8k8
4866A286k7J94J95r3r3q3q2JKQRQQj3j4j3j4n1n2n1n2L1L0L0L1M8M9M8M8J6J6l4l5o3o3N5
4861A280N6NNm6m5Q6Q6l2l2K4K3K4K3K2K1K2K1j3j3j31j31L6L6j5j5k8k7k7k7L4L4L4L5m6
4855A279m6J06J06l3l3l3l3N8N9o0o0PPJ3J3o2M0Q4q5n3M8L1L2j4j4L7L6MMMNr4r3qrK9L0
4850A302n6n5K4K3J3J3J43k6j6j5o5o6J9K0M3M3m1m1J0J0RJ0KKQ7Q7N0N0j02j02k7k7K4K4
4845A369NONOk7k6J4J4J1j58j58J2P0P0Q1Q1J0J1m0m1J1J0J1J0o1o1R1R1n3n4lj72l3O8M5
4839A215M5N3m9j38L2O7O7P8P8K5K5o0n9n7n7J1r1m4J25K03L3m0m1n1n2L0L0k0k1O9O9m9n0
$$ y = [1326, 1249, 1172, 1219, 1266, 1312, 1359, 1318, 1277, 1376, 1475, 1503, 1328, 1318, 1308, 1220, 1133, 1130, 1127, 1156, 1184, 1213, 1242, 1248, 1254, 1261, 1267, 1239, 1212, 1235, 1258, 1271, 1284, 1213, 1141, 1175, 1209, 1193, 1176, 1227, 1277, 1277, 1277, 1273, 1268, 1315, 1361, 1405, 1448, 1373, 1299, 1311, 1324, 1337, 1350, 1325, 1299, 1358, 1417, 1392, 1367, 1427, 1487, 1420, 1352, 1369, 1386, 1449, 1512, 1491, 1470, 1392, 1314, 1286, 1259, 1453, 1648, 1555, 1462, 1379, 1297, 1298, 1300, 1308, 1317, 1325, 1333, 1320, 1306, 1293, 1279, 1228, 1176, 1125, 1073, 1104, 1134, 1164, 1195, 1243, 1292, 1340, 1388, 1404, 1420, 1386, 1351, 1288, 1225, 1280, 1336, 1341, 1346, 1300, 1255, 1341, 1427, 1395, 1363, 1387, 1410, 1434, 1457, 1479, 1500, 1522, 1543, 1530, 1517, 1386, 1255, 1291, 1327, 1312, 1297, 1269, 1242, 1215, 1188, 1222, 1256, 1290, 1325, 1279, 1233, 1339, 1445, 1412, 1379, 1346, 1313, 1371, 1430, 1370, 1310, 1317, 1324, 1337, 1350, 1288, 1328, 1412, 1327, 1274, 1322, 1353, 1385, 1371, 1357, 1394, 1430, 1434, 1438, 1442, 1447, 1353, 1260, 1252, 1243, 1272, 1302, 1246, 1191, 1215, 1238, 1251, 1264, 1407, 1381, 1365, 1350, 1285, 1219, 1238, 1258, 1301, 1344, 1303, 1262, 1272, 1282, 1291, 1301, 1303, 1305, 1392, 1479, 1529, 1579, 1477, 1375, 1348, 1321, 1345, 1369, 1374, 1380, 1385, 1391, 1364, 1338, 1352, 1366, 1377, 1219, 1061, 1073, 1143, 1213, 1294, 1375, 1385, 1396, 1356, 1315, 1326, 1336, 1347, 1357, 1296, 1235, 1326, 1417, 1364, 1310, 1307, 1135, 1102, 1170, 1215, 1260, 1313, 1264, 1126, 1158, 1225, 1292, 1370, 1448, 1473, 1498, 1438, 1379, 1322, 1265, 1276, 1185, 1141, 1266, 1469, 1502, 1462, 1421, 1370, 1318, 1348, 1378, 1358, 1337, 1406, 1475, 1426, 1376]
4834A376k8k8O2O3j16j4J3J3j5j5J0J0j41j41PJ76J07o3r8LQ1Q2L0L1J8q4qqN6m5m4j44R7
4829A243J98J0j59l6l6NMjjk6k6QQk3P7M5M5j24k2J04J03j2j14O2J64j8j7l5l4j35L3Q6j5
4824A361n5M6L1L2o4J06nj07o4o4P8P8k9P1K1K1L3o8o4o4j9j9J6J5j03j02K7K7K7K6N4N3P0
4819A366J72Q9q0o3o4j6j6m1m2J1J1N5N5J9q2j08oM5M5PPj03kqqP2P3o9L2j%k0k0M0M0j0j0
4813A370q6q6jkNMNMjjN0N0n7n6K8K8K1K2P2P2jjq6q5L6L5L6L6j14j15MLP7P6l5l6K2J24Q1
4807A498j55Q4Q4q3q3m0l9j4j4O4O4j23M7Q5j8%%n3n3K1K1%j69n7J12J08PK3K3k3k3p4p4M9
4802A195M9K4K4mmM7M7O4O3k1k1p9p8OOp7p6QQMMQ9Q9m3m4m3m3m3m2P6P6K9K9K9K9k2k3m8
4796A284m9m2m2P6P5N0N0l4l4k6k6k6k6j5j5j5j5OON7N7j8j7L4L4o6o6J9J9J3J3p2p2ONON
$$ y = [1376, 1348, 1320, 1382, 1445, 1329, 1315, 1328, 1341, 1326, 1311, 1321, 1331, 1190, 1049, 1056, 1232, 1339, 1276, 1178, 1181, 1262, 1344, 1374, 1405, 1423, 1339, 1331, 1323, 1379, 1334, 1290, 1146, 1243, 1441, 1451, 1292, 1256, 1220, 1225, 1229, 1228, 1227, 1201, 1175, 1183, 1191, 1168, 1245, 1290, 1335, 1211, 1189, 1293, 1396, 1384, 1270, 1332, 1496, 1478, 1461, 1426, 1392, 1257, 1290, 1376, 1361, 1306, 1352, 1383, 1415, 1351, 1457, 1452, 1345, 1281, 1217, 1295, 1373, 1344, 1415, 1436, 1457, 1490, 1422, 1358, 1294, 1275, 1256, 1272, 1287, 1184, 1082, 1109, 1136, 1163, 1189, 1243, 1296, 1366, 1538, 1627, 1547, 1484, 1420, 1404, 1388, 1347, 1305, 1316, 1327, 1382, 1437, 1456, 1374, 1266, 1260, 1305, 1350, 1357, 1364, 1261, 1259, 1251, 1243, 1315, 1388, 1319, 1351, 1350, 1350, 1330, 1310, 1350, 1390, 1380, 1370, 1284, 1198, 1197, 1195, 1200, 1204, 1209, 1213, 1212, 1211, 1261, 1311, 1254, 1198, 1226, 1254, 1275, 1297, 1369, 1441, 1440, 1439, 1353, 1268, 1304, 1339, 1375, 1411, 1297, 1182, 1186, 1189, 1266, 1342, 1307, 1271, 1293, 1417, 1498, 1343, 1427, 1511, 1428, 1345, 1305, 1266, 1252, 1238, 1302, 1366, 1243, 1290, 1375, 1357, 1357, 1357, 1304, 1251, 1272, 1293, 1293, 1124, 1067, 1179, 1287, 1294, 1317, 1340, 1317, 1294, 1220, 1146, 1195, 1244, 1268, 1292, 1288, 1284, 1331, 1378, 1442, 1505, 1484, 1463, 1384, 1306, 1312, 1318, 1241, 1165, 1173, 1181, 1185, 1189, 1278, 1367, 1324, 1280, 1237, 1194, 1151, 1109, 1185, 1261, 1290, 1319, 1348, 1377, 1355, 1332, 1284, 1235, 1193, 1151, 1227, 1302, 1352, 1402, 1368, 1334, 1308, 1282, 1256, 1230, 1215, 1200, 1185, 1170, 1176, 1182, 1239, 1296, 1278, 1261, 1295, 1329, 1263, 1197, 1216, 1235, 1248, 1261, 1189, 1117, 1123, 1128, 1134, 1139]
4791A139J6J5O6O6NON7N6k2k3p3p3m5m4K3p9M1K10m4m4l1l1K0J9M6M6M6M6r5r4K3K4MLJ22
4785A401K1j22M7n5n4J19J19o6o7n4n4lmL2L1L2L1m2m3m2m2P7P7pqk9l0K1K1l9m0M5M5J02
4780A420J02j52j51J6J5L7o5r6J40J14J4o7L4P9k2lkrrllM8M7J0Rm1m1n2n2n2n3O4O4k0k1
4775A299p5p5p5p5R2R1R2R2p6p6M2M2R0R0NNn0n0JJl0l0l0l0K1K1O5j03j8j8k8k9J3J4J3J3
4769A234O1O1r2r1L1L0L1L0J08J08j1j1j39j39Q1Q0k7k7R1R1j35j36J6J7O9O9j6j5QRp6p6
4765A234k7k6k7k6R7R7J3J3q1q1LLP5P4rj0K6K6P0P1m5j46j00P0M1M2J07j29j08oOOl1l1K0
4759A211K0L3L4L3L4o3o2K2K1l5l6J5J5K5K4K5K4M8M7L0p1j09O0J11J10mmj5j5J8j50j01O9
4754A364q4q4P9P8l3l3l3l3K7K7K6K7M2M2m3m3o8o9J6J6J0RJ0Rj5j6j6j5nnP9Q0LMq1q1po
$$ y = [1139, 1155, 1170, 1236, 1302, 1307, 1313, 1370, 1426, 1404, 1381, 1308, 1235, 1190, 1146, 1169, 1090, 1131, 1341, 1297, 1253, 1222, 1191, 1211, 1230, 1276, 1322, 1368, 1414, 1319, 1225, 1248, 1272, 1276, 1279, 1401, 1422, 1300, 1347, 1292, 1238, 1357, 1476, 1410, 1343, 1289, 1235, 1232, 1228, 1260, 1291, 1323, 1354, 1312, 1269, 1227, 1185, 1262, 1339, 1332, 1324, 1295, 1265, 1286, 1307, 1268, 1228, 1273, 1318, 1420, 1522, 1370, 1219, 1235, 1250, 1287, 1222, 1126, 1266, 1380, 1394, 1327, 1361, 1440, 1418, 1415, 1413, 1404, 1395, 1392, 1389, 1437, 1484, 1494, 1503, 1462, 1421, 1369, 1317, 1265, 1212, 1276, 1340, 1320, 1299, 1224, 1149, 1074, 999, 1091, 1182, 1274, 1366, 1290, 1214, 1256, 1298, 1388, 1478, 1483, 1488, 1438, 1388, 1389, 1390, 1360, 1330, 1300, 1270, 1291, 1312, 1377, 1274, 1256, 1238, 1210, 1181, 1194, 1208, 1221, 1234, 1295, 1356, 1264, 1173, 1204, 1234, 1265, 1295, 1403, 1511, 1500, 1489, 1350, 1211, 1292, 1372, 1345, 1318, 1409, 1500, 1365, 1229, 1245, 1262, 1331, 1400, 1384, 1369, 1377, 1386, 1310, 1234, 1207, 1181, 1154, 1128, 1225, 1322, 1335, 1348, 1267, 1186, 1189, 1192, 1267, 1341, 1332, 1322, 1348, 1374, 1444, 1515, 1470, 1324, 1224, 1294, 1335, 1377, 1484, 1355, 1247, 1241, 1247, 1253, 1222, 1191, 1211, 1231, 1264, 1298, 1331, 1365, 1302, 1240, 1262, 1283, 1248, 1212, 1227, 1242, 1267, 1291, 1316, 1340, 1388, 1435, 1465, 1394, 1285, 1345, 1456, 1566, 1562, 1558, 1543, 1528, 1546, 1396, 1295, 1364, 1280, 1196, 1275, 1353, 1320, 1287, 1254, 1221, 1248, 1275, 1301, 1328, 1370, 1412, 1369, 1326, 1258, 1189, 1205, 1221, 1231, 1240, 1250, 1259, 1244, 1228, 1212, 1197, 1192, 1187, 1266, 1346, 1349, 1353, 1272, 1191, 1184, 1178]
4748A178J02J02L9j29q5J7k2P8J34l5q2Q8L8o2J6J7J0J0POj46j46M6M5M5M6j4j4j4j3K7K7
4744A316k3k3M3M2M3M3l2l2l2l3LLLL%%%%N6N6ONl1l1J9K0o5o4Q8Q7k9l0m6N5M6j22p2K9m4
4738A257N8P1l1j6Q6Q0k2j13j13o2o2r1J1M4M4k2P9P9k3L7L8N8J60j0rrrQ9j3j07j08J5J5
4733A401J5J5n4n4r9r9K6J28j4j4L4L5R2rp0p0RQl8l7P4P4K9p2j6j5L0L0k1k1P1P1m7m7JJ
4727A347J15J4n8M3j4j15j1j0O7O8l2l1q9J3klNMk0k0k0k0k8k8p2p2P8J80L9L9L5L6k6j26
4722A286P5P6q3q2n2n2M3M3j36L2R6R6p4K7P8k3l9l8%jJ48M5m9m9k3k2L4o7lmj23k3M1o0N4
4717A171N3M0M0j7Q4nmN2N3l8l7l7l7J6J5l5l5j0j1M7n5k3k3L4o7KJ04j0j1mmO4l8j39L1L7
4711A203L6J23m7klJ6J6l5l5P5P6J33L1j06j06Nr6r7P2J84J5m2m3qrK1q1k3k3l0k9k9k9M2
$$ y = [1178, 1280, 1382, 1421, 1292, 1207, 1224, 1202, 1280, 1414, 1379, 1297, 1385, 1423, 1361, 1377, 1394, 1404, 1414, 1421, 1427, 1281, 1135, 1181, 1226, 1271, 1317, 1303, 1289, 1275, 1262, 1289, 1316, 1293, 1270, 1313, 1355, 1398, 1441, 1409, 1377, 1345, 1312, 1315, 1318, 1321, 1324, 1324, 1324, 1324, 1324, 1380, 1436, 1442, 1447, 1416, 1385, 1404, 1424, 1359, 1295, 1383, 1470, 1441, 1411, 1365, 1420, 1466, 1344, 1272, 1301, 1257, 1315, 1386, 1355, 1339, 1425, 1505, 1483, 1370, 1257, 1195, 1133, 1042, 1053, 1097, 1141, 1119, 1198, 1277, 1254, 1291, 1329, 1387, 1547, 1537, 1528, 1519, 1510, 1599, 1586, 1479, 1371, 1386, 1401, 1416, 1431, 1377, 1323, 1224, 1125, 1151, 1279, 1265, 1251, 1285, 1320, 1412, 1403, 1333, 1263, 1272, 1280, 1242, 1205, 1279, 1353, 1382, 1310, 1294, 1279, 1309, 1339, 1318, 1297, 1368, 1439, 1392, 1345, 1346, 1347, 1462, 1476, 1418, 1461, 1447, 1332, 1321, 1311, 1378, 1446, 1414, 1383, 1294, 1307, 1305, 1302, 1307, 1311, 1291, 1271, 1251, 1231, 1203, 1175, 1103, 1031, 1109, 1289, 1328, 1367, 1402, 1438, 1412, 1286, 1361, 1437, 1354, 1272, 1220, 1168, 1211, 1254, 1118, 1150, 1246, 1342, 1268, 1295, 1373, 1350, 1311, 1273, 1273, 1272, 1420, 1465, 1416, 1367, 1344, 1322, 1356, 1289, 1286, 1282, 1159, 1136, 1177, 1117, 1171, 1224, 1264, 1304, 1287, 1371, 1366, 1362, 1414, 1467, 1429, 1392, 1355, 1318, 1334, 1349, 1314, 1279, 1269, 1258, 1305, 1250, 1227, 1204, 1238, 1171, 1173, 1277, 1267, 1256, 1252, 1248, 1312, 1274, 1135, 1166, 1203, 1239, 1362, 1315, 1313, 1310, 1326, 1342, 1307, 1272, 1347, 1423, 1556, 1587, 1481, 1375, 1380, 1284, 1187, 1259, 1443, 1458, 1416, 1373, 1365, 1356, 1377, 1296, 1273, 1250, 1220, 1191, 1162, 1133, 1175]
4706A175M1R9lnoO6O7Pr4l1l1q9J3P0l2mR7R1j1o0o1P9P8J6q6k9k9K1K2P2P3p2p1j34l4J37
4700A342L5j9k0noooL1L1L2L1L3L3j52j53J0J0N4N4nj07M0J40j9j22pppqN4J56klJ7q4j44
4695A221m2OOJ22K0J7q5J8J8J2J2M6M6M6M6r0q9O3O3p6p6KKL4o7j0j1J8J8J1J1N3m9m9N2N0
4689A369N0l2j33l0P3J50M9L3L2k8j30j17j6O2O2Q3q6r9KQQJ4J4l1l1lR8j7j7M6M7j15j4P1
4684A372l1jjO7O6%j70j25M4J66O5J5J4n2n1r6r5p3K9Q6j6jJ01j3j4qqqqQ2Q2Q9j3o7o6q0
4679A281K2K3K2L4o6r8r7qrn8J11J17n2n7M5Q4j7OPn1n1K3K2K2K2RQM9M8J01o9k4k4q8q8l7
4673A162l7Q7Q8Q7Q8j8j7j7j7k4k5k4k4L5L5q4q3MNMMN8N7N8N8k3k3k2k3l6l7m7m7J33l6j17
4668A182j5J00J00m6m5M8M9lkk7k8k7k8M3M4m1m2m2m2M3M2L8L9m7m6K6K6n8n9m1m2P7P6J28
$$ y = [1175, 1216, 1315, 1312, 1307, 1301, 1367, 1434, 1441, 1347, 1316, 1285, 1196, 1209, 1279, 1247, 1243, 1340, 1431, 1420, 1360, 1299, 1378, 1456, 1472, 1386, 1357, 1328, 1349, 1371, 1443, 1516, 1444, 1373, 1239, 1205, 1342, 1377, 1358, 1338, 1333, 1327, 1321, 1315, 1346, 1377, 1409, 1440, 1473, 1506, 1354, 1201, 1211, 1221, 1275, 1329, 1324, 1217, 1257, 1397, 1378, 1256, 1249, 1242, 1235, 1227, 1281, 1437, 1435, 1432, 1449, 1365, 1221, 1179, 1185, 1191, 1313, 1333, 1350, 1265, 1283, 1301, 1313, 1325, 1371, 1417, 1463, 1509, 1419, 1330, 1393, 1456, 1380, 1304, 1306, 1308, 1342, 1275, 1265, 1254, 1272, 1290, 1301, 1312, 1365, 1316, 1267, 1319, 1369, 1419, 1387, 1254, 1224, 1297, 1447, 1496, 1529, 1561, 1533, 1403, 1286, 1270, 1332, 1394, 1477, 1391, 1292, 1294, 1302, 1310, 1324, 1338, 1307, 1276, 1273, 1371, 1354, 1337, 1383, 1430, 1315, 1301, 1372, 1341, 1340, 1339, 1406, 1472, 1472, 1302, 1177, 1221, 1387, 1452, 1467, 1481, 1429, 1378, 1282, 1187, 1114, 1143, 1229, 1213, 1212, 1313, 1300, 1286, 1278, 1270, 1262, 1254, 1336, 1418, 1507, 1494, 1427, 1361, 1281, 1303, 1326, 1348, 1382, 1316, 1218, 1121, 1113, 1104, 1046, 1157, 1274, 1222, 1165, 1210, 1294, 1277, 1283, 1290, 1239, 1188, 1211, 1233, 1255, 1277, 1286, 1294, 1343, 1391, 1492, 1423, 1399, 1375, 1287, 1199, 1162, 1125, 1212, 1300, 1387, 1475, 1457, 1440, 1423, 1406, 1382, 1357, 1333, 1309, 1344, 1379, 1295, 1212, 1216, 1221, 1225, 1229, 1287, 1344, 1402, 1460, 1437, 1414, 1392, 1369, 1333, 1296, 1249, 1202, 1335, 1299, 1182, 1167, 1267, 1367, 1321, 1276, 1324, 1373, 1370, 1368, 1341, 1313, 1286, 1258, 1301, 1345, 1304, 1262, 1220, 1178, 1221, 1263, 1301, 1340, 1293, 1247, 1273, 1299, 1241, 1182, 1141, 1099, 1176, 1252, 1380]
4662A380J28r2r2RQRQl4l5n9J76J30m0r9Lp7K4N8N8%%%jJ7J6l4l4mln5n4K5K5o0n9R2R3QQ
4657A443j01j00j7j6KKJKO9O9q3q3N6N5MNl0k9K1K1L2L3L3L2ONm5m5mmq8q8JKN2N2P6P6K6
4651A443K6l2l3l2l2l5l5Q2Q3l2l2J9J8KKm9m9N6N7POj6j6l3j34n2J17J22m8j14N5L3L4j6
4645A372j7O8O8m7m6NMm2m3QQk4k5K6K6J4J4MLL3j36r2J0O6J68J24K3r3r3r9r9J9K0QRQ8q1
4640A251m3N9m4m5Q1Q0J05J04m7m8O1O1n8n7k9k9K2K1n3n4n3n4rro0o0Q7Q6Q6Q7o7o7J8J8
4635A341LLN4N3M4M4j07j08n0m9m9n0N5N6MNJ20J21o5o6OONOJ0J0j42j41J27J28RRn1n1%%
4629A290K2K2K1K2n3n3kkJ8J9l2l2K5K6K5K5rrqrM4M4j08j09mnM6M6J4J3J4J4J3J2O4O3oo
4623A455r1r0KKJ21J20o7o7j7j7l5l6M9M8K6K5n9n9M8M9lkK2K1k9k9n6n7O2O1K0K0q5q6q2
$$ y = [1380, 1508, 1416, 1324, 1333, 1341, 1350, 1358, 1324, 1289, 1230, 1406, 1536, 1496, 1397, 1400, 1323, 1347, 1405, 1463, 1463, 1463, 1463, 1462, 1479, 1495, 1461, 1427, 1423, 1420, 1365, 1311, 1336, 1361, 1301, 1242, 1334, 1427, 1435, 1443, 1342, 1242, 1225, 1209, 1211, 1213, 1214, 1216, 1285, 1354, 1271, 1188, 1244, 1299, 1303, 1308, 1278, 1249, 1270, 1291, 1323, 1356, 1389, 1421, 1427, 1432, 1387, 1342, 1338, 1334, 1246, 1158, 1159, 1161, 1213, 1265, 1341, 1417, 1443, 1469, 1437, 1404, 1372, 1340, 1305, 1270, 1352, 1435, 1403, 1371, 1390, 1408, 1410, 1412, 1363, 1314, 1370, 1427, 1434, 1440, 1424, 1408, 1375, 1241, 1189, 1306, 1428, 1380, 1266, 1321, 1354, 1388, 1372, 1355, 1423, 1491, 1444, 1398, 1403, 1407, 1365, 1322, 1330, 1338, 1314, 1289, 1315, 1341, 1355, 1369, 1373, 1376, 1409, 1273, 1181, 1191, 1257, 1425, 1549, 1572, 1479, 1386, 1287, 1188, 1207, 1227, 1235, 1244, 1332, 1251, 1208, 1267, 1223, 1178, 1259, 1339, 1444, 1548, 1501, 1453, 1514, 1575, 1517, 1460, 1431, 1402, 1424, 1445, 1392, 1338, 1285, 1231, 1222, 1213, 1153, 1093, 1180, 1266, 1352, 1439, 1372, 1305, 1323, 1341, 1344, 1347, 1401, 1454, 1498, 1542, 1435, 1327, 1277, 1228, 1179, 1129, 1184, 1240, 1244, 1249, 1369, 1490, 1425, 1359, 1365, 1371, 1376, 1382, 1392, 1402, 1260, 1119, 1246, 1374, 1383, 1392, 1341, 1290, 1290, 1290, 1312, 1334, 1355, 1377, 1324, 1271, 1269, 1267, 1285, 1304, 1272, 1240, 1265, 1291, 1316, 1341, 1332, 1323, 1315, 1306, 1350, 1394, 1286, 1177, 1173, 1168, 1214, 1260, 1274, 1287, 1301, 1315, 1328, 1340, 1404, 1467, 1461, 1455, 1364, 1274, 1276, 1278, 1399, 1519, 1452, 1385, 1368, 1351, 1316, 1280, 1329, 1377, 1403, 1428, 1369, 1310, 1358, 1407, 1404, 1402, 1424, 1445, 1416, 1387, 1331, 1274, 1336, 1397, 1417, 1437, 1352, 1266, 1184]
4618A184J20N7N7jkkjk6k6K5K5P4P5j11j11J2J2J3J2K4K5o1o0q4q5L4L4n6n6O2O3P5P5m4m3
4613A289J4J4R9R8q2q2l1l1J2J3J2J3o3o2j2j2LLm8m8N6N6N6N5j5j6mlj19Q3J17J6k0Q1L1
4607A473p1j60n8O5O4O8O8J7J8l1l2l1l1M2M2M2M3r8r7m6m7L8L8Q8Q9N0N1j36j35p9p9OOM0
4602A217M0M1M0m5m5M0L9N3N3k9j31o4J38o6o6LLm7m8J6J5O7O6J23J24k9k9n1n1%jQQm3m2
4597A307J0J0m1m0K6K6K5K6M3M2m2m2J3J4l7l7L3L2q6q6l4l4Q4Q4JKKJR6R5k2k3p8p9M0L9
4591A370j2j2j2j2Q8Q8l0l0J6J5J5J6m2m2m1m2k1k0L0L0J6J6jJ01J01o7j18j18K5K4K5K5m
4586A377mM7M7j22j22L0K9L3L3Q0k2J54j4p4K7N1n0j06j05KLLKqqqqO6O5J5J5k8k8k9k8L6
4581A351L6L6L6o6o7o0o0jJ01J07j30j11J26Q5j5N1N2M5M5q9q8K9K9p6p6P6P6KKM2M2K4j45
$$ y = [1184, 1304, 1361, 1418, 1417, 1415, 1413, 1412, 1386, 1360, 1385, 1410, 1484, 1559, 1448, 1337, 1349, 1361, 1374, 1386, 1410, 1435, 1374, 1314, 1230, 1145, 1179, 1213, 1157, 1101, 1163, 1226, 1301, 1376, 1332, 1289, 1303, 1317, 1416, 1514, 1432, 1350, 1319, 1288, 1300, 1313, 1325, 1338, 1275, 1213, 1201, 1189, 1192, 1195, 1147, 1099, 1155, 1211, 1267, 1322, 1307, 1291, 1287, 1284, 1165, 1248, 1365, 1381, 1361, 1442, 1473, 1402, 1242, 1184, 1249, 1313, 1381, 1449, 1466, 1484, 1453, 1421, 1390, 1359, 1401, 1443, 1485, 1528, 1430, 1333, 1287, 1240, 1278, 1316, 1404, 1493, 1543, 1594, 1458, 1323, 1244, 1165, 1171, 1177, 1217, 1257, 1298, 1338, 1293, 1248, 1288, 1327, 1380, 1433, 1404, 1273, 1209, 1347, 1281, 1215, 1218, 1221, 1174, 1126, 1142, 1157, 1224, 1290, 1413, 1537, 1508, 1479, 1428, 1377, 1377, 1376, 1384, 1392, 1349, 1307, 1317, 1327, 1286, 1246, 1272, 1298, 1323, 1349, 1392, 1434, 1392, 1350, 1363, 1377, 1340, 1303, 1336, 1368, 1282, 1196, 1162, 1128, 1212, 1296, 1297, 1299, 1301, 1302, 1398, 1493, 1471, 1448, 1370, 1291, 1331, 1370, 1358, 1346, 1334, 1322, 1410, 1498, 1468, 1438, 1454, 1469, 1484, 1500, 1458, 1416, 1375, 1333, 1312, 1292, 1322, 1352, 1368, 1384, 1383, 1484, 1585, 1518, 1400, 1282, 1307, 1331, 1356, 1381, 1377, 1373, 1420, 1467, 1345, 1223, 1253, 1282, 1315, 1348, 1428, 1406, 1560, 1546, 1472, 1499, 1550, 1500, 1394, 1289, 1291, 1294, 1297, 1299, 1291, 1283, 1275, 1267, 1333, 1398, 1413, 1428, 1400, 1372, 1343, 1315, 1351, 1387, 1423, 1459, 1393, 1326, 1266, 1206, 1205, 1306, 1413, 1283, 1172, 1298, 1383, 1368, 1419, 1471, 1516, 1561, 1472, 1384, 1413, 1442, 1366, 1290, 1366, 1442, 1444, 1446, 1488, 1530, 1554, 1409]
4576A409JJM0M0j1j1l9l8l9l9j7j6%J69n4j56m7J23J43r4q5J6n5M7mmP8P7o8o9q5J7P8P8P3
4570A459P4J24K3k2j23j30k8L8L9J7q5K5K4J8J9o7o6N2N2qpjjp0L2L1p0L2L2K6K5J8J9o7o6
4565A368KJR7p2k1k0mR8k2k3R2j0KLlmk9k9k9k8r0q9k7P3L7L7k0Q2O5l5l0P2l0l0k3k4k4k3
4559A290k4k3O6O6O7O6j9j9p0p0K8K8K8K8l2l2N2N2r1r1k8k7j03J00J38J38k9k8k9k9l2l3
4554A338l3l3J07J07j13j12O6O6j9j9j13j13ONP8P8opK3K3K3K3jjn2n2n3n3O5O5O2O1k4k3
4549A369K1K1l0k9j8j7j01j02M3M2qrO2O3O2O2L2L3q6q6J36J37m9m9k2k2p3p2j5j4j5j5M0
4544A291L9R0R0K7K6k4k4k2k2k2k2rj0rrM4M4m1m0k6k6k5k6K4K5k6k6j3j2P2P2l5l5J5J6k6
4539A345k6k5k6M1M1R2R2J7J7n7n7k32o3K8K8J69J70j7j6l9l9M5M6p5p5k5k4RRm2m1R2R2Q
$$ y = [1409, 1410, 1411, 1451, 1491, 1480, 1469, 1430, 1392, 1353, 1314, 1297, 1281, 1281, 1450, 1396, 1240, 1193, 1316, 1459, 1365, 1280, 1296, 1241, 1288, 1284, 1280, 1358, 1435, 1367, 1298, 1213, 1230, 1308, 1386, 1459, 1533, 1657, 1680, 1658, 1535, 1405, 1377, 1415, 1454, 1471, 1386, 1411, 1435, 1453, 1472, 1405, 1339, 1391, 1443, 1435, 1428, 1427, 1426, 1356, 1388, 1419, 1349, 1381, 1413, 1439, 1464, 1482, 1501, 1434, 1368, 1370, 1371, 1468, 1396, 1375, 1355, 1351, 1449, 1427, 1404, 1496, 1486, 1488, 1491, 1488, 1484, 1455, 1426, 1397, 1369, 1279, 1190, 1163, 1236, 1273, 1310, 1290, 1372, 1437, 1402, 1372, 1444, 1414, 1384, 1361, 1337, 1313, 1290, 1266, 1243, 1309, 1375, 1442, 1508, 1489, 1470, 1400, 1330, 1358, 1386, 1414, 1442, 1410, 1378, 1430, 1482, 1391, 1300, 1272, 1245, 1142, 1242, 1380, 1518, 1489, 1461, 1432, 1403, 1371, 1338, 1305, 1272, 1379, 1486, 1373, 1261, 1327, 1393, 1374, 1355, 1242, 1129, 1135, 1140, 1218, 1296, 1290, 1283, 1306, 1329, 1352, 1375, 1374, 1373, 1321, 1269, 1216, 1163, 1228, 1293, 1355, 1416, 1392, 1369, 1390, 1411, 1381, 1352, 1334, 1317, 1216, 1114, 1157, 1199, 1191, 1182, 1244, 1307, 1369, 1431, 1463, 1496, 1410, 1324, 1460, 1597, 1548, 1499, 1477, 1455, 1382, 1310, 1295, 1281, 1266, 1251, 1291, 1330, 1420, 1510, 1537, 1563, 1539, 1515, 1493, 1471, 1449, 1427, 1418, 1408, 1399, 1390, 1434, 1478, 1437, 1397, 1371, 1345, 1320, 1294, 1318, 1343, 1317, 1291, 1278, 1266, 1338, 1410, 1375, 1340, 1355, 1371, 1345, 1319, 1294, 1268, 1309, 1350, 1442, 1534, 1551, 1568, 1511, 1454, 1222, 1159, 1187, 1215, 1384, 1554, 1537, 1521, 1482, 1443, 1488, 1534, 1459, 1384, 1359, 1335, 1344, 1353, 1311, 1270, 1362, 1454, 1462]
4533A462Qo2o2o2o2J1J1m0l9Q6Q6KKj7j7%j02q9P9Q5j5J2J3OPj9j9O5O6K5K5j4j5n3J16P9
4528A559k4n9n9n5n5n7J12K4p8M4M4L8L8J9J9l2l2J%n0m9p6p5RRK2K2P3P2n1n1j%l3l2K9K9
4522A294j2J56Jj02k8k8l5l4qqJ10J10o7o7L3K34mj05l6l6k9k8k9k8N4N4N4N4N4N4o5o4p6
4517A373p7QQQ9Q8o4o3k2k1K9L0N7N8o0o1mnnnlmk3P9J31p2j27k5O2O2m9n0JJJJl7l7J15J15
4511A494K0K1r9J03j8j20j13j2Q1k1k1Q1M4n6oR5n0j52lmM6M6M6M6p0p1j9k0K5K5J52n1j00
4506A319J04N2j50n4J49k8k9M1M0j0j0j11j12M1M0J39J39m6m7o2o1j1j1m6m6r6r6J25J25J19
4502A407J19N7m4q8Q0N7m4k7k8n9n9K6K5r0r1J29J29p1p0k0k0M5M6l9l9O3O2k1k2m3m3P5P6
4497A478n9n8qpm4m3P5P4K2K1k9k9m1m1M3M4RRRRm1m0m1m0J9K0J9K0j0j0J76Pj21j9R6pj08
$$ y = [1462, 1470, 1408, 1346, 1284, 1222, 1233, 1244, 1204, 1165, 1251, 1337, 1339, 1341, 1324, 1307, 1307, 1205, 1116, 1195, 1280, 1265, 1277, 1290, 1296, 1303, 1284, 1265, 1330, 1396, 1421, 1446, 1432, 1417, 1364, 1480, 1559, 1535, 1476, 1417, 1362, 1307, 1250, 1362, 1386, 1308, 1352, 1396, 1434, 1472, 1491, 1510, 1478, 1446, 1447, 1447, 1397, 1348, 1272, 1197, 1206, 1215, 1237, 1259, 1332, 1404, 1353, 1302, 1301, 1301, 1268, 1236, 1265, 1294, 1282, 1438, 1439, 1337, 1309, 1281, 1246, 1212, 1204, 1196, 1306, 1416, 1349, 1282, 1315, 1549, 1545, 1440, 1404, 1368, 1339, 1311, 1282, 1254, 1308, 1362, 1416, 1470, 1524, 1578, 1513, 1449, 1373, 1296, 1304, 1312, 1401, 1489, 1425, 1362, 1340, 1319, 1348, 1378, 1435, 1493, 1433, 1372, 1368, 1363, 1358, 1353, 1350, 1346, 1323, 1402, 1533, 1461, 1334, 1309, 1371, 1433, 1384, 1334, 1335, 1336, 1337, 1338, 1301, 1264, 1379, 1494, 1514, 1535, 1436, 1539, 1521, 1401, 1288, 1276, 1357, 1336, 1315, 1396, 1440, 1384, 1378, 1473, 1423, 1271, 1268, 1264, 1310, 1356, 1402, 1448, 1378, 1307, 1288, 1268, 1293, 1318, 1470, 1419, 1319, 1423, 1475, 1325, 1271, 1420, 1392, 1363, 1404, 1444, 1434, 1424, 1313, 1201, 1242, 1282, 1421, 1560, 1514, 1467, 1405, 1344, 1333, 1322, 1276, 1230, 1134, 1038, 1163, 1288, 1407, 1526, 1583, 1539, 1451, 1531, 1588, 1544, 1517, 1489, 1430, 1371, 1397, 1422, 1332, 1241, 1370, 1499, 1428, 1358, 1338, 1318, 1363, 1409, 1370, 1331, 1394, 1456, 1435, 1413, 1370, 1327, 1402, 1478, 1419, 1361, 1353, 1346, 1302, 1259, 1334, 1408, 1430, 1451, 1422, 1393, 1352, 1311, 1354, 1398, 1407, 1416, 1425, 1434, 1393, 1353, 1312, 1272, 1291, 1311, 1330, 1350, 1340, 1330, 1506, 1513, 1392, 1373, 1469, 1462, 1354]
4491A354qK5K4n8J11J6J5l5l5j87j8P7k5R9jn6n5R0R0M9M9kkn4n5L0L0L2L2n3n2jjjjj17j18
4485A188O9O8L2L3L2L2P1P0j16j16KJq3q2J3J3O4O3k0k1R1R2O1m0n2n3j18J17M8n4p7K3O8
4480A419l3k5k5M6M7N3m9m8N3j8j8j1j2qqp2L0L0p1rqRRRRJ06J06K2K1mmq8q9RQO0N9KKq3
4474A426q3J9J9N8N9J10n9j73p2J7J6n5n5J2J13l8j41k5k5K0J9K8K8J3J3J08j28J5J5j2J56
4469A398J0J1P1P0j38l7N6N6M5j23j72p1J3J16N5j14k5P7P0l2k4P6J8J9J8J8L9o3j14j2K0
4465A331K0K6K6RQm2m3m2m3RQK1K1m2m3J03j00p1p0N6N6NON2N3J03J03n4n5lmnmp5K7O0j42
4459A265j35O7k1k0J05J04j6j17l5J68J19q3N0N0k1Q1R3j10j11j1k9k9M2M3m2m2ooM4M5L0
4454A472K9j22j22J0J1m1m0M3M3M3M3J4J5j04j04klj5j5J75k8L5L5j2j2j2j2MNNNpoppJ04
$$ y = [1354, 1346, 1371, 1395, 1337, 1448, 1464, 1479, 1444, 1409, 1222, 1204, 1281, 1256, 1355, 1354, 1298, 1243, 1333, 1423, 1472, 1521, 1519, 1517, 1463, 1408, 1438, 1468, 1500, 1532, 1479, 1427, 1426, 1425, 1424, 1423, 1306, 1188, 1257, 1325, 1357, 1390, 1422, 1454, 1525, 1595, 1479, 1363, 1365, 1366, 1283, 1201, 1214, 1227, 1291, 1354, 1334, 1313, 1404, 1496, 1557, 1517, 1465, 1412, 1294, 1411, 1459, 1405, 1328, 1351, 1419, 1386, 1361, 1336, 1382, 1429, 1482, 1433, 1385, 1438, 1420, 1402, 1391, 1379, 1371, 1363, 1291, 1321, 1351, 1280, 1271, 1263, 1272, 1281, 1290, 1299, 1405, 1511, 1533, 1554, 1550, 1546, 1458, 1369, 1378, 1386, 1446, 1505, 1507, 1509, 1426, 1343, 1362, 1381, 1439, 1498, 1608, 1549, 1376, 1304, 1321, 1337, 1282, 1227, 1239, 1352, 1314, 1173, 1148, 1123, 1143, 1162, 1190, 1218, 1231, 1244, 1352, 1224, 1239, 1254, 1242, 1398, 1408, 1419, 1490, 1560, 1422, 1385, 1441, 1497, 1542, 1419, 1247, 1176, 1189, 1305, 1360, 1246, 1221, 1298, 1368, 1336, 1312, 1388, 1406, 1425, 1443, 1461, 1500, 1437, 1323, 1311, 1331, 1351, 1377, 1403, 1412, 1420, 1378, 1335, 1293, 1250, 1259, 1267, 1288, 1309, 1267, 1224, 1327, 1227, 1156, 1086, 1142, 1198, 1203, 1209, 1261, 1314, 1417, 1520, 1466, 1411, 1408, 1404, 1399, 1395, 1320, 1347, 1407, 1265, 1130, 1197, 1176, 1156, 1261, 1365, 1349, 1232, 1197, 1365, 1484, 1401, 1451, 1501, 1480, 1561, 1654, 1544, 1433, 1422, 1393, 1364, 1406, 1449, 1407, 1365, 1359, 1353, 1397, 1442, 1472, 1501, 1379, 1257, 1267, 1278, 1237, 1197, 1240, 1283, 1326, 1369, 1383, 1398, 1294, 1190, 1188, 1185, 1170, 1155, 1330, 1302, 1337, 1372, 1360, 1348, 1336, 1324, 1328, 1333, 1338, 1343, 1336, 1330, 1323, 1316, 1420]
4449A420J03q2q2K5K6K5K6j8j7L3L4qqqqm6m5m6m5P3P4j1j1k5k6k6k6n6n7noJ00J01n2n1j3
4443A262j3L9L8K9K9K9K9p1p0J4J5KKKKp2p2M7M6J0J1J0J0m6m5NNM2M3R4R3l2l2l3l2m6m5
4438A299L8L9m2m3QQJ5J5o9o9K2K2K3K2j6j6L5L5N4N4l1l1K8K7K0K1J7q5p8R0L3o8j%q3q3
4432A210L5L5L1L1L1L1K8K8k3k3m5m5P4P3j8j7j8j7KLKLp3p2k2k2L1L0K4K4N7m5q2Q6K0J9
4427A386L0L0nnn6n5L2L3l5O7J06o4j07O1K4K4n0m9O4O4m8m7r2RO1m2l1l2M7M6QQPQk3k3L4
4421A385o7J0J0J8J8j69O7J8J8rj0J1J13l4j35R0J92k5k6j9j9l4l5k9k8l1P0J4J3j2j2L9L9
4416A431J5J5m2m2K2p9j17N2N5N5M5n7o5L6J25J25l7l6l6l7N4N3r9r8N7N8k7k7j25j25O5J67
4411A381N2m9K0K1jR9K2p9n3M8o6o5R3R4M3j26j01%mj06k8P3J0RN2N3M6M6N5m6r0P9M4n8m1
$$ y = [1420, 1523, 1441, 1359, 1384, 1410, 1435, 1461, 1443, 1426, 1459, 1493, 1485, 1477, 1469, 1461, 1415, 1370, 1324, 1279, 1352, 1426, 1415, 1404, 1379, 1353, 1327, 1301, 1245, 1188, 1183, 1177, 1277, 1378, 1326, 1275, 1262, 1249, 1288, 1326, 1355, 1384, 1413, 1442, 1371, 1301, 1315, 1330, 1332, 1334, 1336, 1338, 1266, 1194, 1241, 1287, 1297, 1308, 1318, 1328, 1282, 1237, 1242, 1247, 1289, 1332, 1426, 1519, 1487, 1455, 1422, 1390, 1344, 1299, 1337, 1376, 1334, 1291, 1299, 1307, 1322, 1337, 1268, 1199, 1221, 1243, 1266, 1288, 1272, 1256, 1291, 1326, 1380, 1434, 1403, 1372, 1400, 1427, 1447, 1468, 1485, 1400, 1322, 1412, 1445, 1377, 1376, 1376, 1293, 1210, 1245, 1280, 1311, 1342, 1373, 1404, 1432, 1460, 1437, 1414, 1369, 1324, 1398, 1471, 1453, 1436, 1418, 1401, 1403, 1406, 1408, 1411, 1338, 1266, 1244, 1222, 1253, 1283, 1307, 1331, 1388, 1343, 1261, 1347, 1367, 1386, 1416, 1446, 1441, 1436, 1380, 1325, 1357, 1390, 1355, 1422, 1528, 1464, 1357, 1418, 1442, 1466, 1416, 1367, 1431, 1495, 1447, 1400, 1308, 1317, 1378, 1336, 1305, 1273, 1320, 1366, 1374, 1382, 1389, 1397, 1374, 1351, 1385, 1318, 1328, 1338, 1356, 1374, 1205, 1272, 1290, 1308, 1299, 1289, 1300, 1413, 1379, 1244, 1334, 1526, 1501, 1475, 1456, 1437, 1403, 1368, 1339, 1311, 1280, 1350, 1364, 1377, 1365, 1353, 1392, 1431, 1446, 1461, 1419, 1377, 1399, 1320, 1203, 1255, 1310, 1365, 1410, 1353, 1288, 1324, 1449, 1574, 1537, 1501, 1465, 1428, 1482, 1535, 1436, 1338, 1395, 1453, 1426, 1399, 1274, 1149, 1214, 1381, 1433, 1384, 1404, 1425, 1424, 1523, 1545, 1466, 1413, 1461, 1395, 1330, 1423, 1517, 1560, 1434, 1333, 1333, 1329, 1223, 1195, 1268, 1278, 1287, 1339, 1392, 1438, 1484, 1539, 1493, 1403, 1482, 1526, 1468, 1427]
4406A427m1ppJ01jl5l5l5l5j24k2NNP6P7P6P6O9O9O9P0j27j26j26j27K5K5K4K5R0R0j29j30
4401A292O2O2j25j24j3j3J38J39l5l6j9J51M7n3J4J4n7n7opm7m7J4J4l5J34R0R0k5k4K6K6
4396A590k3k4k3k4r3r3rqJ24J24k7j29o9J00jjj2j2L9L9j3j4j3j4l4l4l5l4O9P0m9j50oJ62
4391A373O2O1p8p8OOqrk5P6N3j16p2K9j6j7nmL9J40J27m2m9m9N9N8o5o5Q6Q7p0o9j9j9O8O8
4385A523j18j17o4o4N4N5K1K2K2K2m3m3m2m3L4L5L4L5k7k7N8N7k7k8R0R1klJ9j50j11N8LL
4380A327J5J6j37L3Q2j9n3M9m7N5MNonnol5l4M9N0P2P2j13j13j6j5KJ03J02o7k9P2N8m2P1
4375A495P1p4p4M4M4JJ%Jp2p3M6M6NOp9p9J0J0J0J0k1k0L0L0M2M2N8m2j61RJJ04k1k1o4o5
4369A250N6N7NOj4j4j4j4m9m8O9O9m5m6L9L8MMMMkkQ2Q2n4n4llp7p7k0k0qR3L6L7L5L6M2o0
$$ y = [1427, 1386, 1379, 1372, 1473, 1472, 1437, 1402, 1367, 1332, 1208, 1186, 1191, 1196, 1272, 1349, 1425, 1501, 1570, 1639, 1708, 1778, 1651, 1525, 1399, 1272, 1297, 1322, 1346, 1371, 1461, 1551, 1422, 1292, 1354, 1416, 1291, 1167, 1154, 1141, 1279, 1418, 1383, 1347, 1328, 1479, 1526, 1473, 1487, 1501, 1444, 1387, 1381, 1374, 1327, 1280, 1294, 1308, 1273, 1407, 1497, 1587, 1562, 1538, 1564, 1590, 1567, 1543, 1520, 1496, 1403, 1310, 1301, 1293, 1417, 1541, 1514, 1385, 1316, 1416, 1415, 1414, 1402, 1390, 1429, 1468, 1455, 1441, 1428, 1414, 1380, 1346, 1311, 1277, 1346, 1416, 1367, 1217, 1211, 1373, 1435, 1496, 1418, 1340, 1346, 1352, 1344, 1335, 1310, 1386, 1439, 1323, 1251, 1280, 1264, 1247, 1242, 1238, 1277, 1417, 1544, 1502, 1453, 1404, 1463, 1521, 1456, 1391, 1477, 1564, 1494, 1425, 1406, 1387, 1455, 1523, 1405, 1288, 1224, 1160, 1214, 1269, 1290, 1312, 1334, 1356, 1313, 1270, 1228, 1185, 1219, 1254, 1288, 1323, 1296, 1269, 1327, 1384, 1357, 1329, 1419, 1510, 1508, 1505, 1524, 1374, 1263, 1321, 1324, 1327, 1342, 1358, 1221, 1254, 1336, 1317, 1264, 1313, 1266, 1321, 1325, 1330, 1324, 1319, 1314, 1308, 1273, 1239, 1288, 1338, 1410, 1482, 1369, 1256, 1240, 1225, 1227, 1330, 1432, 1365, 1336, 1408, 1466, 1424, 1495, 1566, 1492, 1418, 1462, 1506, 1507, 1508, 1508, 1509, 1437, 1364, 1410, 1456, 1461, 1467, 1388, 1309, 1319, 1329, 1339, 1349, 1328, 1308, 1338, 1368, 1410, 1452, 1510, 1468, 1307, 1316, 1317, 1421, 1400, 1379, 1315, 1250, 1306, 1363, 1368, 1374, 1360, 1346, 1332, 1318, 1269, 1221, 1290, 1359, 1314, 1268, 1307, 1345, 1349, 1353, 1357, 1361, 1359, 1357, 1439, 1521, 1467, 1413, 1410, 1407, 1330, 1253, 1233, 1213, 1205, 1298, 1334, 1371, 1406, 1442, 1484, 1424]
4363A424j9k0j9j9p0L2J21J21K7p5k4k4j3j15j15j3j1j0o1M1QPM2J43j3j4n7n8J6J6J7J6J5
4358A296J5k9k9L1J33N4m7j19j9P1P0kko6L6J11J1n1n1M7n6KKQPj07nO6l5p3K8%J01o7o8N
4352A268OONo8o8J17J18j1j0j1j1L4L3L4L4K1K1o3o3j6j6j5j6L5L6K9K8O7l4K9p2m5m5L4L3
4347A424l2l3l3l3LLm8m8l5l5J51J50J0J0RJ0kkn2n3j52j53L4L3J08J09m4m4M4M3p1J32O8
4342A471O8l8l8q7q8klk7k6R1R1OOPOJ3J4l7l7p3p3P9P9mmmmr6r5j1j1n9n8N9O0N8N8k7k6
4336A238Q6Q6Q7Q6q3q4l2l3r1r1R5R5O3O3k1k1qrqrK8K8J5J5R2j12LKJ1J0kkR1j12KKKJKK
4330A487n0n0n0n0m1m2J0RJ3J4J3J4K8K9J93rn1n0N5N5rj0r3r4O7O8q4q4j4j3j3j3O6O6O6
4325A433O6o4o5n1n2k2J80J6J6Q9Q8l0k9j23j23l8l8J8J7l3l3k3k2K8K8OOR0R1N2N3o6o5m9
$$ y = [1424, 1405, 1385, 1366, 1347, 1277, 1309, 1430, 1551, 1578, 1503, 1479, 1455, 1442, 1327, 1212, 1199, 1188, 1178, 1117, 1158, 1166, 1173, 1215, 1358, 1345, 1331, 1274, 1216, 1232, 1248, 1265, 1281, 1296, 1311, 1282, 1253, 1284, 1417, 1471, 1424, 1305, 1286, 1357, 1427, 1425, 1423, 1357, 1393, 1504, 1515, 1464, 1413, 1460, 1404, 1406, 1408, 1416, 1423, 1316, 1311, 1377, 1342, 1269, 1297, 1297, 1398, 1331, 1263, 1268, 1274, 1280, 1285, 1217, 1149, 1266, 1384, 1373, 1363, 1352, 1341, 1375, 1408, 1442, 1476, 1497, 1518, 1455, 1392, 1376, 1360, 1345, 1329, 1364, 1400, 1429, 1457, 1524, 1490, 1519, 1447, 1402, 1357, 1391, 1424, 1392, 1359, 1326, 1293, 1296, 1299, 1251, 1203, 1168, 1133, 1284, 1434, 1444, 1454, 1463, 1473, 1471, 1469, 1417, 1364, 1212, 1059, 1093, 1126, 1234, 1343, 1299, 1255, 1299, 1342, 1271, 1403, 1471, 1539, 1501, 1463, 1376, 1288, 1286, 1283, 1256, 1230, 1321, 1412, 1418, 1424, 1431, 1437, 1450, 1464, 1427, 1390, 1317, 1244, 1323, 1402, 1398, 1394, 1390, 1386, 1290, 1195, 1184, 1173, 1114, 1056, 1115, 1175, 1233, 1291, 1264, 1238, 1324, 1410, 1497, 1583, 1500, 1416, 1384, 1351, 1260, 1169, 1264, 1359, 1422, 1485, 1464, 1443, 1435, 1426, 1418, 1409, 1437, 1465, 1480, 1495, 1587, 1475, 1478, 1480, 1491, 1501, 1499, 1497, 1588, 1476, 1478, 1480, 1482, 1483, 1485, 1487, 1437, 1387, 1337, 1287, 1246, 1204, 1214, 1223, 1236, 1250, 1263, 1277, 1305, 1334, 1527, 1518, 1467, 1417, 1472, 1527, 1518, 1508, 1415, 1321, 1388, 1456, 1372, 1288, 1274, 1261, 1248, 1235, 1301, 1367, 1433, 1499, 1435, 1370, 1319, 1267, 1245, 1425, 1441, 1457, 1546, 1634, 1604, 1575, 1452, 1329, 1291, 1253, 1271, 1288, 1255, 1222, 1199, 1177, 1205, 1233, 1239, 1245, 1335, 1426, 1478, 1531, 1465, 1400, 1351]
4319A351m9LKJ2J3J3J2nonnJ0J1m1m0J9K0J9K0LMLMk6k5k6k5M9M9N0M9k9k9K1K1j9k0k0k0
4314A368J7J7J7J7r9j00N3N3k8k9R0R0o2o1K3K4K7K8K8K8q1q1LMJ21J22o4o4o2o2J0J0J53
4308A510m9j9k0m8m8L6L7J6J6r7J05M2M3NNm3m2M2M2K4K3q5q4r5P3Q7j5N4N4p1p1j3j3j3j4
4303A374K0K0N9O0M3j25j32l1m4N7J12n7j26M3P9P9J7j51j01O8lmQPk1k2L0K9Q0P9K9K8rr
4298A486j28j27nmM6M7k2k1O3O3p5p6P7P6k2k1r0J2J05o5j3j4N6N6N6N6O5O6j20j21j3j4o4
4293A315o4J02J03J8J8m5m6P3P3j09j09k5k5o3o3Q9J91P0r9j05mOOO3O2l3l2l3l3J0RK6J28
4288A474O4j05OPr7P1K7K6m0m0J0J1l1l1K0K0noooP7P8p5p4j8j8J00J01J3J4p1p0j1j1P4P4
4282A552m3m4m3m4o4o5N4N3O6O7q6q6nmnmM1M1j0j0M9N0j03O7Q8j3K8p4k1k1k7k7M4M4pj08
$$ y = [1351, 1302, 1305, 1307, 1319, 1332, 1345, 1357, 1352, 1346, 1341, 1336, 1346, 1357, 1316, 1276, 1295, 1315, 1334, 1354, 1357, 1361, 1364, 1368, 1342, 1317, 1291, 1266, 1315, 1364, 1414, 1463, 1434, 1405, 1426, 1447, 1428, 1408, 1388, 1368, 1385, 1402, 1419, 1436, 1337, 1237, 1290, 1343, 1315, 1286, 1376, 1466, 1404, 1343, 1366, 1390, 1417, 1445, 1473, 1501, 1420, 1339, 1342, 1346, 1467, 1589, 1525, 1461, 1399, 1337, 1347, 1357, 1510, 1461, 1442, 1422, 1374, 1326, 1362, 1399, 1415, 1431, 1334, 1439, 1481, 1524, 1529, 1534, 1491, 1449, 1491, 1533, 1557, 1580, 1495, 1411, 1316, 1389, 1476, 1461, 1515, 1569, 1498, 1427, 1414, 1401, 1388, 1374, 1394, 1414, 1473, 1533, 1576, 1451, 1319, 1288, 1244, 1301, 1413, 1356, 1230, 1273, 1352, 1431, 1448, 1297, 1196, 1264, 1261, 1257, 1265, 1272, 1251, 1229, 1259, 1288, 1368, 1447, 1476, 1504, 1495, 1486, 1358, 1231, 1226, 1222, 1268, 1315, 1293, 1272, 1335, 1398, 1323, 1247, 1324, 1400, 1378, 1357, 1267, 1279, 1384, 1319, 1306, 1292, 1348, 1404, 1460, 1516, 1581, 1647, 1527, 1406, 1393, 1379, 1315, 1251, 1353, 1456, 1474, 1492, 1447, 1401, 1474, 1547, 1438, 1329, 1304, 1279, 1216, 1153, 1242, 1433, 1503, 1404, 1299, 1295, 1301, 1307, 1370, 1432, 1399, 1367, 1334, 1301, 1311, 1320, 1346, 1474, 1538, 1433, 1439, 1446, 1349, 1420, 1447, 1473, 1433, 1393, 1403, 1414, 1383, 1352, 1372, 1392, 1387, 1381, 1375, 1369, 1446, 1524, 1449, 1375, 1357, 1339, 1439, 1540, 1553, 1567, 1496, 1426, 1415, 1404, 1478, 1552, 1509, 1465, 1422, 1378, 1314, 1249, 1303, 1356, 1422, 1489, 1403, 1317, 1312, 1308, 1303, 1299, 1340, 1381, 1371, 1361, 1410, 1460, 1357, 1424, 1512, 1499, 1527, 1453, 1432, 1411, 1384, 1357, 1401, 1445, 1438, 1330]
4277A330n9J09J10QN1n1q4q5OPN6N7j8j8j8j8l2l2N2N2k0j9k0k0K1K1k9l0j4j4j3j4M9N0M9
4272A420M9K0K0K0K0o7o8o7o7k1k1l1J38J%O2O3J1J1p3p3m0m0M4M4m9m9M2M2k6P5lj04J5J16
4266A414N9O0j47m5P7r2ONnnK5K6k5k5J6J6l5l4N1N1PPp6K6N4N3kln9o0Q3j8j37l5K2K2K9
4261A306K8m0m0N5J56ONJ8q3p7p8k3P8K2K3K8K8P4P4J33j03k20n1J31l8j06O4QRO1O1j14j15
4256A280j45K3J98R7p6j78m3m2R5R4O8l5P4P4J6J7j7j8p4K7j3j4qpmlM7M8m4m4J7J7j34L6
4250A329Lr8J5J17J04o5m5N6L9M0k0k0j27k6L7L8M3M4j8j7nnk29k6J2J2J60J60k6k6k5k5k5
4245A381k5K2K2k8k9P0P1K0K0k0j9j9j9Q4Q4%%m6m6m6m6J5J6KLJ35o7k19j6J8J9L1L1L4L3
4240A466L4L4NNp9p9j4j4j4j4q9q8R7R7M3M3p5p5k5k6k5k5N9O0j05R7RRK2K1M7M8mlM4M4p5
$$ y = [1330, 1271, 1380, 1490, 1498, 1549, 1498, 1414, 1329, 1335, 1342, 1398, 1455, 1437, 1419, 1401, 1383, 1351, 1319, 1371, 1423, 1403, 1384, 1364, 1344, 1365, 1386, 1357, 1327, 1313, 1299, 1286, 1272, 1321, 1371, 1420, 1469, 1489, 1509, 1529, 1549, 1482, 1414, 1347, 1280, 1259, 1238, 1207, 1345, 1346, 1346, 1408, 1471, 1482, 1493, 1420, 1347, 1307, 1267, 1311, 1355, 1306, 1257, 1299, 1341, 1315, 1390, 1387, 1283, 1298, 1414, 1473, 1533, 1386, 1341, 1418, 1326, 1332, 1337, 1332, 1327, 1352, 1378, 1353, 1328, 1344, 1360, 1325, 1291, 1342, 1393, 1400, 1407, 1331, 1357, 1411, 1464, 1462, 1459, 1400, 1340, 1423, 1405, 1268, 1233, 1255, 1277, 1306, 1334, 1294, 1254, 1309, 1465, 1471, 1476, 1494, 1411, 1334, 1256, 1233, 1311, 1333, 1356, 1384, 1412, 1486, 1560, 1693, 1590, 1370, 1319, 1450, 1412, 1306, 1370, 1378, 1387, 1448, 1509, 1395, 1280, 1135, 1158, 1356, 1453, 1377, 1199, 1156, 1114, 1209, 1303, 1371, 1336, 1410, 1484, 1500, 1517, 1500, 1482, 1408, 1435, 1422, 1408, 1400, 1393, 1389, 1386, 1433, 1481, 1437, 1393, 1410, 1427, 1293, 1329, 1332, 1234, 1249, 1366, 1470, 1405, 1360, 1416, 1455, 1495, 1475, 1455, 1328, 1302, 1339, 1377, 1420, 1464, 1446, 1429, 1424, 1419, 1190, 1164, 1176, 1188, 1348, 1508, 1482, 1456, 1431, 1406, 1381, 1356, 1378, 1400, 1372, 1343, 1413, 1484, 1504, 1524, 1504, 1485, 1466, 1447, 1531, 1615, 1615, 1615, 1569, 1523, 1477, 1431, 1446, 1462, 1464, 1467, 1602, 1535, 1316, 1300, 1318, 1337, 1368, 1399, 1433, 1466, 1500, 1534, 1539, 1544, 1465, 1386, 1372, 1358, 1344, 1330, 1241, 1153, 1250, 1347, 1390, 1433, 1358, 1283, 1258, 1232, 1207, 1182, 1241, 1301, 1196, 1293, 1302, 1311, 1333, 1354, 1401, 1449, 1445, 1442, 1486, 1530, 1455]
4234A455p4N8N9k7k6JKj13R0J0J0K2K3k3k3j0j0k8J75J0J0QRp5p6k8k8K2K3J0J1J1J1lln3
4229A430n4L1L1L1L1j0j0o0o1j8j8K6K6N3m9q0Q9n7M4R3p6m6m6l4J36N2N2n6n6j00r9Q6Q6
4224A367J11J12m7k16j5j4N9O0J5J5p0o9O5O5J5J5p5p4k3k4Q8Q7l0l1J7J7J6J7j4j4L7L7m2
4219A457m2QQm9n0JKR9R9J5J5l1l2l1l2m7m8L7L7P4P4j1j1n1n1n1n1NNNNN0M9l5l5M0M0j1
4213A456j1J3J2J2J3J6J7J7J6j03j04j9j9l1l1J9K0J05J05j3j3l3l3l3l3P8P8K7K7k2k1p2
4208A440p2j8j8j8j8j0j0M1M1K2K1K2K2pon8n7L9L9Q9R0l8l8J2J3%%p2p2j09R3R7R8m6m5l2
4203A435l3j73L0O8O8o0o0R2R2n1n0L4L4ppM4M3m1m0m1m1R5R6n7n7l5l6M9M9k5k5O0N9N2N2
4197A613j34j34m9n0m9n0L1L1L0L1R2R2k7k6m0l9P8P8m9m9JKj7j7j7j7NNn8J45N6N6n0n0k
$$ y = [1455, 1381, 1439, 1498, 1471, 1445, 1446, 1448, 1335, 1425, 1435, 1445, 1467, 1490, 1467, 1444, 1434, 1424, 1396, 1571, 1581, 1591, 1599, 1608, 1533, 1457, 1429, 1401, 1423, 1446, 1456, 1467, 1478, 1489, 1486, 1483, 1430, 1376, 1407, 1438, 1469, 1500, 1490, 1480, 1420, 1359, 1341, 1323, 1349, 1375, 1428, 1379, 1299, 1388, 1331, 1375, 1468, 1392, 1346, 1300, 1266, 1402, 1454, 1506, 1450, 1394, 1294, 1195, 1281, 1367, 1478, 1590, 1543, 1327, 1312, 1298, 1357, 1417, 1432, 1447, 1377, 1308, 1373, 1438, 1453, 1468, 1393, 1319, 1296, 1272, 1360, 1447, 1417, 1386, 1403, 1420, 1436, 1453, 1439, 1425, 1462, 1499, 1457, 1415, 1423, 1431, 1382, 1332, 1333, 1335, 1434, 1533, 1548, 1563, 1532, 1500, 1469, 1437, 1390, 1342, 1379, 1416, 1490, 1564, 1553, 1542, 1491, 1440, 1389, 1338, 1343, 1348, 1353, 1358, 1408, 1457, 1422, 1387, 1427, 1467, 1456, 1445, 1458, 1470, 1482, 1495, 1511, 1528, 1545, 1561, 1458, 1354, 1335, 1316, 1285, 1254, 1273, 1293, 1398, 1503, 1490, 1477, 1444, 1411, 1378, 1345, 1423, 1501, 1528, 1555, 1533, 1512, 1440, 1368, 1350, 1332, 1314, 1296, 1286, 1276, 1317, 1358, 1380, 1401, 1423, 1445, 1438, 1432, 1374, 1317, 1356, 1395, 1484, 1574, 1536, 1498, 1510, 1523, 1523, 1523, 1451, 1379, 1270, 1363, 1460, 1558, 1512, 1467, 1435, 1402, 1229, 1259, 1327, 1395, 1335, 1275, 1367, 1459, 1408, 1358, 1392, 1426, 1419, 1412, 1456, 1499, 1458, 1418, 1377, 1336, 1431, 1527, 1470, 1413, 1378, 1342, 1391, 1440, 1415, 1390, 1450, 1509, 1561, 1613, 1479, 1345, 1296, 1246, 1197, 1147, 1178, 1209, 1239, 1270, 1362, 1454, 1427, 1401, 1361, 1322, 1400, 1478, 1429, 1380, 1381, 1383, 1366, 1349, 1332, 1315, 1320, 1325, 1267, 1412, 1468, 1524, 1474, 1424, 1422]
4192A422kkkj8j9K0K0Q0j23rrqpqql8l9k7k8j4J56M3n8k8J40J35l5K3K3p3p2k1k2j5j5o7L4
4186A329Q5j6ppj3j3L8L8L8L8m9n0JJM6M6M6M6p7p8q4q4L3p0j2j2K9K9L6L5n9M2P0O9k4k4
4181A416K0j49J2J2Q0Q0j5j16R2R3LMJ0r2MMLMq3J9l9l8K7K7K7K7k1k1M6n5j25M4O1O1O7O8
4175A557n1n1j04j04j9j9Q9R0L9L8n3n3N5N4N7j12ppn3J16J5J4m1j42J0J11k9l0K8K8RJ0j32
4170A313l0opPOr6MQ9j2k2k1J6J6R2ro0M1L4L3M1M0k0j9L1L1j04j04Jj67j14N6J02J01pqo5
4165A183L6K3K4l2l2J21m9m8J20J4J3L1p1J27J27K5p6j11j10O8O9l3l2l9m0Q9j2j3Q9P8P8
4160A617l4l4n1n2O7O7n4n3n4n4L0K9J9J8J42k8q5q5j36j37P6P7L3o8O7O7K6p6o9L2M6J47
4155A490L6o6l1l1M8M8PPj11j10j9j8L2L2O3O3N6N7l5j36M9J51o5o6j16j5llLLP8P9L3L4o5
$$ y = [1422, 1420, 1418, 1416, 1398, 1379, 1399, 1419, 1499, 1376, 1367, 1358, 1350, 1343, 1335, 1327, 1289, 1250, 1223, 1195, 1181, 1337, 1380, 1322, 1294, 1434, 1569, 1534, 1557, 1580, 1507, 1435, 1414, 1392, 1377, 1362, 1295, 1329, 1414, 1398, 1391, 1384, 1371, 1358, 1396, 1434, 1472, 1510, 1461, 1411, 1412, 1413, 1459, 1505, 1551, 1597, 1520, 1442, 1358, 1274, 1307, 1237, 1225, 1213, 1242, 1271, 1307, 1342, 1283, 1325, 1395, 1464, 1440, 1416, 1436, 1287, 1299, 1311, 1391, 1471, 1456, 1340, 1432, 1525, 1528, 1532, 1542, 1450, 1454, 1458, 1461, 1465, 1382, 1401, 1362, 1324, 1351, 1378, 1405, 1432, 1411, 1390, 1436, 1381, 1256, 1300, 1361, 1422, 1489, 1557, 1506, 1455, 1351, 1247, 1228, 1209, 1298, 1388, 1427, 1465, 1412, 1359, 1414, 1468, 1525, 1413, 1406, 1399, 1346, 1462, 1477, 1491, 1450, 1308, 1318, 1429, 1400, 1370, 1398, 1426, 1435, 1445, 1313, 1283, 1277, 1270, 1277, 1283, 1187, 1191, 1280, 1268, 1246, 1225, 1241, 1257, 1349, 1340, 1280, 1321, 1355, 1388, 1429, 1469, 1449, 1430, 1461, 1492, 1388, 1284, 1285, 1118, 1004, 1060, 1162, 1263, 1256, 1248, 1183, 1219, 1242, 1266, 1234, 1202, 1323, 1274, 1226, 1346, 1360, 1373, 1404, 1333, 1460, 1587, 1612, 1536, 1425, 1315, 1383, 1452, 1419, 1387, 1348, 1308, 1397, 1385, 1372, 1461, 1539, 1617, 1583, 1549, 1498, 1446, 1513, 1580, 1526, 1473, 1419, 1365, 1395, 1424, 1443, 1461, 1603, 1575, 1490, 1405, 1269, 1132, 1208, 1285, 1318, 1250, 1317, 1384, 1410, 1334, 1265, 1297, 1343, 1490, 1526, 1460, 1429, 1398, 1446, 1494, 1501, 1508, 1397, 1287, 1268, 1250, 1282, 1314, 1377, 1440, 1496, 1553, 1518, 1382, 1431, 1582, 1517, 1451, 1335, 1320, 1317, 1314, 1317, 1320, 1398, 1477, 1510, 1544, 1479]
4150A479L7J19j18j36l6M5M5k2k2k2k2j4j3k0Q1l9l9l3l2M7M8M7M8j7j6N8N7J48k2j74j73
4145A289L0J33K4K4j9k0qj08j01Jj9j8O5l6J4J5J05Lm7N5M0M1M0M1L8o3j02O8j8j8qpm6m5
4140A343n2N0J7J8J38L7p1L1k6k7k3P8k6j94j3J56J05o4j23M7M8n3p2p1J8J19j6j6M0M1lk
4135A434q7q8RRn4M7J52N0mmJ0J1J7J7j28k7P4P5q3J9OON6m5j23k2L1J32N8j10L2L3P2P3m3
4130A605m4m3m4l8l8l8l8J24J24%j69j0rL0L1J53J53l3l3j17j16l2l2P8P8m0m0J9J8l2l2M8
4125A483M7M7M7L7L7n4n4%j00j49J9J51j7LLj8j8j8j8k6k5m3J26k4j26J5J5J26m4l4l3QQQ
4120A379QQ9R0k9k8%%j%K6K6K5K6j8j7j8j8m4m4PPK9K8j23j23KJN2N3L9M0m5m5n5n4N3N3J32
4114A503l8k7k7L1L1n4n4J3J3J3J3m0m0J0J1j1j1j0j1J0J1J22J22qj09r4J08P4j29j43m2P9
$$ y = [1479, 1516, 1635, 1517, 1381, 1345, 1390, 1435, 1413, 1391, 1369, 1347, 1333, 1320, 1300, 1381, 1342, 1303, 1270, 1238, 1285, 1333, 1380, 1428, 1411, 1395, 1453, 1510, 1658, 1636, 1462, 1289, 1319, 1452, 1476, 1500, 1481, 1461, 1453, 1345, 1244, 1245, 1226, 1208, 1273, 1237, 1251, 1266, 1371, 1374, 1327, 1382, 1422, 1463, 1503, 1544, 1582, 1519, 1417, 1485, 1467, 1449, 1441, 1434, 1388, 1343, 1291, 1341, 1358, 1376, 1514, 1551, 1480, 1511, 1485, 1458, 1435, 1513, 1487, 1293, 1280, 1436, 1541, 1477, 1354, 1401, 1449, 1396, 1324, 1253, 1271, 1390, 1374, 1358, 1398, 1439, 1436, 1434, 1347, 1259, 1268, 1277, 1223, 1270, 1422, 1472, 1468, 1464, 1474, 1485, 1502, 1519, 1391, 1364, 1438, 1513, 1430, 1449, 1455, 1461, 1517, 1472, 1349, 1327, 1358, 1490, 1548, 1438, 1470, 1503, 1575, 1648, 1605, 1561, 1518, 1474, 1436, 1398, 1360, 1322, 1446, 1570, 1570, 1401, 1391, 1382, 1412, 1443, 1596, 1749, 1716, 1683, 1566, 1450, 1418, 1386, 1464, 1542, 1502, 1462, 1481, 1499, 1467, 1435, 1483, 1530, 1577, 1624, 1661, 1698, 1644, 1590, 1590, 1490, 1341, 1360, 1511, 1494, 1497, 1500, 1482, 1464, 1446, 1428, 1402, 1377, 1334, 1460, 1436, 1310, 1325, 1340, 1466, 1422, 1388, 1355, 1363, 1371, 1379, 1387, 1476, 1566, 1537, 1509, 1509, 1509, 1508, 1508, 1534, 1560, 1585, 1611, 1593, 1576, 1558, 1540, 1496, 1452, 1459, 1466, 1495, 1523, 1400, 1277, 1279, 1280, 1332, 1385, 1424, 1464, 1419, 1374, 1319, 1265, 1318, 1371, 1503, 1465, 1438, 1411, 1442, 1473, 1419, 1365, 1378, 1391, 1404, 1417, 1377, 1337, 1347, 1358, 1347, 1336, 1326, 1315, 1325, 1336, 1458, 1580, 1572, 1463, 1369, 1477, 1551, 1422, 1279, 1237, 1316]
4109A316P9l3l3P6P6P6P5n7n7n7n7L6L7j4j3L7L8n9n9J29p4j37O5J31p1q7J5RQp0o9LLLLJ06
4103A374J05j3j2J6J5K9K8j35O8m7m6OON7N7k2k2p3p3M8M7l7l7M2M2m3m3Q3Q3L2L3j9j8j8
4098A513j8q9q9l8l8J05J06K3p8q0J22J23q1m5N7j4j3n8n8K7K7jjn2n2K2K1K1K1p2p2Q0Q0
4093A399n5n6mnllmlJ8J8o7o6N4N4N5N4j8j7j8j8o7o7Q4Q5K4K5K4K4M5M4M4M5m9m9m8m9KJ
4087A433KKo5o5N3N3j4j5j28P4N8N9K0K0j03j04n3n3J71J71J8J9l0l1j49j49O4O3J3J2J3J2
4082A371J3J2q2q3J03J04o5o5o5o5N1N1N1N1P4P4j1j1l0l0l0l0Q5Q5l4l3k6k7k6k6K1K1K1
4077A449K0J4J3J28p6q7q7j6j6k0k1O3O4L2L3j9j8J6J5O6O7n7n8oopopok0k0k1k0l3l2Q5Q5
4072A491N0N1l5l4K3K4k7k7l4l5l4l4L8L9L8L9LLo6L5l2k35k6P5R3pO2m0q3q4R6R6J1J1l9
$$ y = [1316, 1395, 1362, 1329, 1405, 1481, 1557, 1632, 1575, 1518, 1461, 1404, 1440, 1477, 1463, 1450, 1487, 1525, 1466, 1407, 1536, 1462, 1325, 1390, 1521, 1450, 1363, 1378, 1387, 1395, 1325, 1256, 1259, 1262, 1265, 1268, 1374, 1479, 1466, 1454, 1470, 1485, 1514, 1542, 1407, 1475, 1428, 1382, 1388, 1394, 1451, 1508, 1486, 1464, 1391, 1318, 1366, 1413, 1376, 1339, 1381, 1423, 1380, 1337, 1420, 1503, 1535, 1568, 1549, 1531, 1513, 1495, 1406, 1317, 1279, 1241, 1346, 1452, 1475, 1397, 1317, 1439, 1562, 1481, 1436, 1493, 1479, 1466, 1408, 1350, 1377, 1404, 1403, 1402, 1350, 1298, 1320, 1341, 1362, 1383, 1311, 1239, 1319, 1399, 1344, 1288, 1284, 1279, 1276, 1273, 1269, 1266, 1284, 1302, 1235, 1169, 1223, 1277, 1332, 1386, 1368, 1351, 1333, 1315, 1248, 1181, 1265, 1350, 1374, 1399, 1423, 1447, 1492, 1536, 1580, 1625, 1576, 1527, 1479, 1430, 1432, 1433, 1435, 1437, 1372, 1307, 1360, 1413, 1399, 1384, 1256, 1330, 1388, 1447, 1467, 1487, 1384, 1280, 1227, 1174, 1345, 1516, 1534, 1553, 1523, 1492, 1343, 1194, 1258, 1321, 1334, 1346, 1359, 1371, 1384, 1396, 1314, 1231, 1334, 1438, 1373, 1308, 1243, 1178, 1229, 1280, 1331, 1382, 1456, 1530, 1519, 1508, 1478, 1448, 1418, 1388, 1473, 1558, 1524, 1491, 1465, 1438, 1412, 1386, 1407, 1428, 1449, 1469, 1483, 1496, 1624, 1548, 1461, 1374, 1358, 1342, 1322, 1301, 1364, 1428, 1460, 1493, 1474, 1456, 1472, 1487, 1553, 1620, 1563, 1505, 1499, 1493, 1486, 1480, 1473, 1467, 1447, 1427, 1406, 1386, 1353, 1321, 1406, 1491, 1541, 1592, 1557, 1523, 1546, 1570, 1543, 1516, 1482, 1447, 1413, 1379, 1417, 1456, 1494, 1533, 1536, 1539, 1473, 1508, 1476, 1241, 1215, 1290, 1383, 1376, 1438, 1398, 1315, 1231, 1327, 1423, 1434, 1445, 1406]
4066A406l9m4m4M1M1QPN8N9n2n1L3L3MMN5N4m4m4m5m4L6L6L5L6O3O4n5n5l6l7J5J5k2k1K9
4061A499K9k4k5K6K7m2m1r2r3R3R3k4j25jK01P7j26QQnnl8l8J3J3k4k4K7K7J07J07j12j13
4056A403MLJ22J22m2m1J23q0j9j8j01JO1j41p7K4P8P8%%K0K0l1l0llM8M8K4K3r4r5j6j6j6
4051A379j6m4m5R5R5Q2j20P8P8k0k0O5O4n3n3n3n4m1m2P7P6L2L2j9j9m3m2m2m2M6M6M7M6j3
4045A557j2j3j3j4j5j4j5ONONL2L2n3n2K9K8m3m3j39O3K49M7k2k2l5l5m7m6N9N9M6j58j06
4040A326R6L7L8%jj4j4j4j4L5L6j6j5k7k7N8N7K9K9n6n6J7J7J8J7L1L1n4n4PPOPk9k9k9k9
4035A421o9o9Q3Q3o6o6j5j5P8P8K7K8m2m1P7P7j9j8j8j8j4j4j4j4QQRQL6L7j4j5L7L6m8m8
4029A494j6j5j6j6k1k1k1k1L3L3L3L2J0J0p5p5mnQ0Q0j4j4J04J04l4l3l4l4n5n5n5n5J24J23
$$ y = [1406, 1367, 1323, 1279, 1320, 1361, 1369, 1376, 1434, 1493, 1441, 1390, 1423, 1456, 1460, 1464, 1519, 1573, 1529, 1485, 1440, 1396, 1432, 1468, 1503, 1539, 1602, 1666, 1611, 1556, 1520, 1483, 1498, 1513, 1491, 1470, 1499, 1528, 1504, 1479, 1505, 1532, 1490, 1449, 1357, 1264, 1357, 1450, 1426, 1301, 1300, 1501, 1578, 1452, 1460, 1468, 1463, 1458, 1420, 1382, 1395, 1408, 1384, 1360, 1387, 1414, 1521, 1628, 1516, 1403, 1407, 1410, 1532, 1654, 1612, 1571, 1694, 1614, 1595, 1577, 1476, 1477, 1538, 1397, 1320, 1344, 1422, 1500, 1500, 1500, 1520, 1540, 1509, 1479, 1476, 1473, 1521, 1569, 1593, 1616, 1522, 1427, 1411, 1395, 1379, 1363, 1319, 1274, 1369, 1464, 1546, 1426, 1504, 1582, 1562, 1542, 1607, 1671, 1618, 1565, 1512, 1458, 1417, 1375, 1452, 1528, 1560, 1592, 1573, 1554, 1511, 1469, 1427, 1385, 1431, 1477, 1524, 1570, 1557, 1545, 1532, 1519, 1505, 1490, 1476, 1461, 1467, 1472, 1478, 1483, 1515, 1547, 1494, 1442, 1471, 1499, 1456, 1413, 1274, 1337, 1586, 1633, 1611, 1589, 1554, 1519, 1472, 1426, 1485, 1544, 1590, 1432, 1326, 1422, 1459, 1497, 1497, 1496, 1482, 1468, 1454, 1440, 1475, 1511, 1495, 1480, 1453, 1426, 1484, 1541, 1570, 1599, 1543, 1487, 1504, 1521, 1539, 1556, 1587, 1618, 1564, 1510, 1517, 1524, 1530, 1537, 1508, 1479, 1450, 1421, 1352, 1283, 1366, 1449, 1383, 1317, 1302, 1287, 1365, 1443, 1470, 1498, 1456, 1415, 1492, 1569, 1550, 1532, 1514, 1496, 1482, 1468, 1454, 1440, 1448, 1456, 1465, 1473, 1509, 1546, 1532, 1517, 1554, 1590, 1542, 1494, 1478, 1463, 1447, 1431, 1410, 1389, 1368, 1347, 1380, 1413, 1446, 1478, 1488, 1498, 1423, 1348, 1344, 1339, 1419, 1499, 1485, 1471, 1575, 1679, 1645, 1612, 1578, 1544, 1489, 1434, 1379, 1324, 1448, 1571]
4024A571P3P3o5o4o5o4N6N7k9k8k8k8p8p9Q9Q9Q9Q8n7n8n8n8K5K6K6K5O4O3k1k1m3m3PPmm
4018A533q9q9NONN%%%%J5J6J5J5L3L4L3L3L7L7q2q1rqP6P6K2K1o2o3r4r5l3l3o3J05O1O1L1
4012A474L2k0j9n3n2lkL3L3L3L2k3k4K8K7j4j4r8r9O4O5k1k0L8L8L8L7p0p0k0j9L9M0L9L9
4007A488P7P7p5p5l5l5l4l5J94J94n9n9K6K6n9n9J7J7J7J7l8l8l8l8LKl8l8j9J50J11J1qq
4002A639r9r8K9K9J8J9N2j16q5J7Kj00j10j10oJ62J76P3j4j5O3O4kjn2n2j04j04M8M8J3J2
3997A396J2J3J8J9J8J9PPm3m4k5k6K5K5M4M3qqL2L1L2L1r4r4K4K4J4J3J28p5L7L7k7k6q5q6
3992A408K0K1R4j09n1N0k5k6j8j9j5j4j5j4N7N7N7N8%JJJL8L7L8L8r5r5J7J8J13J2k04jJ32
3986A567L0J6J6j3j3l2O9P9j24j17Q5LLJ6J5J5J6o9o9J0J0O0O1m9m8l0j31p8J26O8j34K2K1
$$ y = [1571, 1644, 1717, 1652, 1588, 1523, 1459, 1515, 1572, 1543, 1515, 1487, 1459, 1381, 1302, 1391, 1480, 1569, 1657, 1600, 1542, 1484, 1426, 1451, 1477, 1503, 1528, 1592, 1655, 1634, 1613, 1570, 1527, 1534, 1541, 1537, 1533, 1444, 1355, 1360, 1366, 1371, 1376, 1376, 1376, 1376, 1376, 1391, 1407, 1422, 1437, 1470, 1504, 1537, 1570, 1607, 1644, 1562, 1481, 1472, 1464, 1540, 1616, 1638, 1659, 1597, 1534, 1440, 1345, 1312, 1279, 1216, 1321, 1382, 1443, 1474, 1506, 1486, 1467, 1414, 1362, 1359, 1357, 1390, 1423, 1456, 1488, 1465, 1441, 1469, 1496, 1482, 1468, 1370, 1271, 1335, 1400, 1379, 1359, 1397, 1435, 1473, 1510, 1440, 1370, 1350, 1331, 1370, 1410, 1449, 1488, 1565, 1642, 1567, 1492, 1457, 1422, 1388, 1353, 1547, 1741, 1682, 1623, 1649, 1675, 1616, 1557, 1574, 1591, 1608, 1625, 1587, 1549, 1511, 1473, 1476, 1478, 1440, 1402, 1383, 1533, 1644, 1655, 1647, 1639, 1540, 1442, 1471, 1500, 1518, 1537, 1589, 1473, 1388, 1405, 1407, 1307, 1197, 1087, 1081, 1243, 1419, 1492, 1478, 1463, 1526, 1590, 1588, 1587, 1535, 1483, 1379, 1275, 1323, 1371, 1384, 1396, 1408, 1421, 1439, 1458, 1476, 1495, 1502, 1509, 1466, 1422, 1397, 1371, 1396, 1421, 1465, 1508, 1500, 1492, 1524, 1555, 1587, 1618, 1524, 1430, 1454, 1478, 1492, 1505, 1633, 1558, 1595, 1632, 1605, 1579, 1494, 1408, 1428, 1449, 1543, 1434, 1383, 1433, 1408, 1382, 1364, 1345, 1330, 1316, 1301, 1287, 1344, 1401, 1458, 1516, 1516, 1517, 1518, 1519, 1557, 1594, 1632, 1670, 1575, 1480, 1497, 1515, 1628, 1640, 1436, 1435, 1567, 1597, 1613, 1629, 1616, 1603, 1571, 1640, 1719, 1595, 1478, 1563, 1566, 1569, 1585, 1600, 1615, 1631, 1562, 1493, 1503, 1513, 1573, 1634, 1585, 1537, 1507, 1376, 1298, 1424, 1492, 1358, 1380, 1401]
3981A401RRJ3J4J3J3n7n6O1O2O4O5J4J4l5l6J5J6k2k2j42O1J00kj6j6N0N0o7o8QQm2m3m4m5
3976A347OOj9j8O6O5M3M2l5l6p0L0L1L1k0Q1L1p0o1o0N6J57P6k5m7m6k2k1L6o5p9p9jjO5O6
3970A460M4n7jJ00J45M3r1r1m0j42R4R4RRk2Q0k9k8J9J9o6o5lmo6L4J37L6q7q7k5k6p6R3N9
3965A469m3n9n9P0P0K0K0k0j9q3J9N5m6NJ06J05Ln1n2J3J2l8l9K6K6K6K6k5k6p6p6M9N0o9
3960A389L3J67jn2n2K3K3J3J2K8j41r1P9Q2Q3P2k9p9K3N4j14nnp2K9KLJ20J21Kr8m2m2q5q4
3954A366%%J0J1J0J1J03J04j16j16m0m1J12J12noPPq5J17KLO8O7q4q4J2J3J3J2j01j01Q4Q5
3949A550K9K8Q0P9o6o6J8J8N2N3m5m5J53n0j11rJ4J5K1K1l0l0K0K0qqqqk5k6k5k5q9q8J31
3944A540J31J08J07N7N7q0q1K8J29M2K46J52K54L17J14J70l4k19j18K0K22L59L60K96j77k35
$$ y = [1401, 1410, 1419, 1432, 1446, 1459, 1472, 1415, 1359, 1420, 1482, 1546, 1611, 1625, 1639, 1604, 1568, 1583, 1599, 1577, 1555, 1413, 1474, 1574, 1572, 1556, 1540, 1590, 1640, 1573, 1505, 1513, 1521, 1479, 1436, 1392, 1347, 1353, 1359, 1340, 1322, 1388, 1453, 1496, 1538, 1503, 1467, 1397, 1427, 1458, 1489, 1469, 1550, 1581, 1511, 1450, 1390, 1446, 1603, 1679, 1654, 1607, 1561, 1539, 1518, 1554, 1489, 1410, 1331, 1330, 1329, 1394, 1460, 1504, 1447, 1446, 1546, 1691, 1734, 1643, 1552, 1512, 1370, 1464, 1558, 1567, 1576, 1554, 1634, 1605, 1577, 1596, 1615, 1549, 1484, 1481, 1477, 1411, 1445, 1582, 1618, 1531, 1444, 1419, 1393, 1317, 1410, 1469, 1426, 1367, 1308, 1378, 1448, 1468, 1488, 1468, 1449, 1366, 1385, 1440, 1394, 1399, 1505, 1610, 1613, 1562, 1510, 1523, 1535, 1497, 1458, 1484, 1510, 1536, 1562, 1537, 1511, 1435, 1359, 1408, 1458, 1389, 1422, 1589, 1588, 1536, 1484, 1507, 1530, 1543, 1555, 1583, 1442, 1351, 1430, 1512, 1595, 1667, 1638, 1559, 1582, 1636, 1522, 1517, 1512, 1440, 1469, 1471, 1474, 1594, 1715, 1717, 1619, 1577, 1535, 1450, 1366, 1366, 1366, 1376, 1387, 1397, 1408, 1511, 1615, 1499, 1383, 1343, 1302, 1414, 1526, 1521, 1515, 1522, 1529, 1444, 1561, 1563, 1566, 1634, 1701, 1617, 1533, 1545, 1558, 1571, 1583, 1482, 1381, 1465, 1550, 1579, 1607, 1687, 1766, 1700, 1634, 1652, 1670, 1722, 1775, 1730, 1685, 1838, 1788, 1677, 1668, 1682, 1697, 1718, 1739, 1709, 1679, 1699, 1719, 1711, 1703, 1695, 1687, 1662, 1636, 1611, 1586, 1497, 1409, 1540, 1671, 1779, 1886, 1943, 2000, 1920, 1839, 1867, 1996, 2038, 2284, 2436, 2690, 3007, 3121, 3291, 3257, 3038, 2920, 2940, 3162, 3521, 3881, 4177, 4000, 3765]
3940C765l3J75P3j69o9j54M7J87K88N2k87m21l20k38l5k5k28k20k20j76j77P7P7j2j2j2j2
3936A921P3P4K2K3R9R8J4J4l1l2N3N3J77J77J77J76K08K07J23J23M7M7K33M35M78J40m16n16
3931D197j69L4jkj88j89j88j89l4l5j40j40l79j76j68o6j9j20n6n7m6m7m6m6k4k4O1O0J7J6
3927A836J6J6l5l5J6J6m5m4OOM1M2j0rL1L0m1m1j25P9P2l0k7k8J7J7K7K8m5m4n3J49J44M2
3922B019n4n3J6j87r5J07k0k0J9J8J9J8Q6Q6o6o6o2o3j4Q7J13q9j9Q1n3M8n3n3Q5Q5o7o7O3
3917A849O3n4n5q4q3O9O8O0O0O0O0oppol5l4L3o9r5P3P9k2O6O5R9R9N8j11j23j24j01O8k7
3911A886k7q3q3L6L5J7J7O8J69K8j41r7NJ5J6K2K2QQm2m3M5M4M5M4m2m2m2m2O2O3o2o2R2j0
3906A929n3J15N0n1o8o7j3j3L7L8n3n3n3n3R3R2k5k6LMLMO8O9rrp2L0P4r5qR3P6P6n0n1n0
$$ y = [3765, 3732, 3907, 3980, 3811, 3742, 3588, 3635, 3822, 4110, 4162, 3875, 3454, 3134, 2896, 2861, 2836, 2608, 2388, 2168, 1992, 1815, 1892, 1969, 1957, 1945, 1933, 1921, 1994, 2068, 2090, 2113, 2212, 2310, 2324, 2338, 2307, 2275, 2328, 2381, 2558, 2735, 2912, 3088, 3296, 3503, 3626, 3749, 3796, 3843, 4076, 4511, 4989, 5129, 4713, 4197, 4028, 4062, 4061, 4059, 3871, 3682, 3494, 3305, 3271, 3236, 3096, 2956, 2577, 2401, 2233, 2167, 2148, 2028, 1972, 1915, 1869, 1822, 1776, 1730, 1706, 1682, 1743, 1803, 1820, 1836, 1852, 1868, 1833, 1798, 1814, 1830, 1785, 1741, 1747, 1753, 1794, 1836, 1826, 1817, 1848, 1878, 1837, 1796, 1671, 1750, 1822, 1792, 1765, 1737, 1754, 1771, 1798, 1826, 1781, 1737, 1684, 1833, 1977, 2019, 1965, 1912, 1928, 1741, 1646, 1753, 1733, 1713, 1732, 1750, 1769, 1787, 1873, 1959, 1893, 1827, 1765, 1702, 1688, 1775, 1888, 1799, 1780, 1861, 1808, 1856, 1803, 1750, 1835, 1920, 1853, 1786, 1849, 1912, 1858, 1803, 1719, 1636, 1705, 1773, 1833, 1893, 1953, 2013, 2007, 2000, 1993, 1987, 1952, 1918, 1951, 1882, 1787, 1860, 1939, 1917, 1983, 2048, 2147, 2246, 2304, 2193, 2070, 1946, 1845, 1913, 1886, 1859, 1776, 1693, 1729, 1764, 1781, 1798, 1866, 2035, 2063, 1922, 1825, 1830, 1845, 1861, 1883, 1905, 1913, 1921, 1879, 1836, 1881, 1925, 1970, 2014, 1972, 1930, 1888, 1846, 1908, 1971, 1909, 1847, 1939, 1929, 1876, 1991, 2041, 1990, 1922, 1855, 1842, 1829, 1866, 1904, 1851, 1798, 1745, 1692, 1785, 1877, 1852, 1826, 1829, 1833, 1836, 1840, 1908, 1977, 1968, 1959, 1887, 1917, 1991, 1896, 1888, 1981, 2057, 2133, 2083, 2032, 1982]
3900A982n1J13J14K8K9l2l1J9J9J6J6J6J6l8l8M6M6k6k7N8N8l1l2q2q1ooookjjkM7M6l8l9
3895B093pqpqj6j6j6j6R5R5M4M4J0J1K1K1k4J45%jM2M1rrm0m1m0m0RJ0O0O0%JQ6Q5k3k4k3
3889B605k4M2M2m3m3l2l2l2l3l7l7M8M7J12J12K7K8j2j1P2P3J0RJ05o5o2o1p3p2L4L4L5L4
3884B800LMm7m8POPPj0rJKJ1J81J03o6j26k5P0P1m5J24L0K9J02J02q4q4L3L2J02J02J31j05
3879C411p9R1J06o2L7L7Mr8j41K7Q0k1P0K38R8R8j0j0KKKJO5O5J4J4L9L9M0L9M9N0kjQ7Q8
3873D469o5o4L8L8L8L9J21J22L1L1N2m9o2J41J44M2J70O7J36J35P9P8R2R1R1R1L7L7J77J77
3869F524J06r5J1J14N2N2N8N8K27K28K20K21Q4j7J6K19J90K92J31L0K50M52M04M03K67O4p85
3864I776n83M9K51N47P49N16L12j35K03Q13J421J421J421J624J623J538J638J761K099K717
$$ y = [1982, 1931, 2044, 2158, 2186, 2215, 2183, 2152, 2171, 2190, 2206, 2222, 2238, 2254, 2216, 2178, 2224, 2270, 2244, 2217, 2275, 2333, 2302, 2270, 2188, 2107, 2101, 2095, 2089, 2083, 2081, 2080, 2079, 2077, 2124, 2170, 2132, 2093, 2086, 2078, 2071, 2063, 2047, 2031, 2015, 1999, 2094, 2189, 2233, 2277, 2287, 2298, 2319, 2340, 2316, 2461, 2461, 2460, 2502, 2543, 2534, 2525, 2485, 2444, 2404, 2364, 2373, 2383, 2443, 2503, 2503, 2504, 2590, 2675, 2652, 2628, 2605, 2581, 2623, 2665, 2622, 2579, 2547, 2515, 2483, 2450, 2413, 2376, 2424, 2471, 2583, 2695, 2722, 2750, 2738, 2727, 2799, 2872, 2882, 2891, 2996, 2931, 2869, 2808, 2735, 2663, 2697, 2731, 2766, 2800, 2803, 2807, 2760, 2712, 2719, 2725, 2732, 2739, 2729, 2720, 2721, 2723, 2734, 2915, 3018, 2952, 2826, 2801, 2871, 2942, 2897, 3021, 3051, 3080, 3182, 3284, 3200, 3116, 3149, 3181, 3283, 3385, 3516, 3411, 3332, 3423, 3529, 3467, 3504, 3541, 3545, 3447, 3306, 3333, 3413, 3392, 3462, 3700, 3798, 3896, 3886, 3876, 3878, 3880, 3882, 3883, 3948, 4013, 4027, 4041, 4080, 4119, 4159, 4198, 4247, 4297, 4295, 4294, 4381, 4469, 4404, 4340, 4378, 4416, 4454, 4493, 4614, 4736, 4767, 4798, 4850, 4801, 4739, 4880, 5024, 5066, 5236, 5303, 5439, 5574, 5653, 5731, 5823, 5914, 6005, 6096, 6133, 6170, 6347, 6524, 6630, 6535, 6546, 6660, 6712, 6764, 6822, 6880, 7107, 7335, 7555, 7776, 7860, 7843, 7859, 8078, 8268, 8560, 8691, 8721, 8971, 9423, 9827, 10230, 10497, 10561, 9776, 9193, 9242, 9493, 10040, 10789, 11305, 11617, 11482, 11685, 12498, 13919, 15340, 16761, 18385, 20008, 21546, 23184, 24945, 27044, 29761]
3861B9761M136N648P743R821J2185J2558L707o057n179j211M937J0597J8637K8556M4569O2466
3859B42874P4291Q5626J01774M2264k9427k3250k2506j9711J2790N7961P0056q712o3105o1198
3857D59727l9239l9839o7474o4717m5324k1008l103Q679j929k7293l4793k8618k0984j2504
3855F1581p976m085k530q58l86Q46N08J201J403K939M493Q125J1571J6226K0484K7173L1699
3852A72414J9894q554j5884p844Q318K6359M8935P1841R4522R1617N6152K7977L9359j3142
3850F11964p7399n6115k0575K600L0710M8344K3275p1524j19870r5882o4535l4873k6460k3014
3848A26646j5873p022j067m783j6620j7229j4078r551o576m481l899k885k747j598j066m58
3845A6713r8K39n72p75j168q30p12n10j058q55p12l75k11qn24r96j541r34m91j55k97j97k22
$$ y = [29761, 33897, 39545, 47288, 57109, 69294, 81852, 85559, 79502, 74323, 73112, 78049, 88646, 107283, 135839, 180408, 242874, 317165, 402791, 504565, 546829, 517402, 494152, 471646, 451935, 464725, 522686, 592742, 584030, 520925, 459727, 420488, 380649, 313175, 248458, 203134, 182126, 179023, 187702, 185773, 158480, 123687, 95069, 74085, 61581, 53605, 49520, 46990, 46132, 45746, 46592, 47100, 48301, 49704, 52643, 57136, 65261, 76832, 93058, 113542, 140715, 172414, 192308, 183754, 167870, 160026, 168344, 194703, 243638, 315479, 410001, 501618, 557770, 585747, 625106, 611964, 534565, 478450, 457875, 460475, 491185, 539529, 562804, 491280, 371410, 275528, 210993, 176120, 149660, 126646, 110773, 103751, 102684, 97901, 81281, 64052, 49974, 40423, 33847, 29366, 25467, 22582, 19835, 18237, 17171, 16713, 16615, 16854, 16282, 15507, 14339, 13509, 12797, 12287, 11229, 10374, 9662, 9287, 9076, 9068, 8544, 7548, 6007, 5073, 4582, 4427, 4130, 3933, 3711]
3842C711j9j68o7m05k02j42m1j29k8j84J9q8q8N3N3O6O6j12R0k3k4L3L3j18j19QQQQJ0J1j32
3837B088k9m1m0m0O1J0J1J6J7M3M3l0l1j62Qo0M1r5r5L6L6m7N5o0M2poNOj26k4n9J11L0L0
3832A737L5L4kj04r1P8K2K3k3P7opm0m1o0J08O4O4m7m7o0M2Q5j7l7l8k0k0j4j4p9K2l5l5M2
3826A596M1rrj6j5p3K9N7N7q8Q0oj07m0m0M8M7l1l1nR6m6m6j9j9j2j3LJ05N4m8q3q4O8O8n1
3821A458N0j3j3J02JP1l1J4J15lj04n4M8j6j5n7n7o3L8j7j7M0M0J4J4l7O4L3J34r2RK7K8n5
3816A656j57j0R2Pr5n5M6j7j8O5O4k0k1j0j1j50J9K1J22N5m6m5N6R8p1j08O1J38L5k0Q1J8
3811A780J8m6m5j47K3N6m5k9k8j5j4l1J37L8o4j11rK8p4j05O3O4O3N3m8m3N9mnN4N3r8r9P7
3806A506P7r9LN3N4k5k4L2L1j13j14j22k1J7J18J34J34P9k2p8p7k8P2Q0k2l6l6l9O3P0l3q0
$$ y = [3711, 3692, 3524, 3457, 3052, 2850, 2708, 2667, 2538, 2510, 2326, 2345, 2257, 2169, 2222, 2275, 2341, 2407, 2295, 2385, 2362, 2338, 2371, 2404, 2286, 2167, 2175, 2183, 2191, 2199, 2209, 2220, 2088, 2059, 2018, 1978, 1938, 1999, 2009, 2020, 2036, 2053, 2096, 2139, 2109, 2078, 1916, 1924, 1864, 1905, 1810, 1715, 1751, 1787, 1740, 1795, 1735, 1777, 1770, 1764, 1769, 1775, 1649, 1625, 1566, 1677, 1707, 1737, 1772, 1806, 1804, 1700, 1609, 1687, 1709, 1732, 1709, 1786, 1780, 1773, 1733, 1692, 1632, 1740, 1804, 1868, 1821, 1774, 1714, 1756, 1841, 1824, 1787, 1749, 1729, 1709, 1695, 1681, 1602, 1624, 1589, 1554, 1596, 1637, 1628, 1619, 1603, 1588, 1515, 1544, 1601, 1658, 1570, 1650, 1644, 1537, 1497, 1457, 1505, 1552, 1521, 1490, 1485, 1581, 1535, 1489, 1470, 1451, 1439, 1426, 1429, 1534, 1588, 1540, 1457, 1373, 1441, 1509, 1458, 1508, 1495, 1482, 1584, 1585, 1656, 1625, 1639, 1754, 1751, 1647, 1593, 1641, 1625, 1610, 1553, 1496, 1433, 1471, 1454, 1437, 1477, 1517, 1531, 1545, 1508, 1572, 1605, 1739, 1647, 1656, 1683, 1711, 1656, 1499, 1489, 1581, 1588, 1493, 1438, 1484, 1467, 1449, 1514, 1578, 1558, 1537, 1527, 1516, 1366, 1385, 1406, 1528, 1583, 1537, 1492, 1548, 1646, 1575, 1467, 1528, 1666, 1701, 1681, 1762, 1780, 1798, 1752, 1707, 1560, 1583, 1639, 1594, 1565, 1537, 1522, 1508, 1477, 1614, 1652, 1588, 1477, 1468, 1496, 1422, 1317, 1380, 1444, 1507, 1560, 1512, 1469, 1528, 1524, 1519, 1573, 1626, 1528, 1429, 1506, 1583, 1484, 1487, 1540, 1594, 1569, 1545, 1577, 1608, 1495, 1381, 1259, 1238, 1255, 1373, 1507, 1641, 1720, 1698, 1620, 1543, 1515, 1587, 1667, 1645, 1609, 1573, 1534, 1597, 1667, 1634, 1554]
3801A554K0m2m3o5o5pqm4N8JJK8K9o7J02J3J2n5n5q2J8P6j27K0J9J26J25O1O0j1j1o7J36r7
3795A613r7K5K5o0o0PPPPK3K3K2K3j5j4N5m7r2J11M7n3n9n9K0J9j0j0M1M0M3M2M2M2n4n4R8
3790A698R8j22j22mlkkM9M9p4p3M4M5O4O5J4J4j5j5j4j5K0K1K0K0k4k4k3k4q5q6O1O1Q0k1
3785A675j69L3kj03N0N1K5K6k5k5k8k8k9k8J03J02j6j6J20J20M8j54j11j12noP0P0K0K0M8
3780A724M8l7l6R5R4J0J0m7m7j66j66P9P8P8P8N4N3o5o5J10J09r7r8J22L24J60J60K31K30
3775C023K4K4J03L07K37J36J61m0o0K78L53J5m87m87l88j85RK11J88J87k31m33m21k18k4k4
3772B258p6p7P6P5j23j23K9K9L1L1j21j21ppM3M4l8l9J07J07L97K95L26J24j45N7J48K49K01
3767C750kL4L4j28j28m4m3k1k0R6J97J87j5k63k62j72J67K73J73j46l49m14m15l29j27j21
$$ y = [1554, 1574, 1532, 1489, 1424, 1359, 1352, 1344, 1300, 1358, 1359, 1360, 1388, 1417, 1350, 1452, 1465, 1477, 1422, 1367, 1285, 1303, 1379, 1252, 1272, 1291, 1417, 1542, 1603, 1663, 1652, 1641, 1574, 1710, 1613, 1516, 1541, 1566, 1506, 1446, 1453, 1460, 1467, 1474, 1497, 1520, 1542, 1565, 1550, 1536, 1591, 1544, 1452, 1563, 1610, 1557, 1498, 1439, 1459, 1478, 1468, 1458, 1499, 1539, 1582, 1624, 1666, 1708, 1654, 1600, 1698, 1796, 1674, 1552, 1548, 1545, 1543, 1541, 1590, 1639, 1565, 1492, 1536, 1581, 1645, 1710, 1724, 1738, 1723, 1708, 1694, 1679, 1699, 1720, 1740, 1760, 1736, 1712, 1689, 1665, 1580, 1494, 1555, 1616, 1696, 1675, 1506, 1539, 1537, 1434, 1484, 1535, 1560, 1586, 1561, 1536, 1508, 1480, 1451, 1423, 1526, 1628, 1612, 1596, 1716, 1836, 1884, 1730, 1619, 1507, 1502, 1496, 1566, 1636, 1656, 1676, 1724, 1772, 1735, 1699, 1794, 1888, 1898, 1908, 1861, 1814, 1648, 1482, 1561, 1639, 1717, 1795, 1849, 1902, 1837, 1772, 1882, 1991, 1894, 1796, 1918, 2242, 2402, 2562, 2793, 3023, 3047, 3071, 3174, 3481, 3718, 3854, 4015, 3975, 3915, 4193, 4546, 4561, 4074, 3587, 3199, 3014, 3023, 3234, 3422, 3609, 3378, 2945, 2524, 2306, 2282, 2258, 2182, 2105, 2181, 2256, 2133, 2010, 2039, 2068, 2099, 2130, 2009, 1888, 1881, 1874, 1917, 1961, 1923, 1884, 1991, 2098, 2495, 2790, 3116, 3240, 3095, 3152, 3300, 3549, 3750, 3748, 3782, 3816, 3688, 3560, 3516, 3473, 3452, 3432, 3528, 3725, 3912, 3897, 3634, 3372, 3200, 3367, 3640, 3813, 3667, 3318, 2904, 2489, 2160, 2033, 1912]
3763A912k22q5J18q1q1K7J29J07r6j62o1N6N5J5J5l5l6m9m9L5L5L6L6L7L6k2k2J76k6n4n4
3758A690J8J8l8l9l9l9qqn9n8M2M3qqJ15J15O4O4J3J4R8R8p0p0J16J16J70J69K84Q1k79k78
3754B327l9l8j13j13NNj07j06o3o2j9j19r9J04Q1k1jkN1N1n5n5p7J26J2J2O9O9p0p0r2J11
3749A702J38L6J26J25L26L26J89j4q6q6J34J33L68M69J63l10m70l69j57M6J37o6j42j42j55
3745B421j55q8q9q9q9j16j16QQrR1L1j72O0O0p1p1R2R1k6k7p1p0Q1Q1J11J11K7K7O9O9J8J9
3740B216L4L3K08K07K74P2k68l69k32k9JJ02J25p7j14k14k00r9N8N7qrrrR9J00j9j9O9O9n0
3735A999m9R6R7K13L14N93R30J626Q82j022j496r35n98k54j52r1r1k19j6M5n6m0m1m6m7l8
3731A604l7Q0Q1j9j9j8j9RJ0P3j30o6o5M0M0J54J53l3l2n7n6K7K8ooooQRp6p5nnnml9l8J2
$$ y = [1912, 1690, 1605, 1723, 1642, 1561, 1588, 1717, 1824, 1728, 1566, 1505, 1561, 1616, 1631, 1646, 1611, 1575, 1526, 1477, 1512, 1547, 1583, 1619, 1656, 1692, 1670, 1648, 1824, 1798, 1744, 1690, 1708, 1726, 1688, 1649, 1610, 1571, 1563, 1555, 1496, 1438, 1480, 1523, 1515, 1507, 1622, 1737, 1801, 1865, 1878, 1892, 1990, 2088, 2018, 1948, 2064, 2180, 2350, 2519, 2803, 2884, 2605, 2327, 2288, 2250, 2137, 2024, 2029, 2034, 1927, 1821, 1758, 1696, 1677, 1558, 1459, 1563, 1644, 1623, 1622, 1620, 1671, 1722, 1667, 1612, 1535, 1661, 1673, 1685, 1754, 1823, 1753, 1683, 1591, 1702, 1840, 1876, 2002, 2127, 2453, 2779, 2968, 2954, 2868, 2782, 2916, 3049, 3417, 3886, 4049, 3739, 3269, 2900, 2743, 2789, 2926, 2860, 2718, 2576, 2421, 2266, 2178, 2089, 2000, 1911, 1795, 1679, 1687, 1695, 1686, 1777, 1808, 1636, 1696, 1756, 1685, 1614, 1706, 1797, 1771, 1744, 1673, 1603, 1684, 1765, 1876, 1987, 2014, 2041, 2110, 2179, 2197, 2216, 2250, 2283, 2491, 2698, 2972, 3044, 2776, 2407, 2175, 2146, 2147, 2249, 2374, 2297, 2183, 1969, 1769, 1670, 1728, 1785, 1777, 1768, 1759, 1750, 1849, 1949, 1930, 1911, 1980, 2049, 1999, 1950, 2046, 2143, 2356, 2670, 3263, 4193, 5819, 6701, 5679, 4183, 3248, 2650, 2396, 2244, 2153, 2062, 1843, 1827, 1872, 1816, 1776, 1735, 1689, 1642, 1604, 1567, 1647, 1728, 1709, 1690, 1672, 1653, 1662, 1672, 1745, 1615, 1549, 1484, 1524, 1564, 1718, 1871, 1838, 1806, 1749, 1693, 1720, 1748, 1742, 1736, 1730, 1724, 1732, 1741, 1665, 1590, 1585, 1580, 1575, 1571, 1532, 1494, 1506]
3725A506J2P0P0J84j9j1j2R0j12m1m0n4n3lkM6J47Q5j18m8m9P6P5K4K5k1k1k0k1KLKKJ4J3
3720A801l8l7K5K5q7q7j2R0P8r2QPM8M8n9n9K5K6n7n7O1O1R0Q9o2o3n5n5m4m5m5J23M0j30
3715A561mmJ37J38k5k5K6K6L6L5q2q3klj3j3J19n0j8Q3N4m9J6J5J6J7J6J6m5m5P4P3L1L1L1
3709B090L1m5m5NOm4m4PPq4q4L5L4k4k5K6K6M1M1m4m4QPPPKKR7p1N0M9R0R0l0l0l0l1q6q6
3703A911O6O6K4K3k6k7P8P9l9m0j27j27Q3Q2P8r1m7m6llM9M8j0j0j0j0O8O8j7j6P2P2K1K2
3698B261k6k5k5k6k6k6N8N8LLq1q1J8J8l3l3P8P9J28m0m5N6N2n0j05nJ35L4N1n1%%P1P1j4
3693B482j3n3n2R9R9l3l3N1N1K7K8P9P8p6p7QRm5m5M0M0O3O3n6n5PPPPK0K0P1P1j5j5L6L6
3687B931ooJ46J46k2k1o9L4j1J59J20m8m8N3R1p8j13N6L5L5J07J07N6N6N8N7N8N7N9N9QQP2
$$ y = [1506, 1518, 1588, 1658, 1842, 1823, 1812, 1800, 1890, 1778, 1737, 1697, 1643, 1590, 1587, 1585, 1631, 1778, 1863, 1745, 1697, 1648, 1724, 1799, 1823, 1848, 1827, 1806, 1786, 1765, 1767, 1770, 1772, 1774, 1788, 1801, 1763, 1726, 1751, 1776, 1689, 1602, 1590, 1680, 1758, 1666, 1674, 1681, 1729, 1777, 1718, 1659, 1684, 1710, 1653, 1596, 1657, 1718, 1808, 1897, 1835, 1772, 1717, 1662, 1618, 1573, 1528, 1651, 1691, 1561, 1557, 1553, 1690, 1828, 1803, 1778, 1804, 1830, 1866, 1901, 1819, 1736, 1734, 1731, 1718, 1705, 1824, 1774, 1756, 1839, 1893, 1844, 1860, 1875, 1891, 1908, 1924, 1940, 1895, 1850, 1924, 1997, 2028, 2059, 2090, 2121, 2076, 2031, 2036, 2042, 1998, 1954, 1961, 1968, 1884, 1800, 1835, 1869, 1845, 1820, 1846, 1872, 1913, 1954, 1910, 1866, 1874, 1881, 1888, 1895, 1897, 1899, 1996, 1925, 1975, 2024, 2114, 2204, 2174, 2144, 2114, 2083, 1997, 1911, 1977, 2043, 2067, 2090, 2064, 2037, 2115, 2194, 2155, 2115, 1988, 1861, 1944, 2026, 2104, 2013, 1966, 1920, 1917, 1914, 1963, 2011, 2001, 1991, 1981, 1971, 2039, 2107, 2090, 2074, 2146, 2218, 2239, 2261, 2235, 2210, 2185, 2159, 2133, 2107, 2165, 2223, 2226, 2229, 2148, 2067, 2085, 2103, 2070, 2037, 2115, 2194, 2322, 2282, 2237, 2293, 2345, 2295, 2190, 2185, 2320, 2354, 2405, 2354, 2354, 2354, 2425, 2496, 2482, 2469, 2416, 2364, 2463, 2562, 2529, 2496, 2547, 2598, 2625, 2653, 2732, 2810, 2734, 2657, 2665, 2674, 2629, 2584, 2624, 2664, 2727, 2790, 2734, 2679, 2686, 2693, 2700, 2707, 2727, 2747, 2818, 2889, 2874, 2859, 2895, 2931, 2925, 2919, 3065, 3211, 3189, 3168, 3099, 3133, 3122, 3281, 3401, 3353, 3305, 3358, 3449, 3371, 3258, 3314, 3349, 3384, 3491, 3598, 3654, 3710, 3768, 3825, 3883, 3940, 3999, 4058, 4066, 4074, 4146]
3682D146P3K1K2p3p4J47J46J81J81J56m7l64j61K64M66M33N35L81M2j72J65L64N66O69O70
3678H737J27K5J22L26L23O61O97J035R25J399J772K921M035O401R549J4482J9600K3857J1165
3676A08159j0120j2214k147J0905K3810L5634L5162o199l9781l5000k0473n123N484J3914
3673A02011P225j6338k5324j9674j2715o974m070k276j669j063r61o08m06L80Q53J210M66
3671B0067R1J92O33O34J142J480K194K802M001N285Q106J2228J8340K4759L2199K8484J2172
3668A74809J0077J6691N001O76K1014M8996P3928O2909j3782p8275p4425m3575j2966L402
3666A94480l287j0977p126k1855l7329l2618k2145j3488q015n318m305l452k438j729r86m62
3664A8950J45J02M39M98K6n46p3K82J025J433K041K497L781N354Q666J3007J9290K5541L0068
$$ y = [4146, 4219, 4240, 4262, 4189, 4115, 4262, 4408, 4589, 4770, 4926, 4879, 4515, 4354, 4618, 5084, 5517, 6052, 6433, 6475, 6303, 6468, 6832, 7398, 8067, 8737, 8864, 8889, 9011, 9337, 9660, 10321, 11018, 12053, 12978, 14377, 16149, 19070, 23105, 29506, 39055, 53537, 73137, 96994, 108159, 98039, 85825, 83678, 94583, 118393, 154027, 189189, 182990, 143209, 108209, 87736, 82613, 88097, 102011, 109236, 92898, 67574, 47900, 35185, 28211, 24141, 21865, 20196, 19133, 18172, 17564, 17158, 17538, 18391, 19601, 20067, 20158, 20350, 20983, 21617, 22759, 24239, 26433, 29235, 33236, 38521, 46627, 58855, 77195, 101954, 134153, 162637, 174809, 184886, 201577, 206578, 207254, 228268, 277264, 351192, 414101, 400319, 322044, 247619, 204044, 191078, 194480, 191193, 180216, 173090, 151235, 113906, 81288, 59143, 45655, 37640, 32322, 28017, 24565, 22127, 20398, 19412, 18950, 19095, 19197, 19636, 20134, 20160, 19614, 19541, 19823, 20848, 22281, 24322, 26819, 30600, 35954, 44620, 57627, 76917, 102458, 132526]
3661A32526J0532j5617j5147j836J5234L1653M6584M0705j5765n2726m3650k4529n627P414
3659A09751J6963N543k3300l1476k4205j5893r661o080l771k623j909j437j234j234r85o47
3656G802l11K7L52L51l11p85m85l84j87q6n2n2k28k28L9L8m71q08n17m5j7J85J23p9l43m44
3652C084k88q5p9K2R2rj69o8N5N5llO7l5r2J10nmr8Mj55M7n8J45L1J32J05Mp2p3j39O3J01
3647B682J01m2m1RJ0K8K8k2k2O4O4J4J4M3M3J3J4j20K19K47K48M40M40J80J80k32l33l35L
3643C937nJ99J32K34K56K56K63K62k08k07m36r7J5K17N3N3l45j41k05kj06R7PK08M4J44R4
3639D719J95O8O7l4J69k7P5L1N03M33O37M90J7j712j813n99O84J096J095J79O52Q87J360R17
3635A0089R17N69P72M68Q06M31M31j99K75J82J331J289J762J187J931J669K682K190L880M310
$$ y = [132526, 143058, 127441, 112294, 110458, 125692, 157345, 203929, 244634, 228869, 176143, 132493, 107964, 102337, 109751, 126714, 132257, 108957, 77481, 53276, 37383, 27722, 21642, 17871, 15248, 13339, 11902, 10668, 9434, 8449, 7802, 7491, 7518, 7870, 8221, 7910, 7125, 6640, 6256, 6069, 5983, 5931, 5879, 5651, 5423, 5462, 5500, 5029, 4221, 3704, 3659, 3642, 3827, 3950, 3871, 3528, 3084, 2796, 2711, 2632, 2654, 2746, 2737, 2568, 2500, 2555, 2610, 2607, 2604, 2671, 2636, 2544, 2654, 2649, 2645, 2547, 2551, 2396, 2443, 2385, 2530, 2561, 2693, 2798, 2802, 2730, 2657, 2518, 2581, 2682, 2783, 2741, 2700, 2709, 2719, 2747, 2775, 2753, 2731, 2795, 2859, 2873, 2887, 2930, 2973, 2986, 3000, 2880, 3099, 3346, 3594, 4034, 4474, 4654, 4834, 4602, 4269, 3934, 3937, 3932, 4131, 4263, 4497, 4753, 5009, 5272, 5534, 5326, 5119, 4683, 4586, 4601, 4818, 4871, 4924, 4579, 4438, 4233, 4231, 4125, 4222, 4229, 4437, 4481, 4625, 4719, 4914, 4982, 5049, 5015, 5184, 5157, 5232, 5263, 5766, 6199, 6836, 7326, 7343, 5631, 3818, 3219, 3903, 4999, 6094, 6273, 6925, 7812, 9172, 10089, 11006, 11575, 12347, 12815, 13621, 14052, 14483, 14284, 14559, 14741, 16072, 17361, 19123, 20310, 22241, 23910, 26592, 28782, 32662, 36972]
3632C6972O675Q056J3394J9053L2769N5823J10351K04052L05067J37118k09170k70040j79702
3630B70418j00686n6159l2096k0272j3181j0005o999n579m081l473k132k031r81p79l03o41
3627A1020p65j238p73p73n28n28l30l30m4J60M75J38L09J07J90L94J181R79J68j657k345j601
3624D209p05n01LJ05P2k67l32k31o2o2j9j20j9k0J24K2N2n0k6k6K4p6m6m6J23J22R7p3o8o8
3620B136P7k3L9o2j8j8j8j20n4n4N2N2N7m5p2p2l2l1Q0Q0O4l6j22k0L0L0Q6j4J17J6j15j4
3615A976P5k6j4j4j8j9k5k4P7k4M8j88P8P8J2J3M7M8M1M1l7j39j24k25j67J38K42K41N5m7
3610B119q4Q4j5j5mmK1K2k9k9%jOOm4N7POn7M5n7n7kJ00qqRRl8O4o8J01J9J8o2L9p6K7mmm2
3604B051m2j3Q9qqq2Q7M8n2L0L0Q0k1k9l0m2N9k2k2M1M1r8Mj05O5M4n8l4l5q7J4J8J20P5P5
$$ y = [36972, 43647, 51703, 65097, 84150, 116919, 172742, 283093, 487145, 792212, 929330, 720160, 450120, 270418, 169732, 113573, 81477, 61205, 48024, 38019, 31020, 25441, 21360, 17887, 15755, 13724, 12743, 11964, 11661, 11020, 10255, 9017, 8244, 7471, 6943, 6415, 6085, 5755, 5711, 5871, 6346, 6484, 6793, 6900, 7090, 7484, 8665, 9644, 9812, 8155, 5810, 4209, 3504, 3003, 3006, 3111, 3183, 2916, 2584, 2353, 2291, 2229, 2210, 2090, 2071, 2051, 2175, 2197, 2249, 2199, 2173, 2147, 2171, 2095, 2049, 2003, 2126, 2248, 2345, 2272, 2204, 2136, 2213, 2190, 2229, 2167, 2149, 2131, 2113, 1993, 1939, 1885, 1937, 1989, 2046, 2001, 1929, 1857, 1825, 1794, 1874, 1954, 2018, 1982, 1860, 1840, 1870, 1900, 1986, 1972, 2089, 2105, 1990, 1976, 2051, 2025, 2011, 1997, 1979, 1960, 1935, 1911, 1988, 1964, 2012, 1824, 1902, 1980, 1992, 2005, 2052, 2100, 2141, 2182, 2145, 2006, 1882, 1657, 1490, 1628, 1870, 2111, 2166, 2119, 2035, 2119, 2104, 2089, 2085, 2081, 2102, 2124, 2095, 2066, 2066, 2065, 2071, 2077, 2033, 2090, 2097, 2103, 2046, 2091, 2034, 1977, 1975, 2075, 2067, 2059, 2068, 2077, 2039, 2103, 2035, 2136, 2155, 2173, 2111, 2150, 2074, 2101, 2097, 2093, 2051, 2009, 1996, 2085, 2077, 2069, 1987, 2074, 2122, 2070, 2100, 2130, 2210, 2189, 2160, 2130, 2088, 2147, 2125, 2103, 2144, 2185, 2087, 2091, 1986, 2051, 2095, 2037, 2003, 1968, 1881, 1895, 1913, 2033, 2108, 2183]
3598B183L1p0q5Q5M0M0m7N4LLqR3m8m8L5L5L5L6L2L2n6J12Q3J84N3N4J0J1MJ06J67J68m5m5
3593C237j01j00j51m9l5O7J6J6j29j30OJ08n1N0OOj52m9q0K2L1L2n7J11J3J3K4K3Q7Q7Q7Q6
3588C044l1l2j27M2P5P5R1R2P9J80K85L87L52L52P9j57k29o1l45l46l20j52q1Q7k4P8N5K23
3584C671L3L4o8o8k39j38o9R9P1P2j74J31L6L7k9k8j0j0J09J08N4N3N0K18K00L01J74Nk16
3580D407m6k2K16J66L36L76P1l37l38j79p8p3J64L7L7o9p0j13j14n4M8k0J49M6M5k2k2M7J48
3575D736j6Q4N6N6P3P3l7J32k0Q1M0L9L9J41O2O1J7J19M8J49J04J05J03K05J42K43O6O6J6
3571F983J17J62J62P2J73K09L78L74M76j1j79j43L63M74M74O11P81N22K19K8K65L94O30O77
3567A4211J184J217J116Q54R55J056J496K006L391N640Q782J2152J5970J5168J419r968q041
$$ y = [2183, 2214, 2144, 2059, 2144, 2184, 2224, 2177, 2231, 2234, 2237, 2229, 2322, 2274, 2226, 2261, 2296, 2331, 2367, 2399, 2431, 2375, 2487, 2570, 2754, 2807, 2861, 2871, 2882, 2886, 2992, 3159, 3327, 3282, 3237, 3136, 3036, 2885, 2836, 2801, 2868, 2884, 2900, 2771, 2641, 2647, 2755, 2704, 2754, 2760, 2766, 2614, 2565, 2485, 2507, 2538, 2570, 2513, 2624, 2637, 2650, 2674, 2697, 2784, 2871, 2958, 3044, 3013, 2981, 2854, 2896, 2971, 3046, 3137, 3229, 3308, 3488, 3773, 4160, 4512, 4864, 4943, 4786, 4557, 4496, 4151, 3805, 3485, 3333, 3252, 3339, 3315, 3393, 3448, 3671, 3704, 3738, 3670, 3602, 3363, 3225, 3156, 3255, 3326, 3398, 3224, 3355, 3391, 3428, 3399, 3371, 3361, 3351, 3460, 3568, 3622, 3675, 3725, 3943, 4143, 4444, 4618, 4623, 4407, 4361, 4339, 4555, 4721, 5057, 5433, 5504, 5167, 4829, 4650, 4572, 4499, 4663, 4700, 4737, 4668, 4598, 4485, 4371, 4317, 4365, 4345, 4494, 4540, 4585, 4563, 4541, 4588, 4736, 4720, 4804, 4860, 4916, 4989, 5062, 5025, 5157, 5137, 5218, 5258, 5297, 5336, 5477, 5539, 5600, 5617, 5736, 5784, 5933, 6037, 6142, 6245, 6450, 6592, 6835, 6901, 6967, 6983, 7100, 7262, 7424, 7496, 7669, 7878, 8256, 8630, 9106, 9095, 8916, 8773, 9136, 9610, 10084, 10695, 11476, 11998, 12217, 12245, 12510, 12904, 13534, 14211, 15395, 16612, 17728, 18582, 19537, 20593, 22089, 24095, 27486, 33126, 41908, 54060, 70030, 85198, 86617, 76649, 68608]
3565F8608k868L922J0551K0787L5096N7056Q3866J12447J01087M4127j7368n1085p7202r6863
3562B92161p8620n0174k4236n249J1212K2632K2761q929l7206l6733k6561j7576j1114o587
3560D5781l698k686k356k018j182m38K52L53P18R22J827K841M487O312R108J2554J6677K1070
3558A10524J8586O356O230J7649L2497M3510L2832J2359K5500O0163J00964J03870P9680N6369
3555G07089M3901K617l8127m2654p7679j21532j20163p7798l7672q684n323k7012l8022k7684
3553A31257j5048l765o006j6480j8735j4207j0206o490m455k495j925r12q78%K83J567J711
3551C3216K183K324M149N879R326J2749J9032K5206L0815J7569j3310k5760j8259o213Q584
3548A07490K3965M3492O5496Q0294O2000L9094Q359l3871p6178r3138p1442m7050k7903j6348
$$ y = [68608, 65740, 69662, 80213, 101000, 136096, 193152, 277018, 389465, 490552, 534679, 517311, 466226, 389024, 292161, 213541, 163367, 139131, 133882, 145094, 167726, 190487, 181558, 144352, 107619, 81058, 63482, 52368, 45781, 42083, 39397, 37041, 35023, 33841, 33403, 33655, 34008, 34726, 35648, 37475, 40316, 44803, 51115, 60223, 72777, 89454, 110524, 129110, 135466, 141696, 159345, 191842, 235352, 268184, 280543, 306043, 366206, 467170, 571040, 650720, 707089, 750990, 753607, 715480, 672826, 595147, 473615, 353452, 275654, 237982, 229298, 223975, 196963, 158941, 131257, 116209, 112444, 106438, 89958, 71223, 57016, 46810, 40320, 35865, 33370, 31445, 30533, 29655, 29655, 29938, 31505, 33216, 35399, 37723, 41872, 47751, 57077, 69826, 88858, 114064, 144879, 162448, 149138, 123378, 105119, 98906, 107490, 131455, 174947, 240443, 320737, 382737, 421831, 430190, 396319, 320141, 227003, 155561, 108511, 80608, 64260]
3546F4260p647j633L797P649M667r319j5265j2631q293n387l336k186j375r02o31r70r75o38
3544I185k66m69m78k76K10M12O79O79M46k6m20p58q93j096j195r93o10k72k39j37j29j28n5
3540C171j56l0k32k76j74r2r2K8K9r0r0j1j1P3P3j6j7j6j7J%N1N1k5k4k5k5j16j17KLJ00J00
3535B030J00J00p3p3p3p3m3m4M1M1k2k3O3O2r8r7r7r8Q1Q0L0K9L1L1p5p5p3J30o9o9o5o5Q7
3530A631Q7l5l6Q3Q2k9k9l0k9m4m3m4m4N6N7N6N7m4m4o2L8J88j5m5j46oJ97P6J78J19K20K87
3525B687O26J274J612K77j412j354q80m71k69r0r1o5o5j41O1j03j03M3M3M4M3r8r8K0K0L9
3521A549L9L9L9l7l7l7l7L6L5j5j5qqn8n9m8m8L6L6O5O6O5O6j4j5q4J7J32p2j20j8l7O4J49
3516A666M7j3j14%j01k5P7J21K0MMM9M8mmj56j56n1n0L3L4o2o3Q9R0n8n7O1O0J8J7Q7j4j79
$$ y = [64260, 56613, 54980, 58777, 66426, 71093, 61774, 46509, 33878, 25585, 20198, 16862, 14676, 13301, 12399, 11768, 10798, 9823, 9185, 8919, 8450, 7972, 7696, 7906, 8318, 8997, 9676, 10122, 10096, 9676, 8918, 8025, 6929, 5734, 4741, 4131, 3859, 3620, 3483, 3354, 3226, 3171, 3015, 2985, 2753, 2477, 2303, 2211, 2119, 2147, 2176, 2086, 1996, 1985, 1974, 2047, 2120, 2104, 2087, 2071, 2054, 2055, 2055, 2106, 2157, 2132, 2108, 2083, 2058, 1942, 1825, 1827, 1830, 1930, 2030, 2130, 2230, 2157, 2084, 2011, 1938, 1895, 1851, 1892, 1933, 1911, 1888, 1951, 2013, 1915, 1818, 1721, 1623, 1704, 1784, 1814, 1843, 1874, 1905, 1830, 1755, 1682, 1812, 1743, 1674, 1609, 1544, 1631, 1718, 1683, 1647, 1730, 1812, 1783, 1754, 1724, 1695, 1651, 1608, 1564, 1520, 1576, 1633, 1689, 1746, 1702, 1658, 1596, 1634, 1822, 1807, 1762, 1616, 1610, 1807, 1883, 2061, 2180, 2400, 2687, 3313, 4587, 6199, 6476, 5064, 3710, 2830, 2359, 2090, 2000, 1909, 1844, 1779, 1638, 1699, 1596, 1493, 1536, 1579, 1623, 1666, 1568, 1470, 1490, 1510, 1549, 1588, 1627, 1666, 1629, 1592, 1555, 1518, 1554, 1589, 1574, 1559, 1551, 1543, 1485, 1426, 1378, 1330, 1366, 1402, 1467, 1533, 1598, 1664, 1650, 1635, 1551, 1568, 1700, 1628, 1508, 1490, 1453, 1517, 1666, 1713, 1700, 1586, 1586, 1485, 1460, 1537, 1658, 1678, 1682, 1686, 1735, 1783, 1779, 1775, 1619, 1463, 1412, 1362, 1395, 1429, 1367, 1304, 1393, 1483, 1425, 1368, 1429, 1489, 1507, 1524, 1611, 1597, 1418]
3511A418K5K3K2k1k2R6R7j2j3j2j2J0J0m1m0K3K4k7k7N0M9l5l5l3l2Q5Q6n2n1j%j04j04K4
3506A368K5q5Q4Jj00J7J19J12J1q0q0kkK1K2J5J5pj08l5J35Q3j9K8p3q3J8R6oo8o9J0RQ1Q1
3500A534mlL8L9m6m5m8m7L8L7L2L2n2n3k2k2k3k2P7P7m1m2M5M5M5M4O0N9r2r3j4j5j5j5k7
3495A461k8k1k1M5J46J33l6j9k0l1l0J8J9m9N2Nj64o9L2L5L4M2M1m1m2M4M3m3m4m3m4Q6Q7
3490A578l2l2m8m8KLQ2Q3l6l5j1j1L9M0r8r7K0K1J9J9P0P0j00j01N2N2L8L7L8L8L4L5j7j6
3485A688J4J5l7l6m9n0M8M8L5K38K19L20K04K04L7j66J5J4J20J20r3r3J69L71P4j29l31n35
3480B434l90j88j65o3J92j2rrK7K6J12J11j02j01n1n1j9k0o9p0J16J17J35L4r2J10R7mK8K8
3476B152R9L02L27M28N10L08j38O5J96J96J79k95l04l03nJ97j45l48k59n7L7K39K11j27l78
$$ y = [1418, 1443, 1466, 1488, 1467, 1445, 1541, 1638, 1626, 1613, 1601, 1589, 1599, 1609, 1568, 1528, 1551, 1575, 1548, 1521, 1571, 1620, 1585, 1550, 1517, 1485, 1570, 1656, 1604, 1553, 1552, 1552, 1448, 1344, 1368, 1393, 1308, 1392, 1393, 1293, 1310, 1429, 1541, 1552, 1472, 1392, 1390, 1388, 1409, 1431, 1446, 1461, 1454, 1346, 1311, 1446, 1529, 1510, 1538, 1465, 1382, 1400, 1496, 1490, 1422, 1353, 1363, 1372, 1453, 1534, 1530, 1527, 1565, 1604, 1558, 1513, 1465, 1418, 1456, 1493, 1525, 1557, 1505, 1452, 1430, 1408, 1385, 1363, 1440, 1517, 1476, 1434, 1479, 1524, 1569, 1613, 1673, 1732, 1640, 1547, 1533, 1518, 1503, 1488, 1461, 1433, 1412, 1391, 1436, 1582, 1715, 1679, 1660, 1640, 1609, 1579, 1597, 1616, 1567, 1619, 1624, 1460, 1391, 1423, 1458, 1492, 1534, 1575, 1534, 1492, 1536, 1579, 1536, 1492, 1449, 1405, 1491, 1578, 1546, 1514, 1466, 1418, 1420, 1423, 1505, 1588, 1552, 1517, 1506, 1495, 1534, 1574, 1476, 1379, 1399, 1420, 1439, 1458, 1528, 1598, 1498, 1397, 1449, 1501, 1539, 1576, 1614, 1652, 1686, 1721, 1704, 1688, 1702, 1717, 1680, 1644, 1595, 1545, 1593, 1641, 1676, 1914, 2133, 2453, 2657, 2861, 2898, 2732, 2747, 2761, 2881, 3001, 2908, 2815, 2984, 3355, 3429, 3300, 2969, 2434, 2044, 1856, 1691, 1628, 1820, 1808, 1799, 1790, 1817, 1843, 1955, 2066, 1964, 1863, 1812, 1761, 1742, 1722, 1653, 1583, 1699, 1816, 1951, 1985, 1893, 2003, 2100, 2096, 2124, 2152, 2251, 2553, 2880, 3308, 3818, 4126, 3988, 4053, 4249, 4445, 4624, 4329, 4025, 3722, 3717, 3914, 3769, 3421, 3162, 3105, 3142, 3381, 3592, 3465, 3087]
3472C087m80l87j84J6J7j16j15l1l1k9k9k9k9j%j%n0n0n0n0R5R5M4M4J81J80L35K33L14k3
3467B956j12R1J37L6j92l95k68r9j2j81p3J63J72K72L76K07j14k83l49k48j64j64n5n4n5n5
3463A537j0rJ09J08o1o1K3K3r5r5m4m4P6P6K5K6q1q2L8L7j3j3j3j3P1P1j4j15m0J29k3k3J
3458A501%Q5Q5o0o0j0rj18j18R5R5J0r2j29L9P6P7l2l1l3l3J7J8M3M3pqK4K3o0o1N3N4KLP7
3453A559P7pqJ3J3p2p2j0j0j0j0o0n9rrLMQ8Q8K2K2K1K2n6n6O3O2p6p6M3M2o9o9M9M9RQp7
3447A442p6J1J1J1J2N6N7q5q5j17N1P0l1NJ06P9P9ok43j54J5R4R3p2p1J4J84ppJ29m0j48m7
3442A330QJ09r3r3M7M7N3N4KJ03J05j32o5J03R4p4n8M4p5p4j1j2j1j1q5q4L4L3P6P6Q6q2%
3437A444%j1j1J1J0J1J0M3M2qqj49j50P0P0k3k4k3k3K2K2P3P2l1l2N3N3J7J7O8O7r3r4K4K4
$$ y = [3087, 2607, 2220, 2036, 2052, 2069, 1953, 1838, 1807, 1776, 1747, 1718, 1689, 1660, 1659, 1659, 1658, 1658, 1608, 1558, 1508, 1458, 1553, 1648, 1692, 1736, 1917, 2097, 2432, 2665, 2979, 2956, 2844, 2935, 3072, 3108, 2916, 2521, 2253, 2154, 2142, 1961, 1888, 2051, 2223, 2495, 2871, 3078, 2964, 2681, 2332, 2084, 1920, 1756, 1701, 1647, 1592, 1537, 1527, 1518, 1627, 1735, 1674, 1613, 1636, 1659, 1564, 1469, 1425, 1381, 1457, 1533, 1558, 1584, 1503, 1421, 1459, 1496, 1483, 1470, 1457, 1444, 1515, 1586, 1572, 1457, 1417, 1546, 1523, 1500, 1501, 1501, 1586, 1671, 1611, 1551, 1541, 1532, 1414, 1296, 1391, 1486, 1496, 1404, 1275, 1314, 1390, 1467, 1435, 1404, 1371, 1338, 1355, 1373, 1416, 1459, 1452, 1444, 1468, 1491, 1431, 1370, 1423, 1477, 1479, 1482, 1559, 1636, 1629, 1621, 1634, 1647, 1575, 1503, 1493, 1483, 1473, 1463, 1403, 1344, 1335, 1326, 1329, 1333, 1421, 1509, 1531, 1553, 1574, 1596, 1540, 1484, 1547, 1609, 1533, 1457, 1500, 1542, 1473, 1404, 1453, 1502, 1511, 1519, 1442, 1366, 1377, 1388, 1399, 1411, 1467, 1524, 1439, 1354, 1237, 1288, 1358, 1327, 1332, 1438, 1517, 1596, 1590, 1347, 1193, 1208, 1302, 1395, 1323, 1252, 1266, 1450, 1443, 1436, 1565, 1525, 1377, 1330, 1338, 1447, 1354, 1261, 1308, 1355, 1408, 1462, 1464, 1567, 1672, 1540, 1475, 1578, 1672, 1598, 1540, 1584, 1509, 1435, 1424, 1412, 1401, 1390, 1305, 1221, 1255, 1288, 1364, 1440, 1526, 1444, 1444, 1444, 1433, 1422, 1433, 1443, 1454, 1464, 1507, 1549, 1541, 1533, 1384, 1234, 1304, 1374, 1351, 1327, 1304, 1281, 1303, 1325, 1398, 1470, 1439, 1407, 1460, 1513, 1530, 1547, 1615, 1682, 1589, 1495, 1519, 1543]
3432A543RQp6p6jj%jN3N3o5o5lkQ2Q2q3q2k6k5P7J79O5j04r6r5k2k1llj9J49R8mJ3J3l7l6
3426A478m4m3J05Lj7j8p7K5k6k6j3Q8L1p1O6l6J4J5j9j9k6k5R3rqrKr9r9KL9L8J29J30m8m8
3420A478P0P0l7l7l1l1m8N4lmPPk0j22j1j1p5K7N9N9KJ04K1q1q0K1K1q1q1K1J37L5j3j3r6
3415A318NJ57N5m5m4l0P1K9p2j11N9P0l2j11j0P0l1j8j8P7P7qqN4N3o6o5ppppL0L0k7k8O6
3409A469l5k3k3m3N9J2J2q8Q1o5o5J11J11opJ8J8r9j00j6j5J37J36k0k1k1k0j14j14MMP4P4
3404A425P4P4q2q2KKL5L5L5L5l7l7l7l7PQJ13J13O3j38j90J3R4R3K2K1j36j37J5J6j9j8o1
3399A284J42O7j36M1M2NONOPPPPk3k2k3k2j7j7j7j6Q0Q0j05j06R0R0k9k8k0k0O4O5M3M3j43
3394A437j43j5j5j5j5M9N0kjQ8Q7LLPOPPj19j19k2k2j35O8P2P2m1m0J11J11J6J7J7J6r8r8
$$ y = [1543, 1552, 1560, 1484, 1408, 1407, 1406, 1406, 1405, 1458, 1511, 1446, 1381, 1378, 1376, 1458, 1540, 1457, 1375, 1349, 1324, 1401, 1580, 1645, 1541, 1445, 1350, 1328, 1307, 1304, 1301, 1282, 1431, 1529, 1525, 1538, 1551, 1514, 1478, 1434, 1391, 1496, 1499, 1482, 1464, 1387, 1412, 1386, 1360, 1347, 1435, 1466, 1395, 1461, 1425, 1439, 1454, 1435, 1416, 1390, 1365, 1458, 1449, 1441, 1432, 1434, 1335, 1236, 1238, 1277, 1315, 1444, 1574, 1526, 1478, 1548, 1618, 1581, 1544, 1513, 1482, 1434, 1488, 1485, 1481, 1488, 1495, 1475, 1353, 1342, 1331, 1256, 1283, 1342, 1401, 1403, 1507, 1528, 1447, 1367, 1388, 1409, 1328, 1247, 1268, 1405, 1440, 1427, 1414, 1318, 1323, 1480, 1535, 1490, 1446, 1416, 1487, 1516, 1444, 1333, 1392, 1462, 1430, 1319, 1309, 1379, 1348, 1330, 1312, 1389, 1466, 1458, 1450, 1504, 1557, 1491, 1426, 1419, 1412, 1405, 1398, 1428, 1458, 1431, 1403, 1469, 1434, 1411, 1388, 1345, 1404, 1416, 1428, 1340, 1421, 1356, 1291, 1402, 1513, 1507, 1500, 1518, 1536, 1437, 1337, 1321, 1306, 1443, 1579, 1559, 1538, 1517, 1497, 1383, 1269, 1273, 1277, 1351, 1425, 1499, 1573, 1491, 1409, 1411, 1413, 1448, 1483, 1518, 1553, 1516, 1479, 1442, 1405, 1412, 1420, 1533, 1646, 1709, 1571, 1381, 1394, 1488, 1581, 1603, 1624, 1488, 1351, 1366, 1382, 1363, 1345, 1284, 1426, 1493, 1357, 1398, 1440, 1445, 1451, 1456, 1462, 1469, 1476, 1483, 1490, 1467, 1445, 1422, 1400, 1383, 1366, 1349, 1333, 1413, 1493, 1388, 1282, 1372, 1462, 1433, 1405, 1385, 1365, 1429, 1494, 1537, 1580, 1437, 1294, 1279, 1264, 1249, 1234, 1283, 1333, 1331, 1330, 1418, 1505, 1508, 1511, 1518, 1524, 1531, 1538, 1419, 1300, 1278, 1256, 1121, 1189, 1261, 1333, 1292, 1252, 1363, 1474, 1490, 1507, 1524, 1540, 1442, 1344]
3389A344J9K0j2j2P2P2O1O0n7n8l7l7l7l7Q5Q5l2l3OPOOK6K5n9n9llmlL1L2n3n3j3j2P2P2
3383A487M4M5poPQm4m3j6j6o7o6l5l5J51J51n6n6noM1M1p7p7l7l6KKP9j25j0j0K8K8K8K8R5
3377A435R6R1j11r6r6J0J0m5m4P3P3n7n8O1O1J16J15L2L1jjk00LJ2J3J39o3j26j25M7M8n4
3372A389n4L0L1O0O0k4k4M3M4qpj9j9j8j9k9l0K2K2M2M3qqpppoj8j7j8j7K7K7r1r1R0Q9L9
3366A512L9mnn5n5K0K0J15n4m3m4L0L1k9k9k9k9J22J22o4o4M1M1m4m4r0q9K8K8J02J03N1N2
3361A686p8p8k7k8K7K6P8P7l0l1l0l1n6n7n7n7O6O6O5O6n5n4L0K9j04j05J3J4O4O4k0k1k8
3356A424k8m5k14J4J15O0m0j13j2P8P7L0L0n5n4N7N8N8N8j4j4L7L7k1k2k1k1JJn0n0j2j3L9
3351A375L8L6L7L6L6j8j8j8j8J4J5J5J4l2l2J9J8k4k5j09j09Q2Q2l7l6R7R6M6M7k0j9p0o9
$$ y = [1344, 1363, 1383, 1371, 1359, 1431, 1503, 1564, 1624, 1567, 1509, 1472, 1435, 1398, 1361, 1446, 1531, 1499, 1466, 1472, 1479, 1485, 1491, 1517, 1542, 1483, 1424, 1421, 1418, 1414, 1411, 1442, 1474, 1421, 1368, 1355, 1343, 1415, 1487, 1531, 1576, 1569, 1563, 1570, 1578, 1534, 1491, 1475, 1459, 1392, 1326, 1291, 1256, 1407, 1558, 1502, 1446, 1441, 1435, 1476, 1517, 1440, 1363, 1326, 1290, 1292, 1294, 1373, 1248, 1238, 1228, 1256, 1284, 1312, 1340, 1435, 1531, 1622, 1511, 1415, 1319, 1329, 1339, 1294, 1250, 1323, 1396, 1339, 1281, 1342, 1403, 1519, 1634, 1666, 1697, 1696, 1695, 1495, 1498, 1510, 1523, 1662, 1599, 1473, 1348, 1395, 1443, 1389, 1335, 1365, 1396, 1456, 1516, 1492, 1468, 1511, 1555, 1547, 1540, 1521, 1502, 1484, 1465, 1436, 1406, 1428, 1450, 1492, 1535, 1527, 1519, 1512, 1505, 1498, 1492, 1474, 1457, 1439, 1422, 1449, 1476, 1385, 1294, 1384, 1473, 1512, 1551, 1547, 1542, 1487, 1432, 1452, 1472, 1587, 1533, 1490, 1446, 1476, 1507, 1478, 1449, 1420, 1391, 1513, 1635, 1571, 1507, 1548, 1589, 1545, 1501, 1411, 1322, 1350, 1378, 1480, 1583, 1634, 1686, 1608, 1530, 1503, 1475, 1502, 1528, 1606, 1683, 1653, 1622, 1592, 1561, 1505, 1448, 1391, 1334, 1400, 1466, 1531, 1597, 1542, 1488, 1518, 1547, 1443, 1338, 1351, 1365, 1429, 1493, 1473, 1452, 1424, 1396, 1351, 1137, 1151, 1266, 1326, 1286, 1173, 1161, 1239, 1316, 1346, 1376, 1321, 1267, 1324, 1382, 1440, 1498, 1484, 1470, 1507, 1544, 1523, 1501, 1480, 1459, 1460, 1461, 1411, 1361, 1349, 1336, 1375, 1413, 1449, 1486, 1522, 1558, 1540, 1522, 1504, 1486, 1500, 1515, 1530, 1544, 1512, 1480, 1499, 1517, 1493, 1468, 1359, 1250, 1332, 1414, 1377, 1341, 1438, 1534, 1580, 1627, 1607, 1588, 1518, 1449]
3346A449k2k2MLo9o9M9M9N5N6j30j30l5l6M9M9O4O4k1k1j6j6O9O8rj0PJ09J01o7n0n1o5o5
3341A341Q7Q7M6M7j05j06RRR3R3q7q6R9R9o1o1l5l6j1j1j1j2K1K0nmk2k2m3N9J25j11k2J46
3336A530P6k6p7p7o1o2K2K3p9p8J07J07K1K1l0l0l2l2N2N3n1n1j%JJn0m9N8N8Q3Q3n8n9l3
3330A360l4L9L9j1j2k8k7kl%%%%N7N8L2L2q1q0MMO1O1n8n7K9K9O7O8Q0j22j74L0Q5Q4n5n4
3325A421M0M1q4q4O2l9j15Q7N1J52M6n5jjJ7J8j0j0r5r5J09J08m3m4NNm5m6o5o6Q6Q6j6j6
3320A404j6j7J8J8O9O8l0l1n6n6N0M9o9p0K8K7J53m9j13R0O4l8J40L7j20j9M4M4N3j50p1L0
3315A481J02Jk3k2K8K8r0J1J8j85k7k8P8P8lmlll0k9N5N6l2l2poO9O9j6j5m2m1P0P0o3j64
3309A349n6J12J26K4PQn6n6K9K8m4m5M0M0o0n9K5K5j2j1L8L9L9L9m6m5n5n4L0L0M0M1K3p7
$$ y = [1449, 1427, 1405, 1409, 1412, 1343, 1274, 1323, 1372, 1427, 1483, 1353, 1223, 1188, 1152, 1201, 1250, 1314, 1378, 1357, 1336, 1320, 1304, 1373, 1441, 1432, 1422, 1429, 1538, 1639, 1572, 1522, 1471, 1406, 1341, 1428, 1515, 1561, 1608, 1503, 1397, 1406, 1415, 1508, 1601, 1514, 1428, 1527, 1626, 1565, 1504, 1469, 1433, 1422, 1411, 1400, 1388, 1409, 1429, 1424, 1420, 1398, 1376, 1333, 1392, 1517, 1406, 1384, 1530, 1606, 1580, 1503, 1426, 1365, 1303, 1325, 1348, 1269, 1191, 1298, 1405, 1426, 1447, 1417, 1387, 1355, 1323, 1375, 1428, 1377, 1326, 1325, 1325, 1326, 1327, 1277, 1228, 1286, 1344, 1427, 1510, 1452, 1393, 1360, 1326, 1365, 1404, 1393, 1381, 1353, 1326, 1324, 1321, 1321, 1321, 1321, 1321, 1378, 1436, 1468, 1500, 1419, 1339, 1343, 1347, 1408, 1469, 1411, 1354, 1383, 1412, 1479, 1547, 1627, 1505, 1331, 1361, 1446, 1530, 1475, 1421, 1461, 1502, 1418, 1334, 1396, 1357, 1242, 1329, 1380, 1532, 1578, 1523, 1522, 1521, 1538, 1556, 1546, 1536, 1441, 1346, 1455, 1563, 1520, 1476, 1481, 1486, 1441, 1395, 1330, 1264, 1350, 1436, 1420, 1404, 1388, 1371, 1389, 1407, 1476, 1544, 1514, 1483, 1427, 1371, 1421, 1470, 1401, 1331, 1359, 1386, 1539, 1490, 1377, 1467, 1531, 1493, 1633, 1670, 1550, 1531, 1575, 1619, 1672, 1522, 1451, 1481, 1583, 1584, 1561, 1539, 1567, 1595, 1505, 1516, 1534, 1349, 1322, 1294, 1372, 1450, 1447, 1443, 1440, 1437, 1407, 1378, 1433, 1489, 1457, 1425, 1418, 1412, 1481, 1550, 1534, 1519, 1477, 1436, 1506, 1576, 1513, 1349, 1293, 1405, 1531, 1555, 1562, 1570, 1514, 1458, 1487, 1515, 1471, 1426, 1466, 1506, 1446, 1387, 1412, 1437, 1425, 1414, 1452, 1491, 1530, 1569, 1523, 1478, 1423, 1369, 1399, 1429, 1469, 1510, 1533, 1456]
3304A456m1J28l4j36J8J9L7L7n5n5l1l0m4m5OON5N5NNK1K0K1K1p2p2J9J8R0J91R2j45j37L2
3299A455PPr0r0K8K8M4M4opklM8M9K4K4k6k7p1p2J9J9n1N0R5p4k0Q2j1j2K0K0P0P0j61j62
3293A318K4K5K6K6K6K6P3P3j1j1M2M2j43j44ppJ8J8J8J7l3l3j2j1O6O7P3k9j84j6k8k9jJ00
3288A379J44k5o5L6O0O0n1n2k1k0MNj1j2j1j2j3j3P2P2p3p3M5M5M9M8j03j03L6L6j5j5K9K9
3283A461k1k2M2M1L6L5K6p6j13N5qqN3N4m8m8r2P6L3L3pqm4m5j9j9N3N2K7K8l6l7J5J4L2L2
3277A547n9n8M3n8r6P3m7m6J5J4R9J00J4J5m9m9k4k4MLQ8Q9K6K6n8n8j7j7j6j7M1M2j0rj16
3272A411j17l2l2O2O3L7L7J3J3J2J3N1N2%j00j62QN8N8K6K5K5K6L8L8m6m6j5j4j5j4N3N3m
3267A575ll5j35k2J47J7J7k4k3j4j4L7L6k4k4k4k4Q6Q6o6o7NMMNK3K3k7k8k0k0k1k0P1P0q1
$$ y = [1456, 1415, 1543, 1509, 1373, 1391, 1410, 1447, 1484, 1429, 1374, 1343, 1313, 1269, 1224, 1230, 1236, 1291, 1346, 1351, 1356, 1377, 1397, 1418, 1439, 1367, 1295, 1314, 1332, 1422, 1613, 1705, 1560, 1423, 1455, 1462, 1469, 1379, 1289, 1317, 1345, 1389, 1433, 1427, 1420, 1418, 1415, 1463, 1512, 1536, 1560, 1534, 1507, 1436, 1364, 1383, 1402, 1351, 1401, 1496, 1422, 1402, 1484, 1473, 1461, 1481, 1501, 1571, 1641, 1480, 1318, 1342, 1367, 1393, 1419, 1445, 1471, 1544, 1617, 1606, 1595, 1637, 1679, 1536, 1392, 1385, 1378, 1396, 1414, 1432, 1449, 1416, 1383, 1371, 1360, 1426, 1493, 1566, 1537, 1353, 1337, 1309, 1280, 1279, 1379, 1523, 1498, 1433, 1469, 1529, 1589, 1538, 1486, 1465, 1445, 1449, 1454, 1443, 1431, 1420, 1408, 1395, 1382, 1454, 1526, 1453, 1380, 1425, 1470, 1519, 1567, 1464, 1361, 1397, 1433, 1418, 1403, 1432, 1461, 1440, 1418, 1460, 1501, 1537, 1572, 1598, 1522, 1409, 1464, 1456, 1448, 1501, 1555, 1507, 1459, 1367, 1443, 1476, 1509, 1502, 1494, 1450, 1405, 1386, 1367, 1420, 1472, 1499, 1527, 1491, 1454, 1469, 1483, 1515, 1547, 1488, 1430, 1473, 1415, 1319, 1392, 1345, 1299, 1314, 1328, 1427, 1527, 1541, 1556, 1507, 1458, 1434, 1410, 1414, 1417, 1505, 1594, 1620, 1646, 1588, 1530, 1513, 1496, 1480, 1463, 1504, 1546, 1536, 1527, 1411, 1294, 1262, 1230, 1292, 1355, 1392, 1429, 1442, 1455, 1467, 1480, 1531, 1583, 1583, 1483, 1321, 1329, 1387, 1445, 1471, 1496, 1521, 1547, 1585, 1623, 1577, 1531, 1516, 1502, 1487, 1473, 1526, 1579, 1575, 1572, 1537, 1402, 1380, 1527, 1544, 1561, 1537, 1514, 1500, 1486, 1523, 1559, 1535, 1511, 1487, 1463, 1549, 1635, 1569, 1502, 1507, 1511, 1515, 1520, 1543, 1566, 1539, 1511, 1491, 1471, 1450, 1430, 1501, 1571, 1490]
3261A490Q7L6o6r9P0N8m4l2O8k4k4j8j7P5P5p7p7n8n8O0O0J13J13p3p3j58j58K8K8K7K7K7
3257A386K7M9M8o9p0O0O0O1O0l9l8l9l8K4K5K5K5n7n8n7n7O3O3nR7O4j05j10N9J02o7j18N1
3252A422J23m6j93j93M0M1J26J25j9j9p0p0O7O8P7r1J2J2n0J19M6n6O2O3m0l9M5M5kklkJ0
3246A608J0m0m0m7m7m7m7n7n7J29J29L0L1q8q8klM8M9J8J9o6o6M7M8llk1k1k1k1j8j7O7O7
3241A480L7L7m7m7K6K5K6K5j5j6O9O9j17j17l2J37N3m8P6k5m1m2r8r9j7j8O8O7qqM3M3M6M6
3236A578p2j73j9J51J06Nj09j09KJ04J18n1N0N1k2k1k2k1q1q0L8L7m6m7m6m7RJ0N4N4kj04
3231A295m2J61M2M3l0k9p1p2M7M7Q6Q6KKM0M0o5o6j57M6J41L9r6r5j8j8O7O7j7j7L2L2L2L2
3226A586LMm8m7N3N4l0l1k8k8Q7j17q1q2R2R1R7R7q9q9k7k6K4K4K0J9K0K0m8m8m8m7j0j0P5
$$ y = [1490, 1577, 1613, 1547, 1448, 1518, 1576, 1532, 1500, 1568, 1544, 1520, 1502, 1485, 1560, 1635, 1558, 1481, 1423, 1365, 1425, 1485, 1598, 1711, 1638, 1565, 1407, 1249, 1277, 1305, 1332, 1359, 1386, 1413, 1462, 1510, 1441, 1371, 1431, 1491, 1552, 1612, 1573, 1535, 1496, 1458, 1482, 1507, 1532, 1557, 1500, 1442, 1385, 1328, 1391, 1454, 1449, 1546, 1610, 1505, 1395, 1454, 1556, 1489, 1371, 1422, 1545, 1499, 1306, 1113, 1153, 1194, 1320, 1445, 1426, 1407, 1337, 1267, 1334, 1402, 1479, 1388, 1400, 1412, 1362, 1481, 1527, 1471, 1533, 1596, 1556, 1517, 1562, 1607, 1605, 1603, 1600, 1598, 1608, 1618, 1578, 1538, 1491, 1444, 1397, 1350, 1293, 1236, 1365, 1494, 1524, 1555, 1467, 1379, 1377, 1374, 1422, 1471, 1489, 1508, 1442, 1376, 1423, 1471, 1468, 1465, 1444, 1423, 1402, 1381, 1363, 1346, 1413, 1480, 1517, 1554, 1507, 1460, 1486, 1511, 1537, 1562, 1547, 1531, 1600, 1669, 1552, 1435, 1403, 1540, 1593, 1545, 1621, 1596, 1555, 1513, 1415, 1316, 1299, 1281, 1349, 1416, 1408, 1400, 1443, 1486, 1532, 1578, 1506, 1333, 1314, 1465, 1571, 1576, 1467, 1358, 1360, 1464, 1582, 1531, 1581, 1632, 1610, 1589, 1567, 1546, 1465, 1385, 1423, 1460, 1414, 1367, 1321, 1274, 1283, 1293, 1347, 1401, 1399, 1295, 1253, 1414, 1456, 1499, 1469, 1440, 1369, 1297, 1344, 1391, 1477, 1563, 1565, 1567, 1607, 1647, 1582, 1516, 1359, 1405, 1546, 1585, 1489, 1394, 1376, 1358, 1425, 1492, 1475, 1458, 1490, 1522, 1554, 1586, 1589, 1593, 1545, 1498, 1551, 1605, 1575, 1544, 1516, 1488, 1575, 1458, 1377, 1295, 1387, 1478, 1575, 1672, 1583, 1494, 1467, 1441, 1465, 1489, 1509, 1528, 1548, 1568, 1520, 1472, 1424, 1377, 1367, 1357, 1432]
3221A432P4NNNNm9m8JKQQRQJ0J0j01j02rR3J56m7l9O3M4M3n1n1n2n1j7j6q6J16J01jj5j6j9
3215A428k0p0p0N4N4L6J37J23p9j24P9R4R4p9p9o9o9J5J6j5j5j5j6K0K0P0P1l9l8J2J2n4n4
3210A430O4O4q8q8O4O4Q1Q0L0L0j13j14NNK5K6n9n9RRRQj3j4j4j3Q5Q6l3l2J02J03n0n0k5
3204A614k5k5k6n2n1L2L3lkkllmmmR6R5k2k3r2r1J40o2k2k2l4l5M1M1M0M1rrqrL4L3q4q4m3
3198A387m4m3m3M5M6L2L3J40o2o7o6LLN3N4m7m8J04J05J7J8o7o7j3j3K5K5J03r9J4J4l4l4
3193A474l4l4J9K0P0P0o9o8o8o8L6L6L6L7M0M1p8p8K1K0k9l0J9K0J9K0j5j6L5L5J7J6J6J6
3188A546k1k1p2p2rqrrJ55J54L6L6j9j9j9j9l6l7M8M8l3l2O3j07n3n4j3j3N1N1l4l3J0RO1
3183A526O0ONm5m5J32J33n3M8k1j91j46m4J4J4K0K0Q7Q7l1l2J0J0J0J0P1P0j5j4r5r4K3K4
$$ y = [1432, 1506, 1511, 1516, 1521, 1526, 1477, 1429, 1430, 1432, 1440, 1448, 1457, 1465, 1475, 1485, 1384, 1282, 1273, 1366, 1522, 1475, 1436, 1499, 1543, 1586, 1535, 1484, 1432, 1381, 1364, 1348, 1262, 1378, 1479, 1478, 1463, 1447, 1428, 1408, 1338, 1268, 1322, 1376, 1412, 1549, 1672, 1593, 1469, 1548, 1642, 1736, 1657, 1578, 1509, 1440, 1455, 1471, 1456, 1441, 1426, 1410, 1430, 1450, 1520, 1591, 1552, 1514, 1526, 1538, 1484, 1430, 1494, 1558, 1470, 1382, 1446, 1510, 1591, 1671, 1701, 1731, 1618, 1504, 1509, 1514, 1539, 1565, 1506, 1447, 1456, 1465, 1474, 1482, 1469, 1455, 1441, 1428, 1513, 1599, 1566, 1534, 1636, 1739, 1689, 1639, 1614, 1589, 1564, 1538, 1486, 1435, 1467, 1500, 1497, 1495, 1493, 1490, 1487, 1483, 1479, 1475, 1571, 1666, 1644, 1621, 1529, 1438, 1578, 1516, 1494, 1472, 1438, 1403, 1444, 1485, 1525, 1566, 1557, 1548, 1540, 1531, 1565, 1598, 1514, 1430, 1387, 1343, 1300, 1257, 1302, 1348, 1380, 1413, 1553, 1491, 1424, 1358, 1361, 1364, 1417, 1471, 1424, 1376, 1480, 1585, 1602, 1620, 1553, 1486, 1473, 1460, 1485, 1510, 1613, 1514, 1528, 1542, 1508, 1474, 1440, 1406, 1425, 1445, 1515, 1585, 1516, 1448, 1380, 1312, 1348, 1384, 1420, 1457, 1497, 1538, 1460, 1382, 1403, 1423, 1394, 1364, 1383, 1403, 1422, 1442, 1427, 1411, 1446, 1481, 1498, 1514, 1530, 1546, 1525, 1504, 1432, 1360, 1351, 1343, 1334, 1325, 1480, 1634, 1670, 1706, 1687, 1668, 1649, 1630, 1594, 1557, 1605, 1653, 1620, 1588, 1651, 1544, 1491, 1437, 1424, 1411, 1462, 1513, 1479, 1446, 1456, 1465, 1526, 1586, 1592, 1597, 1552, 1507, 1639, 1772, 1719, 1767, 1746, 1555, 1409, 1365, 1379, 1393, 1413, 1433, 1520, 1607, 1576, 1544, 1554, 1564, 1574, 1584, 1655, 1725, 1710, 1696, 1601, 1507, 1530, 1554]
3178A554k3k3k3k3K3K3K2K3l6l7l6l7k6k7k7k6R3R4k5k4K5K5n9o0P8P8poo6o5M6M6R0j2k62
3172A290r4K5J26J38L6K0K0p1p1K6K7j30L9J39k9l2P0j9j8Q9q0j44m3O5O5K1j49L2L1L0L0
3168A439L7L6p1L0J25m4j11rQQn9n9O0N9J1J1J1J1K2K2K3K2k6k7K5K4o5o5J9J9J2J2J2J2j2
3162A522j3r6r7O0O1k4k4MMN4N4M2M2p7p6J9J9l2l2onL9j30N7N7M6M7m7m6L8L8J0J0J1J0P9
3157A618P9o3o2p3R6N2N1m5m5L9L9q4q4l3l3N8N8K0K0k10oL2L1l1l2J9J9%%N0N1l6l6m4J58
3151A573J20q2p5p4lmq8q8L5L5L5L5L3L4m4m5k2P9N1j51K4K4J1J1L4L4L4L4ppppJ3J4l7l7
3146A485J8J8J8J8o5o4K0K0J6J6J6J6j2j2Qr4q0J24LLo0n9K5K4poppRRN1j51q9J14M4M4p8
3140A328K3J65l8nnj8j8R1R0OOJ9J9l2l2m3m3m3m3n0n1L4L4N0N0jjq9q9n8J45J45M4rj10j50
$$ y = [1554, 1531, 1508, 1485, 1462, 1485, 1508, 1530, 1553, 1517, 1480, 1444, 1407, 1381, 1354, 1327, 1301, 1394, 1488, 1463, 1439, 1464, 1489, 1430, 1370, 1448, 1526, 1519, 1513, 1447, 1382, 1428, 1474, 1564, 1552, 1290, 1196, 1221, 1347, 1485, 1521, 1541, 1561, 1490, 1419, 1445, 1472, 1342, 1381, 1520, 1491, 1459, 1529, 1510, 1492, 1581, 1501, 1357, 1314, 1379, 1444, 1465, 1316, 1348, 1379, 1409, 1439, 1476, 1512, 1441, 1471, 1596, 1552, 1441, 1432, 1440, 1448, 1389, 1330, 1390, 1449, 1460, 1471, 1482, 1493, 1515, 1537, 1560, 1582, 1556, 1529, 1554, 1578, 1513, 1448, 1467, 1486, 1498, 1510, 1522, 1534, 1522, 1509, 1413, 1316, 1376, 1437, 1413, 1389, 1393, 1397, 1451, 1505, 1547, 1589, 1512, 1436, 1455, 1474, 1442, 1410, 1404, 1399, 1438, 1308, 1365, 1422, 1468, 1515, 1468, 1422, 1460, 1498, 1508, 1518, 1529, 1539, 1618, 1697, 1634, 1572, 1499, 1595, 1647, 1698, 1653, 1608, 1647, 1686, 1602, 1518, 1485, 1452, 1510, 1568, 1588, 1608, 1398, 1392, 1424, 1455, 1424, 1392, 1411, 1430, 1430, 1430, 1480, 1531, 1495, 1459, 1415, 1573, 1693, 1611, 1536, 1462, 1459, 1455, 1367, 1279, 1314, 1349, 1384, 1419, 1452, 1486, 1442, 1397, 1375, 1454, 1505, 1354, 1378, 1402, 1413, 1424, 1458, 1492, 1526, 1560, 1553, 1546, 1539, 1532, 1545, 1559, 1522, 1485, 1503, 1521, 1539, 1557, 1492, 1428, 1448, 1468, 1484, 1500, 1516, 1532, 1520, 1508, 1516, 1422, 1342, 1466, 1469, 1472, 1412, 1353, 1378, 1402, 1395, 1389, 1382, 1375, 1384, 1393, 1444, 1293, 1204, 1318, 1362, 1406, 1328, 1351, 1516, 1478, 1473, 1468, 1450, 1432, 1523, 1613, 1619, 1625, 1644, 1663, 1631, 1599, 1556, 1513, 1470, 1427, 1377, 1326, 1360, 1394, 1444, 1494, 1493, 1492, 1403, 1314, 1256, 1401, 1546, 1590, 1581, 1471, 1321]
3135A321m9J08J07jkn2n3L4L3Q4Q4L9L9L9L9j12j12o1M0Q5q3o6o6N6N6J2J2o1M1J30m0l3l3
3130A535PPk7k8K3K3O7O6j8j8l5l6l5l6p7p6P5P5k7k7K3K3K1K2o4o3K9K9j23j23J8J7K4K4
3125A295J5J16J10n9j02jJ6J6L2L2n2n3K3K4P4P4kkn3n3nnP9P9pqpqL3L3L3L2j39j39Q0Q0
3119A581l9l9J1J2m1m0J0J0N3N3N3N4m3m3M2M2L1L2L1L1r4r5K4K4k0k0p1p1ppMMn0J19k7k7
3114A487lmj6Q5M3n9m6m6J26J25k7k7JJq4q4M7M6K0q3m4m4%%j4j4P0P0J5J4r3PKJQQJ4J4m2
3108A474N8L7L8o4L7l9m0r1J1N9N8O4O5JJq4q3J3J3p1p1j0j0j6Q5Q2Q3MML6L6m9m8l3l3j2
3102A505R0j2j13n6M5m4m3J3J4mlJ8J19J20J9o6L6M2n9j04kJ9K0K5p5k4j26M4M4L2L2k5P7
3097A558ooj39L0p2L0k3k4J01jr2RJ25K4o9J00L7j31p2K9j4J55M0o3j1j2l5j36k3J46M5M4
$$ y = [1321, 1272, 1380, 1487, 1486, 1484, 1432, 1379, 1413, 1446, 1530, 1614, 1653, 1692, 1731, 1770, 1658, 1546, 1485, 1525, 1610, 1527, 1461, 1395, 1451, 1507, 1519, 1531, 1470, 1511, 1641, 1601, 1568, 1535, 1542, 1549, 1522, 1494, 1517, 1540, 1607, 1673, 1655, 1637, 1602, 1566, 1531, 1495, 1418, 1342, 1417, 1492, 1465, 1438, 1461, 1484, 1505, 1527, 1463, 1400, 1429, 1458, 1335, 1212, 1230, 1247, 1271, 1295, 1310, 1426, 1536, 1477, 1375, 1374, 1390, 1406, 1438, 1470, 1418, 1365, 1388, 1412, 1486, 1560, 1558, 1556, 1503, 1450, 1445, 1440, 1519, 1598, 1591, 1583, 1576, 1568, 1601, 1634, 1667, 1699, 1560, 1421, 1501, 1581, 1542, 1503, 1514, 1526, 1485, 1445, 1455, 1465, 1518, 1571, 1624, 1678, 1635, 1592, 1634, 1676, 1707, 1739, 1770, 1801, 1707, 1612, 1636, 1660, 1640, 1620, 1549, 1478, 1471, 1464, 1468, 1472, 1422, 1541, 1514, 1487, 1484, 1480, 1464, 1549, 1592, 1533, 1487, 1441, 1567, 1692, 1665, 1638, 1639, 1640, 1556, 1472, 1519, 1565, 1585, 1502, 1458, 1414, 1414, 1414, 1400, 1386, 1456, 1526, 1541, 1555, 1462, 1469, 1471, 1472, 1480, 1488, 1502, 1516, 1474, 1532, 1569, 1607, 1543, 1580, 1541, 1501, 1410, 1421, 1480, 1538, 1602, 1667, 1668, 1669, 1585, 1502, 1515, 1528, 1457, 1386, 1376, 1366, 1350, 1435, 1517, 1600, 1604, 1608, 1644, 1680, 1631, 1583, 1550, 1517, 1505, 1595, 1583, 1470, 1414, 1459, 1415, 1372, 1385, 1399, 1395, 1392, 1410, 1529, 1649, 1668, 1602, 1638, 1680, 1621, 1517, 1515, 1534, 1554, 1579, 1504, 1480, 1354, 1398, 1442, 1474, 1506, 1481, 1558, 1552, 1546, 1407, 1437, 1365, 1395, 1372, 1348, 1449, 1448, 1356, 1365, 1490, 1514, 1445, 1545, 1582, 1451, 1379, 1408, 1394, 1549, 1589, 1526, 1515, 1503, 1468, 1332, 1309, 1455, 1500, 1544]
3092A544J2J2j64o2m3m3R3J93k7k7j4j4o5L6L7L6j09qM2M3J21m9M7M7n6n6K9K9J5J5p0o9R0
3087A565R0n6n6m0O2kkkj04RJ10Rr3l5l6Q4j7k4P7K1q1q1K1J56N4n7M3k6k6j4j14n0m9K8K9
3082A393M8M8klOOj1j12o6J03J74OM9n3oojkn2n1m1m0M4M4j04j04M2M2J22K1o8o8J5J16J47
3076A636q9l8O3P6P6n6n6JJj14j3L6j33j3J57%%qqqqJ16J15l0l0m9N3R6p2j27k6N9N8n2n2
3071A561L2L2L6L6m9m9l4l4l4l4L4L4L4L4L4L3j8j8mmmlj8j8L3L3NMm6m6j10j09M3M2K0K0
3066A468P1P0q1q2K7K6J35l5m7N4j2j2oon5n5nmL6L5L6L6l2l2q3q2J01J01j7j7J7J7J7J8J5
3060A617J5J5J5M1M0p8p7P5P5j44j44m4m4J08J08J8J7j00j01L8L8j3j2L8L8L8L8l8l7l8l7
3056A465J%N1N2l3l4J8J7l9m0J1J2K9K9k1k1j9j9l6O5J08o0j41m0N3m9J4J5O5O4j9k0LKN4
$$ y = [1544, 1556, 1568, 1404, 1342, 1299, 1256, 1349, 1542, 1515, 1488, 1474, 1460, 1395, 1431, 1468, 1504, 1395, 1387, 1429, 1472, 1593, 1544, 1591, 1638, 1582, 1526, 1555, 1584, 1599, 1614, 1544, 1475, 1565, 1655, 1599, 1543, 1503, 1565, 1563, 1561, 1559, 1455, 1464, 1574, 1583, 1490, 1455, 1419, 1503, 1486, 1462, 1539, 1560, 1479, 1398, 1419, 1575, 1629, 1572, 1615, 1589, 1563, 1549, 1435, 1385, 1336, 1364, 1393, 1441, 1489, 1487, 1484, 1490, 1496, 1485, 1373, 1307, 1410, 1584, 1590, 1639, 1586, 1580, 1574, 1573, 1571, 1519, 1468, 1427, 1387, 1431, 1475, 1371, 1267, 1309, 1351, 1473, 1494, 1426, 1358, 1373, 1489, 1636, 1547, 1509, 1572, 1648, 1724, 1668, 1612, 1613, 1614, 1500, 1487, 1523, 1390, 1377, 1534, 1534, 1534, 1526, 1518, 1510, 1502, 1618, 1733, 1703, 1673, 1624, 1677, 1773, 1701, 1574, 1548, 1607, 1665, 1613, 1561, 1593, 1625, 1661, 1697, 1648, 1599, 1565, 1531, 1497, 1463, 1497, 1531, 1565, 1599, 1633, 1666, 1648, 1630, 1626, 1622, 1618, 1615, 1597, 1579, 1612, 1645, 1650, 1654, 1608, 1562, 1452, 1343, 1386, 1428, 1448, 1468, 1539, 1609, 1528, 1446, 1473, 1499, 1634, 1599, 1552, 1606, 1594, 1582, 1576, 1570, 1515, 1460, 1455, 1451, 1487, 1522, 1558, 1594, 1562, 1530, 1447, 1365, 1466, 1567, 1550, 1533, 1550, 1567, 1584, 1602, 1617, 1632, 1647, 1662, 1703, 1743, 1665, 1588, 1663, 1738, 1594, 1450, 1406, 1362, 1470, 1578, 1596, 1613, 1513, 1412, 1450, 1488, 1475, 1463, 1501, 1539, 1577, 1615, 1577, 1540, 1502, 1465, 1466, 1466, 1517, 1569, 1536, 1502, 1520, 1537, 1498, 1458, 1469, 1481, 1510, 1539, 1518, 1497, 1478, 1459, 1423, 1488, 1596, 1536, 1395, 1355, 1408, 1359, 1373, 1388, 1453, 1517, 1498, 1478, 1481, 1483, 1537]
3050A537N3o4o4j4j4mmM7M7k5k5k6k5R0R0k8k8r2r2K7K6O1O0n8n8M1M1m3m4Q2Q2klj6j6j6
3045A523j7o7o8N0N0l9l9P9P9j20j19O6O6O3O3k2k2j23j23J30J30L2L1M9j20j05lJ05Lk2k1
3040A489k8k8M9M9l5l5O8O7n0n1rrj0rL4L3q5q5m1m2M3M3J8J8O9O8ppj60j59R1R1k7k7pop
3034A306pQ5Q6L7o5p0J33l8l8M8M8l6l7k1k2k2k1mmmmO8O7O8O8m7m8m7m7O2O3r0q9qqM3M3
3029A448O3O2j10j10q1J22J28p4n3M8k2k1o1o1R1R1o8o8J6J7K7K7P8P8k7k8N7N7LLq1q2J3
3024A482J2o1j63q7K51J75k9o7L5q7q6Q0Q1nmn6n6O2O3j8j8q8J4J11r2K8K9M6M6R7R7j21j22
3019A549p1p1R7R7J3J2qrn9o0K5K4k6k7K8K7K8K7q6q6L2L3L3L3j7j8R0R0k9k9j5j5j5j5j4
3013A568j4o5o6P7P6m2m2J9J8J9J8ppopn6n5nnL0L0Q1Q1m0m1J1J0n3n4n4n4p1p2M7M7M1M0
$$ y = [1537, 1590, 1526, 1462, 1448, 1434, 1430, 1426, 1473, 1520, 1495, 1470, 1444, 1419, 1509, 1599, 1571, 1543, 1451, 1359, 1386, 1412, 1473, 1533, 1475, 1417, 1458, 1499, 1456, 1412, 1494, 1576, 1574, 1571, 1555, 1539, 1523, 1506, 1439, 1371, 1421, 1471, 1432, 1393, 1472, 1551, 1431, 1312, 1378, 1444, 1507, 1570, 1548, 1526, 1403, 1280, 1410, 1540, 1572, 1603, 1652, 1532, 1427, 1424, 1529, 1532, 1510, 1489, 1461, 1433, 1482, 1531, 1496, 1461, 1529, 1596, 1546, 1495, 1486, 1477, 1467, 1458, 1492, 1525, 1440, 1355, 1314, 1272, 1315, 1358, 1376, 1394, 1463, 1531, 1524, 1517, 1357, 1198, 1289, 1380, 1353, 1326, 1319, 1313, 1306, 1299, 1384, 1470, 1507, 1442, 1372, 1505, 1467, 1429, 1477, 1525, 1489, 1452, 1431, 1409, 1387, 1366, 1362, 1358, 1354, 1350, 1418, 1485, 1553, 1621, 1574, 1526, 1479, 1432, 1494, 1557, 1467, 1378, 1370, 1362, 1405, 1448, 1511, 1573, 1463, 1353, 1272, 1394, 1522, 1448, 1395, 1443, 1421, 1400, 1339, 1278, 1369, 1460, 1392, 1324, 1340, 1357, 1384, 1411, 1489, 1567, 1540, 1512, 1569, 1626, 1629, 1632, 1551, 1469, 1482, 1494, 1433, 1270, 1183, 1434, 1609, 1580, 1513, 1548, 1461, 1375, 1455, 1536, 1531, 1527, 1471, 1415, 1477, 1540, 1522, 1504, 1416, 1430, 1541, 1449, 1477, 1506, 1552, 1598, 1695, 1792, 1671, 1549, 1478, 1407, 1504, 1601, 1614, 1626, 1618, 1609, 1550, 1490, 1515, 1539, 1513, 1486, 1514, 1541, 1569, 1596, 1510, 1424, 1456, 1489, 1522, 1555, 1538, 1520, 1610, 1700, 1671, 1642, 1627, 1612, 1597, 1582, 1568, 1554, 1489, 1423, 1500, 1576, 1534, 1492, 1511, 1529, 1548, 1566, 1559, 1552, 1546, 1539, 1483, 1428, 1423, 1418, 1448, 1478, 1559, 1640, 1600, 1559, 1570, 1580, 1527, 1473, 1419, 1365, 1294, 1222, 1269, 1316, 1357, 1397]
3008A397M1M1m2m3M3M2J5J5J5J4n0n0O8O9LMK3p9j45N7Q9Q9n1n2J01J01K5K6K6K5r7r8j4j3
3002A595m8m7j18Q6J06NK4K5q8q8n0J53J4J3K7K6p4p4p3p4N2N2JJJ7J7J6J7o0o1N8N8N1N1
2997A610o8o7M3M3M4M3M8M8j04j05%jN0N0l5l5l4l5J8J8J8J8m6m6NNj7j6O8O9onnnq7q8L1
2992A424L1L5L6L5L5m7m7m7m7R5R6n7n7K4K3K4K3L4L3m0m1q8Q1j4j4l5l5l5l6j1j1P4P3j2
2986A502j2j3j2l0l0K0K0N0M9o9o8N4N5N5N4p6p5n3J17j9j9qqo5o4K0K0P0P1l1J38J25K4o1
2981A731o1m7m7LMP8P9l9m0m5m4m5m5onP8P9J6J5o9o9KKKKn3n3n2n3K7K8k3k3K9K8k2k2M7
2975A387M6l8l8R1R1OOj53j53J01J00O3O2q9r0m3m3PQNOQ9R0R5R4j25j25K8K9K8K8l5l6J6
2970A508J5j3j2L7L8q7q7L2L1LLLKL3L2j8j8o9o9M9N0j1j1j1j1K9L0K9K9K8K8n6n6M8M8lk
$$ y = [1397, 1438, 1479, 1437, 1394, 1437, 1479, 1494, 1509, 1524, 1538, 1488, 1438, 1506, 1575, 1578, 1582, 1605, 1526, 1381, 1438, 1527, 1616, 1565, 1513, 1614, 1715, 1740, 1766, 1792, 1817, 1720, 1622, 1608, 1595, 1547, 1500, 1382, 1468, 1574, 1579, 1603, 1628, 1540, 1452, 1402, 1555, 1569, 1582, 1609, 1635, 1561, 1487, 1414, 1340, 1392, 1444, 1445, 1446, 1463, 1480, 1496, 1513, 1453, 1392, 1450, 1508, 1559, 1610, 1542, 1475, 1518, 1561, 1605, 1648, 1696, 1744, 1640, 1535, 1535, 1534, 1584, 1634, 1599, 1564, 1530, 1495, 1513, 1531, 1549, 1567, 1521, 1475, 1480, 1485, 1468, 1452, 1520, 1589, 1583, 1578, 1573, 1568, 1481, 1393, 1424, 1455, 1490, 1526, 1561, 1596, 1549, 1502, 1455, 1408, 1503, 1599, 1542, 1485, 1509, 1532, 1556, 1579, 1613, 1646, 1606, 1565, 1477, 1558, 1544, 1530, 1495, 1460, 1425, 1389, 1378, 1367, 1441, 1514, 1502, 1490, 1477, 1465, 1435, 1405, 1425, 1445, 1495, 1544, 1475, 1407, 1461, 1516, 1571, 1625, 1549, 1474, 1421, 1538, 1519, 1500, 1492, 1484, 1419, 1355, 1375, 1395, 1465, 1536, 1505, 1643, 1768, 1792, 1731, 1670, 1623, 1576, 1579, 1583, 1661, 1740, 1701, 1661, 1616, 1572, 1527, 1482, 1476, 1471, 1549, 1628, 1644, 1659, 1590, 1521, 1523, 1525, 1527, 1529, 1476, 1423, 1371, 1318, 1345, 1373, 1350, 1327, 1356, 1384, 1362, 1340, 1387, 1433, 1395, 1357, 1448, 1539, 1545, 1551, 1398, 1245, 1346, 1446, 1509, 1571, 1482, 1392, 1349, 1306, 1313, 1321, 1326, 1332, 1421, 1511, 1606, 1700, 1575, 1450, 1478, 1507, 1535, 1563, 1528, 1492, 1508, 1523, 1510, 1498, 1535, 1573, 1486, 1399, 1431, 1462, 1465, 1468, 1471, 1473, 1506, 1538, 1520, 1502, 1433, 1364, 1413, 1463, 1452, 1441, 1430, 1419, 1448, 1478, 1507, 1536, 1564, 1592, 1536, 1480, 1528, 1576, 1573, 1571]
2965A571N2N2j01j00n2n1jjmmJ14J14J1J1O1O2j01j01N1N2k2k2K9K9j7j8j7j8p5p6RRR3R2
2959A631j27j26K8K8K8K8N9N8QQJ5J5J5J5k6k6k6k6K3K2j29L9Q4j7%%kkrrK1q1j19N0m9n0
2954A351M6M6P9P9nol6l6J5J5lklkQQQQJ2J2p3p3N3N3o5o5o8o8J18J19O0O0n8n9k0k0k1k0
2948A447P5P6K5K5q3q4l2l3L3L3L3L3jjjjj0j0P4P4o7o7o7o7j7j7O7O7J6J6O6O7n1n1n0n1
2943A466K0K1P1P1jkn2n2o7o7N1N2m6m6L9L9n7n8O1O1k0k1k0k0O0O1n7n8K9K9K9K9m8m8P0
2937A519P1n2n1%jr0r1m0m0Q9Q9L9L8P1P2j3j3o6o5o6o6O8O8O8O8J3J3l7l8j06j06J13J13
2932A571j1j0j0j1j4j4L6L6m0m1P8P7p7p8PPj7j7O7O7k6k6k6k7RRN9N9K2K1o3o3j2j2j3j2
2927A505L5L4L5L4o2o3o2o3L3L4L3L3l0l0K1K0lmM8M7O6O6q5q6O4O4J4J3m4m3P5P4n6n5on
$$ y = [1571, 1623, 1675, 1574, 1474, 1422, 1371, 1370, 1369, 1365, 1361, 1475, 1589, 1600, 1611, 1672, 1734, 1633, 1532, 1583, 1635, 1613, 1591, 1620, 1649, 1632, 1614, 1597, 1579, 1504, 1428, 1437, 1446, 1539, 1631, 1504, 1378, 1406, 1434, 1462, 1490, 1549, 1607, 1615, 1623, 1638, 1653, 1668, 1683, 1657, 1631, 1605, 1579, 1602, 1624, 1495, 1534, 1618, 1601, 1601, 1601, 1599, 1597, 1588, 1579, 1600, 1519, 1400, 1450, 1401, 1351, 1397, 1443, 1522, 1601, 1596, 1590, 1554, 1518, 1533, 1548, 1545, 1543, 1540, 1538, 1546, 1554, 1562, 1570, 1582, 1594, 1521, 1448, 1501, 1554, 1489, 1424, 1356, 1288, 1406, 1525, 1585, 1645, 1587, 1528, 1508, 1488, 1467, 1447, 1522, 1598, 1623, 1648, 1565, 1481, 1449, 1416, 1449, 1482, 1515, 1548, 1547, 1546, 1545, 1544, 1534, 1524, 1598, 1672, 1605, 1538, 1471, 1404, 1387, 1370, 1437, 1504, 1520, 1536, 1602, 1669, 1618, 1567, 1517, 1466, 1486, 1507, 1578, 1649, 1648, 1646, 1594, 1542, 1475, 1408, 1459, 1511, 1465, 1419, 1458, 1497, 1440, 1382, 1443, 1504, 1484, 1463, 1443, 1423, 1483, 1544, 1487, 1429, 1458, 1487, 1516, 1545, 1497, 1449, 1519, 1590, 1538, 1487, 1487, 1486, 1396, 1305, 1265, 1225, 1314, 1403, 1442, 1480, 1551, 1623, 1610, 1597, 1531, 1466, 1400, 1334, 1402, 1470, 1538, 1606, 1619, 1632, 1595, 1557, 1451, 1345, 1458, 1571, 1560, 1550, 1540, 1529, 1515, 1501, 1537, 1573, 1533, 1492, 1570, 1647, 1570, 1492, 1499, 1506, 1489, 1472, 1539, 1606, 1580, 1554, 1528, 1501, 1510, 1519, 1578, 1637, 1659, 1680, 1617, 1554, 1542, 1530, 1517, 1505, 1540, 1574, 1609, 1643, 1581, 1518, 1456, 1393, 1426, 1460, 1493, 1526, 1496, 1466, 1487, 1507, 1504, 1500, 1548, 1595, 1661, 1727, 1642, 1556, 1620, 1684, 1698, 1711, 1667, 1624, 1699, 1773, 1717, 1662, 1656, 1651]
2921A651L3L3q6q5m2m1M3M3J5J4o3o4m4N7%%Q4Q4jjJ9J8r9r9j0j0o0o0N3N4J11Rm3m4L5L4
2916A538JKJJj3j2L1L2P3k8q5J6k3j24n5n4N7J59P5k7JKN9m3m5N6Q7q1l0l1m7N4MNJ7q4l8
2910A451l8M0J42M8j20j04j04M8M7LLj1R1K3K3J23m5k9k9qR3Q0q9P4P4J3q9j09N9QR%%J3q9
2905A601rR2L9j30rj0l2O8M0o1n5n5Or5J2J3N3N3l2l2NMN9J61rj10MLl6l6l7l6L4L4L5L4m4
2899A522m4M0M1K6K7n8n8JKn0m9J01J01n0n1m4m5J42M0j66KN3N4P8P9ool2l2J8J9j6j5j6j5
2894A593j%%jRRRJ0opJ1r0j02O6J52j8j38l6M8J49O7j02q5q5J4J4O5O4j7j6j7j7ppr2r2K2
2888A366K3K2K2O8O7q5q5Q2Q2O5j04j14j3q1q1J15J15L0L0l0l0N4N4J5J4o0o0q8Q1J61N9J6
2883A710J5p6p5n7n7K7K8k9k8K2K2K1K1J23m7j02jM9N0L2L2n3n2j6j5j6j5m1m1Q3Q4j56n5
$$ y = [1651, 1684, 1717, 1631, 1546, 1504, 1463, 1506, 1549, 1564, 1578, 1515, 1451, 1407, 1464, 1464, 1464, 1548, 1632, 1631, 1630, 1649, 1667, 1568, 1469, 1459, 1449, 1389, 1329, 1382, 1436, 1547, 1556, 1513, 1469, 1504, 1538, 1539, 1541, 1542, 1543, 1530, 1518, 1549, 1581, 1654, 1626, 1541, 1557, 1534, 1410, 1355, 1301, 1358, 1517, 1592, 1565, 1566, 1568, 1627, 1584, 1539, 1595, 1682, 1601, 1571, 1540, 1493, 1547, 1551, 1556, 1573, 1489, 1451, 1413, 1453, 1595, 1643, 1523, 1419, 1315, 1363, 1410, 1413, 1416, 1405, 1496, 1519, 1542, 1665, 1620, 1591, 1562, 1554, 1647, 1727, 1638, 1712, 1786, 1799, 1710, 1601, 1660, 1668, 1677, 1677, 1677, 1690, 1601, 1592, 1684, 1723, 1593, 1584, 1574, 1542, 1610, 1650, 1589, 1534, 1479, 1485, 1390, 1402, 1415, 1468, 1521, 1489, 1457, 1462, 1466, 1525, 1686, 1677, 1567, 1571, 1574, 1538, 1502, 1465, 1429, 1463, 1497, 1532, 1566, 1522, 1478, 1518, 1559, 1585, 1612, 1554, 1496, 1497, 1499, 1449, 1400, 1501, 1602, 1552, 1501, 1457, 1412, 1554, 1594, 1428, 1430, 1483, 1537, 1615, 1694, 1688, 1682, 1650, 1618, 1636, 1655, 1639, 1624, 1608, 1593, 1592, 1592, 1592, 1591, 1600, 1609, 1618, 1628, 1622, 1615, 1626, 1536, 1434, 1500, 1652, 1634, 1496, 1460, 1508, 1657, 1724, 1622, 1537, 1452, 1466, 1480, 1545, 1609, 1592, 1576, 1559, 1542, 1535, 1528, 1436, 1344, 1366, 1389, 1411, 1433, 1501, 1568, 1483, 1398, 1480, 1562, 1627, 1523, 1409, 1396, 1315, 1234, 1349, 1464, 1494, 1524, 1494, 1464, 1518, 1572, 1587, 1601, 1541, 1481, 1393, 1474, 1635, 1694, 1710, 1725, 1649, 1574, 1517, 1460, 1487, 1515, 1486, 1458, 1480, 1502, 1523, 1544, 1667, 1620, 1518, 1517, 1566, 1616, 1648, 1680, 1627, 1575, 1559, 1544, 1528, 1513, 1472, 1431, 1514, 1598, 1442, 1387]
2878A387J02o7l3l2QPK9K9K3K2L5o6j11N9R4pr1r2P5P4j0j0J00J00qqr0P9J25K4q9q9K3K2
2873A614LKo5L7k0j89o4J05N8N9J8J9k7k6N9N8mnj23j23L9L9L8L9M7M6mml2l1k1k1j10O0P2
2868A543k9RJ0ppP0r9lmL2L2j8j9m5m6L8L9N9N9lkN7j11k3k2J05Mq5Q4j3j3M9M8o6o6N3N2
2862A662K7K6k4k4j16j17L6L6J3J3J3J3%%J%RQO0N9l9l8M5M6p1p2k0k1r0r0O1O2K5K4k6k6
2857A465K5K4K5K4mnnmqqM3M3l4l4l4l4onnoLLKLQ7Q7l1l1L7L6q1q2O1O1O0O1j19j19jjK8
2850A521K9K8K9j4j4o4J05J00jj19j20L6L6K5K5Q4q5r1J1oR6M5M5K0K0o5o4k6k5k6k6N0M9
2845A608jjq6q6O6O7K3K3J2J3J07o1K1J23L3o9j81p9j7j7M0M0lkM8M9pon8n7m9m9KKR9R8j54
2840A491j55M4M3poO8O9j5j6mmmmK8K9k3k2k0j9R9R9l2l3J9J8p0p0J4J4L0L0q8q8O7O7J6J6
$$ y = [1387, 1489, 1422, 1389, 1357, 1365, 1372, 1401, 1430, 1453, 1475, 1510, 1444, 1333, 1392, 1486, 1479, 1388, 1296, 1371, 1445, 1435, 1425, 1525, 1625, 1617, 1609, 1519, 1598, 1723, 1747, 1658, 1569, 1592, 1614, 1617, 1619, 1554, 1591, 1571, 1382, 1318, 1423, 1481, 1540, 1558, 1577, 1550, 1524, 1583, 1641, 1637, 1632, 1509, 1386, 1425, 1464, 1502, 1541, 1588, 1634, 1630, 1626, 1594, 1563, 1542, 1521, 1411, 1471, 1543, 1514, 1523, 1533, 1526, 1519, 1589, 1490, 1487, 1483, 1515, 1547, 1529, 1510, 1465, 1419, 1457, 1496, 1555, 1614, 1611, 1609, 1666, 1555, 1532, 1510, 1615, 1619, 1534, 1618, 1605, 1592, 1641, 1689, 1623, 1557, 1610, 1662, 1689, 1715, 1691, 1667, 1551, 1434, 1470, 1506, 1519, 1532, 1545, 1558, 1558, 1558, 1559, 1559, 1568, 1576, 1636, 1695, 1656, 1618, 1663, 1709, 1638, 1566, 1546, 1525, 1435, 1345, 1406, 1468, 1493, 1517, 1491, 1465, 1490, 1514, 1539, 1563, 1559, 1554, 1549, 1545, 1537, 1529, 1572, 1615, 1581, 1547, 1513, 1479, 1473, 1468, 1463, 1457, 1460, 1463, 1465, 1468, 1555, 1642, 1611, 1580, 1617, 1653, 1572, 1490, 1551, 1612, 1672, 1733, 1614, 1495, 1494, 1493, 1521, 1550, 1578, 1607, 1593, 1579, 1515, 1620, 1720, 1719, 1600, 1480, 1516, 1552, 1577, 1602, 1686, 1601, 1510, 1521, 1515, 1611, 1656, 1701, 1721, 1741, 1676, 1612, 1586, 1561, 1535, 1509, 1559, 1608, 1607, 1606, 1520, 1434, 1500, 1567, 1590, 1613, 1625, 1638, 1745, 1684, 1705, 1828, 1861, 1792, 1611, 1532, 1515, 1498, 1538, 1578, 1575, 1573, 1621, 1670, 1663, 1657, 1599, 1542, 1493, 1444, 1446, 1448, 1547, 1645, 1491, 1336, 1380, 1423, 1416, 1410, 1478, 1547, 1532, 1516, 1512, 1508, 1504, 1500, 1528, 1557, 1534, 1512, 1492, 1473, 1572, 1671, 1639, 1606, 1625, 1643, 1573, 1503, 1517, 1531, 1561, 1591, 1503, 1415, 1482, 1549, 1565, 1581]
2834A581KKJKk3k4j1j1j34O8O0O0P8j25j25P8J2J2K4K5j3j4P1P1j5j4o6o6J2J1O2O2l9l9m0
2829A535l9l7l7M7M7J0RJ0J0n2n1jjQ6Q6Q6Q5j22j22mmK4K4o0o1P2P1j3j3l8l9l9l8k7k7K3
2823A400K4k0k1j6J87J4J3k4k4%Jn1n0M8M8M8M8j02j02M9N0K7K8K7K8k0k0k0k1l2l3J8J8Q0
2818A600Q0mmq1q2MLPPPPOOm5m4KKM3M3P9q9n8M4Q1k0j02O6%%J1J1J4J5J5J4k6k7k6k6o3o3
2812A407K1K2Q8Q8j9k0j51J9P5P6J08J08m4m4o3o3o3o3P2P2j2j2L3L4L4L4j10j10QRjjjjq
2806A522qM2M3q5q5L3L4oonoJ9J9N9N9R9p1o0o0k8k7O3O3n5M5Q3q5j35j35P4P3Q8Q8r8r9J00
2801A552J00P2k9j04j04k1P9K1q1p5K7R2R2k4j25k9P2RQM0L9j1j1J7J7o7o8m9m9L5L5J0J0
2796A480K0K0n9J11l6l6m1m1j34J02J09o0jjQ2Q2K1q0poP1P2L3L3j08oOOP1r8k01L5L3o8R8
$$ y = [1581, 1583, 1585, 1586, 1588, 1565, 1541, 1530, 1519, 1385, 1453, 1513, 1573, 1651, 1526, 1401, 1479, 1491, 1503, 1527, 1552, 1539, 1525, 1596, 1667, 1652, 1638, 1572, 1506, 1518, 1529, 1591, 1653, 1614, 1575, 1535, 1496, 1459, 1422, 1469, 1516, 1526, 1535, 1545, 1555, 1503, 1452, 1451, 1450, 1536, 1622, 1708, 1793, 1671, 1549, 1545, 1541, 1565, 1589, 1529, 1468, 1540, 1611, 1598, 1585, 1547, 1508, 1469, 1431, 1404, 1377, 1400, 1424, 1404, 1383, 1367, 1554, 1568, 1581, 1557, 1533, 1533, 1534, 1483, 1433, 1481, 1529, 1577, 1625, 1523, 1421, 1470, 1520, 1547, 1575, 1602, 1630, 1610, 1590, 1570, 1549, 1517, 1484, 1502, 1520, 1600, 1680, 1676, 1672, 1591, 1509, 1513, 1516, 1523, 1530, 1537, 1544, 1550, 1556, 1511, 1467, 1469, 1471, 1514, 1557, 1636, 1547, 1489, 1533, 1614, 1594, 1492, 1558, 1558, 1558, 1569, 1580, 1594, 1609, 1624, 1638, 1612, 1585, 1559, 1533, 1470, 1407, 1428, 1450, 1538, 1626, 1607, 1587, 1436, 1455, 1530, 1606, 1714, 1822, 1778, 1734, 1671, 1608, 1545, 1482, 1554, 1626, 1614, 1602, 1635, 1669, 1703, 1737, 1627, 1517, 1525, 1534, 1533, 1532, 1531, 1530, 1522, 1514, 1556, 1599, 1514, 1429, 1462, 1496, 1490, 1484, 1479, 1473, 1492, 1511, 1570, 1629, 1728, 1657, 1597, 1537, 1509, 1482, 1545, 1608, 1553, 1598, 1681, 1596, 1461, 1326, 1400, 1473, 1561, 1649, 1551, 1452, 1552, 1652, 1724, 1695, 1591, 1487, 1466, 1545, 1566, 1485, 1410, 1437, 1529, 1621, 1597, 1472, 1443, 1515, 1524, 1532, 1572, 1611, 1600, 1589, 1606, 1623, 1556, 1488, 1439, 1390, 1425, 1460, 1470, 1480, 1500, 1520, 1461, 1572, 1536, 1500, 1459, 1418, 1284, 1386, 1495, 1435, 1434, 1433, 1515, 1597, 1618, 1538, 1531, 1525, 1596, 1668, 1701, 1734, 1626, 1620, 1626, 1632, 1703, 1605, 1404, 1439, 1472, 1404, 1502]
2791A502R9O4l6P7P8k4j26q3q3N3N2R6p3q6J6l0l1L7J38j2j3m6m7o5J04K1q0k3P8l0k9m2N9
2786A515M7M6p1j73J3J15M7M7k5k5J8J20P4r6m4m4n4n4J8J8l3l3P0P0P0l2O0m1j74O2K3K3
2781A557k5P6O2l9q4J8K4K4m8m8j8Q3K6K7o2o1j1j1j0j0M1M1K8K8K1K2oj07n6n7R0j3noq4
2775A407q4J02J01N5N4l0l0k0k0j3j3k3P8K8p3q1q0O5O5l4l4K2K3n8M4O4O5L6o5j9j9J64o
2770A671j13j2l1O9m4N7K4p6j4j3ppM4M4l9l8J2J3j3j3J00%q0K1M9M9r7MQ5Q4J33j05j1j2
2765A734k07l8J10RRRllJ7q5j69o8K0K0k8J41J85J5L8L7q6q6jjK6K7n9n8Q4Q5o8o8q0q1P2
2760A449P1M2M1p6p7R6R7J2J2P8P8p3p4O0N9r2r3J2J1j06j07N1N0N1N1R4R4n7n8J5J5J5J5
2755A756J7J7J7J7m2m3m2m2k0k0k0k0j7j7opr4P5J32l8k6P4O4l7q9r0N7N6M1M2j0rr4r4r4
$$ y = [1502, 1601, 1665, 1629, 1706, 1784, 1760, 1634, 1551, 1468, 1521, 1573, 1669, 1596, 1510, 1526, 1496, 1465, 1502, 1640, 1628, 1615, 1569, 1522, 1457, 1561, 1582, 1502, 1479, 1557, 1527, 1498, 1456, 1515, 1562, 1608, 1537, 1364, 1377, 1492, 1539, 1586, 1561, 1536, 1554, 1674, 1748, 1652, 1608, 1564, 1510, 1456, 1474, 1492, 1459, 1426, 1496, 1566, 1636, 1604, 1664, 1623, 1449, 1511, 1534, 1557, 1532, 1608, 1670, 1631, 1547, 1565, 1589, 1613, 1565, 1517, 1499, 1582, 1608, 1635, 1573, 1512, 1501, 1490, 1480, 1470, 1511, 1552, 1580, 1608, 1629, 1651, 1645, 1538, 1482, 1425, 1515, 1502, 1497, 1491, 1407, 1323, 1425, 1526, 1581, 1635, 1605, 1575, 1555, 1535, 1522, 1509, 1486, 1564, 1592, 1519, 1438, 1358, 1423, 1488, 1454, 1420, 1442, 1465, 1407, 1451, 1515, 1580, 1616, 1551, 1532, 1513, 1677, 1671, 1558, 1546, 1515, 1584, 1540, 1597, 1621, 1545, 1531, 1518, 1511, 1504, 1548, 1592, 1553, 1515, 1527, 1540, 1527, 1514, 1614, 1614, 1534, 1555, 1604, 1653, 1556, 1560, 1645, 1729, 1862, 1757, 1746, 1734, 1527, 1489, 1599, 1608, 1617, 1626, 1623, 1620, 1637, 1552, 1383, 1315, 1335, 1355, 1327, 1468, 1653, 1668, 1706, 1743, 1657, 1571, 1570, 1569, 1595, 1622, 1563, 1505, 1589, 1674, 1606, 1538, 1458, 1377, 1449, 1520, 1562, 1603, 1527, 1450, 1546, 1643, 1655, 1667, 1745, 1823, 1750, 1676, 1736, 1795, 1703, 1610, 1622, 1633, 1527, 1420, 1471, 1521, 1572, 1623, 1717, 1811, 1754, 1696, 1711, 1726, 1741, 1756, 1773, 1790, 1807, 1824, 1782, 1739, 1697, 1655, 1635, 1615, 1595, 1575, 1558, 1541, 1535, 1528, 1434, 1509, 1641, 1603, 1577, 1651, 1715, 1678, 1589, 1499, 1556, 1612, 1653, 1695, 1685, 1676, 1582, 1488, 1394]
2749A394r4M0M1R0R1q1q1MLR7R8R7R8j78j78PQO4O3O4O3J8J8J8J8p0p0o9p0m7m7L7L7k0k1
2744A442L0L0O3O2n6n5J1J0J1J1N0N1%j%%j%LLm2m1l3O8J32p1j46m5MMJ4J5J4J5M7M7l8l7
2738A571QQR2R2m4m4PPn2n1L3L3m4m3m4m4j3j2j3j3J9J9J9J8ooP8P8O1O1n9M3N1j51q1q1j4
2733A483j3j4j4M3M4n2N0q8J16O5l7L3L3k4k4l1l2l1l2QQPQM8M8M8M8K0J9o5o5m7m7m7m7j
2727A418kM9M9n3n3kkj0j1J08J07l7l7Q2Q1n4n4n4n4L1L1L1L1n2n2n3n2J06J05j2j3l7l6l3
2722A466J70o1o2L6L5k0k0k1k0N3N3KK%%n1n1j1j2j2j2R9R9J4J4P3P3p8p9k8k7K3K4l1l0l1
2716A579l0R6R6J2J1l3l4l3l4l3l3l4l3Q3Q4l4l5J0J0j04R8o3o3O7O8n0m9J23J24J13r0o0
2711A729o0J8J8l3l3l2l2J8J9m2m2m1m2M2M2qrj2j3j3j2P5P5m3m3PQQPq4q5n9J44J59m3o8
$$ y = [1394, 1300, 1340, 1381, 1471, 1562, 1481, 1400, 1404, 1407, 1504, 1602, 1699, 1797, 1619, 1441, 1448, 1456, 1520, 1583, 1647, 1710, 1728, 1746, 1764, 1782, 1712, 1642, 1573, 1503, 1456, 1409, 1446, 1483, 1463, 1442, 1472, 1502, 1565, 1627, 1571, 1516, 1527, 1537, 1548, 1559, 1609, 1660, 1660, 1659, 1659, 1659, 1658, 1658, 1661, 1664, 1622, 1581, 1548, 1616, 1748, 1677, 1531, 1486, 1490, 1494, 1508, 1523, 1537, 1552, 1599, 1646, 1608, 1571, 1579, 1587, 1679, 1771, 1727, 1683, 1690, 1697, 1645, 1594, 1627, 1660, 1616, 1573, 1529, 1485, 1472, 1460, 1447, 1434, 1453, 1472, 1491, 1509, 1503, 1497, 1575, 1653, 1714, 1775, 1716, 1759, 1810, 1659, 1578, 1497, 1483, 1470, 1456, 1442, 1485, 1529, 1477, 1527, 1439, 1555, 1620, 1583, 1616, 1649, 1625, 1601, 1570, 1538, 1507, 1475, 1483, 1491, 1498, 1506, 1554, 1602, 1650, 1698, 1718, 1737, 1672, 1607, 1560, 1513, 1466, 1419, 1418, 1416, 1465, 1514, 1461, 1408, 1406, 1404, 1394, 1383, 1491, 1598, 1561, 1524, 1606, 1687, 1633, 1579, 1525, 1471, 1502, 1533, 1564, 1595, 1543, 1491, 1438, 1386, 1492, 1597, 1585, 1572, 1535, 1499, 1466, 1636, 1575, 1513, 1549, 1584, 1564, 1544, 1523, 1503, 1556, 1609, 1611, 1613, 1613, 1613, 1562, 1511, 1500, 1488, 1476, 1464, 1563, 1662, 1676, 1690, 1763, 1836, 1758, 1679, 1651, 1624, 1647, 1671, 1640, 1610, 1579, 1549, 1645, 1741, 1753, 1764, 1731, 1697, 1664, 1630, 1597, 1564, 1530, 1497, 1580, 1664, 1630, 1595, 1605, 1615, 1511, 1609, 1546, 1483, 1550, 1618, 1568, 1519, 1642, 1766, 1879, 1789, 1729, 1669, 1687, 1705, 1672, 1639, 1607, 1575, 1593, 1612, 1570, 1528, 1487, 1445, 1487, 1529, 1521, 1512, 1500, 1487, 1474, 1462, 1537, 1612, 1569, 1526, 1533, 1541, 1549, 1556, 1472, 1387, 1328, 1472, 1631, 1588, 1520]
2706A520o9RQO0N9M7M7l8l8l1l1K0K0J4J5l7l6K0K1K0K0K6K5k5k5j1j1P4P4j69j69N1N0J02
2701A612J02n1n0N4N5N4N4r7r7j3j2m9m8K3K3Q3j20nok8k8R0R1j08j08M5M4OPm5m4J51J51
2696A736o8o9L8L8j3j2JJJJk3k3p4p4J16J16kkj5j5o5o6m5m5L9M0L9L9R0R0o1o1j0j0l8l8
2690A556J15J14p5p6M3M3QQp6p6nnnnnnmnR1R2k7k7m3m4m4m3k5k4N8J59J48n5k11j10P1P1
2685A582J7J6P2r8rR3N2N2n9o0K3K3k8k8o6o6Q6Q6k4k4o4o4l4J36J7j52K6K6p0o9L5L5j6J53
2680A599J21K0qj09jkM3M2nnKJk4P7J2k25j35L4P6P7n8n7ppP2P1m7m7k8k8N6N6l2l3Q6Q6j00
2674A573j00J8J8n3n2o3J06L9L9N0N0K1K2o4o3O2O1P2r7o3o3J1J1o0n9rrO9O8O8O9j07j07
2669A458K2K2j49K1J35J35K4j46L5L4K0J9o5o5p3p4M5M5J06J06m6m6q7q7llN2N2o6o7J4J3
$$ y = [1520, 1451, 1460, 1468, 1528, 1587, 1634, 1681, 1643, 1605, 1574, 1543, 1563, 1583, 1597, 1612, 1575, 1539, 1559, 1580, 1600, 1620, 1646, 1671, 1646, 1621, 1610, 1599, 1673, 1747, 1578, 1409, 1460, 1510, 1612, 1714, 1663, 1613, 1667, 1722, 1776, 1830, 1733, 1636, 1623, 1611, 1562, 1514, 1537, 1560, 1643, 1523, 1518, 1512, 1484, 1456, 1546, 1637, 1529, 1421, 1466, 1510, 1516, 1523, 1478, 1434, 1585, 1736, 1668, 1599, 1637, 1675, 1662, 1650, 1651, 1652, 1653, 1654, 1631, 1608, 1534, 1460, 1576, 1692, 1690, 1688, 1673, 1658, 1593, 1527, 1482, 1437, 1476, 1516, 1555, 1594, 1684, 1774, 1713, 1652, 1642, 1632, 1594, 1556, 1671, 1785, 1710, 1634, 1677, 1720, 1728, 1736, 1660, 1584, 1579, 1574, 1569, 1564, 1559, 1554, 1550, 1545, 1636, 1728, 1701, 1674, 1631, 1587, 1543, 1500, 1475, 1451, 1509, 1668, 1816, 1761, 1550, 1440, 1511, 1582, 1599, 1615, 1687, 1589, 1580, 1673, 1725, 1777, 1718, 1658, 1681, 1704, 1676, 1648, 1582, 1516, 1602, 1688, 1664, 1640, 1576, 1512, 1478, 1614, 1631, 1479, 1505, 1531, 1461, 1392, 1427, 1462, 1446, 1599, 1720, 1740, 1732, 1623, 1622, 1620, 1663, 1705, 1700, 1695, 1697, 1698, 1674, 1751, 1763, 1538, 1403, 1437, 1513, 1590, 1532, 1475, 1468, 1461, 1533, 1604, 1557, 1510, 1482, 1454, 1510, 1566, 1534, 1501, 1587, 1673, 1573, 1473, 1491, 1509, 1456, 1404, 1341, 1447, 1486, 1525, 1575, 1625, 1646, 1668, 1604, 1541, 1603, 1664, 1736, 1639, 1576, 1513, 1524, 1535, 1475, 1416, 1407, 1398, 1467, 1535, 1603, 1672, 1565, 1458, 1480, 1502, 1353, 1374, 1509, 1644, 1668, 1522, 1557, 1591, 1611, 1630, 1565, 1500, 1427, 1353, 1398, 1443, 1549, 1655, 1609, 1563, 1476, 1389, 1386, 1383, 1435, 1487, 1421, 1354, 1368, 1381]
2664A381O4O4l5l4k4k3l7J33lkk9J40J27j09j8j7J9J9qpqqk6k7N8N8P1P1q2q1L2L2L2L2l8
2659A717l9q9r0k1k2L0K9J4J5R8R9j10j10k6k5o8o8J6J7l2l2N3N3j2j2P3P2J%%%n5n5L0L0
2653A481j1j0j0j1R4R4M4M3K6K7n9n8M1M1R2R2K16K16L15L16j27m31l05j35j04j04r3r3K5
2649A612K5M2o0p7R2M8n4n1n2n8n7N8N8QPM7M7p2p2NNN0M9kj04j04kQ5Q5M1M1L3L4j42j42
2644A423n6J13J19J7R4qr8LL2L3o9L2j7j7OJ07M8j20p7K6M9M9K8p3k2k3K2K2J3J4J3J4k7k7
2638A643k6k7jjQ3Q3poJ0r1j01O7P4k8p9p9r2J0QRN9O0M8n4o4L8J7j52o7J02J18J6O3l9r4
2633A500QKJpR4Q8Q8p3p3P5k6j61n9l9l8N1N2j2Q9J01jm9m9oR5j2j2p8p8KJ72J49k0q9J2J0
2628A707J1J1J0pj09n8M4L0L0j4j4onM5M5l0k9j7Q5O6j69q8J4m2m2J6J5N3N3N4N3p8p8M1M0
$$ y = [1381, 1445, 1509, 1474, 1440, 1416, 1393, 1356, 1489, 1486, 1484, 1455, 1595, 1722, 1613, 1595, 1578, 1597, 1616, 1608, 1601, 1593, 1585, 1559, 1532, 1590, 1648, 1719, 1790, 1708, 1627, 1659, 1691, 1723, 1755, 1717, 1678, 1589, 1499, 1478, 1456, 1486, 1515, 1529, 1544, 1642, 1741, 1631, 1521, 1495, 1470, 1402, 1334, 1350, 1367, 1335, 1303, 1356, 1409, 1397, 1385, 1458, 1530, 1531, 1531, 1531, 1531, 1476, 1421, 1451, 1481, 1470, 1460, 1450, 1439, 1533, 1627, 1671, 1714, 1740, 1767, 1708, 1650, 1691, 1732, 1824, 1916, 2132, 2348, 2663, 2979, 2852, 2421, 2116, 1981, 1877, 1773, 1680, 1587, 1612, 1637, 1679, 1619, 1542, 1634, 1682, 1628, 1577, 1525, 1467, 1410, 1468, 1526, 1534, 1541, 1588, 1635, 1563, 1491, 1496, 1501, 1551, 1600, 1598, 1494, 1390, 1388, 1473, 1558, 1599, 1640, 1673, 1707, 1565, 1423, 1367, 1480, 1599, 1616, 1710, 1702, 1604, 1607, 1639, 1672, 1603, 1635, 1618, 1601, 1607, 1714, 1762, 1642, 1565, 1591, 1640, 1689, 1717, 1644, 1622, 1599, 1621, 1643, 1656, 1670, 1683, 1697, 1670, 1643, 1617, 1590, 1589, 1588, 1671, 1754, 1747, 1741, 1751, 1660, 1559, 1626, 1700, 1672, 1593, 1514, 1422, 1432, 1440, 1449, 1508, 1568, 1616, 1562, 1498, 1536, 1553, 1401, 1334, 1436, 1554, 1570, 1633, 1594, 1500, 1508, 1510, 1511, 1504, 1598, 1686, 1774, 1701, 1628, 1703, 1677, 1516, 1457, 1418, 1380, 1431, 1483, 1471, 1560, 1661, 1660, 1611, 1562, 1556, 1651, 1639, 1627, 1549, 1471, 1473, 1645, 1794, 1774, 1685, 1697, 1707, 1718, 1729, 1739, 1732, 1623, 1565, 1609, 1639, 1669, 1655, 1641, 1635, 1630, 1675, 1720, 1690, 1661, 1644, 1729, 1795, 1626, 1538, 1552, 1510, 1468, 1484, 1499, 1552, 1605, 1659, 1712, 1634, 1556, 1597, 1637]
2622A637PPPPn6n6O2O3o6o5j5j4P9P9l9m0L8L8L8L8p0p0k0Q2J32l7j18j6M6n5j67o5N9N9J4
2617A523J5l6l7P2P1J18n1j65o3k7k7O4O4R7R7J2J2o2o2o3o2j2j1j2j2N5N4MLj5j6j5j5N9
2612A557O0k5k5l0l0N5N4L9L9m5m6j0j1j0j1k7k8R1R1o0o0J26J25l7l7j22j21M9N0o9o9j3
2607A450j2J01%r8LR6J98L8o3POq1K1l7l7k3k3k9l0J23K1p4p4O6O5P9k4q0K1O6l6M3M3k1k1
2601A684J4q9K0J9L6L6m8m9O3O4J2J3p6p5j20M9NMP5r5j36J00J66O4QPm9n0l3l2J8J8n7n8
2596A508Q4j8POn0n0n2n1J57J58N8j10q3J8O6j03m6m6o0M1J59N8m3m4JJnoj07orR1Q5Q5l4
2591A660j35P4P4RJ0n4M7N1n0k7k7j29L9M6n6L3o8J24K3%JM4M5m3m3m4m3kkJ10J09j3j15m1
2586A607J28Nr7q6J5j5j5M2M3m7m6m7m6k0k0L0L1R9R9J5J5m1m2J0Rl0l1K0K0L8L7q1q1N8N7
$$ y = [1637, 1644, 1651, 1658, 1665, 1609, 1553, 1615, 1678, 1612, 1547, 1532, 1518, 1597, 1676, 1637, 1597, 1635, 1673, 1711, 1749, 1679, 1609, 1589, 1671, 1803, 1766, 1648, 1632, 1678, 1623, 1456, 1391, 1450, 1509, 1523, 1538, 1502, 1465, 1537, 1608, 1726, 1675, 1510, 1447, 1420, 1393, 1457, 1521, 1618, 1715, 1727, 1739, 1677, 1615, 1552, 1490, 1478, 1467, 1455, 1443, 1498, 1552, 1556, 1559, 1544, 1528, 1513, 1498, 1557, 1617, 1592, 1567, 1537, 1507, 1562, 1616, 1655, 1694, 1649, 1603, 1593, 1582, 1572, 1561, 1534, 1506, 1597, 1688, 1628, 1568, 1694, 1819, 1782, 1745, 1623, 1502, 1551, 1601, 1532, 1463, 1450, 1438, 1539, 1539, 1441, 1444, 1540, 1738, 1776, 1713, 1720, 1726, 1645, 1666, 1629, 1592, 1569, 1546, 1517, 1487, 1610, 1631, 1557, 1483, 1549, 1614, 1693, 1669, 1589, 1610, 1676, 1640, 1683, 1726, 1705, 1684, 1698, 1609, 1629, 1648, 1684, 1720, 1672, 1623, 1686, 1750, 1762, 1775, 1699, 1624, 1504, 1553, 1558, 1562, 1637, 1542, 1406, 1506, 1672, 1736, 1744, 1751, 1702, 1652, 1619, 1587, 1605, 1623, 1566, 1508, 1592, 1574, 1581, 1587, 1537, 1487, 1435, 1384, 1541, 1699, 1757, 1647, 1564, 1582, 1648, 1545, 1499, 1453, 1393, 1434, 1593, 1651, 1608, 1564, 1565, 1566, 1561, 1555, 1448, 1442, 1433, 1524, 1609, 1694, 1660, 1525, 1599, 1673, 1682, 1692, 1638, 1685, 1736, 1686, 1659, 1632, 1503, 1542, 1588, 1532, 1565, 1497, 1621, 1644, 1644, 1645, 1689, 1734, 1691, 1648, 1604, 1561, 1559, 1557, 1667, 1776, 1763, 1648, 1607, 1735, 1740, 1643, 1557, 1572, 1557, 1542, 1584, 1627, 1580, 1534, 1487, 1441, 1421, 1401, 1431, 1462, 1561, 1660, 1675, 1690, 1649, 1607, 1617, 1626, 1596, 1565, 1585, 1605, 1643, 1680, 1599, 1518, 1576, 1633]
2580A633N8N7n8n8K7K6k9k8k9k8q6q6kkQ9Q8M3M4r9KR1p9o9p0L8L8J15J16j38j38m9m9L1K00
2575A599P4r4p4p3J5J6O6O6q0q0NNL3L3L4L3J38J37j16j15K9K8j29j30K8p3k7J41O2O2K1K2
2570A656l7l7K0K0J2J13P7r2j12N8L7L6l2l2l3l2j0j0r5r5J7J8J35J35J7J7J6J7n1n1%jj1
2565A670j2j2j2n5n5mnm5m5ONN8N7k7k7mnmmM7M6M7M6j01j01N0N1K3K4K3K3qpk7P4J16q7n1
2560A668n1O3O4k0k1q9q9nmL4L4L4L4j7j7j6j7O0O0r3r2Q0Q0l8l9n3n3O5O5k2k1p3p2klO9
2554A503O9Lk00j4J88ooOOJ1J1J0J1m2m2p1J31K5K5L8L7m2m1m2m2O4O4k1k0l3l3n2M9J64m0
2549A668p1p1jkJ6J16Lj66q2Q7K7p4P8P8K5K5n9n9j3j3L7L8ooK0j50j05J32j2j2L2L2L3L2
2543A577O9O8J8J8q5q4l4l4qqM3M3k4k4K7K7j9j9j9k0opM5M4K6K6K6K6J4J4l6l6m6m6noR3
$$ y = [1633, 1691, 1748, 1690, 1632, 1659, 1685, 1656, 1628, 1599, 1571, 1485, 1399, 1397, 1395, 1484, 1572, 1615, 1659, 1560, 1562, 1653, 1574, 1505, 1435, 1473, 1511, 1626, 1742, 1604, 1466, 1417, 1368, 1399, 1599, 1673, 1579, 1505, 1432, 1447, 1463, 1529, 1595, 1515, 1435, 1440, 1445, 1478, 1511, 1545, 1578, 1716, 1853, 1737, 1622, 1651, 1679, 1550, 1420, 1448, 1375, 1348, 1489, 1551, 1613, 1634, 1656, 1619, 1582, 1602, 1622, 1634, 1747, 1824, 1732, 1620, 1678, 1715, 1751, 1719, 1687, 1654, 1622, 1612, 1602, 1507, 1412, 1429, 1447, 1582, 1717, 1734, 1751, 1767, 1784, 1733, 1682, 1682, 1681, 1670, 1658, 1646, 1634, 1579, 1524, 1520, 1515, 1470, 1425, 1431, 1436, 1494, 1551, 1524, 1497, 1493, 1488, 1484, 1480, 1527, 1573, 1620, 1666, 1565, 1464, 1514, 1565, 1588, 1612, 1635, 1658, 1650, 1643, 1616, 1690, 1806, 1719, 1668, 1617, 1680, 1744, 1724, 1703, 1614, 1525, 1520, 1516, 1550, 1584, 1618, 1652, 1635, 1618, 1602, 1585, 1645, 1705, 1612, 1520, 1600, 1680, 1642, 1603, 1550, 1497, 1562, 1627, 1605, 1584, 1511, 1439, 1437, 1434, 1503, 1572, 1575, 1375, 1361, 1549, 1543, 1537, 1543, 1549, 1560, 1571, 1581, 1592, 1550, 1508, 1437, 1568, 1593, 1618, 1656, 1693, 1651, 1610, 1568, 1526, 1590, 1654, 1633, 1613, 1580, 1547, 1495, 1544, 1708, 1668, 1597, 1526, 1525, 1523, 1539, 1655, 1658, 1492, 1410, 1497, 1524, 1450, 1528, 1606, 1631, 1656, 1597, 1538, 1525, 1512, 1549, 1587, 1581, 1575, 1595, 1445, 1340, 1472, 1460, 1448, 1480, 1512, 1545, 1577, 1646, 1714, 1732, 1750, 1665, 1581, 1547, 1513, 1505, 1497, 1540, 1583, 1559, 1535, 1562, 1589, 1570, 1551, 1532, 1512, 1506, 1499, 1544, 1588, 1614, 1640, 1666, 1692, 1706, 1720, 1684, 1648, 1602, 1556, 1551, 1545, 1638]
2538A638p7r5OO0m2K2K1K3K3k8k8NNN6N5KKKKp6p6M2M2KKKKM3M3qpj2j2j1j2J5J5l6l6ppq
2531A552pj6j6j6j6Q7Q8KLq1q2P0P0L2L3j9j8j6j6j00j00K7K6P7P8l5l5M9N0L0L1k0k1MMm7
2526A652m8k8k8j59J45K22N2o4j65J9J9l9l8p5p5M3M3j8j7j1j0K0J23J20m9r6P2O0m1n1J17
2521A695J37l2N3N2j10j10m7m6MNo0o0K4K4jjjjJ7J7O8O8k0k0L0L1LLq1q1l7l7M7M8MMMMO
2515A603Nl5l5o1J07O4l8jj02n1n1Q8Q8L8L7j9j9L1L1n1n1L4L4N4N4MMk6k6k6k6L3L2L3L2
2510A788j1j2l6l7o8o9j19j19J06J07J06J06n4n4j64NJ73o3J7J18l9j40n2n2N5N4k4k4n9M2
2505A481J99K9n9n8J5J5m1m1j5j6ppP7P8m3m3j7j8M4M3p5p5K2K1P3P2l9l8l9l8ooP8P8KKk3
2500A625k4m8m8KKO3O2J2J2L9L9J3J4r2r1K6K7l4l5q5q5L4L4N9N9k3k2k3k3K9K8k2k2K4K4
$$ y = [1638, 1561, 1466, 1472, 1532, 1490, 1512, 1533, 1556, 1579, 1551, 1523, 1528, 1533, 1589, 1644, 1646, 1648, 1650, 1652, 1576, 1500, 1542, 1584, 1586, 1588, 1590, 1592, 1635, 1678, 1670, 1663, 1651, 1639, 1628, 1616, 1631, 1646, 1610, 1574, 1567, 1560, 1552, 1545, 1529, 1513, 1497, 1481, 1568, 1656, 1658, 1661, 1580, 1498, 1568, 1638, 1670, 1703, 1684, 1666, 1650, 1634, 1534, 1434, 1461, 1487, 1564, 1642, 1607, 1572, 1621, 1671, 1701, 1732, 1712, 1691, 1695, 1699, 1652, 1604, 1576, 1548, 1389, 1534, 1756, 1808, 1744, 1579, 1598, 1617, 1578, 1540, 1465, 1390, 1433, 1476, 1458, 1441, 1430, 1420, 1440, 1563, 1683, 1634, 1538, 1610, 1670, 1629, 1578, 1695, 1832, 1800, 1853, 1905, 1795, 1685, 1638, 1592, 1596, 1601, 1541, 1481, 1505, 1529, 1528, 1527, 1526, 1525, 1542, 1559, 1627, 1695, 1675, 1655, 1685, 1716, 1719, 1722, 1641, 1560, 1523, 1486, 1533, 1581, 1585, 1589, 1593, 1597, 1603, 1608, 1573, 1538, 1477, 1584, 1648, 1610, 1609, 1507, 1456, 1405, 1493, 1581, 1619, 1656, 1637, 1618, 1649, 1680, 1629, 1578, 1612, 1646, 1700, 1754, 1758, 1762, 1736, 1710, 1684, 1658, 1691, 1723, 1756, 1788, 1777, 1765, 1729, 1692, 1624, 1555, 1436, 1317, 1423, 1530, 1636, 1742, 1688, 1634, 1470, 1475, 1648, 1585, 1602, 1720, 1681, 1541, 1489, 1437, 1492, 1546, 1522, 1498, 1439, 1481, 1680, 1709, 1650, 1592, 1607, 1622, 1581, 1540, 1525, 1509, 1502, 1495, 1572, 1650, 1607, 1564, 1547, 1529, 1573, 1616, 1541, 1466, 1488, 1509, 1582, 1654, 1615, 1577, 1538, 1500, 1494, 1488, 1566, 1644, 1646, 1648, 1625, 1601, 1553, 1505, 1507, 1509, 1572, 1634, 1646, 1658, 1697, 1736, 1749, 1763, 1671, 1580, 1606, 1633, 1599, 1564, 1479, 1394, 1428, 1462, 1521, 1580, 1557, 1535, 1512, 1489, 1518, 1546, 1524, 1502, 1526, 1550]
2494A550K4K4n7n8j46R1J64O2j8j7N4N4o4o4p1p2J15J15m7m8p2p3n8n7O0O0N6N6NNl5l5M9
2489A552N0m2m3RQj7j8j7j8L0L0k0k1l4l4J7J7N9N9k5k6N4N4ppM2j26q9J3M0M1nmppM3M3M
2484A598Mm6m7j4j4L7L7L0L1L0L1p0p0j9j9qrn9n9P8P8opkkM8M9KKKKP0P1P0P0r1r2r1r1N5
2477A579N5k9k9L4L4j6j7nnonKKN3j17j28k8J25J25K6K7k4j26m5J24K3K2K4K4k7k8n8n8O0
2472A588O0J5J6l5l5M7M8mlj2j3j3j2n1n1%%m2m3J10J10J5J6J6J6j3j3o3o4M8M9lkl9l8M6
2467A651M6o1o2N7N7l9l9q2J22J13q9K4K5R6j08m4m4Q7Q7M8j54k9k9QRQRp7p6j6j5L4L5L1
2462A583L0L1L0r1r0K7K7K7K6k4k4K8K7k3k3k2k2k2k2qppqJ3J2R7R7l1l1l1l1K1K1K1K2k1
2456A602k1L0K9o9p0M9M9m4m4m6J56R8lj7j8o3o3K1K1M1M1M1M0o7o7N1N2m3m2m2m2O9O8J8
$$ y = [1550, 1574, 1598, 1541, 1483, 1337, 1428, 1592, 1654, 1636, 1619, 1673, 1727, 1663, 1599, 1528, 1456, 1571, 1686, 1639, 1591, 1519, 1446, 1388, 1331, 1391, 1451, 1507, 1563, 1568, 1573, 1538, 1503, 1552, 1602, 1560, 1517, 1526, 1534, 1517, 1499, 1482, 1464, 1494, 1524, 1504, 1483, 1449, 1415, 1432, 1449, 1508, 1567, 1542, 1516, 1570, 1624, 1617, 1610, 1652, 1526, 1437, 1450, 1490, 1531, 1526, 1522, 1515, 1508, 1551, 1594, 1598, 1602, 1556, 1509, 1495, 1481, 1518, 1555, 1585, 1616, 1646, 1677, 1607, 1537, 1518, 1499, 1491, 1482, 1423, 1364, 1442, 1520, 1514, 1507, 1505, 1503, 1551, 1600, 1602, 1604, 1606, 1608, 1678, 1749, 1819, 1889, 1798, 1706, 1615, 1524, 1579, 1634, 1605, 1576, 1610, 1644, 1628, 1611, 1606, 1601, 1595, 1590, 1592, 1594, 1647, 1530, 1402, 1374, 1499, 1624, 1650, 1677, 1653, 1527, 1482, 1606, 1629, 1651, 1675, 1699, 1672, 1644, 1586, 1528, 1588, 1648, 1663, 1679, 1644, 1609, 1656, 1704, 1700, 1697, 1685, 1672, 1659, 1647, 1596, 1545, 1545, 1545, 1503, 1460, 1570, 1680, 1695, 1711, 1727, 1743, 1730, 1717, 1654, 1590, 1638, 1687, 1684, 1682, 1643, 1605, 1651, 1697, 1636, 1574, 1631, 1688, 1649, 1610, 1528, 1650, 1763, 1674, 1698, 1723, 1819, 1711, 1667, 1623, 1710, 1797, 1845, 1691, 1662, 1633, 1641, 1650, 1658, 1667, 1590, 1514, 1498, 1483, 1517, 1552, 1583, 1613, 1644, 1674, 1583, 1493, 1520, 1547, 1574, 1600, 1576, 1552, 1580, 1607, 1584, 1561, 1539, 1517, 1495, 1473, 1465, 1458, 1451, 1443, 1456, 1468, 1565, 1662, 1631, 1600, 1569, 1538, 1559, 1580, 1601, 1623, 1602, 1581, 1611, 1640, 1571, 1501, 1550, 1599, 1555, 1511, 1465, 1621, 1719, 1716, 1699, 1681, 1618, 1555, 1576, 1597, 1638, 1679, 1720, 1760, 1693, 1626, 1677, 1729, 1686, 1644, 1602, 1560, 1629, 1697, 1715]
2451A715J8l1l0K0K0k0j9j03j04M7M7M7M6l8l9J2J2Q1Q2lmQPm3m3L1L1j80K3J22q1M6M6j4
2446A709j4k6k6J26p6L9L8J7J8J3j90N7N6opr5r4K3K4l2l2Q6Q6n3n3n3n3N8N8PQK0K1o4o4
2440A526P1P1j3j3l8l8M6M6j9j9j03j04PON7N7j4j5L6L6qpM3M4K7K8K7K8k3k4p4p4mmJ09r3
2435A578o6o7L9L9L2L3L2L3J0J1m1m0L5L4n0m9p6p5QRN5N4R0j12k2Q0P3k7r7NR3R4j0j0q8
2430A607q8j17j5M6M6M4M3J01jN9O0j94j94N9J61j5j4J16J16j2j14l9l8r6r6N2N2O5l7m4N7
2425A570J39l0lmj4j4l2l3J9J8k5k6R4R3%%m5m4n9M2k1k1O5l6K1K0j1j1o8o8J16J4m6m7RR
2419A571m1m2K6K6l2P0N1N1J15J3NNj20j19jkjjLMJ0r1NON6m4k6k5J03KJ2r0n6J13J34L4j2
2414A712j1j5Q6K9K9m5m5j40K9J2J2J18n2m8m9o0n9J%N2N1J8J9J8J8K0K1l1l0K4K5K4K5j3
$$ y = [1715, 1733, 1702, 1672, 1692, 1712, 1692, 1673, 1570, 1466, 1513, 1560, 1607, 1653, 1615, 1576, 1588, 1600, 1681, 1763, 1760, 1756, 1764, 1771, 1728, 1685, 1716, 1747, 1567, 1590, 1712, 1631, 1677, 1723, 1709, 1695, 1669, 1643, 1769, 1693, 1732, 1770, 1787, 1805, 1818, 1628, 1685, 1741, 1735, 1728, 1633, 1539, 1562, 1586, 1554, 1522, 1608, 1694, 1641, 1588, 1535, 1482, 1540, 1598, 1605, 1613, 1633, 1654, 1590, 1526, 1597, 1668, 1655, 1642, 1604, 1566, 1612, 1658, 1639, 1620, 1517, 1413, 1420, 1426, 1483, 1540, 1526, 1511, 1547, 1583, 1575, 1568, 1611, 1655, 1682, 1710, 1737, 1765, 1742, 1718, 1644, 1570, 1566, 1562, 1671, 1578, 1512, 1445, 1484, 1523, 1555, 1588, 1620, 1653, 1663, 1674, 1633, 1593, 1628, 1662, 1612, 1563, 1487, 1412, 1420, 1429, 1484, 1538, 1628, 1516, 1494, 1574, 1647, 1620, 1523, 1528, 1621, 1715, 1705, 1695, 1607, 1519, 1402, 1387, 1433, 1479, 1523, 1566, 1667, 1666, 1725, 1785, 1591, 1397, 1456, 1617, 1602, 1588, 1704, 1820, 1808, 1694, 1655, 1617, 1521, 1425, 1477, 1529, 1594, 1557, 1513, 1570, 1709, 1679, 1676, 1672, 1658, 1644, 1612, 1579, 1598, 1616, 1591, 1565, 1659, 1752, 1752, 1752, 1707, 1663, 1604, 1646, 1625, 1604, 1669, 1633, 1654, 1674, 1663, 1652, 1584, 1516, 1632, 1646, 1600, 1553, 1562, 1571, 1530, 1488, 1514, 1540, 1508, 1578, 1629, 1680, 1795, 1808, 1813, 1818, 1698, 1579, 1578, 1576, 1575, 1574, 1577, 1581, 1591, 1500, 1505, 1511, 1567, 1523, 1497, 1472, 1575, 1577, 1589, 1499, 1443, 1556, 1690, 1724, 1712, 1701, 1686, 1772, 1801, 1830, 1785, 1740, 1600, 1629, 1641, 1653, 1771, 1719, 1671, 1622, 1562, 1503, 1504, 1504, 1556, 1607, 1625, 1644, 1662, 1680, 1700, 1721, 1690, 1660, 1684, 1709, 1733, 1758, 1745]
2408A745j2r7r7M9N0j03j03MMN5N4L8L7L8L7o5o5j4j5k7k8K4K3J6J5O7O6j6j6j7j6m0l9m0
2403A512l9k5k5K6K6J24J25o2o2K7K7r2r1k2k2O3O3Q0P9p2p2K2K2K2K1l8l8J2J3K5K5k6k5
2398A603m6m6m6m6J14J13nml1l1Q7Q8j0j0o0o0k3k2K9K8j5j5j4j5O3O4k1k1l1l1l2l1k1k1
2393A481O3O3J9J9J9J9r5r5m4m5Q3Q2l6l6O3O3O3O3n0m9j01j01M2M2M9n4l6l6M2M2Q0Q0o2
2388A637M0L4L3J9q3j11rk3k2K7K8L3o7k1k1k0k1p6K6Q7Q7K2K2K2K2m0l9J8q4J08J08j7j6
2383A703m3m3O4l7j3j4o0o0n9J11P3P3k7P4k7k7o3L7p0p1J4J3J4J3M4M4j1j12k4P8lj04l4
2378A453J36R7mm3N9N0j19j33L6J5J5L4L5p4p3p0R9MLJ%P8P9J8q3L5J36r0r0L9J40Nr6k3k2
2373A647p9R1N3m8O9P0n5n5n9n9K5K5opn7n7J19J18j0j12k4k5o2L9K3K4L0L0p4p4J0J1K0J9
$$ y = [1745, 1733, 1636, 1539, 1588, 1638, 1535, 1432, 1436, 1440, 1495, 1549, 1587, 1624, 1662, 1699, 1634, 1569, 1555, 1540, 1513, 1485, 1509, 1532, 1548, 1563, 1630, 1696, 1680, 1664, 1647, 1631, 1591, 1552, 1512, 1473, 1448, 1423, 1449, 1475, 1599, 1724, 1662, 1600, 1627, 1654, 1562, 1471, 1449, 1427, 1490, 1553, 1633, 1712, 1640, 1568, 1590, 1612, 1634, 1655, 1617, 1579, 1591, 1604, 1629, 1654, 1628, 1603, 1557, 1511, 1465, 1419, 1533, 1646, 1641, 1637, 1606, 1575, 1662, 1750, 1740, 1730, 1670, 1610, 1587, 1565, 1594, 1622, 1607, 1592, 1578, 1563, 1626, 1690, 1669, 1648, 1617, 1586, 1554, 1523, 1502, 1481, 1544, 1607, 1626, 1645, 1664, 1683, 1588, 1493, 1449, 1404, 1487, 1569, 1533, 1497, 1560, 1623, 1686, 1749, 1699, 1650, 1549, 1448, 1490, 1532, 1581, 1527, 1491, 1455, 1497, 1539, 1619, 1699, 1637, 1677, 1711, 1744, 1763, 1680, 1569, 1560, 1537, 1515, 1542, 1570, 1603, 1536, 1515, 1494, 1474, 1453, 1377, 1403, 1490, 1577, 1599, 1621, 1643, 1665, 1625, 1586, 1604, 1520, 1628, 1736, 1719, 1703, 1660, 1617, 1681, 1644, 1631, 1617, 1557, 1497, 1438, 1549, 1622, 1695, 1668, 1742, 1715, 1688, 1625, 1662, 1592, 1521, 1535, 1548, 1562, 1575, 1619, 1663, 1652, 1540, 1516, 1594, 1591, 1487, 1453, 1589, 1686, 1682, 1639, 1698, 1748, 1629, 1496, 1532, 1547, 1562, 1596, 1631, 1557, 1484, 1414, 1513, 1517, 1520, 1521, 1521, 1599, 1678, 1696, 1613, 1648, 1784, 1694, 1604, 1643, 1783, 1788, 1692, 1669, 1647, 1568, 1659, 1712, 1664, 1733, 1803, 1748, 1693, 1634, 1575, 1600, 1625, 1619, 1612, 1555, 1498, 1617, 1735, 1725, 1613, 1589, 1564, 1502, 1541, 1564, 1588, 1618, 1648, 1574, 1500, 1510, 1521, 1541, 1560]
2367A560M1J42N7m5j17j5j3Q8R5pj07j07L9L8n7n7O1O1n1n2k6k6OPj1J58J9q2j4j4N6N6N0
2362A733N0M2o0n9M1RRO6l6j7j19j25k4N3N4L8o3%J01M4n8k7k7M5M5L7o5j22k1P3k8j6j6p
2357A550pl2l2RJ0R4R4q8q9lmONJ20J9r4QK9K9L1L2M4n7n5M7j6j7j8j9m3m4k7k8R1R1l2l3
2352A571N2N2MNrqJ7j87J3J2P5P5j0j0m8m8KKj2j3L9L8N3N3M9j54L1L0pqm7m8P0P1LMq1q1
2346A550O1O0O1O0k5k5k5k5l3l4l3l3MNMNj8j9j8j8qqJ7J7k5k4K6K6J%K6K6N1N0l4l4M4M4
2340A699M1j63J6J5m8m8l1l1N3N4llQ2Q1k4k4O1O0K5K5k5k6q1q0l0l0j8j8L2L2j5j6j6j6N9
2335A589N9L3L4L3L2q5q5o8o8N0N0pqqqL6L5m8m9%JN1N2Q7Q7l1l1l3l3l3l3N0N1N0N0j12j12
2329A578L9M0m3m4PPJJJ%k1k0k1k1Q6Q7j3j2J22j15k1k2j31L7p0L1K0q1LJ05J28K6ONp6p5
$$ y = [1560, 1601, 1743, 1800, 1755, 1638, 1623, 1610, 1698, 1793, 1786, 1679, 1572, 1611, 1649, 1592, 1535, 1596, 1657, 1606, 1554, 1528, 1502, 1508, 1515, 1504, 1662, 1681, 1599, 1585, 1571, 1627, 1683, 1733, 1783, 1825, 1765, 1706, 1747, 1756, 1765, 1831, 1795, 1778, 1659, 1534, 1510, 1563, 1617, 1655, 1592, 1592, 1693, 1737, 1679, 1652, 1625, 1670, 1715, 1752, 1687, 1565, 1544, 1617, 1589, 1573, 1557, 1550, 1543, 1511, 1479, 1488, 1498, 1592, 1686, 1598, 1509, 1506, 1502, 1508, 1513, 1633, 1652, 1558, 1566, 1595, 1624, 1655, 1687, 1731, 1674, 1619, 1666, 1650, 1633, 1615, 1596, 1553, 1509, 1482, 1454, 1545, 1636, 1604, 1571, 1623, 1675, 1679, 1684, 1675, 1667, 1684, 1497, 1510, 1522, 1597, 1672, 1662, 1652, 1604, 1556, 1558, 1560, 1548, 1535, 1574, 1612, 1665, 1718, 1767, 1613, 1644, 1674, 1667, 1659, 1612, 1564, 1634, 1705, 1708, 1712, 1631, 1550, 1611, 1671, 1732, 1792, 1767, 1742, 1717, 1692, 1659, 1625, 1592, 1559, 1563, 1568, 1572, 1577, 1559, 1540, 1522, 1504, 1496, 1488, 1505, 1522, 1497, 1473, 1499, 1525, 1526, 1526, 1552, 1578, 1629, 1679, 1645, 1611, 1655, 1699, 1740, 1577, 1593, 1608, 1560, 1512, 1481, 1450, 1503, 1557, 1554, 1551, 1633, 1714, 1690, 1666, 1727, 1787, 1812, 1837, 1812, 1786, 1705, 1625, 1595, 1565, 1547, 1529, 1561, 1593, 1578, 1562, 1546, 1530, 1589, 1648, 1681, 1715, 1748, 1780, 1695, 1610, 1542, 1474, 1524, 1574, 1567, 1559, 1551, 1543, 1579, 1614, 1566, 1517, 1517, 1518, 1569, 1621, 1708, 1795, 1764, 1733, 1700, 1667, 1634, 1601, 1651, 1702, 1752, 1802, 1690, 1578, 1617, 1657, 1614, 1570, 1577, 1584, 1585, 1586, 1587, 1587, 1566, 1546, 1525, 1504, 1590, 1677, 1664, 1652, 1774, 1659, 1638, 1616, 1485, 1522, 1452, 1483, 1503, 1422, 1425, 1530, 1658, 1684, 1690, 1695, 1619, 1544]
2323A544J5J5p0L2J55j5n6n5j6j5K1K1P2P2m2m2m3m2N5N5l0l0k1k0k1k1L4L5L4L4n4n5L0L0
2318A606MMm7m7m1m1M4M4RRRRO0O0k4k4L9L9j1j2k7k7k7k7O2O2r1r0llllQ4Q5K3p8M5M5n6
2312A660j58mnM6M6rR2R1rj4j4j28k6K9K9L5L5k2k3k9k9O7l5K3K3m1m0m7N4M0L9j02%J35L5
2307A744p8K4K7K7L3L4l0l0l0l0n1n1O7O7J6J5O6O6l4l4k8j29n0n0m5m6r6P2K8K9L2L2K2K2
2302A611R8p1j96k7J49M8klo2o3o8L3O6O7J1r0O3O3L6o6o2M0M0o2k3P8J4J5o3o4qR2J40L8
2297A772q5q5pqL7L7N1n0QPK2K3L4j36RQM8M9p0p0M9M8J1J2p4p3j3j3P2P2j5j5l9m0jjp5p5
2291A424o3J05L5L6j1j2L9M0J4J4O4O5o0o0p7K4J31l8k1k0n1n1L4L4P7P7qj09q6Q2K0q2m8
2286A518N4j0rnnnmkkkkK7K8J12J12JJm9n0j3j3l8l9q3q3O9O9J8J8l3l3n2n3N5N5J20m9N2
$$ y = [1544, 1559, 1574, 1504, 1536, 1691, 1676, 1620, 1565, 1549, 1534, 1555, 1576, 1648, 1720, 1678, 1636, 1593, 1551, 1606, 1661, 1631, 1601, 1580, 1560, 1539, 1518, 1552, 1587, 1621, 1655, 1601, 1546, 1576, 1606, 1610, 1614, 1567, 1520, 1479, 1438, 1482, 1526, 1535, 1544, 1553, 1562, 1622, 1682, 1658, 1634, 1673, 1712, 1701, 1689, 1662, 1635, 1608, 1581, 1643, 1705, 1614, 1524, 1521, 1518, 1515, 1512, 1596, 1681, 1704, 1626, 1671, 1716, 1660, 1502, 1498, 1493, 1539, 1585, 1576, 1668, 1759, 1750, 1736, 1722, 1594, 1568, 1597, 1626, 1661, 1696, 1674, 1651, 1622, 1593, 1660, 1625, 1648, 1671, 1630, 1590, 1543, 1597, 1637, 1676, 1574, 1574, 1709, 1744, 1666, 1690, 1717, 1744, 1777, 1811, 1781, 1751, 1721, 1691, 1640, 1589, 1656, 1723, 1739, 1754, 1820, 1886, 1852, 1818, 1790, 1661, 1611, 1561, 1516, 1470, 1374, 1446, 1474, 1503, 1535, 1567, 1589, 1611, 1709, 1638, 1442, 1415, 1564, 1612, 1610, 1607, 1545, 1482, 1414, 1447, 1513, 1580, 1591, 1501, 1564, 1627, 1663, 1597, 1535, 1575, 1615, 1553, 1530, 1608, 1622, 1637, 1574, 1510, 1502, 1594, 1734, 1772, 1687, 1602, 1595, 1587, 1624, 1661, 1712, 1662, 1670, 1677, 1699, 1722, 1756, 1620, 1629, 1637, 1685, 1734, 1664, 1594, 1643, 1691, 1702, 1714, 1640, 1567, 1554, 1541, 1613, 1685, 1670, 1655, 1616, 1576, 1575, 1574, 1499, 1424, 1361, 1466, 1501, 1537, 1526, 1514, 1553, 1593, 1607, 1621, 1685, 1750, 1690, 1630, 1553, 1577, 1708, 1670, 1649, 1629, 1578, 1527, 1561, 1595, 1672, 1749, 1741, 1632, 1546, 1628, 1648, 1566, 1518, 1572, 1562, 1553, 1548, 1543, 1538, 1534, 1532, 1530, 1528, 1526, 1553, 1581, 1693, 1805, 1806, 1807, 1758, 1708, 1695, 1682, 1644, 1605, 1522, 1439, 1508, 1577, 1595, 1613, 1580, 1547, 1495, 1442, 1497, 1552, 1672, 1623, 1675]
2280A675N3l9O3J25m3q0q1poLKq1q2L1L0N5N6k8k9llklq8q7NON7N6N6N7ONk8k8p0J33P9j23
2274A642q0q1P5P5K5K4q2q2L6L7N2N3N3N3k0k0k1k0K0K0J9K0r3r3rqK4K4jjl9l9j02J01L4
2269A596L4mmn3n3O5O6j5j5m0m0onM5M4n2n2J12r1RRM7M6O5O5n4n4p6p7P5P5L9L9q0p9j5j4
2263A552J0J1J9K0P0P0pol1l2o0o1o1o1J35J35q5q5mmK1K2JJQ5Q6k9k9k8k9kjk7k8l3l3Q5
2257A587Q5ONONP4P4j12j11k6k5N9O0n3n4j48K1P7P6J38l1p7K4l8j39jjM2M3K6K6k5k5m6m6
2252A476J06J06m0m1J1J0k6k7O9j01j1j1O2O3N7N7M1j29r3PN8N8N4N4L7j32j22k0l3O8Q1k1
2247A668o5L7o5o5O0N9J9J9l3l2n0n1m0m0JJ70K4K4n6n7K7K8K7K7K6K7lmq8q7k8k7K3K3L9
2242A537L9m6m5J1J1O3O2mln4n4K4K4K5K4K4K4K4K4l9l9l9m0P2P2P2P2j33j34j6j5K8K8K8
$$ y = [1675, 1728, 1689, 1752, 1877, 1834, 1754, 1673, 1666, 1660, 1663, 1665, 1584, 1502, 1533, 1563, 1618, 1674, 1646, 1617, 1614, 1611, 1609, 1606, 1518, 1431, 1436, 1442, 1499, 1555, 1611, 1668, 1674, 1679, 1651, 1623, 1553, 1686, 1765, 1642, 1562, 1481, 1556, 1631, 1656, 1680, 1598, 1516, 1552, 1589, 1641, 1694, 1747, 1800, 1780, 1760, 1739, 1719, 1739, 1759, 1778, 1798, 1705, 1612, 1603, 1595, 1619, 1643, 1642, 1641, 1602, 1563, 1461, 1562, 1596, 1630, 1626, 1622, 1569, 1516, 1581, 1647, 1632, 1617, 1577, 1537, 1531, 1526, 1571, 1615, 1563, 1511, 1623, 1532, 1541, 1550, 1597, 1643, 1708, 1773, 1719, 1665, 1589, 1512, 1587, 1662, 1701, 1740, 1660, 1581, 1566, 1552, 1562, 1573, 1592, 1612, 1682, 1752, 1745, 1739, 1708, 1676, 1616, 1555, 1494, 1433, 1568, 1703, 1618, 1533, 1529, 1525, 1546, 1568, 1569, 1570, 1655, 1741, 1712, 1683, 1655, 1626, 1624, 1623, 1596, 1568, 1535, 1502, 1587, 1672, 1678, 1683, 1689, 1694, 1768, 1842, 1730, 1619, 1593, 1568, 1627, 1687, 1634, 1580, 1432, 1453, 1530, 1606, 1744, 1713, 1636, 1660, 1622, 1483, 1482, 1481, 1523, 1566, 1592, 1618, 1593, 1568, 1522, 1476, 1582, 1688, 1648, 1607, 1618, 1628, 1602, 1575, 1644, 1543, 1532, 1521, 1583, 1646, 1703, 1760, 1801, 1672, 1579, 1586, 1644, 1702, 1756, 1810, 1847, 1715, 1593, 1573, 1540, 1608, 1689, 1668, 1603, 1640, 1575, 1510, 1570, 1629, 1648, 1667, 1634, 1602, 1552, 1501, 1461, 1421, 1422, 1592, 1616, 1640, 1584, 1527, 1554, 1582, 1609, 1636, 1662, 1689, 1686, 1682, 1594, 1507, 1479, 1452, 1475, 1498, 1537, 1576, 1530, 1485, 1496, 1507, 1570, 1632, 1628, 1625, 1571, 1517, 1541, 1565, 1590, 1614, 1638, 1662, 1686, 1710, 1671, 1632, 1593, 1553, 1625, 1697, 1769, 1841, 1708, 1574, 1558, 1543, 1571, 1599, 1627]
2237A627K8M2M2p6p6K7K8n6n7j6j5L5L5L2L1L2L1o9o9J6J6N4N3r8r8N6N6N6N6j3j2j33O9M2
2231A676n9J1J0n9o0O1j42p4K7P3J75P1j32j1Q9j35l3J26p5p0J33O3l8L0K9o1o1nnonk1k1
2226A501K9L0J5J5l6l5L7L7L7L7k7k7K4K4n9n9n4J48LKJ5J5l7l8M7M6l6l7l7l7OPOOl7l7l7
2221A457l7R9R9J5J4o2o3o2o2K7K7J12J12K5K5n9n9j61j60J27J26P9P8oon5n5L0L0o4o4K1
2216A528K0MLm7m7Q2Q2K1K1J07o1j46K3lkj48K1J20m9OOM0M0p9p8L8L7m6m7N7N8Or4pJ62J55
2210A783j3l4l3POk9k9K1K2n1n2j46K2k3k3j2j2L6L6L6L6P4P5j1j0l4l3OPR2p5j00r9J1J1
2205A462l9m0M3M3J27J28j19j18O7O8k5k4p6p5L9L9L9L9J08J09m4m3llj3j3J16n2qqK8K8L9
2200A819j30MNpon5n5nR7N1j19O8O7%jj%LMm7m8J8J7J7J8r3r2l8O4M4n7POP3P3j8j7O7l5k1
$$ y = [1627, 1655, 1697, 1739, 1663, 1587, 1614, 1642, 1586, 1529, 1513, 1498, 1533, 1568, 1600, 1631, 1663, 1694, 1625, 1556, 1572, 1588, 1642, 1695, 1597, 1499, 1555, 1611, 1667, 1723, 1710, 1698, 1565, 1634, 1676, 1617, 1628, 1638, 1579, 1519, 1580, 1438, 1364, 1391, 1464, 1639, 1710, 1578, 1567, 1656, 1521, 1488, 1614, 1539, 1469, 1602, 1665, 1627, 1657, 1686, 1625, 1564, 1559, 1554, 1548, 1543, 1522, 1501, 1530, 1560, 1575, 1590, 1554, 1519, 1556, 1593, 1630, 1667, 1640, 1613, 1637, 1661, 1602, 1543, 1489, 1637, 1640, 1642, 1657, 1672, 1635, 1597, 1644, 1690, 1654, 1617, 1580, 1543, 1549, 1556, 1562, 1568, 1531, 1494, 1457, 1420, 1519, 1618, 1633, 1647, 1585, 1522, 1460, 1398, 1425, 1452, 1564, 1676, 1701, 1726, 1667, 1608, 1447, 1287, 1414, 1540, 1619, 1697, 1691, 1685, 1630, 1575, 1605, 1635, 1571, 1507, 1528, 1548, 1552, 1555, 1508, 1461, 1543, 1625, 1646, 1667, 1774, 1713, 1567, 1590, 1587, 1585, 1437, 1458, 1578, 1529, 1535, 1541, 1581, 1621, 1542, 1464, 1502, 1539, 1493, 1446, 1503, 1561, 1567, 1473, 1466, 1628, 1783, 1770, 1736, 1703, 1710, 1716, 1687, 1658, 1679, 1701, 1650, 1598, 1452, 1474, 1451, 1428, 1416, 1404, 1440, 1476, 1512, 1548, 1622, 1697, 1686, 1676, 1642, 1609, 1615, 1622, 1714, 1639, 1539, 1440, 1451, 1462, 1423, 1383, 1426, 1469, 1596, 1724, 1605, 1487, 1554, 1622, 1597, 1573, 1497, 1422, 1461, 1500, 1539, 1578, 1686, 1795, 1751, 1708, 1705, 1702, 1689, 1676, 1792, 1740, 1732, 1724, 1752, 1780, 1819, 1689, 1693, 1698, 1691, 1685, 1630, 1575, 1570, 1667, 1718, 1599, 1667, 1734, 1734, 1733, 1732, 1732, 1735, 1739, 1692, 1644, 1662, 1679, 1696, 1714, 1621, 1529, 1491, 1555, 1599, 1542, 1549, 1555, 1628, 1701, 1683, 1666, 1733, 1698, 1677]
2194A677k2j16j4P0l1L0K9J6J7j5j16j17j5O5O4K0K0m0m1P8P8m4m3O8O8L1p1j9Q1M0M0M6M6
2189A880o0o0n9o0M4M4N6m5n6M5j03j03R5R5k4k3q7q7KJ03J13J2n0n0rj11j05O5R2j0q3J8
2184A479QRQRN6m5O2O3J2J1J2J2MMJ6q5m7N5M8M8o0M1j5j6J2J1O3O2p9q0p9p9n2n2L3L2L0
2178A511L0k6P4%jN7N6p4p4n3M9J25K4k4k5n7M5j3j3ppM3M4J19J19o6o7n7n7j14j3O7O7l8
2173A644l9r8KlmN9O0O5l6N1N1l4l3o5L6O3O4k1k1o1o1j17N2R8lp9p9L3L3K8K7Pr5m3N8J14
2168A653J13p3p2j6j17J9J8J8J9p4K7J45M4l1l2k8k8j13N6P9P9PPN8N8n1n1n1n0j9j8j8j8
2163A540PQJ3J4k1Q0Q0k1Q8Q9j3j14q1q2r8P0Q8Q7Lr9LLj49J9N1N0J05J05P8k3j42m1L3L2
2157A762j2j2%Jq4q4p9p8N0N0QJ77l7l6n9o0rrR7R7q9q9m0l9P9P9p4p3k2k3J15J16llo2o2
$$ y = [1677, 1655, 1539, 1525, 1595, 1564, 1594, 1623, 1639, 1656, 1641, 1525, 1408, 1393, 1458, 1522, 1542, 1562, 1522, 1481, 1559, 1637, 1593, 1550, 1618, 1686, 1717, 1646, 1627, 1708, 1748, 1788, 1834, 1880, 1820, 1760, 1701, 1641, 1685, 1729, 1785, 1740, 1684, 1729, 1626, 1523, 1618, 1713, 1689, 1666, 1579, 1492, 1494, 1597, 1710, 1722, 1672, 1622, 1613, 1502, 1397, 1462, 1554, 1544, 1461, 1479, 1487, 1496, 1504, 1513, 1569, 1524, 1586, 1649, 1661, 1672, 1684, 1696, 1700, 1704, 1720, 1635, 1588, 1643, 1691, 1739, 1679, 1720, 1705, 1689, 1701, 1712, 1775, 1837, 1758, 1678, 1599, 1520, 1468, 1416, 1449, 1481, 1511, 1541, 1515, 1589, 1589, 1588, 1645, 1701, 1627, 1553, 1500, 1549, 1674, 1698, 1674, 1649, 1592, 1637, 1624, 1611, 1604, 1597, 1640, 1684, 1803, 1922, 1856, 1789, 1732, 1675, 1561, 1548, 1615, 1682, 1644, 1605, 1507, 1509, 1506, 1502, 1561, 1621, 1686, 1650, 1701, 1752, 1718, 1685, 1620, 1656, 1719, 1783, 1762, 1741, 1680, 1619, 1502, 1554, 1652, 1649, 1570, 1491, 1524, 1557, 1585, 1612, 1619, 1524, 1481, 1539, 1653, 1766, 1693, 1621, 1605, 1488, 1507, 1525, 1543, 1562, 1488, 1515, 1660, 1704, 1673, 1641, 1613, 1585, 1472, 1528, 1607, 1686, 1693, 1700, 1758, 1816, 1765, 1714, 1663, 1613, 1594, 1576, 1558, 1540, 1547, 1555, 1568, 1582, 1561, 1641, 1721, 1700, 1788, 1877, 1864, 1750, 1669, 1587, 1489, 1559, 1647, 1734, 1737, 1638, 1641, 1644, 1495, 1514, 1565, 1615, 1720, 1825, 1903, 1880, 1738, 1697, 1730, 1762, 1750, 1738, 1738, 1739, 1655, 1571, 1492, 1414, 1464, 1514, 1522, 1699, 1662, 1626, 1567, 1507, 1498, 1489, 1586, 1683, 1594, 1505, 1465, 1426, 1505, 1584, 1510, 1437, 1415, 1392, 1507, 1623, 1620, 1617, 1555, 1493]
2152A493R0Q9l8l8J2J2o1o2J25J24r6r7m5m6J30J29k2k2P6P6m2m2p0p0M9M9ppk4P8K4j44P6
2147A699P5o0o1j11j12P8P7P8P8l3l3N1N2o3o2N6N5l8l9l8l9J6J5O6O6l4l5J7J6j0j0o1o1
2142A595K8K7K8K7K2K1J23m7j53n1jjm6m5L9L9k9l0l0l0L6L6M2M2j33l2N9m3k0Q1k6k7p6K5
2137A450N2N3m5m5J7J17K6K6Nr6Q2Q2m3m3M4M5M4M4l6l6l6l6r5r5K3K3KKN9m2J1J1oJ63M4
2131A771M4K7p5o0o1M8n5j6Q5o2o3M1M2m3m4N4N4MLj3j2n7n8m7N4P5P4K8p4p3K7J2J2l3l2
2126A577O5O6n3n3O9P0j54Q2R5nRRoj07JJn3n2NNq6J5P1P0Q5j5l7l7lR8k0j21nnM0L9J6J7
2120A693J57N7j79j78P9J80J5J5K1K1m0m0J0J1q7q6q7q6N3N3l1l1P1P1K1K1qqn8n9L6L5L6
2115A678L5noP9P9j06j06J3J2L1L2q7q7poppjkNMm2O0R7p1kkj3j2K1K1k9l0j3j2P1P2L2L3
$$ y = [1493, 1583, 1672, 1634, 1596, 1608, 1620, 1559, 1497, 1622, 1746, 1650, 1553, 1508, 1462, 1592, 1721, 1699, 1677, 1753, 1829, 1787, 1745, 1675, 1605, 1654, 1703, 1696, 1689, 1665, 1743, 1767, 1623, 1699, 1774, 1714, 1653, 1542, 1430, 1508, 1585, 1663, 1741, 1708, 1675, 1726, 1778, 1715, 1653, 1709, 1764, 1726, 1687, 1649, 1610, 1626, 1641, 1707, 1773, 1739, 1704, 1721, 1737, 1727, 1717, 1656, 1595, 1623, 1650, 1678, 1705, 1727, 1748, 1871, 1824, 1671, 1620, 1619, 1618, 1572, 1527, 1566, 1605, 1576, 1546, 1516, 1486, 1522, 1558, 1600, 1642, 1509, 1477, 1536, 1493, 1473, 1554, 1528, 1501, 1425, 1450, 1502, 1555, 1510, 1465, 1482, 1599, 1625, 1651, 1656, 1560, 1642, 1724, 1681, 1638, 1682, 1727, 1771, 1815, 1779, 1743, 1707, 1671, 1576, 1481, 1504, 1527, 1529, 1531, 1590, 1548, 1559, 1570, 1564, 1727, 1771, 1815, 1842, 1767, 1707, 1646, 1694, 1639, 1623, 1708, 1646, 1583, 1624, 1666, 1623, 1579, 1633, 1687, 1691, 1694, 1681, 1669, 1612, 1554, 1507, 1561, 1636, 1710, 1738, 1664, 1591, 1618, 1630, 1642, 1609, 1577, 1642, 1708, 1655, 1602, 1671, 1741, 1587, 1669, 1764, 1759, 1768, 1777, 1771, 1664, 1665, 1666, 1613, 1561, 1566, 1571, 1485, 1500, 1571, 1641, 1726, 1711, 1674, 1637, 1634, 1732, 1712, 1591, 1586, 1581, 1621, 1660, 1676, 1693, 1850, 1907, 1728, 1550, 1629, 1809, 1824, 1839, 1860, 1881, 1841, 1801, 1811, 1822, 1735, 1649, 1562, 1476, 1529, 1582, 1551, 1520, 1591, 1662, 1683, 1704, 1696, 1688, 1630, 1571, 1607, 1642, 1678, 1713, 1708, 1702, 1781, 1860, 1754, 1648, 1661, 1673, 1704, 1736, 1649, 1562, 1555, 1549, 1542, 1535, 1534, 1532, 1537, 1541, 1499, 1559, 1656, 1585, 1583, 1581, 1568, 1556, 1577, 1598, 1569, 1539, 1526, 1514, 1585, 1657, 1689, 1722]
2109A722J00jj30M0K2K3q9r0l8l9O9O9O9O9k5k4k5k5JJ%Jl4l4N1N0k6k7k6k7QRQQQQKJJ8q4
2103A613j16N4J3J15M7n5r1J0N4m7r0r1K1K2qpM3M4l1l1l1l1L0L0k1k0N7N7N7N8k1k1k1k1
2098A571K0K0k4k4k4P7J28K7PQKJp5p6k5k5L5L4P9P9J4q7l0l0N3N2p3p2Q7j4J5q6M0M0J2q9
2092A647j10rOOJ03JPQm4m4j7Q5j0rj0j0Q2k0j4j4klkkr1r1J28J29K0K0l8O5l0l0m4j46k7
2087A490P4O2j07n2N0M0o2M0M1%j01N4m8n9M1M1o0J05o5p7K5PQR4R5L7L8Lr7j3Q8P3P4j5j17
2081A707pqM9n2j74p3Q4Q3O5O4Lr8rrp3K9ooN1N1j3j3L8L7l9l9n2M9L8o4n8M4k4k5J27J27
2076A804M1o1m8m8j82q0M9M9M7M6KKjJ00J38l0r0r0n0n0O9O9J9J9J8J8l2l2j4j5j4j4l3l2
2071A574J09Pm8m9l1J37L9L8m6j47MLj54J4P5k6M1M2l2l1J9J9L4L5j08nO2O3J2J2O4l7K0K0
$$ y = [1722, 1822, 1821, 1691, 1731, 1753, 1776, 1687, 1597, 1559, 1520, 1589, 1658, 1727, 1796, 1771, 1747, 1722, 1697, 1698, 1699, 1699, 1700, 1666, 1632, 1683, 1733, 1707, 1680, 1654, 1627, 1635, 1644, 1652, 1660, 1668, 1676, 1678, 1679, 1697, 1613, 1497, 1551, 1564, 1679, 1726, 1671, 1580, 1590, 1644, 1597, 1507, 1416, 1437, 1459, 1451, 1444, 1487, 1531, 1500, 1469, 1438, 1407, 1437, 1467, 1446, 1426, 1483, 1540, 1597, 1655, 1634, 1613, 1592, 1571, 1591, 1611, 1587, 1563, 1539, 1616, 1744, 1771, 1778, 1786, 1788, 1789, 1714, 1638, 1613, 1588, 1623, 1657, 1736, 1815, 1829, 1742, 1712, 1682, 1735, 1787, 1714, 1642, 1729, 1715, 1730, 1644, 1684, 1724, 1736, 1647, 1537, 1528, 1534, 1540, 1643, 1644, 1651, 1659, 1615, 1571, 1554, 1639, 1629, 1620, 1610, 1600, 1682, 1662, 1648, 1634, 1632, 1629, 1627, 1625, 1534, 1443, 1571, 1700, 1720, 1740, 1702, 1767, 1737, 1707, 1663, 1517, 1490, 1564, 1626, 1519, 1467, 1517, 1557, 1495, 1535, 1576, 1576, 1475, 1529, 1481, 1422, 1463, 1504, 1444, 1549, 1484, 1407, 1432, 1439, 1447, 1541, 1636, 1673, 1711, 1714, 1617, 1604, 1692, 1765, 1839, 1824, 1707, 1700, 1692, 1741, 1689, 1515, 1442, 1526, 1609, 1674, 1738, 1741, 1643, 1634, 1625, 1552, 1581, 1575, 1569, 1620, 1671, 1658, 1645, 1683, 1720, 1681, 1642, 1590, 1639, 1677, 1613, 1555, 1599, 1575, 1550, 1677, 1804, 1845, 1784, 1736, 1688, 1506, 1426, 1475, 1524, 1571, 1617, 1619, 1621, 1620, 1720, 1858, 1828, 1738, 1648, 1598, 1548, 1617, 1686, 1705, 1724, 1742, 1760, 1728, 1696, 1682, 1667, 1653, 1639, 1606, 1574, 1683, 1690, 1642, 1593, 1562, 1699, 1738, 1776, 1730, 1583, 1587, 1590, 1436, 1450, 1525, 1499, 1540, 1582, 1550, 1519, 1538, 1557, 1591, 1626, 1518, 1513, 1575, 1638, 1650, 1662, 1726, 1689, 1709, 1729]
2066A729o5o5j4J55K5p6lkp2K9J7J7J9q1j8j9L6J37rj10j7Q4k9l0M0M0m5m4J8J8k7k6m8N2
2060A616O4l8q6Q2J23K2o0o0nR7K4K3k0k1j6j6Q5j6qj08jjL4J35p4p4l2l3l2l3P3P2p0L2n6
2055A622n6R1j0m4m3n0n0M3M4L7L8P1l0k4k4k4k5K6K7M1M1K0q2j22k1%%l8l8Q1Q0k4k4J29
2050A662m1K4J26n9o0k8k7J6J7Lr8r8LQ0Q1L6L7K4K5l2l3Kr9QQN4N4N4N3j40j40o1J09J87
2045A747J8j8j8q2Q6M2o0k4j25j25k4L7J38N9m2lmj0j0r1r1l6O5J30K9M1M1o5o4p5R4j7j6
2040A527poO7O7J7J6K2K2k9k9q3q3l3l2R0R1o2o2qpP6P7nmj5j5J12n7j46R1J03J02r6r6p9
2034A526K1J11n9l1l1RRN6N6J11n8q1Q8j8j8l5l5l6l5O4O4j22j22NMq0q0R4R4k4k4RJ0J0R
2029A461K0K1P1P0klj04O4P8k4m1m1K7K7K7K7p3p4M5M5O3O3j60QJ95K6p7K4l5l5k9k9k8k9
$$ y = [1729, 1664, 1599, 1585, 1740, 1765, 1689, 1686, 1684, 1612, 1641, 1658, 1675, 1694, 1613, 1595, 1576, 1612, 1749, 1740, 1630, 1613, 1697, 1668, 1638, 1678, 1718, 1673, 1629, 1647, 1665, 1638, 1612, 1564, 1616, 1680, 1642, 1556, 1638, 1761, 1783, 1723, 1663, 1658, 1755, 1779, 1802, 1782, 1761, 1745, 1729, 1814, 1798, 1790, 1682, 1681, 1680, 1714, 1849, 1775, 1701, 1669, 1636, 1604, 1571, 1644, 1716, 1646, 1678, 1622, 1566, 1657, 1647, 1603, 1560, 1510, 1460, 1503, 1547, 1584, 1622, 1693, 1663, 1639, 1615, 1591, 1566, 1592, 1619, 1660, 1701, 1721, 1639, 1517, 1496, 1496, 1496, 1458, 1420, 1501, 1581, 1557, 1533, 1662, 1621, 1645, 1771, 1712, 1652, 1624, 1597, 1613, 1630, 1633, 1535, 1437, 1440, 1520, 1601, 1637, 1674, 1698, 1723, 1691, 1658, 1660, 1561, 1569, 1577, 1631, 1685, 1739, 1792, 1652, 1512, 1451, 1560, 1747, 1765, 1747, 1729, 1647, 1733, 1775, 1715, 1691, 1566, 1441, 1417, 1454, 1592, 1651, 1609, 1606, 1602, 1592, 1582, 1491, 1400, 1364, 1429, 1559, 1588, 1629, 1670, 1605, 1541, 1466, 1560, 1543, 1527, 1520, 1514, 1581, 1648, 1665, 1681, 1703, 1725, 1696, 1667, 1584, 1501, 1468, 1436, 1526, 1617, 1555, 1493, 1485, 1478, 1554, 1631, 1626, 1622, 1607, 1592, 1704, 1647, 1501, 1592, 1695, 1797, 1701, 1605, 1526, 1547, 1658, 1599, 1568, 1537, 1546, 1555, 1611, 1667, 1778, 1720, 1639, 1727, 1709, 1691, 1656, 1621, 1585, 1550, 1614, 1678, 1556, 1434, 1439, 1443, 1363, 1283, 1377, 1471, 1447, 1423, 1432, 1442, 1452, 1461, 1481, 1502, 1573, 1643, 1641, 1638, 1534, 1598, 1676, 1652, 1611, 1570, 1597, 1624, 1651, 1678, 1605, 1531, 1576, 1621, 1684, 1747, 1587, 1595, 1790, 1816, 1739, 1763, 1728, 1693, 1664, 1635, 1607, 1578]
2024A578K2K2j0j1j0j0K3K2K3K2J6J5J6J6LLm8m8m2m2M2M2n3n3kkL8L7j2j3q3q2J03J03k4
2018A601k5K6K6MMMLj4j5r9r9J02J02k9k9R1j12k3k3J27J27M3M3klq6q7l0l0K1K1MMm6m7m9
2013A505m9KKP9P9oojjQ4Q3m5m6k0k0N4N3r9r9J9J8l2l2LLJ6J6J64l9m4m3j9j9j9j9L4L5R
2007A600Rj10j10P6P6O7O6n1n2j5j4j5j4N8N8PQo6o6j5j5M4M4J8J9J6J7J05r7NMpqo2o2j2
2002A506j1J4J4l7l6rj0M2M2N3N4l1l0m8m8J05J04k2k2p2p3J2J2R6R6j4j5o5o5L2L2j9j9k4
1996A544k5qR3R5p4k3k3j8j8m3m3O9P0J9J9lkK3K3M0M0M0M1%Jn0n0r8r7N4N5MNm7m6k1k1O4
1991A589O3l5l6M9M9n1n1k6k6KJN2N3L7L7O3O3m9m9j00j00L8L8P8P8L5j33q3q3K9J30N0j18
1986A594k0k0K0K0qqqqmlM8J49O9j00p4R4Q9j4l4j36j15j3k2P9O5l6Q4j7l1l1M7M7n2n2L2
$$ y = [1578, 1600, 1622, 1612, 1601, 1591, 1581, 1604, 1626, 1649, 1671, 1687, 1702, 1718, 1734, 1737, 1740, 1692, 1644, 1602, 1560, 1602, 1644, 1591, 1538, 1536, 1534, 1572, 1609, 1597, 1584, 1501, 1419, 1522, 1625, 1601, 1576, 1602, 1628, 1632, 1636, 1640, 1643, 1629, 1614, 1515, 1416, 1518, 1620, 1591, 1562, 1653, 1541, 1518, 1495, 1622, 1749, 1792, 1835, 1833, 1830, 1744, 1657, 1627, 1597, 1618, 1639, 1643, 1647, 1601, 1554, 1505, 1456, 1458, 1460, 1539, 1618, 1612, 1606, 1605, 1604, 1688, 1771, 1726, 1680, 1660, 1640, 1694, 1747, 1648, 1549, 1568, 1586, 1554, 1522, 1525, 1528, 1544, 1560, 1724, 1685, 1641, 1598, 1579, 1560, 1541, 1522, 1556, 1591, 1600, 1609, 1499, 1389, 1465, 1541, 1608, 1674, 1623, 1571, 1556, 1542, 1527, 1513, 1571, 1629, 1636, 1644, 1578, 1512, 1497, 1482, 1526, 1570, 1588, 1607, 1623, 1640, 1745, 1648, 1653, 1657, 1650, 1642, 1580, 1518, 1506, 1495, 1509, 1523, 1486, 1450, 1441, 1431, 1473, 1515, 1568, 1622, 1591, 1561, 1513, 1465, 1570, 1674, 1652, 1630, 1558, 1485, 1497, 1509, 1605, 1701, 1687, 1672, 1607, 1542, 1574, 1606, 1587, 1568, 1544, 1519, 1511, 1604, 1699, 1625, 1602, 1579, 1561, 1543, 1500, 1457, 1526, 1596, 1615, 1634, 1631, 1629, 1652, 1675, 1715, 1755, 1795, 1836, 1836, 1837, 1787, 1737, 1639, 1542, 1596, 1651, 1655, 1660, 1613, 1567, 1546, 1525, 1589, 1652, 1617, 1581, 1630, 1679, 1628, 1577, 1551, 1525, 1527, 1528, 1580, 1633, 1670, 1707, 1770, 1833, 1784, 1735, 1635, 1535, 1573, 1611, 1689, 1767, 1802, 1669, 1586, 1503, 1532, 1662, 1712, 1594, 1574, 1554, 1574, 1594, 1586, 1578, 1570, 1562, 1558, 1555, 1603, 1752, 1821, 1721, 1647, 1741, 1830, 1816, 1782, 1646, 1531, 1518, 1496, 1575, 1640, 1604, 1688, 1671, 1640, 1609, 1656, 1703, 1651, 1599, 1631]
1980A631L2k2k3K8K8l9l8m5N7J35J35Q4q5r5r5j26M2J31l8p3K7J8J8J2J13J9q2j9j9NMk3j25
$$ y = [1631, 1663, 1641, 1618, 1646, 1674, 1635, 1597, 1552, 1609, 1744, 1879, 1963, 1878, 1783, 1688, 1562, 1604, 1735, 1697, 1624, 1651, 1669, 1687, 1699, 1812, 1831, 1749, 1730, 1711, 1716, 1720, 1697, 1572]
$$ [...]
##END=	
##END=	
