##TITLE=	kmi-Dibenzothio-1.10.fid


##JCAMP-DX=	6.0	$$ MestReNova 14.1.1-24571
##DATA TYPE=	LINK
##BLOCK_ID=	1
##BLOCKS=	1    
##ORIGIN=	Mestrelab Research S.L.
##OWNER=	hrzepa
##$MNOVA/LINK_BLOCK_TYPE=	ITEM	$$ NMR Spectrum
##$MNOVA/ITEM/POLYGON=	(XY..XY)
5321,5835
8722,5835
8722,8208
5321,8208
5321,5835
##$MNOVA/ITEM/Z=	0
##$MNOVA/ITEM/ANGLE=	0
##TITLE=	kmi-Dibenzothio-1.10.fid
##JCAMP-DX=	6.0	$$ MestReNova 14.1.1-24571
##BLOCK_ID=	2
##DATA TYPE=	NMR SPECTRUM
##DATA CLASS=	XYDATA
##NUMDIM=	1
##ORIGIN=	Bruker BioSpin GmbH
##OWNER=	root
##.OBSERVE FREQUENCY=	500.13308850747802126
##.OBSERVE NUCLEUS=	^1H
##.SOLVENT NAME=	CDCl3
##.PULSE SEQUENCE=	zg30
##LONGDATE=	2022/03/10 11:03:00.000
##.ACQUISITIONMODE=	SIMULTANEOUS (DQD)
##$ORIGINAL FORMAT=	Bruker XWIN-NMR
##$MNOVA/SCALES_VERSION=	9
##$PARAMETER FILE=	(acqus, ASCII, /Users/hrzepa/Library/Mobile%20Documents/com~apple~CloudDocs/C2/Pure%20samples/kmi-Dibenzothio-1/dibenzo[b,d]thiophene/acqus, 0)
$$ ##TITLE= Parameter file, TOPSPIN		Version 3.2
$$ ##JCAMPDX= 5.0
$$ ##DATATYPE= Parameter Values
$$ ##NPOINTS= 11	$$ modification sequence number
$$ ##ORIGIN= Bruker BioSpin GmbH
$$ ##OWNER= root
$$ $$ 2022-03-10 11:03:50.659 +0900  root@CZC31189P3
$$ $$ C:/Users/root/Desktop/NMR/miyamoto/kmi-Dibenzothio-1/10/acqus
$$ $$ process C:\Bruker\TopSpin3.2\prog\mod\shimcntl.exe
$$ ##$ACQT0= -2.52100840336134
$$ ##$AMP= (0..31)
$$ 100 100 100 100 100 100 100 100 100 100 100 100 100 100 100 100 100 100
$$ 100 100 100 100 100 100 100 100 100 100 100 100 100 100
$$ ##$AMPCOIL= (0..19)
$$ 0 0 0 0 0 0 0 0 0 0 0 0 0 0 0 0 0 0 0 0
$$ ##$ANAVPT= -1
$$ ##$AQSEQ= 0
$$ ##$AQ_mod= 3
$$ ##$AUNM= <au_zg>
$$ ##$AUTOPOS= <17 >
$$ ##$BF1= 500.13
$$ ##$BF2= 500.13
$$ ##$BF3= 500.13
$$ ##$BF4= 500.13
$$ ##$BF5= 500.13
$$ ##$BF6= 500.13
$$ ##$BF7= 500.13
$$ ##$BF8= 500.13
$$ ##$BYTORDA= 0
$$ ##$CAGPARS= (0..11)
$$ 0 0 0 0 0 0 0 0 0 0 0 0
$$ ##$CFDGTYP= 0
$$ ##$CFRGTYP= 9
$$ ##$CHEMSTR= <none>
$$ ##$CNST= (0..63)
$$ 1 1 1 1 1 1 1 1 1 1 1 1 1 1 1 1 1 1 1 1 1 1 1 1 1 1 1 1 1 1 1 1 1 1 1 1
$$ 1 1 1 1 1 1 1 1 1 1 1 1 1 1 1 1 1 1 1 1 1 1 1 1 1 1 1 1
$$ ##$CPDPRG= (0..8)
$$ <> <> <> <> <> <> <> <> <>
$$ ##$D= (0..63)
$$ 0 1 0 0 0 0 0 0 0 0 0 0 0 0 0 0 0.0002 0 0 0 0 0 0 0 0 0 0 0 0 0 0 0 0
$$ 0 0 0 0 0 0 0 0 0 0 0 0 0 0 0 0 0 0 0 0 0 0 0 0 0 0 0 0 0 0 0
$$ ##$DATE= 1646877829
$$ ##$DE= 6.5
$$ ##$DECBNUC= <off>
$$ ##$DECIM= 2000
$$ ##$DECNUC= <off>
$$ ##$DECSTAT= 4
$$ ##$DIGMOD= 1
$$ ##$DIGTYP= 12
$$ ##$DQDMODE= 0
$$ ##$DR= 22
$$ ##$DS= 2
$$ ##$DSPFIRM= 0
$$ ##$DSPFVS= 20
$$ ##$DTYPA= 0
$$ ##$EXP= <A.Proton>
$$ ##$F1LIST= <>
$$ ##$F2LIST= <>
$$ ##$F3LIST= <>
$$ ##$FCUCHAN= (0..9)
$$ 0 2 0 0 0 0 0 0 0 0
$$ ##$FL1= 90
$$ ##$FL2= 90
$$ ##$FL3= 90
$$ ##$FL4= 90
$$ ##$FOV= 20
$$ ##$FQ1LIST= <>
$$ ##$FQ2LIST= <>
$$ ##$FQ3LIST= <>
$$ ##$FQ4LIST= <>
$$ ##$FQ5LIST= <>
$$ ##$FQ6LIST= <>
$$ ##$FQ7LIST= <>
$$ ##$FQ8LIST= <>
$$ ##$FRQLO3= 23161.4925220013
$$ ##$FRQLO3N= 2
$$ ##$FS= (0..7)
$$ 83 83 83 83 83 83 83 83
$$ ##$FTLPGN= 0
$$ ##$FW= 125000
$$ [...]
$$ 130000 130000 130000 130000 130000 130000 130000 130000 130000 130000 130000
$$ 130000 130000 130000 130000 130000 130000 130000 130000 130000 130000 130000
$$ 130000 130000 130000 130000 130000 130000 130000 0 0 0 0 0 0 0 0 0 0 0
$$ 0 0 0 0 0 0 0 0 0 0 0 0 0
$$ ##$ShimPowMaxUC= (0..63)
$$ 130000 130000 130000 130000 130000 130000 130000 130000 130000 130000 130000
$$ 130000 130000 130000 130000 130000 130000 130000 130000 130000 130000 130000
$$ 130000 130000 130000 130000 130000 130000 130000 130000 130000 130000 130000
$$ 130000 130000 130000 130000 130000 130000 130000 0 0 0 0 0 0 0 0 0 0 0
$$ 0 0 0 0 0 0 0 0 0 0 0 0 0
$$ ##$ShimPowMaxUG= (0..63)
$$ 524287 524287 524287 524287 524287 524287 524287 524287 524287 524287 524287
$$ 524287 524287 524287 524287 524287 524287 524287 524287 524287 524287 524287
$$ 524287 524287 524287 524287 524287 524287 524287 524287 524287 524287 524287
$$ 524287 524287 524287 524287 524287 524287 0 0 0 0 0 0 0 0 0 0 0 0 0 0 0
$$ 0 0 0 0 0 0 0 0 0 0
$$ ##$ShimPowRcbType= 3
$$ ##$ShimPowRes= (0..63)
$$ 1e-020 1e-020 1e-020 1e-020 1e-020 1e-020 1e-020 1e-020 1e-020 1e-020 1e-020
$$ 1e-020 1e-020 1e-020 1e-020 1e-020 1e-020 1e-020 1e-020 1e-020 1e-020 1e-020
$$ 1e-020 1e-020 1e-020 1e-020 1e-020 1e-020 1e-020 1e-020 1e-020 1e-020 1e-020
$$ 1e-020 1e-020 1e-020 1e-020 1e-020 1e-020 1e-020 0 0 0 0 0 0 0 0 0 0 0
$$ 0 0 0 0 0 0 0 0 0 0 0 0 0
$$ ##$ShimPowRng0= (0..63)
$$ 1 1 1 1 1 1 1 1 1 1 1 1 1 1 1 1 1 1 1 1 1 1 1 1 1 1 1 1 1 1 1 1 1 1 1 1
$$ 1 1 1 1 0 0 0 0 0 0 0 0 0 0 0 0 0 0 0 0 0 0 0 0 0 0 0 0
$$ ##$ShimPowRng1= (0..63)
$$ 1 1 1 1 1 1 1 1 1 1 1 1 1 1 1 1 1 1 1 1 1 1 1 1 1 1 1 1 1 1 1 1 1 1 1 1
$$ 1 1 1 1 0 0 0 0 0 0 0 0 0 0 0 0 0 0 0 0 0 0 0 0 0 0 0 0
$$ ##$ShimPowRng2= (0..63)
$$ 1 1 1 1 1 1 1 1 1 1 1 1 1 1 1 1 1 1 1 1 1 1 1 1 1 1 1 1 1 1 1 1 1 1 1 1
$$ 1 1 1 1 0 0 0 0 0 0 0 0 0 0 0 0 0 0 0 0 0 0 0 0 0 0 0 0
$$ ##$ShimPowRng3= (0..63)
$$ 1 1 1 1 1 1 1 1 1 1 1 1 1 1 1 1 1 1 1 1 1 1 1 1 1 1 1 1 1 1 1 1 1 1 1 1
$$ 1 1 1 1 0 0 0 0 0 0 0 0 0 0 0 0 0 0 0 0 0 0 0 0 0 0 0 0
$$ ##$ShimSysFunc= (0..63)
$$ 1 2 3 4 5 6 7 8 9 10 0 37 38 35 16 15 14 13 12 11 28 27 26 25 24 23 36
$$ 22 30 29 20 21 34 33 32 31 17 18 19 0 0 0 0 0 0 0 0 0 0 0 0 0 0 0 0 0 0
$$ 0 0 0 0 0 0 0
$$ ##$ShimSysMatrix= 0
$$ ##$ShimSysType= 4
$$ ##$TFXNUM= 0
$$ ##$TRIPLO2= 0
$$ ##$VTU= 2
$$ ##$VTUETH= <149.236.99.20>
$$ ##$VTUTY= <no>
$$ ##$WBREFAM= (0..15)
$$ 100 100 100 100 100 100 100 100 100 100 100 100 100 100 100 100
$$ ##$WBREFLM= (0..15)
$$ 1 0 0 0 0 0 0 0 0 0 0 0 0 0 0 0
$$ ##$WBREFPH= (0..15)
$$ 0.03 0 0 0 0 0 0 0 0 0 0 0 0 0 0 0
$$ ##$WBSGU= (0..15)
$$ 0 0 0 0 0 0 0 0 0 0 0 0 0 0 0 0
$$ ##$XFAC= 2
$$ ##END=
$$ 
##$DECIM=	2000
##$DSPFVS=	20
##XUNITS=	HZ
##YUNITS=	ARBITRARY UNITS
##FIRSTX=	8074.9686700346401267
##LASTX=	-1924.8787420747351007
##DELTAX=	-0.152587890625
##XFACTOR=	1
##YFACTOR=	0.0097491901605912638373
##FIRSTY=	13.111521720886230469
##MINY=	5.6640734672546386719
##MAXY=	8569.8037109375
##NPOINTS=	65536
##XYDATA=	(X++(Y..Y))
$$ [...]
5220A211q4R7o4M7M8llM0L9M0L9l8l8M2M2l9l9l0k9j18M3Q6Q6p9p9M4M5Q6p5l5l5J36k5j05
5214A253N6LLJ3J3K8K8L7j23n9n9q0Q1J3J2p8Q2J43j8LKl1l1l2l1L4L3l3J27J19j48l1j92
5209A137jjK9L0K8K8J08J09m8m7ppj3j3j3j2M7M8k3k3j11N0%jo8o8J2J2L7L8m3m3M6M6n5J06
5204A314J17m4p8p7K7K7j3j3M9M9M8M9k8k8J2J2j31j32N6N6N3N2R3R3J7J7j17j18o7o8J3J2
5199A252J9J8J8J9ONM6M6n5n5K5K6l9l8KKL5L6r8r8L5L4l5l5m3J17K8K7J6J6J5J6J9K0J9K0
5193A441q3q3klM5M5M5M5RRM9M9r7r7j18M3K9j31m2J20%J%JJ29l2k2k2j3j3n3n4R6R5l9l9
5188A308o3o3J8J8PQPQK0K0J9K0j14j15K0K0Q6Q6m8m8k8k9N2N2K3K3Q0Q0P2q9q9P1J8J7j2
5183A455j3j7j7K4K3M7M7k1k0LKJ2J3r1P0J9K0j23j23K5K4K1K1K1K1m0l9l0k9o8R3N9O0O5
$$ y = [1211, 1127, 1224, 1160, 1207, 1255, 1252, 1249, 1289, 1328, 1368, 1407, 1369, 1331, 1373, 1415, 1376, 1337, 1307, 1278, 1160, 1203, 1289, 1375, 1296, 1217, 1261, 1306, 1392, 1317, 1282, 1247, 1383, 1358, 1253, 1309, 1312, 1315, 1328, 1341, 1369, 1397, 1434, 1311, 1252, 1193, 1113, 1194, 1207, 1219, 1141, 1223, 1366, 1348, 1351, 1353, 1322, 1291, 1259, 1228, 1262, 1295, 1262, 1389, 1508, 1360, 1329, 1137, 1136, 1135, 1164, 1194, 1222, 1250, 1358, 1467, 1419, 1372, 1365, 1358, 1345, 1332, 1319, 1307, 1354, 1402, 1379, 1356, 1245, 1295, 1295, 1294, 1226, 1158, 1170, 1182, 1219, 1257, 1214, 1171, 1217, 1263, 1208, 1314, 1431, 1387, 1309, 1232, 1259, 1286, 1273, 1260, 1309, 1358, 1406, 1455, 1427, 1399, 1411, 1423, 1292, 1160, 1216, 1272, 1325, 1377, 1470, 1563, 1580, 1597, 1480, 1362, 1295, 1227, 1240, 1252, 1271, 1289, 1307, 1326, 1332, 1337, 1383, 1429, 1374, 1319, 1344, 1370, 1331, 1293, 1295, 1297, 1332, 1368, 1270, 1172, 1207, 1241, 1206, 1171, 1128, 1245, 1273, 1300, 1316, 1332, 1347, 1363, 1382, 1402, 1421, 1441, 1358, 1275, 1273, 1270, 1315, 1360, 1405, 1450, 1459, 1468, 1517, 1566, 1469, 1372, 1254, 1297, 1326, 1195, 1153, 1273, 1273, 1274, 1274, 1275, 1404, 1372, 1350, 1328, 1315, 1302, 1249, 1195, 1291, 1386, 1347, 1308, 1245, 1182, 1200, 1218, 1225, 1233, 1240, 1248, 1268, 1288, 1307, 1327, 1213, 1098, 1118, 1138, 1224, 1310, 1262, 1214, 1186, 1157, 1209, 1261, 1284, 1307, 1387, 1467, 1539, 1450, 1361, 1432, 1450, 1467, 1455, 1442, 1425, 1408, 1432, 1455, 1502, 1549, 1528, 1508, 1511, 1513, 1525, 1538, 1447, 1517, 1536, 1556, 1433, 1310, 1335, 1359, 1380, 1401, 1422, 1443, 1403, 1364, 1334, 1305, 1237, 1330, 1389, 1449, 1514]
5177A514r6o2o2J0J70M9j11L6L7j4j4K1K1o3o2j65mJ43j7L7L6lmj20M0J07n4m0l9R8R8l2l2
5172A423l2l2M4M4O7r3m1m1J7J6o8o9Q0P9J9K0p4p4J4J4J4J4j2j2j1j2J3J4J3J4k0j9K1K1
5167A351m4m3m4m4P5P4QPL8L7j00j00j08N4J10J10J2J2J1J2l4l5K3K2L5j27J5J4q5P6j4j4
5162A304qqqqm1m2m1m1O5O5O5O5o3o2NMM9M9RQM4M4k3k3k3k2L5L4L9j22l2l1k1k0K0J9Q3Q2
5157A449J6J6r3r2J26J26R4o7o1o0j59Jk1k2k2k2o2o2k1k2J43J43J65MJ%N5N4j10j09r0P1
5152A369J12n0k5k5L1L2o7o7j%l0l1R0R0j4j4K7K6n5n6j5j5o4o4Q4Q4J9J8p5p5rrr9O1J42
5146A325J41N8N7n8n8j7j8N2N1k9k8j22j22J3J2J3J4j57LJ32J31QQk8k7J3J2k3k3k4k3M7M7
5141A380l4l3M2M1l8l9K0J9o1o1NNQ5Q6k2k2K8j32L2L3J03J03j4j4j48j48J9K0L6L6o4K04
$$ y = [1514, 1418, 1356, 1294, 1304, 1474, 1523, 1412, 1448, 1485, 1471, 1457, 1478, 1499, 1436, 1374, 1209, 1205, 1348, 1331, 1368, 1404, 1401, 1397, 1277, 1317, 1424, 1370, 1330, 1291, 1389, 1487, 1455, 1423, 1391, 1359, 1403, 1447, 1514, 1421, 1380, 1339, 1356, 1372, 1304, 1235, 1315, 1394, 1413, 1433, 1359, 1285, 1299, 1313, 1327, 1341, 1329, 1317, 1306, 1294, 1307, 1321, 1334, 1348, 1328, 1309, 1330, 1351, 1307, 1264, 1220, 1176, 1251, 1325, 1333, 1340, 1378, 1415, 1315, 1215, 1107, 1161, 1271, 1381, 1393, 1405, 1416, 1428, 1394, 1359, 1382, 1404, 1439, 1312, 1327, 1341, 1256, 1332, 1318, 1304, 1296, 1288, 1280, 1272, 1231, 1189, 1148, 1107, 1172, 1237, 1302, 1367, 1304, 1242, 1247, 1251, 1300, 1349, 1358, 1366, 1410, 1454, 1431, 1408, 1385, 1363, 1398, 1432, 1471, 1349, 1317, 1286, 1265, 1245, 1265, 1284, 1367, 1449, 1465, 1481, 1388, 1296, 1422, 1548, 1642, 1575, 1514, 1454, 1295, 1296, 1275, 1253, 1231, 1209, 1147, 1085, 1064, 1042, 1185, 1328, 1493, 1497, 1498, 1498, 1553, 1607, 1497, 1388, 1298, 1369, 1481, 1431, 1406, 1381, 1412, 1444, 1377, 1310, 1309, 1309, 1279, 1248, 1338, 1428, 1414, 1400, 1427, 1453, 1398, 1342, 1327, 1312, 1248, 1184, 1268, 1352, 1371, 1389, 1314, 1239, 1230, 1221, 1122, 1183, 1325, 1466, 1524, 1581, 1523, 1465, 1448, 1430, 1482, 1533, 1504, 1476, 1354, 1232, 1245, 1257, 1270, 1284, 1127, 1130, 1262, 1393, 1401, 1409, 1381, 1354, 1367, 1379, 1356, 1333, 1309, 1286, 1333, 1380, 1346, 1313, 1355, 1396, 1358, 1319, 1339, 1358, 1297, 1236, 1241, 1246, 1331, 1417, 1395, 1373, 1401, 1269, 1301, 1334, 1437, 1540, 1526, 1512, 1364, 1216, 1235, 1255, 1291, 1327, 1263, 1467]
5136A467N3N3j14j13m4m3N1j10K1K0J30J30n8n8lll3l3k5J36N5j06j7j6l7J24J2J2K2K2ll
5132A489Pj54N0M9m1m1m4m5mnjjjjK8K7j2j2N8N8k3k2m4m4j3j4Q0q1q2Q0L8L8M8M8mlj4j4
5126A378Q0q1p1p1J7J6J6J6l0l1N0N0m3m2m2m3P5P5P4P5p8p7p8p8Q6Q5j02j03L1L1rrO4O4
5121A295j6j6r1r1M3M4J08J09k5k5kkkjM0M1M1M0l5l6l6l5P6P5L6L6n6n6K5K5j43j43J52J52
5115A527n3n3m3m3j26L5j6j5llJ31J31o4o4o4o4J04J04J3J3Q6p5J6J6n5n5n5n4j5j5O5O6j3
5110A359j2n3n3k3k4N7N7R7R7l7l7k6k6J5J4m2m1n2n2J18m3l3l3L7L7m3m3L8L8L7L8qqj36
5105A214n6jJ61J15J15K4K3n1k11p1R0Q4Q3j08j08m1m2L6L6L6L6J0J1J1J0m6m7K1K0k0k1r
5100A304P2Q2p8j00k0J11L0o6o7M8M8j9j9j24j25N0M9J9J9k2k1L4L5L5L4qrL2L1j5j5j6j5
$$ y = [1467, 1520, 1573, 1459, 1346, 1302, 1259, 1310, 1200, 1221, 1241, 1371, 1501, 1443, 1385, 1382, 1379, 1346, 1313, 1288, 1424, 1479, 1373, 1356, 1340, 1303, 1427, 1439, 1451, 1473, 1495, 1492, 1489, 1496, 1342, 1392, 1441, 1400, 1359, 1315, 1270, 1266, 1261, 1260, 1259, 1258, 1257, 1285, 1312, 1300, 1288, 1346, 1404, 1381, 1359, 1315, 1271, 1258, 1244, 1324, 1243, 1161, 1241, 1279, 1317, 1365, 1413, 1409, 1406, 1392, 1378, 1458, 1377, 1306, 1235, 1252, 1268, 1284, 1300, 1270, 1239, 1289, 1339, 1296, 1254, 1212, 1169, 1244, 1319, 1393, 1468, 1390, 1313, 1235, 1157, 1243, 1328, 1226, 1123, 1154, 1185, 1176, 1167, 1231, 1295, 1279, 1263, 1172, 1081, 1124, 1168, 1276, 1385, 1360, 1335, 1333, 1331, 1329, 1328, 1368, 1409, 1450, 1490, 1455, 1419, 1383, 1348, 1424, 1499, 1535, 1571, 1515, 1459, 1484, 1509, 1366, 1223, 1375, 1527, 1474, 1421, 1378, 1335, 1209, 1244, 1228, 1213, 1210, 1207, 1338, 1469, 1405, 1341, 1277, 1213, 1317, 1421, 1434, 1447, 1533, 1458, 1474, 1490, 1435, 1380, 1325, 1271, 1256, 1241, 1306, 1372, 1359, 1347, 1294, 1241, 1218, 1194, 1251, 1308, 1405, 1502, 1465, 1428, 1402, 1376, 1391, 1405, 1363, 1322, 1270, 1218, 1336, 1293, 1260, 1227, 1264, 1301, 1258, 1215, 1253, 1291, 1328, 1366, 1358, 1350, 1214, 1158, 1157, 1318, 1433, 1548, 1572, 1595, 1544, 1333, 1262, 1352, 1436, 1519, 1411, 1303, 1262, 1220, 1256, 1292, 1328, 1364, 1374, 1385, 1396, 1406, 1360, 1313, 1334, 1354, 1334, 1313, 1304, 1376, 1458, 1380, 1280, 1260, 1371, 1401, 1335, 1268, 1316, 1364, 1345, 1326, 1202, 1077, 1127, 1176, 1195, 1214, 1192, 1171, 1205, 1240, 1275, 1309, 1301, 1292, 1324, 1355, 1340, 1325, 1309, 1294]
5095A294l6l6J5J77Qp2K3K3k0k0K0K0RQj12j12P0P0l0j91K4J84K04o3j28L4O2r9j8O2j0r0
5090A270pP4L4m7%Q0qq8j28L3L0J10Qj53q5P5P4oj6r7l6J26J25l5n7K5J04n6qP1PPRj52o1
5085A222o1j2j2R9R8O6r5o0K0pj68l2K35J56oj9j9M0L9K8n2j05N6L5m4Q7p3k8k8q7q7Q8Q7
5080A361j2j1K9K8l5l5L1L2J3J3k7k7j3j3m2J19O4j6j8j9j39K2P2q9n3J08PQM8M9L5j26j55
5075A209J13Q3p8l5l5M8M9kkO0O1J0p0n4J08K3n6QRj45J7p4p4M3M4LLN2N2J2J2l1l0l1l1M6
5069A317M6J1J1o4J5O2j00J4J4P2P1n4n3n4n4j1j2j1j2P3P2qql9m0m9J12L1L1L2L1N4j06j06
5064A288N4j2j3klj1j2k9k8J64j04M7M7l0l0k0j80J5J5NNN7N6N6N7l1l1l1l1j5j5j5j5NMM5
5059A262M4K7K7n4n4J0J0N1N0m1m2K9K9Q1q0j9k0PJ69L4j27J9J8p2p2N2N2N3N2p4p4OOK1K0
$$ y = [1294, 1258, 1222, 1237, 1414, 1422, 1350, 1373, 1396, 1376, 1356, 1376, 1396, 1405, 1413, 1301, 1189, 1259, 1329, 1299, 1108, 1132, 1316, 1520, 1457, 1329, 1363, 1425, 1326, 1308, 1370, 1360, 1270, 1263, 1337, 1371, 1324, 1324, 1404, 1396, 1308, 1180, 1213, 1243, 1353, 1361, 1208, 1123, 1198, 1272, 1266, 1250, 1153, 1117, 1243, 1368, 1333, 1276, 1301, 1405, 1349, 1341, 1412, 1419, 1426, 1435, 1283, 1222, 1161, 1149, 1137, 1236, 1334, 1400, 1305, 1245, 1265, 1258, 1090, 1058, 1293, 1449, 1443, 1424, 1405, 1445, 1484, 1512, 1460, 1355, 1411, 1446, 1402, 1489, 1416, 1388, 1360, 1273, 1186, 1274, 1361, 1349, 1338, 1367, 1395, 1360, 1325, 1356, 1388, 1401, 1414, 1387, 1360, 1347, 1334, 1292, 1411, 1475, 1459, 1441, 1422, 1283, 1305, 1377, 1288, 1235, 1343, 1350, 1358, 1406, 1455, 1490, 1364, 1209, 1322, 1405, 1327, 1292, 1257, 1305, 1354, 1352, 1350, 1410, 1471, 1481, 1411, 1357, 1465, 1488, 1432, 1440, 1449, 1304, 1321, 1247, 1173, 1216, 1260, 1263, 1266, 1318, 1370, 1382, 1394, 1363, 1333, 1302, 1271, 1317, 1363, 1374, 1385, 1321, 1336, 1398, 1298, 1312, 1326, 1398, 1469, 1415, 1362, 1308, 1254, 1243, 1231, 1220, 1208, 1281, 1353, 1345, 1337, 1298, 1258, 1209, 1321, 1352, 1383, 1415, 1446, 1500, 1394, 1288, 1342, 1330, 1317, 1315, 1312, 1301, 1289, 1260, 1232, 1396, 1292, 1339, 1386, 1356, 1326, 1306, 1126, 1141, 1156, 1161, 1166, 1223, 1279, 1335, 1392, 1361, 1330, 1299, 1268, 1253, 1238, 1223, 1208, 1213, 1217, 1262, 1306, 1333, 1360, 1306, 1252, 1262, 1272, 1323, 1373, 1332, 1290, 1319, 1348, 1429, 1349, 1330, 1310, 1317, 1486, 1520, 1393, 1412, 1430, 1358, 1286, 1338, 1390, 1443, 1495, 1421, 1347, 1353, 1359, 1380, 1400]
5053A400j9k0M6M6k5k4r7O4J3J4K4K5K4K5m9m9j19j19j6J45J05n6l4l3R0R1lkk3J39K6j35
5049A454j25L6mmOORQj62jJ9J9K9K9n6n6K5K4KKl8l8K5K5K6K5L3L3L3L3qpqql3l3l3l3Q7Q6
5042A427mlQ5p5j15M6M0M0l0l0O2O3j7j8q0q0r0P1N4N4oon7J04j20j20j1j1O9O9llj3j2J53
5037A433qn1n2P9P9Q9p2o1o1RJ0o2o2k1k2J6J7J6J6Q7Q8PPm9m8L2L2P2P1L8j22o6R5q6q6m
5032A360lP7P6o8o9n3n2j56J12J42j8j48J3J00J00LKp9p8J19J19L3j29j48J4J00J01KLp8p8
5027A319J1J1k9k9j1j2j1j2O0N9N9N9noK5K5J2j49o9R3k3k2O8O8m1m1m0m1OPOOL3L3m7m7M0
5021A365M1%JPQPQj3j4P7q4p5p5J03J03O0O1p3p3r2r2M2M2q2q2kjm5m5M6M6J6J76R6o5n4n5
5016A283J6J5J01J01l3l3J5J5NNJ50j0j08j07l3l3M8M7m3m2L7L8P2P3o1o2r4r5r5r5O7O6O6
$$ y = [1400, 1381, 1361, 1407, 1453, 1428, 1404, 1307, 1371, 1384, 1398, 1422, 1447, 1471, 1496, 1447, 1398, 1279, 1160, 1144, 1289, 1394, 1338, 1304, 1271, 1361, 1452, 1449, 1447, 1424, 1563, 1589, 1454, 1329, 1365, 1361, 1357, 1363, 1369, 1378, 1386, 1224, 1223, 1242, 1261, 1290, 1319, 1263, 1207, 1232, 1256, 1258, 1260, 1222, 1184, 1209, 1234, 1260, 1285, 1318, 1351, 1384, 1417, 1409, 1402, 1394, 1386, 1353, 1320, 1287, 1254, 1341, 1427, 1423, 1420, 1505, 1430, 1315, 1361, 1401, 1441, 1411, 1381, 1443, 1506, 1489, 1471, 1391, 1311, 1221, 1292, 1346, 1400, 1394, 1388, 1331, 1435, 1315, 1195, 1184, 1173, 1242, 1311, 1308, 1305, 1292, 1280, 1433, 1425, 1374, 1322, 1401, 1480, 1569, 1497, 1436, 1375, 1384, 1394, 1332, 1270, 1249, 1227, 1243, 1260, 1276, 1292, 1379, 1467, 1474, 1481, 1432, 1384, 1416, 1448, 1520, 1591, 1629, 1507, 1441, 1536, 1450, 1364, 1360, 1357, 1434, 1510, 1442, 1373, 1320, 1268, 1112, 1224, 1366, 1348, 1200, 1213, 1313, 1413, 1416, 1418, 1339, 1261, 1380, 1499, 1532, 1403, 1255, 1269, 1369, 1470, 1472, 1475, 1397, 1319, 1330, 1341, 1312, 1283, 1272, 1260, 1249, 1237, 1297, 1356, 1415, 1474, 1469, 1463, 1488, 1513, 1525, 1376, 1307, 1400, 1377, 1355, 1423, 1491, 1450, 1409, 1369, 1328, 1334, 1341, 1347, 1353, 1386, 1419, 1372, 1325, 1365, 1406, 1406, 1407, 1414, 1422, 1429, 1437, 1424, 1410, 1487, 1403, 1328, 1253, 1356, 1459, 1519, 1580, 1507, 1434, 1342, 1250, 1292, 1334, 1252, 1170, 1168, 1167, 1122, 1077, 1123, 1169, 1185, 1361, 1457, 1392, 1338, 1283, 1299, 1314, 1415, 1516, 1483, 1450, 1465, 1480, 1485, 1490, 1640, 1630, 1522, 1415, 1382, 1349, 1397, 1444, 1401, 1359, 1396, 1434, 1506, 1579, 1518, 1456, 1362, 1267, 1172, 1077, 1144, 1210, 1276]
5011A276O7m0m0n0J11k5k4J16m5kkK8K8m3m3lll0k9N0N1m1m2L9L8N9N9p5p5MNP4P5rj70l0
5005A259k9l3J29P8P8ooool1l1m2m1J9j42o8K00M9N0k5k5R1o9n0n0l6J25K5K4J22l9q3q3m9
5000A299m9n0m9j6j5O4O5M5M6M6M5p4p4O0O0MNl5l6k7k7N3N4l6l6NMN1N0l0l0k3k3J10J11
4995A547j29j29m9m8M0M0M1M0LMp7p7M6M7L7L7O5r7nom6m6ooO4O4j7j6%JJ0J1n1J09J9J9k6
4989A413k7K9n2j04N6N7j05p8KlkRJ71R0p1p5p5J02J02Q3Q2j0j71l8M2O7O8j20j19J6o4o4
4984A211R7R2J1j32n1P8ll4l4J37k4m7L3k2k2J42J41m7m6j15j16P3P2o9o9J2J1M3M3l7l7K5
4979A316K6K5K6p2p1RQK8K7K7K7j4j5j5j4l2l3l2l2j4j4j5j4M7M8PP%%Q0Q0L4L4m6m7l0k9
4973A317k0k0n5J05J4J5JKq0p9j8j8O2O3j7j6J17J18k9k9k9k9N0M9l0l1o5o5J6J5O0O0k1k0
$$ y = [1276, 1343, 1303, 1263, 1213, 1324, 1299, 1275, 1391, 1346, 1344, 1342, 1370, 1398, 1355, 1312, 1309, 1306, 1276, 1247, 1297, 1348, 1307, 1265, 1304, 1342, 1401, 1460, 1385, 1310, 1314, 1319, 1393, 1468, 1459, 1289, 1259, 1230, 1197, 1326, 1404, 1482, 1476, 1470, 1464, 1458, 1427, 1396, 1354, 1313, 1332, 1190, 1122, 1322, 1371, 1421, 1396, 1371, 1462, 1393, 1343, 1293, 1257, 1382, 1407, 1431, 1553, 1514, 1431, 1348, 1299, 1250, 1200, 1151, 1135, 1120, 1184, 1249, 1294, 1340, 1386, 1431, 1357, 1283, 1343, 1403, 1407, 1412, 1377, 1341, 1314, 1287, 1340, 1394, 1358, 1322, 1327, 1331, 1382, 1432, 1402, 1372, 1349, 1326, 1436, 1547, 1418, 1289, 1240, 1192, 1232, 1272, 1313, 1353, 1356, 1360, 1283, 1206, 1252, 1299, 1336, 1373, 1438, 1341, 1336, 1330, 1284, 1238, 1232, 1226, 1290, 1354, 1337, 1321, 1321, 1322, 1332, 1343, 1292, 1401, 1420, 1439, 1413, 1386, 1415, 1363, 1259, 1315, 1372, 1267, 1189, 1191, 1188, 1186, 1195, 1366, 1456, 1385, 1310, 1235, 1337, 1439, 1522, 1604, 1594, 1423, 1385, 1427, 1494, 1562, 1442, 1323, 1339, 1275, 1211, 1308, 1400, 1411, 1279, 1228, 1306, 1303, 1269, 1235, 1372, 1348, 1301, 1334, 1312, 1290, 1432, 1573, 1526, 1480, 1365, 1249, 1322, 1394, 1325, 1256, 1268, 1279, 1322, 1365, 1328, 1291, 1316, 1342, 1367, 1393, 1321, 1250, 1259, 1267, 1295, 1322, 1349, 1376, 1362, 1347, 1332, 1318, 1286, 1253, 1221, 1189, 1175, 1161, 1146, 1132, 1179, 1227, 1234, 1241, 1241, 1241, 1321, 1401, 1435, 1469, 1423, 1376, 1346, 1317, 1297, 1277, 1222, 1327, 1341, 1356, 1357, 1359, 1279, 1200, 1182, 1164, 1226, 1289, 1272, 1256, 1373, 1491, 1462, 1433, 1404, 1375, 1425, 1474, 1444, 1413, 1348, 1283, 1299, 1314, 1374, 1434, 1413, 1393]
4968A393n1n1j0j1NMl6l5j8j8j8j7J37J37n0n1n3n3K7K7Q8Q7m6m7M4M3l7l7l3l3PQppopK8
4963A303K9O9O8RJ0p1p2n1n2n2n2j8j9O2O2llP7P7k7k6N3N4l7l8LKL7L7r7r7L3L3L3L3Q5Q6
4957A540m8m9n1n2K9K9k4k4k5k4j0j1j0j1n0m9Q4Q5J4J4J4J4l1l1N0M9jjjjN3N2j1j1j02J66
4951A565J36j33j97l6Q2q0k3k3l4l3JKKJJ7J7K6K7r0P1O1O1J4J4j10j10l7J24L3L4n2n2L8
4946A316L9r6O6J55nj37K3K4j38q8P2O0J41l0l1K4K5n1J10o0o1k1k0J9K0M5M5l5l6nnL5L4
4941A434m4m4j9O2Q2q0j9r9O2O1J6J7l9l8KKN8N8K3K3j09k9l6J25J1p0o5J6K1n8L1L2n4n4
4936A279K6K7ooP4P4j34j35r6O5K0o1n6K5J76R6J3J2qrL2L2M0M0r4r4j6j6j6j6M1M0R6J5j00
4931A360O1J0p0L2L3n4n3r6r6R2R1N9N9J4J4K0o1l1J30M1l9j10k9M9N0N9N9j12l3J04n8j98
$$ y = [1393, 1342, 1291, 1281, 1270, 1275, 1279, 1243, 1208, 1190, 1172, 1154, 1137, 1274, 1411, 1361, 1310, 1257, 1204, 1231, 1258, 1346, 1433, 1387, 1340, 1384, 1427, 1390, 1353, 1320, 1287, 1294, 1302, 1295, 1288, 1282, 1275, 1303, 1332, 1401, 1469, 1478, 1488, 1417, 1345, 1294, 1242, 1190, 1138, 1120, 1101, 1163, 1225, 1222, 1219, 1296, 1373, 1346, 1320, 1373, 1427, 1390, 1352, 1355, 1357, 1394, 1431, 1334, 1237, 1270, 1303, 1336, 1369, 1454, 1540, 1492, 1443, 1392, 1340, 1369, 1398, 1374, 1350, 1325, 1301, 1291, 1280, 1270, 1259, 1209, 1160, 1244, 1329, 1343, 1357, 1371, 1385, 1354, 1323, 1373, 1422, 1421, 1420, 1419, 1418, 1471, 1523, 1512, 1501, 1399, 1565, 1701, 1568, 1371, 1335, 1417, 1337, 1314, 1291, 1257, 1224, 1225, 1227, 1229, 1230, 1247, 1264, 1290, 1317, 1227, 1298, 1359, 1420, 1434, 1448, 1338, 1228, 1191, 1315, 1348, 1382, 1330, 1278, 1316, 1355, 1259, 1325, 1480, 1475, 1338, 1361, 1385, 1247, 1159, 1231, 1291, 1432, 1402, 1371, 1395, 1420, 1369, 1479, 1419, 1358, 1337, 1317, 1336, 1356, 1401, 1446, 1411, 1375, 1370, 1365, 1400, 1434, 1390, 1346, 1327, 1389, 1471, 1391, 1372, 1273, 1335, 1396, 1412, 1429, 1390, 1352, 1354, 1356, 1414, 1472, 1495, 1518, 1409, 1380, 1344, 1469, 1480, 1410, 1345, 1361, 1382, 1324, 1355, 1387, 1333, 1279, 1305, 1332, 1326, 1320, 1394, 1468, 1334, 1199, 1103, 1168, 1188, 1127, 1071, 1096, 1272, 1368, 1381, 1393, 1385, 1376, 1408, 1440, 1480, 1520, 1426, 1332, 1316, 1300, 1284, 1268, 1309, 1349, 1445, 1460, 1360, 1421, 1431, 1361, 1393, 1426, 1372, 1319, 1223, 1127, 1219, 1310, 1369, 1428, 1442, 1456, 1476, 1415, 1384, 1514, 1555, 1516, 1406, 1377, 1426, 1476, 1535, 1594, 1482, 1449, 1553, 1495, 1297]
4926A297l7MQ5jkR4o7MLr7O4RRR9R9n9o0K0K1o7o8J3J3M5M5MNj4j4K7K6m8m8m8m8L8L8R4o8
4920A410j05k4%JL2L1k4N7P9q3n7n7q0Q1L1m9P1rL1L1l7l6M4M3jjjkK3K2K2K3KKLK%%j%LM
4914A481p8p7j8j7l8J24L2j28N3N3k1k1N4N4m7j28l9J22L4L4p7p6m1m0Q0Q0N6N5l8l8L5L5
4909A460K1n9k5J09K8K9m3m3q3q3K8K7O8O8l9m0p1p1k6J08l5l4L1L2L2L2J6J6N7N7j50j49
4904A268K5J05O7o7o1P2M1M1m4m4L8L8k9k9J5J5J5J6p0o9K4n6l2J02%q1J22J22j37j38j5j5
4899A239K4K5m6m6M8M8J8J8J7J8M1M1M1M0j9k0L9M0qj42j07j07N3N4o8o7N2N3N2N3K5K5K5
4894A459K5k0j9k0k0rqP1o2j26m6R3J3RJ0MNj5j4q2q1K6K6K5K6M7M7k1k0kllkK9L0L0L0k5
4888A407k5k4k5P6P5m5m5J3J4n4n4K0K0K0K0m1m1N2N3L9L9k8k8q4q5J0J0j1j0j1j0QQQQLK
$$ y = [1297, 1260, 1264, 1349, 1348, 1346, 1440, 1373, 1377, 1380, 1283, 1347, 1356, 1365, 1464, 1563, 1504, 1444, 1464, 1485, 1418, 1350, 1363, 1376, 1421, 1466, 1470, 1475, 1461, 1447, 1474, 1500, 1452, 1404, 1356, 1308, 1346, 1384, 1478, 1410, 1305, 1281, 1281, 1282, 1314, 1345, 1321, 1378, 1457, 1374, 1317, 1260, 1180, 1261, 1292, 1243, 1314, 1305, 1336, 1367, 1330, 1294, 1338, 1381, 1380, 1379, 1378, 1376, 1399, 1421, 1443, 1466, 1468, 1470, 1473, 1475, 1475, 1475, 1474, 1474, 1477, 1481, 1403, 1326, 1308, 1291, 1253, 1377, 1409, 1281, 1334, 1387, 1366, 1345, 1399, 1453, 1406, 1278, 1239, 1361, 1395, 1429, 1352, 1276, 1235, 1195, 1275, 1355, 1411, 1466, 1428, 1390, 1425, 1460, 1481, 1422, 1397, 1506, 1534, 1563, 1520, 1477, 1394, 1311, 1339, 1366, 1434, 1502, 1463, 1423, 1352, 1281, 1255, 1363, 1328, 1294, 1325, 1357, 1389, 1421, 1437, 1453, 1510, 1567, 1417, 1268, 1293, 1398, 1465, 1398, 1337, 1409, 1450, 1491, 1447, 1403, 1441, 1479, 1450, 1421, 1436, 1451, 1466, 1482, 1412, 1343, 1367, 1311, 1279, 1381, 1381, 1300, 1422, 1544, 1407, 1269, 1254, 1239, 1263, 1288, 1242, 1196, 1244, 1292, 1310, 1328, 1345, 1363, 1404, 1445, 1486, 1526, 1507, 1487, 1526, 1566, 1558, 1416, 1309, 1202, 1255, 1309, 1241, 1174, 1226, 1279, 1331, 1384, 1409, 1434, 1459, 1484, 1464, 1445, 1425, 1405, 1396, 1388, 1459, 1397, 1271, 1225, 1318, 1331, 1340, 1350, 1354, 1359, 1344, 1330, 1248, 1167, 1193, 1219, 1244, 1270, 1317, 1364, 1343, 1323, 1321, 1318, 1315, 1313, 1342, 1372, 1402, 1432, 1407, 1382, 1358, 1333, 1409, 1484, 1439, 1394, 1407, 1421, 1367, 1313, 1333, 1353, 1373, 1393, 1352, 1311, 1363, 1416, 1455, 1494, 1466, 1438, 1354, 1269, 1279, 1289, 1278, 1268, 1257, 1247, 1255, 1263, 1271, 1279, 1282, 1284]
4883A284M3M3j5j6j6j5N3N3J3J4n9n8j7j8L6L6P6P7q8q8m7m8m6m5M8M8R0R0n7n7o0n9Q8Q8
4877A371j6j6P8P8K3K3p1p1j2j3N5N5pqO0O0o1o1k1k0M0L9k7k7lkll%jO7O7q5q5q5q5N0M9
4872A332N0N0k0k0nq5o9R3R7o4l4J27N5j06j34n3O9J50Q5OJ6J5KKr1r2K7K8O0j00j36K6M5
4867A326M5m5m4m5m4j3j3Q2Q1J1J0P8P8l9l9J6o4j15M6R9R8KKKLJJrqJ8j42r7j7K7K7R9R9
4861A517rrp6p7nnnnp4p3P3P4O4O3l0l0J5J5J5J5LKl7l8J26J26P4q7j00k0l5l5K3K3j8j7l7
4855A406l8Q3Q4l5l5n7K4J13j55j34K6O5j6M0L9k8k8MLJ11k3o0K0j5j6j0j1MNl6l5J2J2n5
4850A264n5K7K7J40J40L0j03o8o9N0M9p1p1J43J43n8n8j0rL0L1ONONq0q0q0q1N9N8rrK3K3
4845A348K4K3j0ro3J8Q2n1n5P9J29oL0n1j8j8r9L5k6k6k3k3O2j8m3R0l8M2R1J0n9n8LMM0L9
$$ y = [1284, 1327, 1370, 1355, 1339, 1323, 1308, 1361, 1414, 1427, 1441, 1382, 1324, 1307, 1289, 1325, 1361, 1437, 1514, 1426, 1338, 1291, 1243, 1197, 1152, 1200, 1248, 1338, 1428, 1371, 1314, 1254, 1195, 1283, 1371, 1355, 1339, 1417, 1495, 1518, 1541, 1470, 1399, 1387, 1374, 1429, 1484, 1477, 1469, 1529, 1589, 1528, 1467, 1446, 1426, 1466, 1505, 1478, 1451, 1448, 1446, 1443, 1440, 1440, 1439, 1506, 1573, 1488, 1403, 1318, 1233, 1283, 1332, 1382, 1432, 1412, 1392, 1387, 1302, 1233, 1326, 1423, 1359, 1325, 1452, 1507, 1401, 1267, 1214, 1283, 1433, 1518, 1524, 1540, 1555, 1557, 1559, 1468, 1376, 1403, 1431, 1491, 1391, 1255, 1281, 1326, 1371, 1326, 1282, 1237, 1193, 1180, 1167, 1249, 1330, 1341, 1351, 1429, 1507, 1468, 1429, 1445, 1381, 1266, 1312, 1411, 1509, 1511, 1513, 1515, 1518, 1519, 1520, 1511, 1503, 1521, 1379, 1282, 1265, 1292, 1319, 1418, 1517, 1508, 1499, 1423, 1346, 1341, 1336, 1331, 1326, 1252, 1179, 1252, 1326, 1390, 1453, 1423, 1393, 1408, 1423, 1438, 1453, 1456, 1458, 1421, 1383, 1509, 1635, 1709, 1622, 1522, 1502, 1467, 1432, 1455, 1478, 1460, 1443, 1406, 1368, 1451, 1535, 1500, 1465, 1408, 1432, 1545, 1390, 1256, 1282, 1347, 1331, 1371, 1410, 1382, 1354, 1358, 1361, 1472, 1449, 1389, 1409, 1394, 1378, 1368, 1357, 1361, 1366, 1330, 1295, 1307, 1319, 1264, 1209, 1236, 1263, 1403, 1543, 1573, 1470, 1402, 1333, 1383, 1432, 1361, 1290, 1433, 1576, 1518, 1460, 1450, 1441, 1471, 1502, 1508, 1513, 1519, 1524, 1444, 1364, 1284, 1203, 1262, 1320, 1311, 1302, 1325, 1348, 1372, 1395, 1385, 1376, 1313, 1331, 1413, 1362, 1307, 1386, 1515, 1509, 1539, 1488, 1470, 1452, 1353, 1388, 1362, 1336, 1313, 1290, 1352, 1334, 1291, 1381, 1343, 1385, 1476, 1486, 1427, 1369, 1372, 1376, 1416, 1455]
4839A455k7k8J3J3J3J3jkjjoooomml5l5o2P3M3l8J1J0OOm3m3P8P8l7l7l8l7l8l8l3l3J10J89
4833A472J9j15N4N4O9r1n8n7o8o7J26J26mnQ8p4L4J14k1j02m1m2l4J27lmm4m4mmM8M7M9j12
4828A433n5K5J5o5N2N3j9k0J04J04p0p1p9q0q1P9Q3LJ44j7k2j02j23J44Q5Q5L5L5j08j08M0
4823A499M0qqM8j13j29m8rrQ5Q5M7l4J8J78N8j03p1Rm6m6O6O6q2q2KKJ7o4l4J25L3j29j4O7
4818A416J7o4j3j3j8j7k1k0J42j9n8K1p9KO2O2k7k7m5m6ooL7L6R2o9L8J19Q7p4j23j22J6J5
4813A295M8M8M7M8m2m2N2N1n9o0l0k9J19m2l6M4K1K1r4r4M9M8M9M9n5n5j4j5kjkkP5P5O4O5
4807A594O3r8pqllmlj4j5j08j09n2n2M1M2N7N7j0j0k4k3P0P1J0J0n8n7k2k1J8J8M2M2j47J3
4802A300J33N2j12l2M8M8Q2p9kP9p0p0k3k4k3k4N8N8l6l6J08J09l1j11r2J75P0r1L6L7o8o8
$$ y = [1455, 1428, 1400, 1413, 1426, 1439, 1452, 1451, 1449, 1448, 1447, 1441, 1435, 1429, 1423, 1419, 1415, 1380, 1345, 1283, 1356, 1399, 1361, 1372, 1382, 1388, 1394, 1351, 1308, 1386, 1464, 1427, 1390, 1352, 1315, 1277, 1239, 1206, 1173, 1283, 1472, 1491, 1376, 1430, 1484, 1553, 1462, 1404, 1347, 1279, 1212, 1338, 1464, 1460, 1455, 1543, 1469, 1503, 1617, 1596, 1494, 1453, 1411, 1377, 1504, 1501, 1497, 1453, 1409, 1405, 1401, 1449, 1496, 1545, 1433, 1378, 1403, 1418, 1353, 1405, 1458, 1439, 1419, 1523, 1627, 1557, 1486, 1407, 1327, 1246, 1325, 1408, 1411, 1555, 1538, 1516, 1414, 1291, 1435, 1520, 1605, 1640, 1675, 1567, 1459, 1499, 1539, 1531, 1523, 1571, 1458, 1329, 1281, 1272, 1263, 1348, 1433, 1480, 1446, 1464, 1642, 1700, 1597, 1526, 1535, 1489, 1443, 1509, 1575, 1493, 1411, 1413, 1415, 1432, 1368, 1334, 1459, 1492, 1363, 1349, 1416, 1433, 1369, 1356, 1343, 1325, 1308, 1287, 1267, 1409, 1390, 1332, 1353, 1274, 1276, 1338, 1400, 1373, 1346, 1301, 1255, 1249, 1243, 1280, 1316, 1408, 1339, 1377, 1496, 1583, 1509, 1386, 1264, 1280, 1295, 1343, 1391, 1438, 1486, 1444, 1402, 1454, 1505, 1446, 1386, 1356, 1327, 1446, 1404, 1368, 1412, 1433, 1454, 1360, 1266, 1315, 1363, 1412, 1461, 1406, 1351, 1337, 1322, 1320, 1319, 1317, 1315, 1390, 1465, 1529, 1594, 1657, 1559, 1552, 1544, 1541, 1538, 1534, 1531, 1517, 1502, 1394, 1285, 1233, 1181, 1222, 1264, 1321, 1378, 1368, 1358, 1334, 1311, 1381, 1452, 1462, 1472, 1414, 1357, 1335, 1314, 1332, 1350, 1392, 1434, 1287, 1300, 1433, 1485, 1373, 1341, 1389, 1437, 1519, 1440, 1438, 1517, 1447, 1377, 1354, 1330, 1307, 1283, 1341, 1399, 1363, 1327, 1435, 1544, 1513, 1402, 1310, 1485, 1555, 1464, 1500, 1537, 1469, 1401]
4797A401J9J9o7R4l0N2r5r5o2R9R4o7N2k7N8k2j5O5k5k5l3l3l3l3M5M6J01o0j06k6lP8J02
4792A468n8r4j4J24M2Mp6jjm6m6J2J2N2N2o7o8O8j2j02N9poR9o2o7R4K6n5rP1J0p0O0O0L1
4786A483L1j04j03L8L8kkn6n5K5K4l0l1O5j5l1J30L5L4k4k4k9k9k7j07j12M9R8R8K8K8q2q1
4781A260N2N2M0L9m0m1llL2L2J16L6j98l6N0N1K0K1n7n6j7j6J9J9o1o1K9K9n1n1P5P5L4L5
4776A425n3n2pqn3K8J63Lo1J00M6l6j5j4k0k0p7p8N7N6PPl3l3m2m3R2R2O0N9j27j28J4J5J5
4771A339J4O5O5Q5p6j26L5O8O8l3l3l3l3m4m5L6L6k1k1J50j1p6p6J92L1o4o5p4p5K7K7n4n4
4766A224N8N8J8J8K9L0j1j1N1N1q2q3PQl2l3L1L2J1J72Jj60j9j9K0K0K0K0RJ0p1p0k5k4J6
4760A274J6O1O0K0K1m5m4j4j4R2o9o0n9R6R5J5J5K4K4n6n7KJl9m0N9N9K9K9m8J14j8j7J6J6
$$ y = [1401, 1420, 1439, 1372, 1466, 1436, 1488, 1393, 1298, 1236, 1335, 1429, 1362, 1414, 1387, 1445, 1423, 1408, 1473, 1448, 1423, 1390, 1357, 1324, 1291, 1336, 1382, 1483, 1423, 1317, 1291, 1288, 1366, 1468, 1410, 1316, 1302, 1426, 1468, 1472, 1396, 1395, 1394, 1348, 1302, 1314, 1326, 1378, 1430, 1363, 1295, 1363, 1351, 1249, 1308, 1301, 1295, 1394, 1332, 1265, 1359, 1385, 1330, 1321, 1392, 1402, 1332, 1392, 1452, 1483, 1514, 1410, 1307, 1345, 1383, 1381, 1379, 1323, 1268, 1293, 1317, 1287, 1256, 1321, 1306, 1275, 1405, 1440, 1474, 1450, 1426, 1397, 1368, 1341, 1234, 1122, 1171, 1269, 1367, 1395, 1423, 1341, 1260, 1312, 1364, 1404, 1443, 1403, 1362, 1359, 1356, 1388, 1420, 1536, 1572, 1374, 1338, 1388, 1439, 1459, 1480, 1423, 1367, 1350, 1334, 1353, 1372, 1311, 1250, 1279, 1308, 1257, 1206, 1281, 1356, 1390, 1425, 1372, 1320, 1313, 1305, 1252, 1280, 1443, 1446, 1385, 1485, 1531, 1495, 1480, 1466, 1446, 1426, 1349, 1271, 1328, 1384, 1391, 1398, 1365, 1332, 1290, 1247, 1339, 1431, 1491, 1550, 1423, 1295, 1309, 1324, 1339, 1353, 1418, 1483, 1568, 1492, 1366, 1401, 1469, 1537, 1504, 1471, 1438, 1405, 1361, 1316, 1352, 1388, 1367, 1346, 1496, 1485, 1409, 1333, 1525, 1556, 1492, 1427, 1353, 1278, 1305, 1332, 1278, 1224, 1282, 1340, 1358, 1376, 1405, 1435, 1424, 1413, 1464, 1515, 1433, 1350, 1357, 1365, 1333, 1300, 1331, 1363, 1374, 1546, 1547, 1387, 1368, 1349, 1369, 1389, 1409, 1429, 1438, 1448, 1377, 1307, 1282, 1258, 1274, 1290, 1351, 1411, 1431, 1452, 1407, 1363, 1349, 1335, 1427, 1358, 1298, 1239, 1335, 1430, 1445, 1460, 1484, 1508, 1452, 1395, 1397, 1398, 1359, 1319, 1378, 1437, 1466, 1495, 1447, 1561, 1543, 1526, 1542, 1558]
4755A558n4n4j20M1L1L1JJQ1Q1n1n1j31j32J4J5J4J4M4M4l6l6k6k6J44j6PPj3j2J78J7k7k6
4750A512LKLLK7K7n4n3NOl4l5K1K1M1j20j29L2k9k9J35J34M5M4j3j73N2N1l4l5p5p5P0P0L7
4744A453j25l4J26m5m4j07N4M4M4P7P7llM7M6l4l4m6m6m6m6L8L8m3m3k0j9O0O0o6o6k6k7O2
4739A303O2k9J32j5j5q6q6O4O3L0j31q5P5J45j6j7j7k7k7n2n1K8J90K55j3j47j47LLQ4Q3N
4734A564Np6p5j2j2j2j2o2o1o2o1O2O2J13J12m1J20J10j58j16M5O3j7M9M8r1r0L0L1Op5r8
4729A289O3J2J3JQ3R7o4j07N4m7m7K0K0K0K0j3j3k8N3J18m2p3QJ34J35m9m8J1J1p0p0m1m1
4724A409r6O4P8kJ4J3M0L9m0m1o2o3J7R6M2j20JQ2M8j12n7K3q6oL4L4M0M1j%j5j5O5O5k6k5
4719A478O9j0m8J12o3o4m6m7m6m7K3K2n3n3o5J6MJ65J90K9j13l3L9j22j6j6pJ53j3r3J5J6
$$ y = [1558, 1504, 1450, 1330, 1371, 1402, 1433, 1434, 1435, 1516, 1597, 1546, 1495, 1364, 1232, 1246, 1261, 1275, 1289, 1333, 1377, 1341, 1305, 1279, 1253, 1397, 1381, 1388, 1395, 1382, 1370, 1548, 1565, 1538, 1512, 1515, 1517, 1520, 1523, 1550, 1577, 1523, 1470, 1475, 1481, 1447, 1412, 1433, 1454, 1495, 1375, 1246, 1278, 1249, 1220, 1355, 1489, 1534, 1578, 1565, 1392, 1444, 1495, 1461, 1426, 1351, 1276, 1346, 1416, 1453, 1328, 1294, 1420, 1375, 1331, 1224, 1278, 1322, 1366, 1443, 1520, 1517, 1514, 1561, 1607, 1573, 1539, 1493, 1447, 1401, 1355, 1393, 1431, 1388, 1345, 1325, 1306, 1366, 1426, 1360, 1294, 1268, 1241, 1303, 1365, 1336, 1468, 1453, 1438, 1352, 1266, 1330, 1393, 1423, 1292, 1207, 1282, 1427, 1411, 1394, 1377, 1350, 1323, 1271, 1220, 1248, 1438, 1693, 1680, 1533, 1386, 1389, 1392, 1476, 1559, 1564, 1569, 1493, 1418, 1406, 1394, 1382, 1370, 1308, 1247, 1185, 1124, 1186, 1248, 1361, 1473, 1432, 1552, 1662, 1504, 1388, 1433, 1496, 1479, 1528, 1576, 1485, 1395, 1425, 1456, 1462, 1387, 1289, 1352, 1364, 1377, 1378, 1461, 1558, 1494, 1387, 1441, 1394, 1347, 1367, 1387, 1407, 1427, 1414, 1401, 1373, 1426, 1544, 1502, 1429, 1437, 1571, 1706, 1657, 1609, 1620, 1631, 1561, 1491, 1450, 1409, 1313, 1377, 1455, 1453, 1467, 1480, 1520, 1559, 1519, 1478, 1416, 1353, 1370, 1466, 1508, 1388, 1389, 1471, 1519, 1407, 1350, 1373, 1287, 1281, 1315, 1349, 1389, 1430, 1429, 1429, 1414, 1399, 1464, 1529, 1503, 1478, 1547, 1537, 1489, 1601, 1538, 1474, 1428, 1381, 1335, 1288, 1311, 1333, 1280, 1227, 1162, 1178, 1182, 1347, 1537, 1566, 1453, 1420, 1459, 1337, 1321, 1305, 1298, 1451, 1438, 1345, 1360, 1376]
4714A376l0k9K0K1NQ6J60jk6k6k8k8J3J2q1q0M0M0j8j8P6P7k6k6k6k6k3k3o4o3rqJ13J12k9
4709A463k9k9l0n0n0j0j0R9R8jjLp8o6R5J33k7m4L6M4l6p1RK3K2r3r3N2N2J2J1n3n4J3J4o
4703A348nO1O2j3j3j3j4m1m2N2N1j5j5j5j5l9l8N5N5J2J1J2J1j10j11n3J07R3R2p2p2M0M1
4698A407J36k5j0O9J11n1j13l2l7j18m5L5P0j1J7J8q2q2Q3Q2l8l8L6L6n7n7OOP3P4K3K3l3
4693A476l4o2R9QRmmj05N6O5r6l6l6P0P1LMM5M5k1k2m8m8qpJ0J1j74j2O1O2J11J12r8r8l0
4688A375l1L4L4poL5L6l2l2K2K1k9k9O0j01m1m0p5Q7O3O3o7o8r1P0J02J01q9r0M3M3Q3Q3J1
4682A538J2j27j26l0J31O4r8J7J7POLKJ14J13Q2p9q3q2k0j9j9k0K5K6O5O6J3J4J4J3n1n1J5
4677A552J6k9l0l0k9o8o7k7k7J3J3J13m7j50J0J11J12l7l7LLJ4J4P4q6j09N3M6M6n8n7L6L6
$$ y = [1376, 1346, 1317, 1337, 1358, 1363, 1449, 1609, 1608, 1582, 1556, 1528, 1500, 1513, 1525, 1444, 1364, 1404, 1444, 1426, 1408, 1484, 1561, 1535, 1509, 1483, 1457, 1434, 1411, 1347, 1284, 1275, 1267, 1380, 1492, 1463, 1434, 1405, 1375, 1325, 1275, 1265, 1255, 1354, 1452, 1451, 1450, 1453, 1375, 1309, 1404, 1537, 1510, 1466, 1502, 1546, 1510, 1439, 1448, 1471, 1493, 1400, 1307, 1359, 1411, 1423, 1434, 1381, 1327, 1340, 1354, 1348, 1343, 1404, 1466, 1453, 1440, 1427, 1413, 1372, 1330, 1382, 1433, 1418, 1403, 1388, 1373, 1334, 1296, 1351, 1406, 1418, 1429, 1441, 1452, 1342, 1231, 1178, 1285, 1378, 1470, 1398, 1326, 1366, 1407, 1543, 1518, 1508, 1577, 1688, 1637, 1524, 1492, 1455, 1337, 1292, 1327, 1397, 1386, 1403, 1421, 1339, 1257, 1340, 1422, 1384, 1346, 1382, 1418, 1361, 1304, 1310, 1316, 1389, 1463, 1486, 1509, 1476, 1442, 1380, 1479, 1487, 1496, 1492, 1488, 1383, 1439, 1504, 1408, 1372, 1336, 1406, 1477, 1480, 1484, 1529, 1574, 1553, 1531, 1483, 1435, 1427, 1420, 1430, 1441, 1267, 1255, 1316, 1378, 1489, 1601, 1503, 1405, 1375, 1344, 1378, 1412, 1405, 1399, 1434, 1470, 1438, 1406, 1428, 1449, 1420, 1391, 1451, 1350, 1309, 1269, 1194, 1281, 1344, 1407, 1340, 1272, 1181, 1251, 1353, 1454, 1365, 1275, 1318, 1361, 1444, 1527, 1538, 1550, 1423, 1297, 1267, 1398, 1462, 1364, 1381, 1398, 1405, 1411, 1414, 1416, 1530, 1643, 1725, 1646, 1563, 1481, 1461, 1442, 1423, 1403, 1428, 1454, 1519, 1585, 1598, 1612, 1626, 1639, 1588, 1537, 1552, 1568, 1539, 1509, 1479, 1450, 1382, 1315, 1288, 1261, 1274, 1287, 1400, 1353, 1203, 1213, 1324, 1436, 1399, 1362, 1365, 1368, 1382, 1396, 1470, 1384, 1275, 1328, 1374, 1420, 1362, 1305, 1341, 1377]
4672A377L2L2qqk0j9j0rl5J27J26l5o6o7rj0%Jo7o6POR8o4q2q3JJR3R2jjl1l0O9r0kJ60pq
4666A394N0N0m4m4P6P6K9j31q5P6K6j36l6l7L0L1p3Q8Q8p2m9n0QQrro0J02L0L1J31l0nmm4
4661A406m4n9J03j8j9l0J31%%K9K8r3r2J6J5k4k5N1N1N1N1JJKJK6K7K6K6n5n5n6n5n6n7J27
4655A431l3n6n6o6o6N7N7N6N7K7K7j4j3k9k9qJ52M9j11j02O0k6k6N1N1K7K7j20j21L1L1Q8
4650A403Q8j9j80k2k3Q3Q3j19j18K9K9P0O9ooP7P8N1j10o0n9MNl6l5Q2Q3J5J6K3K3o8R4j09
4645A435j08M9M9NOo1o2Q4Q4Q3Q4qqm8m8m4m5M9M9k0k0k1k0J0J0N0N0l6l5j26L5kkQQn5n5
4640A324J2J2j5j4N3N3jkL9L9n4n3n4n3K1K2K1K1O5O5o9o9P0O9j18j18N5N4p9q0N9N8N9N8
4634A450O2O2j9j8l0l0l0l0N3N3J3J3j7j7l8J24O9r1p2p2p1p2O2O2j9k0O2O1J8J7k2k3l8l9
$$ y = [1377, 1409, 1441, 1433, 1425, 1405, 1386, 1376, 1367, 1332, 1459, 1585, 1550, 1484, 1417, 1408, 1398, 1398, 1399, 1332, 1266, 1273, 1279, 1377, 1313, 1231, 1148, 1149, 1150, 1243, 1335, 1334, 1333, 1302, 1272, 1341, 1251, 1249, 1409, 1402, 1394, 1444, 1494, 1450, 1406, 1482, 1558, 1587, 1456, 1371, 1447, 1473, 1337, 1301, 1264, 1294, 1325, 1252, 1340, 1428, 1356, 1307, 1257, 1265, 1273, 1264, 1255, 1195, 1297, 1327, 1358, 1489, 1459, 1454, 1450, 1406, 1362, 1303, 1406, 1388, 1369, 1339, 1470, 1470, 1470, 1499, 1527, 1434, 1342, 1358, 1373, 1349, 1324, 1375, 1426, 1477, 1528, 1529, 1530, 1532, 1533, 1559, 1586, 1612, 1638, 1583, 1528, 1472, 1417, 1361, 1304, 1431, 1398, 1342, 1286, 1220, 1154, 1211, 1268, 1324, 1381, 1408, 1435, 1421, 1408, 1379, 1350, 1342, 1494, 1543, 1432, 1330, 1390, 1364, 1338, 1389, 1440, 1467, 1494, 1374, 1253, 1284, 1315, 1403, 1491, 1472, 1292, 1270, 1247, 1330, 1413, 1294, 1176, 1205, 1234, 1304, 1373, 1367, 1361, 1438, 1516, 1567, 1457, 1397, 1338, 1342, 1347, 1311, 1276, 1358, 1441, 1456, 1472, 1495, 1518, 1450, 1544, 1435, 1327, 1376, 1425, 1430, 1436, 1375, 1313, 1397, 1481, 1564, 1648, 1640, 1632, 1584, 1536, 1492, 1447, 1496, 1545, 1525, 1505, 1484, 1464, 1474, 1484, 1534, 1584, 1548, 1513, 1387, 1422, 1420, 1418, 1426, 1434, 1379, 1324, 1336, 1348, 1333, 1319, 1372, 1425, 1424, 1422, 1461, 1500, 1446, 1393, 1339, 1286, 1307, 1329, 1350, 1371, 1436, 1501, 1432, 1363, 1433, 1502, 1384, 1266, 1321, 1375, 1296, 1216, 1275, 1333, 1392, 1450, 1512, 1574, 1555, 1537, 1507, 1477, 1447, 1417, 1470, 1523, 1536, 1549, 1532, 1515, 1477, 1601, 1670, 1579, 1507, 1435, 1364, 1292, 1354, 1416, 1397, 1377, 1439, 1500, 1518, 1535, 1513, 1490, 1452, 1413]
4629A413m8J12N3N3p1p1MNR4o6n8n8LKJ72J2l2l2j7j7K3K3j0j0n1n0K6K6L6j24J7J6PPn3n3
4624A283Q1Q1k3k3k3k2P3P3o1o1n6n6K4K5O6O7j4j5J7J6J6J6k0k0k1k0M1M0M0M0j4j4j3j4
4619A509j17j17O1O0J9j42j01N9P5P5P5P6J01n9o5R7o4j45rrK6K6K1K1M8l2p8Q3nmONo7o7
4613A362O6O7NNM5M5l0k9l0k9jkjjj6j7j6j6J9K0o1o1m6m6L5L4N1N0k9l0j5j5K5K6J3J3k7
4608A363k7R0R1RJ0llllm2m2kkr0q9M4M5K3K4K4K3j3j3J57lm1m1j0j1nnnnK3K3lq3r8O3R8
4602A468J7r8j8O6O6ppqpk9l0mP7L8j23j27L3J51rq8qM9M9j9j8k5j07J3J74P2q9n0n0j3O7
4596A406P2q9OOm4m5J22J22k6k6p8p8l8l7K8K9K9K8L0L0Q0q1l7l7LLk7J34J29l2o3j44p8Q3
4591A380O3O4N4j07o7R4m7m6J1J2N2N2o1o1O0O0rj0rrk1k1P3P3p2p1o6o6p2Qm4J18J72J1o3
$$ y = [1413, 1365, 1477, 1530, 1583, 1512, 1441, 1445, 1450, 1544, 1478, 1420, 1362, 1365, 1367, 1539, 1551, 1519, 1487, 1470, 1453, 1476, 1499, 1489, 1479, 1428, 1378, 1404, 1430, 1466, 1342, 1359, 1375, 1382, 1389, 1336, 1283, 1364, 1445, 1422, 1399, 1376, 1354, 1427, 1500, 1439, 1378, 1322, 1266, 1290, 1315, 1381, 1448, 1434, 1419, 1436, 1452, 1468, 1484, 1464, 1444, 1423, 1403, 1444, 1484, 1524, 1564, 1550, 1536, 1523, 1509, 1392, 1275, 1336, 1396, 1415, 1273, 1172, 1231, 1306, 1381, 1456, 1532, 1633, 1574, 1509, 1606, 1542, 1397, 1388, 1379, 1405, 1431, 1452, 1473, 1521, 1489, 1411, 1494, 1489, 1485, 1491, 1496, 1429, 1362, 1428, 1495, 1500, 1505, 1550, 1595, 1565, 1536, 1506, 1477, 1476, 1474, 1473, 1472, 1456, 1439, 1423, 1407, 1426, 1446, 1385, 1324, 1278, 1232, 1267, 1301, 1352, 1402, 1373, 1343, 1328, 1313, 1338, 1364, 1377, 1390, 1363, 1336, 1426, 1517, 1526, 1536, 1533, 1530, 1527, 1524, 1482, 1440, 1438, 1436, 1346, 1257, 1301, 1346, 1369, 1393, 1417, 1440, 1427, 1414, 1571, 1568, 1527, 1486, 1476, 1465, 1460, 1455, 1450, 1445, 1468, 1491, 1488, 1405, 1307, 1370, 1468, 1485, 1387, 1369, 1435, 1501, 1494, 1487, 1479, 1472, 1443, 1413, 1409, 1486, 1524, 1401, 1274, 1307, 1458, 1449, 1361, 1353, 1402, 1451, 1432, 1414, 1389, 1282, 1295, 1469, 1541, 1452, 1402, 1352, 1339, 1406, 1478, 1389, 1395, 1401, 1357, 1312, 1434, 1556, 1530, 1504, 1426, 1348, 1310, 1273, 1301, 1330, 1359, 1387, 1417, 1447, 1527, 1446, 1409, 1372, 1375, 1378, 1351, 1485, 1614, 1582, 1519, 1375, 1297, 1380, 1443, 1507, 1561, 1454, 1387, 1481, 1434, 1388, 1399, 1411, 1463, 1515, 1454, 1393, 1453, 1513, 1504, 1494, 1485, 1476, 1455, 1434, 1507, 1580, 1508, 1437, 1371, 1305, 1233, 1241, 1197, 1315, 1487, 1498, 1435]
4586A435o3q6q6L5L4J7J7k3k3M3M4MLM4M4m9n0J3J3Jp9j0J50J41k1rr0J2J2j09j09J1J2R2
4581A370R1lP7M4j15q1Q0Kj59j7j8N3N3N4N3m6m6M7M8L9L9jjl0l1j21M0M7M7o3o4L2L2L2L2
4575A516r9j00K1K1P6P5j8j9p8p8N9N9R6o5o8o8K7K7O8O7p6p5M5M4K8K8K8K8r7r7K3K4q0q1
4570A261O8O7poJ7j44j7j6R5R4J1J2K1K2j40K1J68Prqp6p6q2P8K8K8O1O0O1O1n8n9qqp6Q4
4565A535poj08j07O6O7r2r2Q3Q2L8L8j09j10J34J34m1m1m2m3K5K5L3L3J27J27j13j13L5L5
4560A593k8k7L0K9k3j84r0P0k3k3Q0Q1p3p4m3J17nmq6P6L5L5M5M5nnj00r9K6K6j5j4k1k1L9
4555A364j22pJ54J2J3M7M6m7m8J8J7k3k3Q2Q1r2r2K5K5K6K5L2L3L2L2qrm8m9k2k3J8J8o3o2
4549A362L1L1L1L0L0L1n8n7qpo7R5M3M4n3n3P7q3O3O4N3N3%%L9M0j39j40QQM0L9K9L0l1j91
$$ y = [1435, 1372, 1286, 1200, 1235, 1269, 1286, 1303, 1280, 1257, 1300, 1344, 1348, 1351, 1395, 1439, 1390, 1340, 1353, 1366, 1367, 1288, 1278, 1428, 1569, 1548, 1539, 1449, 1461, 1473, 1364, 1255, 1266, 1278, 1370, 1461, 1458, 1535, 1579, 1464, 1383, 1463, 1465, 1306, 1289, 1271, 1324, 1377, 1431, 1484, 1438, 1392, 1439, 1487, 1526, 1565, 1564, 1563, 1533, 1502, 1381, 1421, 1468, 1515, 1452, 1388, 1420, 1452, 1484, 1516, 1417, 1317, 1338, 1359, 1435, 1510, 1492, 1473, 1395, 1317, 1376, 1435, 1531, 1466, 1398, 1330, 1357, 1384, 1452, 1519, 1443, 1368, 1413, 1457, 1485, 1513, 1541, 1569, 1472, 1375, 1398, 1422, 1342, 1261, 1329, 1396, 1389, 1383, 1400, 1256, 1239, 1223, 1318, 1412, 1423, 1435, 1456, 1478, 1338, 1359, 1527, 1534, 1525, 1517, 1441, 1365, 1283, 1361, 1389, 1417, 1478, 1538, 1599, 1660, 1602, 1543, 1535, 1527, 1451, 1535, 1528, 1522, 1414, 1307, 1373, 1440, 1348, 1256, 1339, 1421, 1459, 1497, 1388, 1278, 1412, 1546, 1505, 1464, 1422, 1379, 1404, 1429, 1462, 1495, 1622, 1749, 1636, 1523, 1558, 1593, 1565, 1538, 1568, 1597, 1574, 1390, 1300, 1370, 1347, 1324, 1404, 1485, 1412, 1338, 1295, 1412, 1407, 1403, 1317, 1393, 1428, 1463, 1508, 1553, 1548, 1543, 1443, 1344, 1370, 1396, 1381, 1367, 1346, 1325, 1364, 1242, 1235, 1389, 1401, 1414, 1461, 1507, 1460, 1412, 1430, 1447, 1424, 1401, 1483, 1564, 1472, 1380, 1405, 1430, 1456, 1481, 1513, 1546, 1578, 1610, 1602, 1593, 1545, 1496, 1474, 1451, 1469, 1487, 1424, 1362, 1393, 1424, 1455, 1485, 1515, 1546, 1488, 1431, 1423, 1416, 1349, 1444, 1487, 1531, 1478, 1425, 1502, 1419, 1482, 1546, 1599, 1652, 1652, 1652, 1691, 1731, 1592, 1452, 1460, 1468, 1508, 1547, 1576, 1606, 1575, 1384]
4544A384N7N7j78j6O7O7J0J1P8P8q3q3q3q3J17J17j10j11n3n4O7O7K8K9o2R8j0j1%%K4K5R2
4539A536R2m1m0j%qrm9m8M0M0J%l8l7J9K0N3j09j85Q3J35j33j23L7J0RK0J9K5K6K5K5j7j8
4533A359k8k7M9j12q1Q0J95L4k9l0q0Q0Q1q1o5o5J8J9O5O4K5K4l1l2RRM2M1M2M1o6o7j06j07
4528A270K3K3O3O4n7n7j6j6O2O2K3K2j10j09N5K16L4L5p6p6n8n9N2N3J47j3j07j07N7j04j34
4523A162J34J93L2o2o1ooL4L4n1n2jjj16M4M8M7k5k5M1M2n0n0L0L1L4L5m6m6kkklK1K0o0o0
4518A255j3j2J8J8J47j3m6m7j45J6J14J13K0J9J00J00j4j4r4r5k4k4N7N6q7q8pqP1P1J21m0
4513A525m2m2K8K9j1j1K9K9rj0m9n0r6r6R1R1K7K7K8K7j00j01Q8Q7k1k2k1k2N4N4k7k7m6m6
4508A365Q9Q8o3o3QQj0j70j07J61P4q7j9k0M9M8RQJ8J8k3k2L4L4L4L5jjj32K9N2N1j9k0l6
$$ y = [1384, 1441, 1498, 1320, 1304, 1371, 1438, 1448, 1459, 1537, 1615, 1532, 1449, 1366, 1283, 1400, 1517, 1407, 1296, 1243, 1189, 1256, 1323, 1351, 1380, 1318, 1416, 1406, 1395, 1395, 1395, 1419, 1444, 1536, 1628, 1587, 1547, 1546, 1546, 1538, 1529, 1480, 1432, 1472, 1512, 1513, 1513, 1475, 1438, 1457, 1477, 1530, 1421, 1236, 1319, 1454, 1321, 1198, 1235, 1245, 1254, 1274, 1293, 1318, 1344, 1369, 1394, 1377, 1359, 1331, 1304, 1353, 1241, 1160, 1240, 1435, 1469, 1440, 1410, 1330, 1410, 1491, 1410, 1345, 1280, 1298, 1317, 1382, 1446, 1471, 1495, 1464, 1432, 1441, 1450, 1492, 1533, 1575, 1616, 1550, 1483, 1377, 1270, 1293, 1316, 1379, 1443, 1386, 1329, 1313, 1297, 1359, 1421, 1444, 1466, 1356, 1247, 1302, 1518, 1552, 1587, 1511, 1435, 1377, 1318, 1370, 1423, 1570, 1557, 1450, 1343, 1400, 1296, 1162, 1296, 1489, 1521, 1459, 1398, 1392, 1386, 1420, 1454, 1403, 1351, 1350, 1349, 1233, 1277, 1325, 1372, 1347, 1322, 1363, 1405, 1355, 1305, 1335, 1366, 1400, 1435, 1389, 1343, 1341, 1339, 1337, 1334, 1355, 1375, 1315, 1255, 1242, 1230, 1248, 1266, 1413, 1400, 1354, 1307, 1162, 1178, 1292, 1405, 1425, 1444, 1544, 1644, 1630, 1616, 1522, 1427, 1403, 1379, 1436, 1492, 1405, 1317, 1310, 1302, 1373, 1444, 1565, 1525, 1483, 1441, 1469, 1498, 1487, 1476, 1505, 1534, 1525, 1515, 1466, 1416, 1320, 1224, 1315, 1406, 1433, 1460, 1488, 1515, 1415, 1314, 1402, 1489, 1468, 1446, 1425, 1403, 1457, 1511, 1484, 1457, 1411, 1365, 1454, 1542, 1479, 1416, 1424, 1432, 1422, 1252, 1145, 1306, 1380, 1293, 1274, 1254, 1303, 1351, 1360, 1368, 1386, 1404, 1381, 1359, 1393, 1427, 1461, 1496, 1495, 1494, 1362, 1391, 1443, 1494, 1475, 1455, 1419]
4502A419l7M4M3K2K2n8n8k8k9J06J06N7N8k3k4o5o6j6j6q7P3j7j8L1L0L1L0P6P6k1j82N8N9
4497A596QQP8P7j9j81m2m2j43J9P2P2J2J2j02N8p3p2j3j2J12J12J04n7j00j00m7m7K4K4J29
4493A467l1N8N9KKp8p9J6J7J6J6j4j4K6K6l6l6R8R8n8n9j8j8M1M1l9m0l2l2j12j12J08J09
4488A392k5k6N2N2q2q2m1m0M0M0M0M0L0L0J18m2k2k2o5R6p5p5M9M9M9M9J%JJj8j7j8j7O9O8
4482A599o5o5nmq6q5O3O4O3O3RRRRRJ0l0l1PPmq5r2O9O4j6p7Ll8l7l9J22J22M2j91j10J63
4476A446Ko7J3N1N2o4o5N7N6n8n7L6L6j0rrrj8j7j7j7L3L4L4L4m7m7q0Q0J24l7r9O2L7m4J2
4471A428J1J3J4J3J3M6M6r1r1n7J04N3k6J6o3k4k3m9m8p2Q9P7P7L6L7Q9p1j65nj6j7poL7L7
4466A405J04J03n1n2n2n2L3L2pqopm7m7L9M0L9L9m7m6M7M7N8N8o3o3p6p6J7J8n8n8RJ0l8l8
$$ y = [1419, 1382, 1426, 1469, 1491, 1513, 1455, 1397, 1369, 1340, 1446, 1552, 1609, 1667, 1644, 1620, 1555, 1489, 1473, 1457, 1370, 1443, 1426, 1408, 1439, 1469, 1500, 1530, 1606, 1682, 1661, 1479, 1537, 1596, 1604, 1612, 1690, 1767, 1748, 1567, 1525, 1483, 1340, 1359, 1431, 1503, 1515, 1527, 1425, 1483, 1410, 1338, 1325, 1313, 1425, 1537, 1641, 1584, 1484, 1384, 1337, 1290, 1314, 1338, 1467, 1436, 1494, 1553, 1555, 1557, 1479, 1400, 1416, 1433, 1449, 1465, 1451, 1437, 1463, 1489, 1453, 1417, 1515, 1613, 1555, 1496, 1478, 1460, 1501, 1542, 1503, 1463, 1431, 1399, 1287, 1175, 1283, 1392, 1367, 1341, 1393, 1445, 1363, 1281, 1240, 1200, 1240, 1280, 1320, 1360, 1390, 1420, 1538, 1496, 1474, 1452, 1387, 1483, 1408, 1333, 1382, 1431, 1480, 1529, 1530, 1530, 1531, 1532, 1514, 1497, 1479, 1462, 1531, 1599, 1534, 1469, 1464, 1460, 1374, 1289, 1352, 1416, 1479, 1542, 1551, 1560, 1569, 1578, 1587, 1597, 1567, 1536, 1543, 1550, 1546, 1461, 1369, 1438, 1502, 1486, 1409, 1412, 1374, 1337, 1298, 1420, 1542, 1584, 1393, 1283, 1446, 1448, 1381, 1394, 1445, 1497, 1433, 1368, 1425, 1481, 1423, 1366, 1402, 1438, 1428, 1419, 1410, 1401, 1383, 1366, 1349, 1332, 1365, 1399, 1433, 1467, 1420, 1373, 1293, 1373, 1497, 1460, 1361, 1423, 1460, 1416, 1428, 1439, 1452, 1466, 1479, 1492, 1538, 1584, 1493, 1402, 1345, 1449, 1502, 1476, 1492, 1429, 1405, 1382, 1333, 1285, 1213, 1302, 1379, 1456, 1492, 1529, 1618, 1547, 1382, 1377, 1361, 1344, 1337, 1331, 1368, 1405, 1509, 1612, 1561, 1509, 1457, 1405, 1438, 1470, 1463, 1455, 1449, 1442, 1395, 1348, 1387, 1427, 1466, 1505, 1458, 1412, 1459, 1506, 1564, 1622, 1559, 1496, 1420, 1344, 1361, 1379, 1321, 1263, 1272, 1282, 1244, 1206]
4460A206pqQ4p7J3J3k7k8J19J20k5k5O8O9Q1Q0o6o7k3k3M4M5j27j27P4P5P3P2L3L2k5k6o5
4455A555o6K5K5O5O5j05j05j2j1poN4j07mJ57j1j0L0K9l7l7n8n8QRO6O6q1q2m4m3N0N0O2O2
4450A494K1K2P5P5p2p2j5j4K6K6rrrrJKL7L7J5o7j61jR5o5j0P0N2N2q3P7J0j51r1j0M0J19
4444A498r6j6P7q4p9KR6J6k8k8K0K0k0k0K3K2K3K3R8R9o6o6j04N7l3l3m5m4M0L9Pj55pJ54
4439A390J8J9K9K9N2N1j5j6l1l2K6K5%j61r4O6P2P1P9q3J0Ro7o7M3M3M0j21LLM4M3m7J13K2
4434A566K3j05j04J5J6P1P0LMj40j41L4L4L7L7P6P7o8o8j59KK8K9L8L8kklkLLP0P0K0K0m7
4428A543m7m2m2N1N2L6L6l1l1p4p5P3P3N9N9qqp2p3p2p3K3K3O3O3l0l1l1l0j4j4K6K6N7N6
4423A521l7l7j3j3j2j3j3j2j3j2J7J8J01J01l7j99n8n8mJ57J67Or0P1O1r9rj0K1K1m8m9m8
$$ y = [1206, 1199, 1191, 1275, 1198, 1211, 1224, 1197, 1169, 1288, 1408, 1383, 1358, 1426, 1495, 1576, 1656, 1590, 1523, 1500, 1477, 1521, 1566, 1439, 1312, 1386, 1461, 1534, 1606, 1639, 1671, 1646, 1620, 1555, 1489, 1514, 1539, 1604, 1669, 1564, 1459, 1447, 1436, 1429, 1423, 1477, 1370, 1366, 1523, 1512, 1502, 1532, 1561, 1524, 1487, 1429, 1371, 1379, 1388, 1454, 1520, 1439, 1357, 1313, 1270, 1320, 1370, 1432, 1494, 1515, 1537, 1612, 1687, 1615, 1543, 1528, 1514, 1540, 1566, 1557, 1548, 1539, 1530, 1531, 1533, 1570, 1607, 1622, 1555, 1394, 1393, 1488, 1423, 1413, 1483, 1535, 1587, 1504, 1581, 1591, 1440, 1349, 1339, 1379, 1498, 1402, 1386, 1463, 1379, 1300, 1302, 1398, 1414, 1386, 1358, 1378, 1398, 1378, 1358, 1381, 1403, 1426, 1449, 1547, 1646, 1580, 1514, 1410, 1467, 1434, 1401, 1356, 1312, 1352, 1391, 1398, 1243, 1236, 1390, 1408, 1427, 1456, 1485, 1537, 1588, 1573, 1557, 1526, 1494, 1520, 1545, 1545, 1384, 1290, 1356, 1428, 1499, 1578, 1495, 1505, 1514, 1447, 1380, 1423, 1466, 1506, 1385, 1388, 1391, 1435, 1478, 1431, 1544, 1566, 1589, 1484, 1380, 1395, 1411, 1482, 1552, 1555, 1559, 1419, 1278, 1312, 1346, 1383, 1420, 1496, 1573, 1505, 1437, 1278, 1280, 1308, 1337, 1375, 1413, 1411, 1409, 1406, 1404, 1407, 1410, 1480, 1550, 1570, 1590, 1543, 1496, 1454, 1412, 1463, 1515, 1551, 1587, 1556, 1525, 1451, 1376, 1449, 1522, 1581, 1640, 1632, 1624, 1552, 1479, 1407, 1334, 1357, 1380, 1443, 1506, 1476, 1445, 1414, 1384, 1370, 1356, 1382, 1408, 1465, 1521, 1484, 1447, 1434, 1421, 1409, 1396, 1383, 1371, 1358, 1346, 1363, 1381, 1482, 1583, 1546, 1347, 1289, 1231, 1227, 1384, 1551, 1557, 1467, 1538, 1599, 1500, 1491, 1481, 1502, 1523, 1475, 1426, 1378]
4418A378m9PPPPP9Q0j4j4klkkm7m7P4P4j21j20K7K7L6L6L6L6KJl8l9j3j4P7q4LLL3L3M1M0
4412A535n3n3P2P2L1L2k1k1K9K9j63kO8k00m9J11J79J8K4j37n7n6N0N1j7j6O2O2O3O2m6m6
4407A613j36K4m2m2l2l2O9O9R3o9llj3j3q7q8O0O0nnL5L5p4p4M6M7j0j1pJ54M5M4J5J5o6o7
4402A545JJl7l7p2p2nP5J25l6j23m3l2l1mmL7L6N6N6j2j1J1J2J1J2M5M6P9q1j78j6M7M7J16
4396A564m5j10l0n5J06K6n5k3k3O6O5k9l0K8K7P4q7m7L3k8j09j8j8J3J2J2J2N4N5K4K4n6J06
4391A538p6NQ6Nq3lLLRQL0L0r2j2R6o5m9L1PQ8R8o2j9j8k9k8l9l8KJN2N1J1J1j20j19M6K06
4385A565L3L4p8p7K5K5m2m2O1O0l3l2j2j1k1k1Q6p5q5P6K7j34QPK3K3O3O3NNl5l5L1L1L2L1
4380A581r6r7L5L4j3J48o4o3q1q0k4J38M6M7l7l7k1k0N6N6r3O9J46j5j00O1N1j10j08j07p8
$$ y = [1378, 1329, 1336, 1343, 1350, 1357, 1436, 1516, 1502, 1488, 1486, 1483, 1481, 1479, 1432, 1385, 1459, 1533, 1412, 1292, 1319, 1346, 1382, 1418, 1454, 1490, 1492, 1493, 1455, 1416, 1403, 1389, 1466, 1382, 1385, 1388, 1421, 1454, 1495, 1535, 1482, 1429, 1501, 1573, 1604, 1636, 1615, 1594, 1623, 1652, 1489, 1487, 1555, 1355, 1306, 1417, 1596, 1614, 1638, 1501, 1444, 1388, 1438, 1489, 1472, 1456, 1518, 1580, 1643, 1705, 1659, 1613, 1477, 1501, 1459, 1417, 1385, 1353, 1422, 1491, 1584, 1515, 1512, 1509, 1496, 1483, 1396, 1308, 1368, 1428, 1423, 1418, 1453, 1488, 1414, 1340, 1386, 1433, 1423, 1412, 1405, 1559, 1604, 1648, 1663, 1678, 1612, 1545, 1546, 1547, 1510, 1473, 1401, 1329, 1324, 1399, 1524, 1488, 1365, 1322, 1290, 1259, 1255, 1251, 1288, 1324, 1380, 1436, 1424, 1413, 1424, 1436, 1447, 1459, 1504, 1550, 1629, 1548, 1370, 1354, 1401, 1448, 1564, 1519, 1409, 1379, 1324, 1430, 1456, 1401, 1378, 1355, 1421, 1486, 1457, 1427, 1455, 1482, 1556, 1469, 1422, 1455, 1427, 1318, 1300, 1282, 1295, 1307, 1319, 1331, 1385, 1440, 1464, 1488, 1432, 1538, 1462, 1467, 1553, 1558, 1475, 1472, 1475, 1478, 1487, 1495, 1525, 1555, 1463, 1451, 1547, 1482, 1433, 1464, 1471, 1559, 1657, 1595, 1576, 1558, 1529, 1501, 1462, 1424, 1426, 1427, 1479, 1530, 1541, 1552, 1432, 1313, 1359, 1565, 1598, 1632, 1554, 1477, 1502, 1527, 1485, 1443, 1504, 1564, 1531, 1499, 1487, 1476, 1455, 1434, 1520, 1445, 1360, 1436, 1463, 1329, 1337, 1344, 1367, 1390, 1453, 1516, 1521, 1526, 1491, 1456, 1487, 1518, 1550, 1581, 1485, 1388, 1423, 1457, 1444, 1592, 1528, 1465, 1384, 1304, 1280, 1418, 1464, 1511, 1474, 1437, 1416, 1396, 1452, 1508, 1415, 1484, 1630, 1615, 1515, 1576, 1627, 1517, 1409, 1302, 1224]
4375A224p7J%J21J22MNNNK2K3m5m5poO0O0K5K6Q3Q3L4j27j67opqM3M3L3L3l4l4rqm9m9l4l3
4369A310O0O0J04J04p0p0o4o4J10J10J9K0J9J9r5r4k8k8k4k4k4k4m2m2J6J76mlP4P4o2o2L2
4364A483L2O0N9o1o1LLo5o4j04j04J08J07k3J39M8M7q9q9k3k2K1K1L8L8o2K06l8l8j8j9q5
4359A448q5mllmO6O6%jJ1J0l9J21K2K2k5k6j11N0m0m1qqO0N9k6k7M1M1j5j5o6R6j6j5noM2
4354A566M2M2M1j54j53J0J1J09n1o2R9K31P1j01j01r9O2J2J1llmln7n7j7j7N4N4N4N4p6p5
4348A490l6l5l7l7L1L0NONNkkkkJ52J52l2l2r1k51j14M7K17N7m4m3P0P0j4j3r8O2k7k8j14
4343A345j13Q8Q8M5M5m9m8kkm3m2P3P3NOj2j2k2k2R1p0p3p3Q5Q4rrk0j9k0k0J8J9N9N9l2l2
4337A439k1k2j02N8J52qj29j28J16J16q1q1O6O6MLMLm4m4K3K3m5m5L8K00qrl9l8J0J0N0N0
$$ y = [1224, 1147, 1148, 1148, 1269, 1391, 1395, 1400, 1405, 1410, 1432, 1455, 1410, 1365, 1358, 1352, 1412, 1472, 1497, 1523, 1606, 1689, 1723, 1596, 1429, 1423, 1416, 1408, 1451, 1494, 1527, 1560, 1526, 1492, 1483, 1475, 1426, 1377, 1343, 1310, 1370, 1430, 1534, 1638, 1568, 1498, 1434, 1370, 1480, 1590, 1609, 1629, 1648, 1667, 1572, 1478, 1450, 1422, 1398, 1374, 1350, 1326, 1284, 1242, 1258, 1434, 1430, 1427, 1501, 1575, 1513, 1451, 1483, 1515, 1575, 1634, 1573, 1512, 1515, 1518, 1453, 1389, 1285, 1181, 1289, 1396, 1373, 1512, 1560, 1607, 1518, 1429, 1406, 1384, 1405, 1426, 1464, 1502, 1440, 1646, 1608, 1570, 1552, 1533, 1448, 1363, 1359, 1356, 1353, 1349, 1415, 1481, 1481, 1480, 1491, 1501, 1462, 1583, 1605, 1627, 1602, 1576, 1465, 1515, 1475, 1434, 1426, 1418, 1478, 1537, 1511, 1484, 1525, 1566, 1551, 1536, 1470, 1566, 1550, 1535, 1530, 1524, 1566, 1608, 1650, 1691, 1537, 1384, 1394, 1405, 1514, 1463, 1401, 1500, 1731, 1802, 1701, 1600, 1501, 1563, 1575, 1586, 1583, 1580, 1576, 1573, 1516, 1459, 1442, 1425, 1479, 1533, 1587, 1641, 1565, 1490, 1454, 1419, 1382, 1345, 1376, 1406, 1411, 1417, 1422, 1427, 1425, 1423, 1421, 1419, 1571, 1723, 1691, 1659, 1568, 1317, 1203, 1250, 1467, 1524, 1480, 1437, 1507, 1577, 1563, 1550, 1452, 1514, 1487, 1459, 1345, 1232, 1320, 1408, 1453, 1498, 1449, 1401, 1399, 1397, 1354, 1312, 1385, 1458, 1463, 1469, 1457, 1445, 1423, 1401, 1492, 1422, 1349, 1276, 1361, 1445, 1436, 1427, 1407, 1388, 1368, 1348, 1366, 1385, 1444, 1503, 1471, 1439, 1418, 1396, 1294, 1352, 1504, 1496, 1367, 1239, 1355, 1471, 1390, 1309, 1375, 1441, 1445, 1448, 1452, 1455, 1411, 1367, 1390, 1413, 1368, 1323, 1361, 1561, 1553, 1544, 1505, 1467, 1477, 1487, 1537, 1587]
4332A587o4o4LLO9O8KJk1k1p1R0m8m8N3j08J4J4MMN4N3N4N3r7r6j47J4J09J10jkl6l5l6l6
4327A428k9l0l9l9J46j4j7j8J14J13P3j95j25L5J17J16j7j7j7j7j10j10K5K4n0n0L1L1L7L7
4322A433L7L7K2K2n8n8M0M1m0m0K8K9K9K8r7r6L7L7N8N8J7J8m1m0m1m1j2j3O3O3L3m8n8J03
4317A550N5k6%q0qP2K3K2o4o5o5o5M7M6M6M7oo%jnP6M5j15r9j8PPL9L8L9L9n0n0L0L0p7p8
4311A380J00J00J8j43j43J7rj0Q2Q1RRl2l1k6k6o7o6J6J5N6N6M3M4KLLLkkJ9o1j87k6Q5Q5
4306A395N4N5L4L5onj21j22J21J20j5j5r5L9O9j2l3l3j0P1J01l3k4k3K2n8m0R3J4J3KJKJJ5
4300A612J4J5J4ppqpj56j55Q5Oj3J22JJM2M2l8l9k4k4k4k4P4P4n9o0PPQ3n1o1o0o9o9N4N3
4295A351N4N3L7L6m4m4P6P5L6L5r2r3j2j2mmnmo2o2P2P2%jj%J4J3O0N9%Q0L4r9o7J2M0L9m7
$$ y = [1587, 1523, 1459, 1462, 1465, 1534, 1602, 1604, 1605, 1584, 1563, 1492, 1582, 1534, 1486, 1539, 1431, 1445, 1459, 1463, 1467, 1521, 1574, 1628, 1681, 1584, 1488, 1341, 1355, 1464, 1574, 1573, 1571, 1535, 1500, 1464, 1428, 1399, 1369, 1330, 1291, 1437, 1423, 1406, 1388, 1502, 1615, 1688, 1493, 1368, 1403, 1520, 1636, 1619, 1602, 1585, 1568, 1458, 1348, 1373, 1397, 1347, 1297, 1328, 1359, 1396, 1433, 1470, 1507, 1529, 1551, 1493, 1435, 1475, 1516, 1476, 1436, 1464, 1493, 1522, 1550, 1453, 1357, 1394, 1431, 1489, 1547, 1564, 1582, 1541, 1501, 1460, 1419, 1407, 1394, 1457, 1520, 1553, 1505, 1447, 1550, 1605, 1579, 1579, 1499, 1491, 1563, 1586, 1608, 1544, 1479, 1414, 1349, 1396, 1442, 1488, 1535, 1529, 1523, 1523, 1522, 1517, 1593, 1638, 1523, 1424, 1406, 1413, 1420, 1459, 1497, 1536, 1575, 1525, 1475, 1505, 1535, 1458, 1380, 1480, 1580, 1598, 1455, 1312, 1329, 1320, 1310, 1392, 1473, 1482, 1491, 1459, 1428, 1402, 1376, 1309, 1243, 1259, 1274, 1330, 1386, 1429, 1473, 1475, 1478, 1481, 1484, 1482, 1480, 1499, 1438, 1251, 1225, 1310, 1395, 1449, 1504, 1538, 1573, 1567, 1562, 1441, 1319, 1440, 1560, 1545, 1530, 1435, 1474, 1543, 1531, 1498, 1465, 1455, 1526, 1627, 1594, 1570, 1547, 1569, 1511, 1471, 1564, 1578, 1591, 1593, 1594, 1596, 1597, 1612, 1626, 1641, 1655, 1648, 1641, 1633, 1626, 1470, 1315, 1400, 1406, 1393, 1515, 1516, 1517, 1559, 1601, 1563, 1524, 1500, 1476, 1452, 1428, 1502, 1576, 1517, 1457, 1464, 1471, 1554, 1503, 1442, 1382, 1313, 1244, 1298, 1351, 1405, 1458, 1495, 1531, 1487, 1443, 1519, 1594, 1630, 1665, 1573, 1480, 1468, 1456, 1452, 1448, 1443, 1439, 1377, 1315, 1387, 1459, 1459, 1458, 1457, 1457, 1471, 1484, 1544, 1603, 1603, 1683, 1717, 1618, 1551, 1563, 1603, 1642, 1595]
4289A595m8m8m7PPL4J15P6n7j11j11j2j3K8K8l6l6o6o6L0J90O7r4j12N0J36J36m8m9L2L2o2
4284A547o1J8J9NNQ5Q6k1k0k0k0j2j2r2r2l5l6m5m5J22l8p2p2k0J41J41k0K3K3J3J3k7k7N3
4279A507N4n1n0L0L0M1M1j0rQ5p6o6o6j4j3K6K6N8N8k3k2j06j05k5k5J82J82Q4p6m0m0n0n0
4274A487JJM1M2k1k0j01j02L2L1P2P1J6J5o5o5l2l2l2l2P7P7llj6j6J19J18m3m3j74j3QQJ8
4268A421J8K0K1L0L1j09N2M2M1k3k4N7N7ppq7q8l7l7kkO1j9j7J17L5r9L8m2k6J09K8j06j6
4263A430O4M6M5L3m7j58k4l3l3N6N6J03J03K3K2MLl7l7ooq6q6PQl3l2M8M8l2l2j9k0O1O1M3
4258A543M2L8r7o0n9O6J46J02l2q1q1n1K9N7j30j37krrrqL2L2J6J6N7N6poP4P4n3n3j3j2L1
4252A502L0rrl2l2M8M8K1K1o0n9m9n0Q5Q5p1p1O3O3j5j6k0k1N3k8n7P6Q1Q0m5m6j3j2K7K8
$$ y = [1595, 1547, 1499, 1452, 1459, 1466, 1500, 1615, 1691, 1634, 1523, 1412, 1400, 1387, 1415, 1443, 1407, 1371, 1305, 1239, 1269, 1459, 1526, 1432, 1320, 1370, 1506, 1642, 1594, 1545, 1577, 1609, 1547, 1486, 1504, 1523, 1528, 1533, 1618, 1704, 1683, 1663, 1643, 1623, 1611, 1599, 1507, 1415, 1380, 1344, 1299, 1254, 1376, 1338, 1266, 1194, 1174, 1315, 1456, 1436, 1459, 1482, 1495, 1508, 1481, 1454, 1507, 1561, 1510, 1460, 1490, 1520, 1561, 1602, 1592, 1583, 1668, 1592, 1526, 1460, 1446, 1433, 1459, 1485, 1543, 1601, 1578, 1556, 1450, 1345, 1320, 1295, 1477, 1659, 1743, 1667, 1627, 1587, 1537, 1487, 1488, 1489, 1530, 1572, 1551, 1531, 1430, 1328, 1360, 1391, 1463, 1534, 1550, 1565, 1500, 1435, 1403, 1371, 1339, 1307, 1384, 1461, 1458, 1455, 1439, 1423, 1542, 1660, 1617, 1574, 1400, 1387, 1395, 1403, 1421, 1439, 1459, 1480, 1510, 1541, 1432, 1484, 1526, 1567, 1544, 1520, 1577, 1634, 1627, 1620, 1533, 1445, 1408, 1371, 1369, 1367, 1428, 1409, 1392, 1509, 1544, 1445, 1483, 1441, 1415, 1524, 1552, 1446, 1430, 1494, 1540, 1585, 1618, 1571, 1413, 1389, 1356, 1323, 1379, 1435, 1538, 1641, 1664, 1686, 1690, 1693, 1656, 1619, 1613, 1607, 1521, 1435, 1442, 1450, 1417, 1385, 1433, 1481, 1449, 1417, 1398, 1378, 1439, 1500, 1543, 1585, 1623, 1526, 1466, 1407, 1473, 1619, 1721, 1689, 1608, 1527, 1476, 1505, 1562, 1432, 1295, 1293, 1284, 1275, 1266, 1258, 1290, 1322, 1338, 1354, 1411, 1467, 1460, 1454, 1528, 1602, 1549, 1496, 1483, 1471, 1502, 1532, 1523, 1514, 1482, 1450, 1498, 1546, 1567, 1588, 1528, 1469, 1420, 1370, 1455, 1540, 1469, 1398, 1461, 1524, 1509, 1493, 1473, 1452, 1505, 1477, 1420, 1496, 1577, 1657, 1612, 1566, 1553, 1541, 1568, 1596]
4247A596l2l2l1l2L1L1l9l9k9J32l9l8rrqrooooonooN0N0N0N1m3m3n3J08n4n4mmj6j6j7j6
4241A386kkP9P9Q4Q3n0n0JKp9p9NNNNM0M0M1M0ppj7j6K0j41n0n0M0M1M0M1poopMMLMJ2J2J2
4234A552J2Q4Q5m9m9PQl3l3m7m7l7l7q6P5O4O5J8J9k2k2MLMLmmr4O6O3O3ppm6m6L4L5p7p7
4228A440l4J28k0k1L1L0k9k9q0Q2O0O1j0j0%jm0m1m1m1R3R4K7K7Q8p4j56ML8L9r6r5n1J09
4223A482K6K7mmk9k9M1M1M9j12q2P9P0r0k0k0r9O2J43j8N7N7p7p7j18M2Q7Q6O0N9K0J9KJk5
4218A706j86j73R4J01j67r8J70J73J3j20j20J0J72Q6p5j4j5OOM6M6l1l1l1l1M3M3k8k8m5J15
4213A637L5j26LKL3L3k3k2J7J8L8L8m3m2l3l3l4l3K7K7n3n4L2L2j39K2L2L1J22J21M8M8l2
4208A729l3r9j00j9j9O2O2K2K2K6K6n4n4o7o6J3J4K4K3K4K3n5n5K5K5K4K4lq4r1M2J17j6n
$$ y = [1596, 1564, 1532, 1501, 1469, 1500, 1531, 1492, 1453, 1424, 1556, 1517, 1479, 1470, 1461, 1453, 1444, 1438, 1432, 1426, 1420, 1414, 1409, 1403, 1397, 1447, 1497, 1547, 1598, 1555, 1512, 1459, 1567, 1513, 1459, 1455, 1451, 1435, 1419, 1402, 1386, 1384, 1382, 1461, 1540, 1624, 1707, 1657, 1607, 1608, 1610, 1531, 1452, 1457, 1462, 1467, 1472, 1512, 1552, 1593, 1633, 1626, 1619, 1602, 1586, 1606, 1465, 1415, 1365, 1405, 1446, 1486, 1527, 1520, 1514, 1508, 1501, 1505, 1509, 1512, 1516, 1528, 1540, 1552, 1564, 1648, 1733, 1684, 1635, 1642, 1650, 1617, 1584, 1537, 1490, 1453, 1416, 1330, 1405, 1469, 1534, 1552, 1571, 1549, 1527, 1531, 1534, 1538, 1541, 1537, 1533, 1439, 1505, 1568, 1631, 1624, 1617, 1571, 1525, 1559, 1594, 1517, 1440, 1406, 1534, 1514, 1493, 1524, 1554, 1525, 1496, 1416, 1498, 1558, 1619, 1609, 1599, 1599, 1598, 1558, 1517, 1476, 1435, 1528, 1622, 1649, 1676, 1764, 1690, 1534, 1538, 1576, 1615, 1519, 1424, 1373, 1482, 1508, 1535, 1531, 1527, 1498, 1469, 1510, 1551, 1600, 1488, 1406, 1485, 1555, 1465, 1445, 1425, 1326, 1388, 1531, 1513, 1570, 1627, 1550, 1473, 1355, 1397, 1484, 1570, 1630, 1689, 1709, 1728, 1730, 1731, 1706, 1520, 1347, 1441, 1542, 1375, 1277, 1447, 1620, 1633, 1513, 1393, 1403, 1575, 1661, 1586, 1572, 1557, 1563, 1569, 1615, 1661, 1630, 1599, 1568, 1537, 1580, 1623, 1595, 1567, 1522, 1637, 1672, 1546, 1549, 1551, 1584, 1617, 1594, 1572, 1589, 1607, 1645, 1683, 1640, 1598, 1565, 1532, 1498, 1465, 1492, 1519, 1466, 1412, 1444, 1476, 1337, 1359, 1391, 1422, 1544, 1665, 1713, 1761, 1729, 1696, 1597, 1497, 1478, 1459, 1521, 1583, 1605, 1627, 1653, 1679, 1625, 1571, 1504, 1438, 1451, 1465, 1489, 1512, 1536, 1559, 1504, 1449, 1474, 1499, 1523, 1547, 1544, 1460, 1369, 1411, 1528, 1512, 1507]
4203A507mO7O8J9J9J9J8J0Rj25j25OOOOp2p2P0P0r8L6R4R5nmRp1r8L5rj43k4k4M0M0J55K0
4197A550l8l8P2P2o3o2K5K5K5K4PPPPj1j1r1r1M8M9QRj3j2M5l6r4R4K8n1K4K4O0O0J3J4o7
4191A619o7j4j3K7K7j00j01L4L3K1K1K1K2l1l0l0l0MLQ4Q4m4m4L7L6J6J7o4o4k6k5J08J09
4186A640L8L8M8j12N2N3l8l8NMl5l5j7j6p1RQ7p3K3K2PPM7M8o3o2p3Q8j1j1k7j07k3J38M2
4181A584M2p3p4m9L2J80K0k1N9P1q9j25L6K7K7m9m8J18L7q8P3L8L8l3l3p5p5O0N9M2M2r2r1
4176A570J00J01r2r2P2rk4J36L5j27o7J4oP5ooN1N1l0k9n2n2K8K8j8j7j3j3l4M6R6o5M3J23
4171A817j3j2o6o5J5J5M8M8Q9Q9lkP7P8J00J01J80J81J34J34M8M8O5j5j65l25k73j13K9K8
4166B272ooJ72J71J08n3k03k04m8m7j29j28N1N1k7j09j39K2K27K26K13K93L29J67J0j50k56
$$ y = [1507, 1503, 1570, 1638, 1657, 1676, 1695, 1713, 1723, 1732, 1607, 1482, 1488, 1494, 1500, 1506, 1434, 1362, 1432, 1502, 1404, 1440, 1534, 1629, 1624, 1620, 1629, 1558, 1460, 1495, 1486, 1343, 1319, 1295, 1335, 1375, 1530, 1550, 1512, 1474, 1546, 1618, 1555, 1493, 1518, 1543, 1568, 1592, 1599, 1606, 1613, 1620, 1609, 1598, 1507, 1416, 1464, 1513, 1521, 1530, 1517, 1505, 1550, 1514, 1420, 1514, 1542, 1491, 1515, 1539, 1599, 1659, 1672, 1686, 1619, 1552, 1538, 1525, 1552, 1579, 1479, 1378, 1412, 1445, 1466, 1487, 1508, 1530, 1499, 1469, 1439, 1409, 1413, 1416, 1500, 1584, 1540, 1496, 1533, 1569, 1585, 1602, 1538, 1474, 1448, 1423, 1531, 1640, 1678, 1716, 1764, 1652, 1704, 1757, 1719, 1681, 1686, 1690, 1655, 1620, 1603, 1587, 1516, 1525, 1612, 1539, 1562, 1584, 1591, 1598, 1645, 1693, 1630, 1568, 1495, 1583, 1572, 1561, 1534, 1427, 1404, 1542, 1584, 1626, 1553, 1479, 1430, 1462, 1642, 1662, 1641, 1700, 1771, 1682, 1557, 1593, 1620, 1647, 1598, 1550, 1668, 1705, 1617, 1690, 1728, 1766, 1733, 1700, 1625, 1550, 1610, 1669, 1711, 1753, 1661, 1570, 1670, 1771, 1679, 1587, 1659, 1650, 1626, 1762, 1797, 1670, 1603, 1617, 1611, 1686, 1680, 1674, 1725, 1776, 1746, 1717, 1665, 1613, 1641, 1669, 1651, 1634, 1621, 1608, 1574, 1620, 1716, 1651, 1694, 1817, 1804, 1792, 1726, 1661, 1676, 1691, 1739, 1787, 1876, 1965, 1962, 1960, 2037, 2115, 2215, 2316, 2496, 2677, 2811, 2945, 2993, 3041, 3106, 3091, 2926, 2601, 2328, 2215, 2244, 2272, 2266, 2260, 2432, 2603, 2711, 2658, 2455, 2251, 2203, 2156, 2027, 1899, 1950, 2001, 1974, 1865, 1726, 1748, 1975, 2201, 2414, 2707, 3036, 3203, 3213, 3063, 2807]
4162B807l37q4P7O1J41J58lj57k38k18k19J7J7n7n7K8K8M6J28J68L30L33J72k2k2r9r9j43
4158B756l04j32j33o3o2k4k4k3k4k3k3J13L3j14M8m8m8l0l0N0N0m6m7oop6p6MMjkP9P8L9L8
4153A927m1m2j09j09L2j29p9Q3K2K2RRQ9Q9K1K2o0n9p2p2J53qmlK6K7KKj4j5P0j99m8m7J1
4147A506J2J2J1j2j2K8K9J11J11K1K0Kj60o9o9L5L5L5L5L1L1j03j03J4J4Q4Q5J00o1o1J00
4142A812n9n9j40K2J4J5K5K5M3M2LKN3N3k8k7k9k9J05J05KLl8l8p7p7LMp6p7N8N8P9Q0jjn7
4137A793n8n8n7L5L5nnR5R4r3r4J0J0J0Rk5k6j6j5l8J24J23l7O0O1q4q3OPPPK6K5n4n5JJJ
4131A737%L3L4n8J04L8L8m2m2K2j38m8m8Q4Q5J7J8J5J6o1o2J30l1n8K2P5nO2J42L2m9r9O2
4126B025M0j21j11N0P2P2J5J4M7M7POk0k0q8q7opO1O0J3J3J3J3j2j2j05j06j2j3J30J30m4
$$ y = [2807, 2470, 2386, 2463, 2524, 2665, 2823, 2820, 2663, 2425, 2207, 1988, 2005, 2022, 1965, 1908, 1936, 1964, 2010, 2138, 2306, 2636, 2969, 3141, 3119, 3097, 2998, 2899, 2756, 2452, 2320, 2187, 2124, 2062, 2038, 2014, 1991, 1967, 1944, 1921, 2034, 2067, 1953, 2001, 1953, 1905, 1875, 1845, 1895, 1945, 1899, 1852, 1846, 1840, 1764, 1688, 1692, 1696, 1695, 1693, 1772, 1850, 1889, 1927, 1886, 1844, 1735, 1626, 1658, 1529, 1450, 1533, 1555, 1577, 1586, 1595, 1684, 1773, 1794, 1816, 1756, 1697, 1625, 1553, 1706, 1698, 1694, 1691, 1717, 1744, 1746, 1748, 1734, 1719, 1789, 1590, 1542, 1495, 1506, 1518, 1530, 1541, 1529, 1517, 1545, 1574, 1685, 1796, 1817, 1837, 1839, 1679, 1610, 1541, 1576, 1611, 1646, 1681, 1712, 1743, 1640, 1537, 1551, 1565, 1649, 1734, 1834, 1773, 1712, 1812, 1753, 1694, 1554, 1576, 1590, 1605, 1630, 1655, 1698, 1740, 1743, 1745, 1798, 1851, 1823, 1796, 1767, 1738, 1843, 1948, 1950, 1953, 1915, 1877, 1800, 1723, 1726, 1730, 1654, 1577, 1635, 1693, 1772, 1852, 1851, 1850, 1793, 1735, 1677, 1620, 1655, 1690, 1685, 1680, 1775, 1869, 1776, 1682, 1692, 1702, 1712, 1721, 1696, 1670, 1654, 1639, 1601, 1725, 1848, 1811, 1871, 1932, 1848, 1765, 1771, 1778, 1785, 1792, 1818, 1843, 1789, 1734, 1735, 1736, 1737, 1737, 1770, 1804, 1746, 1850, 1888, 1926, 1884, 1842, 1864, 1726, 1678, 1630, 1714, 1799, 1816, 1834, 1849, 1865, 1804, 1742, 1872, 1841, 1783, 1805, 1880, 1875, 1937, 2079, 2111, 2062, 1963, 2025, 2065, 1944, 1833, 1883, 1955, 2027, 2042, 2056, 2103, 2150, 2157, 2163, 2143, 2123, 2035, 1948, 1942, 1935, 1996, 2056, 2069, 2082, 2095, 2108, 2096, 2084, 1979, 1873, 1861, 1848, 1978, 2108, 2064]
4121B064j24l3J29J42j9l9l8lkO5O5J7J8m9m9q2q2L9L9J4J3J4J4K5K5K5K5JJl9m0K0J9J9K0
4116B214q5q4L1L1Q1%n5J06J16m5k9N0K8K8L3L4J8J8J8J8n8n7N3N3%j61p3Q8J28M8J02J03
4111B752r2r2K9K9JJJ%klm2m3L5L4L5L4R3R2k8k9L8L8P8P8L7L6l1l1K5K4j6j6R2R2R3R2K2
4105C456K2N2N2n5k15J02J03J2J2J2J2P7P8P7P7%jO7O6N0N0m1J21J36J37J00o0k9J32M8M8
4100D698j52J17J13J13J31J30J71J71J36J35J5J6k7k7J47J48R7R6J91J90J47J47K68K67L08
4097G746L07J87J87K05K05K02M70P28P28N81N80N74P35Q69Q68J021J396K144L269M953P473
4093C5428R470Q559L688k264o358p377n983l999k344j004j97L93N41Q08J032J408K044K955
4091C6800L930N484P943J1429J6441K5179L8678N0419L8766Q796m059P147J3628q516l5771
$$ y = [2064, 1940, 1907, 2036, 2178, 2159, 2120, 2082, 2079, 2077, 2142, 2207, 2224, 2242, 2193, 2144, 2062, 1980, 2019, 2058, 2072, 2085, 2099, 2113, 2138, 2163, 2188, 2213, 2214, 2215, 2176, 2136, 2156, 2175, 2194, 2214, 2129, 2045, 2076, 2107, 2188, 2188, 2133, 2239, 2355, 2310, 2281, 2331, 2359, 2387, 2420, 2454, 2472, 2490, 2508, 2526, 2468, 2411, 2464, 2517, 2517, 2356, 2283, 2371, 2499, 2547, 2649, 2752, 2660, 2568, 2597, 2626, 2627, 2628, 2629, 2629, 2627, 2624, 2582, 2539, 2574, 2608, 2643, 2677, 2770, 2862, 2834, 2805, 2843, 2881, 2959, 3037, 3074, 3110, 3079, 3048, 3073, 3097, 3081, 3065, 3157, 3249, 3342, 3434, 3456, 3478, 3530, 3582, 3527, 3312, 3414, 3517, 3529, 3541, 3553, 3565, 3642, 3720, 3797, 3874, 3874, 3873, 3940, 4006, 4056, 4106, 4065, 4186, 4322, 4459, 4559, 4499, 4470, 4602, 4650, 4698, 4546, 4663, 4776, 4889, 5020, 5150, 5321, 5492, 5628, 5763, 5778, 5794, 5767, 5740, 5887, 6035, 6132, 6228, 6419, 6609, 6756, 6903, 7171, 7438, 7746, 8053, 8240, 8427, 8632, 8837, 9039, 9509, 10237, 10965, 11546, 12126, 12700, 13435, 14304, 15172, 16193, 17589, 19733, 23002, 27955, 35428, 44898, 53457, 57145, 54881, 48523, 41146, 35163, 31164, 28820, 27816, 27619, 28012, 28553, 29361, 30393, 31801, 33845, 36800, 40730, 46214, 54157, 65586, 82027, 107206, 145884, 196303, 235069, 243865, 239806, 246953, 260581, 252065, 216294]
4088B16294m3760l6656k7274j8641j1725o883l612j508N83K958O337J1577J9780L2387M9811
4086A89668O3248N3973J1232l3323n2530n0546l8681k6296j5405p524j229M722J2134K1839
4084A31282L1456K7005L972j8708k2875j4351p12J5961K9939K1949r522l1450l3431k6407
4082A04108j8278j0933n132m68L573P702J3492K2552L6339M9152M1395J1638p883K035J1442
4079B60734o303l7850m8947m1381l1999k2877j5961j1043p986n721m166k766j854j030l33
4077B0517J52R57K424M300N906M351l74m073m265k495j16J975K364m78l957n296m883l757
4074A3252k845j934j344r69n97m36k96k95k96j35j34j33j64j65k63k64j23L8J8j43q3q3K0
4071B626J9o1o0k0k0j00j00QQQQL3L3m8m7p6p6MNK9K9j2j1K8K8j06j06rqqqK2K2j12j12k7
$$ y = [216294, 172534, 135878, 108604, 89963, 78238, 71355, 67743, 66235, 66818, 69776, 76113, 87690, 107470, 139857, 189668, 252916, 306889, 318121, 284798, 232268, 181722, 143041, 116745, 101340, 93816, 92587, 97309, 109443, 131282, 162738, 189743, 193715, 175007, 152132, 137781, 137069, 153030, 182969, 204918, 195396, 163946, 130515, 104108, 85830, 74897, 69765, 69297, 72870, 80572, 94064, 116616, 152955, 202107, 243502, 255140, 247257, 249292, 260734, 254431, 216581, 167634, 126253, 94254, 71377, 55416, 44373, 36387, 30666, 26500, 23734, 21880, 20850, 20517, 20669, 21626, 24050, 28350, 34256, 38607, 38233, 34160, 29895, 27400, 27284, 29259, 31623, 31145, 27188, 21892, 17009, 13252, 10407, 8473, 7129, 6160, 5563, 5127, 4831, 4536, 4240, 4105, 3971, 3838, 3674, 3509, 3246, 2982, 2859, 2897, 2915, 2772, 2689, 2606, 2626, 2645, 2584, 2524, 2504, 2484, 2384, 2284, 2292, 2300, 2308, 2316, 2349, 2382, 2334, 2287, 2211, 2135, 2139, 2144, 2173, 2202, 2190, 2179, 2207, 2235, 2129, 2023, 2014, 2006, 1998, 1990, 2012, 2034, 1922, 1810, 1783]
4065A783k7J06J07J1J1k9k9M9M9q5q6o1o2J8J9m2m2R2R3%%q0q1R6R5l8l8l5l4l4l5N8N8k2
4060A785k3j06j07K8K8K6K6n5n4j0j1j0j0P8P9n6n5J55J56q6q6P0P0o3o4QQRQK0K0o0o1J8
4055A675J8o3o3J8J8o3o2L3L4PJ68J58j10j84k3R8o3j33K8M6M6M6M6j2j73N1N1ppL3L2j5j6
4050A612K5K4RJ0l1l1k2k1J09n2l5l4nmN0M9O9r1j74j4J64Mk4k4L6L7L6j26j15j15M0M0%%
4045A396O1O0k0k0k2k1o2o1N9N9k1k2K6K7j4j4M3M4k6k7p6Q5P5P4rj0%%o3R7L6L7P8q3o3o3
4039A560j07N4J35k7J4J4MMrrj9j9pj67N7N7K4K3j6j7L9M0m1m1J1J0J1J1J19J20M6k22j61
4034A491J08K1K0j2j2K8K8kkklm6m7m7m6K6K6K6K6k8k8N3N3q2q2J05J06K0K0j14j14J6J5J6
4029A537J5M1M0r3r3j9j9O1O2J01J01q7q6M5M6NOm4m4L7L6L4L4l7l7j17M3Q8p3j15l4R8R8
$$ y = [1783, 1756, 1862, 1969, 1980, 1991, 1962, 1933, 1982, 2031, 1946, 1860, 1799, 1737, 1755, 1774, 1732, 1690, 1782, 1875, 1875, 1875, 1795, 1714, 1810, 1905, 1867, 1829, 1794, 1760, 1726, 1691, 1749, 1807, 1785, 1762, 1656, 1549, 1577, 1605, 1631, 1657, 1602, 1548, 1538, 1527, 1517, 1507, 1585, 1664, 1608, 1553, 1708, 1864, 1778, 1692, 1762, 1832, 1769, 1705, 1713, 1721, 1730, 1738, 1758, 1778, 1718, 1657, 1675, 1693, 1630, 1567, 1585, 1603, 1540, 1478, 1511, 1545, 1552, 1720, 1878, 1768, 1584, 1561, 1659, 1596, 1463, 1491, 1537, 1583, 1629, 1675, 1663, 1490, 1541, 1592, 1585, 1578, 1611, 1643, 1628, 1612, 1637, 1661, 1670, 1680, 1649, 1618, 1596, 1575, 1684, 1632, 1597, 1563, 1558, 1554, 1604, 1653, 1722, 1631, 1457, 1443, 1607, 1611, 1587, 1563, 1599, 1636, 1672, 1546, 1431, 1316, 1356, 1396, 1396, 1396, 1457, 1517, 1497, 1477, 1455, 1434, 1372, 1311, 1370, 1429, 1408, 1386, 1412, 1439, 1425, 1411, 1454, 1498, 1472, 1445, 1369, 1454, 1529, 1603, 1594, 1584, 1584, 1584, 1521, 1618, 1654, 1691, 1769, 1686, 1623, 1560, 1453, 1507, 1642, 1615, 1629, 1643, 1647, 1651, 1642, 1633, 1614, 1595, 1588, 1421, 1478, 1535, 1559, 1582, 1566, 1549, 1588, 1628, 1587, 1546, 1557, 1567, 1578, 1589, 1708, 1828, 1874, 1652, 1491, 1599, 1620, 1640, 1628, 1616, 1644, 1672, 1670, 1668, 1666, 1663, 1617, 1570, 1523, 1477, 1503, 1529, 1555, 1581, 1553, 1525, 1578, 1631, 1549, 1467, 1572, 1678, 1698, 1718, 1604, 1490, 1506, 1521, 1537, 1552, 1593, 1633, 1540, 1447, 1428, 1409, 1470, 1532, 1633, 1734, 1647, 1561, 1606, 1652, 1657, 1663, 1619, 1575, 1612, 1648, 1682, 1716, 1679, 1642, 1525, 1568, 1656, 1583, 1468, 1434, 1532, 1630]
4024A630nnNNq1Q0P0P0j9j9K1K1ooL4L4p8p9KLK5K6K5K6j1j2ooN7J37M8j12j06j05K5J85J28
4018B001l2j3j3j4j5j4j4J11J11J83K63L11M2r0P1J71J0k92k92j24j25p5Q5J56K37K67kj79
4014B725k60k42q1l3l3p3p3Q7p3n3K15K06K06K72J12j4j5j48j49L4J94K3K3j01j01L4L3Q0
4010B795Q1J51J50P7q5j22J47K40k8NOJ60J61l8l7J22m0j53j53J78q9l31l31j60%R8R8m7m6
4005B809k18n6o2o1R3R3J93L54K81J2j58j59l09l09j13j12j93j93Q3Q3L2L3J23l7j07N3J63
4001B318L23J45j5j44j45j44j44n2J08J96J96K31P0K7K6l8l9k70k70k00l8m9m9r3r3k3k3J01
3997A912n9L1L0JJJ01o0j78j8l8l8K5K5K5K5l1l1RRp2p2N3N2J43j9o1o2MNl6l6l7l7R8R7l4
3992A727l3l4l4k1k1N9N9l5l6NNR6R6r5j5P8j11q0q0PQQQk0j9K1K1O6O5n7n7L6K23R4r4m2
$$ y = [1630, 1625, 1620, 1625, 1630, 1549, 1629, 1699, 1769, 1750, 1731, 1752, 1773, 1767, 1761, 1795, 1829, 1751, 1672, 1674, 1677, 1702, 1728, 1753, 1779, 1768, 1756, 1750, 1744, 1801, 1938, 1986, 1874, 1768, 1663, 1688, 1873, 2001, 1969, 1956, 1943, 1929, 1914, 1900, 1886, 1997, 2108, 2291, 2554, 2865, 2907, 2817, 2888, 3059, 3069, 2777, 2485, 2361, 2236, 2161, 2246, 2402, 2639, 2906, 2904, 2725, 2465, 2223, 2142, 2109, 2076, 2003, 1930, 2017, 1944, 1891, 2106, 2312, 2518, 2790, 2902, 2888, 2873, 2725, 2576, 2610, 2804, 2827, 2850, 2749, 2648, 2682, 2715, 2795, 2876, 3027, 3177, 3254, 3169, 3047, 3194, 3434, 3406, 3411, 3417, 3577, 3738, 3700, 3663, 3785, 3745, 3592, 3439, 3617, 3528, 3197, 2866, 2706, 2706, 2804, 2902, 2855, 2809, 2591, 2535, 2473, 2412, 2505, 2598, 2791, 3145, 3426, 3438, 3280, 3121, 2812, 2503, 2390, 2278, 2085, 1892, 1975, 2058, 2090, 2123, 2246, 2209, 2102, 2155, 2318, 2641, 2786, 2771, 2627, 2482, 2338, 2194, 2142, 2250, 2446, 2642, 2873, 2943, 2970, 2996, 2958, 2919, 2649, 2379, 2179, 2141, 2092, 2043, 1950, 1857, 1834, 1811, 1912, 1853, 1884, 1914, 1915, 1916, 2017, 1957, 1779, 1761, 1723, 1685, 1710, 1735, 1760, 1785, 1754, 1723, 1732, 1741, 1669, 1597, 1650, 1702, 1845, 1826, 1765, 1703, 1707, 1712, 1676, 1640, 1603, 1566, 1664, 1761, 1727, 1694, 1660, 1626, 1605, 1584, 1643, 1702, 1667, 1631, 1636, 1641, 1737, 1833, 1738, 1723, 1801, 1690, 1610, 1530, 1537, 1545, 1553, 1561, 1541, 1522, 1543, 1564, 1630, 1695, 1638, 1581, 1617, 1840, 1934, 1840, 1798]
3986A798L9r1r0j10K4Q3Q2l7l7M3M3pqOp4r7L7L7L7m4m4L7L7n8n8j8j8J34J33n4n4L6L6P7
3981A820P6o3o4J7J7M8M9RQl2l2l3J02K1o0n7K4R2J1p3p3m5m6L6L5ooL4L5m0l9JJM7M8M8M8
3975A958k6k6k6k6K0K0r6L9J00R9k6k6ooP5P4J4J4j20j20MMQ4Q5l1l0J5J5KQ3N7j03j17M4
3970B021P4q6J7J7PQn3n3k8N2J56nJQ1J15L4NMq9q9rro1o1P3P4K4K4K4K4n5n4o5o5J00o0k5
3964B068N5Q4p6k7k6Q6Oj73j3Q2Q2m2m2j%J34J34k9k8N2N1k2k2k3k2l8l7M3M3j04j05k4k4
3959B042J28J29n4n5L8J17J63Ln5n5O9O9l4l4J00J00j5j5O5O6kjm2m2k9k9J1J1K6K6j4j4K3
3954B696K3K3K3J35J35rj0J02o0L1L1J5J5R6R6l5l5R9R9RJ0J00o0p5p5J2J73J3J3N4N3K11
3949C908N0J7J7m5J16O6O6P1P0O0O0P7q3Q7Q8J23J24Q3Q3J24J24M3M4J11J12K35K35J15m6
$$ y = [1798, 1837, 1746, 1656, 1546, 1570, 1653, 1735, 1698, 1661, 1704, 1747, 1740, 1732, 1738, 1664, 1567, 1604, 1641, 1678, 1634, 1590, 1627, 1664, 1606, 1548, 1530, 1512, 1646, 1779, 1725, 1671, 1707, 1743, 1820, 1896, 1833, 1769, 1786, 1803, 1851, 1900, 1909, 1917, 1885, 1853, 1820, 1922, 1943, 1883, 1826, 1850, 1942, 1953, 1880, 1807, 1762, 1716, 1752, 1787, 1781, 1775, 1809, 1844, 1804, 1765, 1766, 1767, 1814, 1862, 1910, 1958, 1932, 1906, 1880, 1854, 1874, 1894, 1798, 1837, 1937, 2036, 2010, 1984, 1978, 1972, 2047, 2121, 2135, 2149, 2029, 1909, 1913, 1917, 2001, 2086, 2055, 2025, 2040, 2055, 2057, 2140, 2197, 2094, 1977, 2021, 2095, 2009, 2026, 2043, 2050, 2058, 2005, 1952, 1924, 1976, 2132, 2127, 2128, 2209, 2324, 2358, 2363, 2367, 2278, 2189, 2180, 2171, 2110, 2049, 2122, 2196, 2220, 2244, 2268, 2292, 2237, 2183, 2118, 2053, 2153, 2093, 2068, 2123, 2207, 2131, 2104, 2078, 2164, 2170, 1997, 1984, 2066, 2148, 2106, 2064, 2063, 2063, 2197, 2331, 2302, 2274, 2326, 2377, 2355, 2333, 2310, 2288, 2250, 2213, 2256, 2299, 2195, 2090, 2066, 2042, 2170, 2299, 2245, 2190, 2228, 2345, 2508, 2511, 2456, 2401, 2470, 2539, 2505, 2471, 2571, 2671, 2656, 2641, 2706, 2772, 2770, 2769, 2727, 2685, 2656, 2627, 2638, 2649, 2675, 2701, 2687, 2673, 2696, 2719, 2742, 2765, 2900, 3035, 3026, 3016, 3118, 3058, 3089, 3120, 3135, 3150, 3246, 3342, 3307, 3272, 3371, 3470, 3479, 3489, 3589, 3529, 3454, 3379, 3391, 3564, 3577, 3590, 3644, 3697, 3908, 3958, 3975, 3992, 3947, 4063, 4129, 4195, 4266, 4336, 4396, 4456, 4533, 4450, 4537, 4625, 4748, 4872, 4955, 5038, 5162, 5286, 5329, 5373, 5484, 5596, 5831, 6066, 6181, 6135]
3945F135M5M4J81J82J81J81J92J92K42Q1J44J45K68K68L54L55M34P03O02M42O29O29J211J212
3941A5052J647K344L969N632N631J074k438k170q77R99L631O578N862j054n169m900l976k420
3939B9415r80j76O35P97J257K062L228M354O023Q007J1712J7342K7850M3451N5897L0644p757
3936B33761m487J3823J5914k3252m7540m0020l1066k1703j4465q654m634o29L284Q666J6011
3934I5009K8115M2752L6921n702k8059k2216j1452L828J9961K8807P448k4130k9700k4927
3932A16655j7583j0345l708J493P752J5204K7236M3803O0892N1939J8837k6039n8596n4361
3929A73179m1930k9438j9373j2456p407l816j027J599M751Q129J2994K0876L4881N3807N5308
3927B50077J0325j5644m72J7979K163m3796n2320m2515l2382k3243j6006j1287p802n867m205
$$ y = [6135, 6180, 6224, 6405, 6587, 6768, 6949, 7141, 7333, 7575, 7656, 7800, 7945, 8213, 8481, 8835, 9190, 9624, 10327, 10929, 11371, 12000, 12629, 13840, 15052, 16699, 19043, 23012, 28644, 34275, 35349, 32911, 30741, 29864, 30863, 34494, 41072, 46934, 45880, 40711, 35811, 31835, 29415, 28435, 28259, 28894, 29691, 30948, 33010, 36238, 40592, 46615, 54622, 66334, 83676, 111526, 154977, 210874, 241518, 233761, 229274, 243097, 259011, 235759, 188219, 148199, 117133, 95430, 80965, 72311, 67677, 67048, 70332, 78998, 95009, 123124, 165876, 202797, 197095, 169036, 146820, 135368, 139196, 159157, 187964, 195412, 171282, 141582, 116655, 99072, 88727, 85019, 86512, 94264, 109468, 136704, 180507, 241399, 293338, 312175, 286136, 227540, 173179, 131249, 101811, 82438, 69982, 62575, 58759, 57732, 59331, 64082, 72211, 85205, 106081, 140962, 194769, 250077, 260402, 244758, 244286, 262265, 264428, 220632, 168312, 125797, 93415, 70172, 54166, 42879, 35077, 29210, 25005]
3925B5005l006j987j401q11m30N3M33J238K069L301N118Q603J2081R883J29r576j2049r743
3922B8910p357n160l631k398j656j174j107o25m21k60l20l20k78k78k27M1j51j51k01k01q9
3919B946q9j82Q5O6r4n5n4k0j9j13j13n7n8q1q1OK75O6r4q2q2K9K9o6o6o6o6L3L3J64Kp9p9
3914B038n0m9l1l0l1l1Q6Q5O6r5k20n8j2j2J0Rj01j01j1J50N9O0J1J1J1J1J2J2m5m6p7Q3q
3909A706pnonnK7K7o6o7RRq2P9ONk5k5k6k7k7k7O8O9KJL0K9J20m1j39j39P9P8j4j4O3O3j08
3903A615N3Q3p8l8j99j22J46M3M2N6j05m3m2O8O9N5N5j3j2j4j4K6K6n8n9n8n9K0J9O0N9j3
3898A568j3K7K7J4J4j07j07lkL7L7N5N5Q9p2j16M5K8K8K9j31jjkjkkO5O5n6n6POJ01n9j09
3893A457k9j8j7l7l7Q4Q4J6J6p9p8K4K4J18J18p7p7M4M3J29J30m6m5p5p5l5l5J5J5o9o8n1
$$ y = [25005, 21999, 20012, 18611, 17800, 17370, 17423, 17856, 19094, 21163, 24464, 29582, 38185, 50266, 60149, 60278, 50702, 38653, 28910, 21553, 16393, 12762, 10364, 8708, 7534, 6427, 5802, 5381, 5121, 4801, 4481, 4203, 3925, 3698, 3739, 3588, 3437, 3236, 3035, 2946, 2857, 2675, 2760, 2826, 2732, 2677, 2623, 2603, 2584, 2471, 2358, 2301, 2243, 2162, 2081, 2087, 2362, 2428, 2334, 2252, 2170, 2199, 2228, 2162, 2096, 2030, 1964, 1997, 2030, 2194, 2196, 2117, 2038, 1988, 1939, 1908, 1878, 1847, 1816, 1902, 1987, 2053, 1958, 1738, 1680, 1668, 1656, 1666, 1675, 1574, 1473, 1462, 1612, 1671, 1731, 1742, 1753, 1764, 1775, 1787, 1799, 1754, 1708, 1631, 1714, 1706, 1699, 1694, 1688, 1683, 1678, 1705, 1732, 1666, 1599, 1608, 1617, 1535, 1614, 1620, 1625, 1600, 1575, 1549, 1522, 1495, 1468, 1536, 1605, 1607, 1608, 1638, 1667, 1787, 1746, 1607, 1468, 1547, 1625, 1611, 1597, 1660, 1723, 1615, 1668, 1751, 1673, 1635, 1436, 1314, 1460, 1503, 1545, 1601, 1496, 1453, 1411, 1479, 1548, 1603, 1658, 1645, 1633, 1619, 1605, 1631, 1657, 1599, 1540, 1482, 1423, 1443, 1462, 1522, 1581, 1568, 1555, 1582, 1609, 1623, 1637, 1530, 1423, 1420, 1418, 1455, 1492, 1547, 1602, 1691, 1619, 1503, 1548, 1576, 1604, 1633, 1502, 1501, 1500, 1498, 1497, 1495, 1493, 1558, 1623, 1567, 1511, 1518, 1524, 1625, 1566, 1457, 1428, 1410, 1393, 1356, 1319, 1403, 1487, 1503, 1519, 1440, 1362, 1386, 1410, 1528, 1646, 1569, 1492, 1536, 1579, 1708, 1838, 1792, 1747, 1672, 1597, 1562, 1527, 1542, 1557, 1488, 1420, 1369]
3888A369J10L0n1lP7P3qp5p4J5J4O1O0K1K0o4o4k4k3J3J4J4J4k4k4J7J6N4N4j15j15M0J19
3883A541J08n2q6P4J27l5j5r6j11N0J9J9j19j18L9L9J35k7n3K8J7o3j7j6J8J9N9N9N8N9j5
3878A645j5K6K5l9l9r5j4Q6p5K1K0j6j6J4J4J52rq6P4Q3p8j71j1J3j48r7O3J00J01j1j0oo
3873A495n6n6J26l6M6M5Q9p2N8N9KJl8l9n7n8n7n7L7L7P8P7L1L0r0r0K3K3j7j7O0N9N0N0R6
3868A832o5j5j5J4J3n3n3r9r8l2l1J40J40Q3p8m2m2j3j2o8o7N3N3K4K3K4K4j2j1K8K9L4L5
3863A743n9o0L6L6l1l1J9J9k1k1R4R4j35j34L3L2L3L2p5p4M6M5l4l5OON4N5N4N5M7M7m7m7
3857A782K5K4j6j6m7m7P3P4j3j3j3j3N2N1k8k9J8J8K06K05K14K15J23j44K3K3R7o4j66j67
3853B447j77j77o1o1k1k0RJ0R0Q9J23J23J72J2k7k8%K67k2k3j39j40m7m6poj99j98o4o5j1
$$ y = [1369, 1479, 1509, 1458, 1455, 1532, 1605, 1597, 1522, 1448, 1463, 1477, 1538, 1598, 1619, 1639, 1575, 1511, 1487, 1464, 1477, 1491, 1505, 1519, 1495, 1471, 1488, 1504, 1558, 1612, 1497, 1382, 1422, 1541, 1649, 1597, 1511, 1585, 1712, 1677, 1662, 1566, 1455, 1505, 1524, 1543, 1424, 1306, 1345, 1384, 1519, 1492, 1439, 1467, 1484, 1421, 1404, 1388, 1406, 1425, 1484, 1543, 1601, 1660, 1645, 1630, 1656, 1681, 1642, 1603, 1508, 1494, 1580, 1505, 1526, 1546, 1530, 1514, 1528, 1542, 1694, 1685, 1599, 1673, 1756, 1678, 1507, 1496, 1509, 1361, 1264, 1327, 1427, 1528, 1517, 1507, 1501, 1495, 1439, 1383, 1509, 1473, 1519, 1564, 1653, 1581, 1639, 1698, 1700, 1701, 1663, 1624, 1567, 1509, 1452, 1395, 1432, 1469, 1547, 1624, 1655, 1685, 1595, 1505, 1528, 1551, 1534, 1517, 1577, 1636, 1686, 1736, 1832, 1767, 1752, 1737, 1751, 1764, 1711, 1658, 1559, 1461, 1429, 1398, 1538, 1678, 1761, 1683, 1641, 1599, 1586, 1574, 1506, 1439, 1492, 1545, 1569, 1592, 1616, 1640, 1628, 1617, 1645, 1674, 1708, 1743, 1684, 1624, 1660, 1696, 1665, 1634, 1653, 1672, 1651, 1630, 1724, 1818, 1683, 1549, 1582, 1614, 1647, 1679, 1604, 1530, 1576, 1621, 1587, 1552, 1558, 1564, 1618, 1673, 1727, 1782, 1829, 1876, 1829, 1782, 1807, 1831, 1815, 1799, 1752, 1705, 1778, 1852, 1839, 1826, 1813, 1800, 1852, 1903, 1875, 1846, 1864, 1882, 2088, 2293, 2507, 2722, 2845, 2701, 2724, 2747, 2844, 2780, 2614, 2447, 2270, 2093, 2032, 1971, 1950, 1930, 1939, 1949, 2039, 2128, 2251, 2374, 2546, 2558, 2531, 2503, 2503, 2770, 2748, 2725, 2586, 2446, 2399, 2353, 2346, 2340, 2141, 1943, 1879, 1814, 1803]
3848A803j2R6o5q8J80J54J53K56K56j46j47j67j68l3l3n4n3J51L12K91K91jj61kJ60k37k36
3844B500j62j63k03k03r0r0rrj5j4j05N6N7N7R8R7O0j01r1r1l8l8l8l9J3J3pJ53J39k3rj70
3839A535j46J5M8M8ppr8O4P7P8m6m7J1J1J0J1N7N6J3j48L7L8r6r6m3J18J09J08N7N8p6p6q2
3834A591q2RQp8Q4P3P3l4l3PPN6N7p8p8o0o1J17J17R2p0m8m9j00O0k9l0J76J77j2j1j24j25
3829A602J0Rk8k8k9k8qqL2L2m6m6m5J15rJ52P2P2j3j4j3j4k1k1k1k1k1k2M9M8P4q7l7l7L5
3824A685L6m4m5P3P2P3P2llQj54MLJ28J27qqqrO6O6J47J46L63L62O8K28J82q6o0n9k1k1j21
3819C259L9J04n6k41k41k77j16j66j66j8j8q8q8j06N5MMK4K4L5L4j30L1m2m3n4K13K3K3J5
3814B037J6J05J06O6K26L24M84M64J97J69L30M62J94N9O0m5m4p8Q3M0l36m90l30k82j21j82
$$ y = [1803, 1791, 1887, 1822, 1734, 1914, 2068, 2221, 2477, 2733, 2587, 2440, 2273, 2105, 2072, 2039, 1985, 1932, 2083, 2395, 2686, 2977, 2976, 2815, 2813, 2973, 2736, 2500, 2338, 2175, 1972, 1769, 1679, 1589, 1580, 1571, 1556, 1542, 1437, 1493, 1550, 1607, 1705, 1802, 1862, 1761, 1670, 1579, 1541, 1503, 1465, 1426, 1439, 1452, 1445, 1598, 1737, 1714, 1705, 1535, 1389, 1404, 1452, 1500, 1493, 1486, 1388, 1452, 1529, 1607, 1561, 1514, 1525, 1536, 1546, 1557, 1614, 1670, 1683, 1535, 1572, 1610, 1514, 1418, 1375, 1493, 1602, 1710, 1767, 1825, 1749, 1673, 1591, 1509, 1518, 1526, 1448, 1532, 1605, 1678, 1644, 1611, 1618, 1625, 1681, 1738, 1660, 1582, 1522, 1461, 1578, 1695, 1787, 1717, 1669, 1620, 1520, 1580, 1551, 1521, 1697, 1874, 1862, 1851, 1727, 1602, 1612, 1621, 1593, 1565, 1536, 1508, 1500, 1492, 1524, 1556, 1510, 1464, 1419, 1534, 1525, 1677, 1749, 1821, 1808, 1794, 1781, 1767, 1746, 1725, 1704, 1683, 1662, 1640, 1689, 1737, 1811, 1724, 1687, 1650, 1685, 1721, 1677, 1632, 1705, 1777, 1850, 1922, 1919, 1916, 1924, 1770, 1774, 1777, 1905, 2032, 2024, 2016, 2008, 1999, 2065, 2131, 2278, 2424, 2787, 3149, 3217, 3445, 3627, 3541, 3481, 3422, 3401, 3380, 3259, 3298, 3402, 3346, 3105, 2864, 2587, 2471, 2305, 2139, 2121, 2103, 2015, 1927, 1821, 1876, 1880, 1884, 1908, 1932, 1967, 2001, 1871, 1902, 1860, 1817, 1763, 1976, 1999, 2022, 2037, 2053, 2158, 2264, 2330, 2556, 2880, 3364, 3828, 4025, 4194, 4524, 4986, 5180, 5239, 5299, 5254, 5210, 5132, 5215, 5255, 4919, 4429, 4099, 3817, 3696, 3514]
3810C514l43l88k28j40j41q1q2q2q2l8l8M2M2K3K3j01j02mJ56K6K6j5j5n4n5P1P1P1P1J82
3805B329J82K16L77M02K42J02J01M6M6M6M6j61j61j71j0j12j11k79k79k46q5j36j35p3p2p3
3801B031p2k7k6j7j7q2P9k1k2L9j22j01J66r3r3q7P5J28J28MMJ8J9o2o2L0K9P0P1o2o1j8J43
3796A989M2M2k8k8m2m2L8L9K8K8j2j2j03j02o3o2J06J06j8j8m6J15j7j6N6N6k5k5m7m8m7m7
3792A797q6q6M8M8lmQ7p5l0l1m0m1R7R6J7J6R6R6l8l8j51j50R1R1M9M9L9L9P2q9l9l9o1o0
3786A767K0J9ONmJ56N3N3k8k8Q8p3J8J7l7l7j17j18R1R0m4m3rrrrjjK8K9K2j40L1L2J02J03
3781B023K2K2L4L4j00j00j6j6L4L4p3Q8J28l3l6l5J42J42l1l1J0RR5R4m0m0J3J4J4J3o0o0
3776B294o0o0L2L2m9m9PPQ7Q7k4k5j05j04N9N9O0N9L4L4L4L3p7p8q7P3L2L2KKQ0Q0n5n4l4
$$ y = [3514, 3171, 2783, 2555, 2415, 2274, 2193, 2111, 2029, 1947, 1909, 1871, 1913, 1955, 1978, 2001, 1900, 1798, 1794, 1950, 1976, 2002, 1987, 1972, 1918, 1863, 1934, 2005, 2076, 2147, 2329, 2511, 2727, 3104, 3506, 3748, 3850, 3951, 3997, 4043, 4089, 4135, 3974, 3813, 3642, 3632, 3520, 3409, 3130, 2851, 2605, 2520, 2384, 2249, 2176, 2104, 2031, 1959, 1932, 1906, 1889, 1872, 1790, 1869, 1848, 1826, 1865, 1743, 1642, 1808, 1715, 1622, 1535, 1610, 1738, 1866, 1870, 1874, 1892, 1911, 1849, 1787, 1817, 1846, 1916, 1987, 1925, 1864, 1846, 1989, 2031, 2073, 2045, 2017, 1975, 1933, 1971, 2010, 2038, 2066, 2054, 2042, 1939, 1837, 1774, 1712, 1818, 1924, 1906, 1888, 1842, 1957, 1940, 1924, 1980, 2036, 2011, 1986, 1939, 1891, 1844, 1797, 1711, 1625, 1673, 1721, 1718, 1714, 1801, 1726, 1696, 1665, 1625, 1584, 1681, 1777, 1794, 1810, 1906, 2002, 1964, 1926, 1775, 1625, 1716, 1807, 1856, 1905, 1944, 1983, 2055, 1966, 1927, 1888, 1827, 1767, 1787, 1806, 1812, 1817, 1813, 1969, 2022, 2075, 2047, 2019, 2107, 2034, 2052, 2069, 2032, 1995, 1878, 1760, 1851, 1941, 1897, 1854, 1845, 1836, 1827, 1818, 1817, 1816, 1844, 1873, 1895, 1755, 1786, 1818, 1920, 2023, 2045, 2067, 2101, 2135, 2035, 1935, 1919, 1903, 1937, 1971, 1898, 1986, 2114, 2081, 2045, 2010, 2152, 2294, 2263, 2232, 2242, 2251, 2346, 2440, 2400, 2360, 2373, 2387, 2401, 2414, 2354, 2294, 2234, 2174, 2206, 2238, 2189, 2140, 2147, 2154, 2241, 2328, 2304, 2279, 2174, 2070, 2129, 2188, 2248, 2307, 2341, 2375, 2409, 2442, 2365, 2287, 2200, 2273, 2305, 2337, 2339, 2341, 2421, 2501, 2446, 2392, 2358]
3771B358l4J00J00j25j25O2O3N6N7J6J6l3l3J44J45J26l6j22j22o8R3M3M2m7m7n7n6J09n1
3766B574M0L9L1L1L1L1l9m0O1r9l9J22J13m9k6k6MMm2m3L7L7K6K6j5j4J36J36L8j22K6K6Q7
3761C102Q6J14m7M3M3J8J9J8J8m3m2M8j13O7O7k3k3M7M8PPN9N8M9K09M7M8l3l3K08M8MMk8
3756D101k7N2N3k1k1O0N9KLQ2Q3N0N1N1N0L1L1J65J64P0O9P9q1J8J9Q9Q9J5J5R6K56L71J03
3751F227J13m8J4J4MMN9O0K84J23P8P8K29O8J98L8J98J98J21J20K02K01J84J85L08L08M62
3747A0030L02L38J78J15m5J69J70K28K28M69M69O59O58P39N78M19K59M92L32J83q5J02M78
3743A7465R67J235J805K288K118Q86P79J046J969K665M307O183R725J4710K0950J6821K276
3741A08195K91J632r038j4584j1528p480l888j740p22j15j14N09J635L327M668O108P771J0518
$$ y = [2358, 2324, 2424, 2524, 2399, 2274, 2336, 2399, 2455, 2512, 2528, 2544, 2511, 2478, 2622, 2767, 2893, 2857, 2735, 2613, 2545, 2638, 2681, 2723, 2676, 2629, 2572, 2516, 2625, 2574, 2614, 2653, 2684, 2715, 2746, 2777, 2738, 2698, 2759, 2660, 2621, 2743, 2856, 2807, 2781, 2755, 2759, 2763, 2721, 2678, 2715, 2752, 2778, 2804, 2789, 2775, 2911, 3047, 3085, 2963, 2989, 3015, 3102, 3188, 3302, 3255, 3298, 3341, 3359, 3378, 3396, 3414, 3371, 3329, 3377, 3264, 3331, 3398, 3375, 3352, 3399, 3447, 3454, 3461, 3520, 3578, 3627, 3836, 3883, 3931, 3898, 3865, 4073, 4121, 4125, 4129, 4101, 4074, 4126, 4179, 4158, 4137, 4197, 4256, 4258, 4261, 4343, 4426, 4476, 4527, 4578, 4628, 4659, 4690, 4855, 5019, 5089, 5158, 5237, 5156, 5174, 5193, 5282, 5371, 5386, 5401, 5497, 5753, 6124, 6227, 6340, 6292, 6306, 6320, 6324, 6328, 6387, 6447, 6731, 6854, 6932, 7010, 7239, 7307, 7505, 7543, 7741, 7939, 8060, 8180, 8382, 8583, 8767, 8952, 9260, 9568, 10030, 10332, 10670, 10848, 10963, 10918, 11087, 11257, 11485, 11713, 12182, 12651, 13310, 13968, 14707, 15285, 15704, 15963, 16455, 16787, 16970, 16885, 16987, 17465, 18432, 19667, 21472, 23760, 25878, 26764, 27543, 28589, 30558, 33223, 37530, 43713, 53438, 68148, 89098, 105919, 108195, 108486, 110118, 101080, 86496, 74968, 67488, 63600, 61860, 61138, 61023, 60909, 61418, 63053, 66380, 71048, 77156, 84927, 95445]
3738I5445J3574J9124K6576L8947N8946R6717J54782K06735J13606r1251j62184j41776j10948
3736C18293p6363m9823l1796k0054j1776n396L01N824J1673J9341K9615M6075P1589J01452
3734D08955Q6568K3141J4992J2901n5243r7223q5102o6175m5233k8558j5942o881J563R123
3732A56886J9196L2010N4260Q5410J10521P0150J4350N612m9308r7186q7703p0278n1378l5027
3730A57515k1951j3855p064l150J394N522J2228K0108L4237N4985R2940J48325J95479Q3585
3727G60298j16980j56495j30666j00588o8898m6005l0759k1054j5431j1303q489o397m673
3725D2560l011k462j657j031j2R66K092L762O604J1027J5262J0461L544L463p527j7232j5356
3723E1453j2159q781o295m526l561k649j950j361j152q85k18N0llj40j40l82l81n65n66k71
$$ y = [95445, 109019, 128143, 154719, 193666, 252612, 349329, 504111, 710846, 824452, 733201, 571017, 429241, 318293, 241930, 192107, 160311, 140257, 128481, 123085, 123386, 129210, 140883, 160224, 189839, 235914, 307503, 408955, 495523, 518664, 533656, 546557, 491314, 394091, 308989, 242814, 197581, 169023, 153081, 146200, 147763, 156886, 176082, 208092, 262352, 347762, 458283, 528433, 542783, 548395, 499087, 401901, 314198, 243920, 192542, 157515, 135564, 121709, 114645, 111495, 112889, 118411, 130639, 150747, 184984, 239969, 332909, 481234, 676713, 760298, 643318, 486823, 356157, 255569, 186671, 140666, 109907, 88853, 73422, 62119, 53630, 47233, 42560, 39549, 37087, 35430, 34399, 34387, 35353, 37445, 41207, 47811, 58838, 74100, 84561, 88105, 91568, 84041, 66809, 51453, 39294, 30513, 24218, 19692, 16131, 13482, 11532, 10171, 9019, 8134, 7916, 7966, 7963, 7960, 7820, 7680, 7298, 6917, 6352, 5786, 5515]
3720E515k70r5r5j76j75r2r1q2k43j90j91k9j91L1L0n9o0o0o0n0k10j00j01K4K4P9P8kkj16
3715C041j16j26j26O5r6noj9j9O2O2j28j27PPj29j28NNM0L9L0K9Q2q0noN6k13j52RM7M8k3
3710B130k3k8k7k8k8O3O3O3r8P1r0j9k0J02o0n0m9llj3j4L8j24M7M7OPOOj07j08k7k7N9N9
3705A821J39k1J02n8k2j82l7l6m6m7L2L3K2K2R5o6K5K4K3K3J13m7j48j49k4k4n9n8J19J19
3700A688J56nO5r5p2Q9P9q2l0l1q1q1M6M5k1k2p4p4K0J9K6K5o8o8M8M9M9M9J0J0L4j27K9L0
3695A635J10n0k9k8J3j49Q8Q9K8K8O2r8Q2p8r7r7J4J4J30J31P3q8J4J4N4j07m1m2j18j19M8
3690A486M8R9o3mnP6q5R2R3N2j08J6J6OPk5k5k4k5P6P6RRl5l6NNK1K2r9r9N7N8rj0L2L2L1
3684A772L2M9M9rj68k8k7J20m1L0K9n7n8L3j28L0K9N1N0j7j6n1n0j0j0J42J41j67j66N2N3
$$ y = [5515, 5245, 5150, 5055, 4879, 4704, 4612, 4521, 4439, 4196, 4006, 3815, 3786, 3595, 3626, 3656, 3597, 3537, 3477, 3417, 3367, 3157, 3057, 2956, 2980, 3004, 3083, 3161, 3159, 3157, 3041, 2925, 2799, 2673, 2738, 2642, 2637, 2631, 2612, 2593, 2655, 2717, 2589, 2462, 2469, 2476, 2347, 2219, 2224, 2229, 2269, 2308, 2338, 2367, 2449, 2369, 2364, 2358, 2414, 2201, 2049, 2058, 2105, 2153, 2130, 2107, 2079, 2052, 2024, 1996, 2059, 2122, 2185, 2087, 2158, 2068, 2049, 2029, 2131, 2071, 2021, 1972, 1969, 1966, 1953, 1939, 1977, 1853, 1900, 1947, 1953, 1960, 1966, 1972, 1865, 1757, 1730, 1703, 1762, 1821, 1960, 1939, 2041, 1983, 1961, 1779, 1742, 1706, 1660, 1613, 1645, 1678, 1700, 1722, 1817, 1751, 1776, 1800, 1823, 1846, 1959, 1912, 1764, 1615, 1591, 1567, 1508, 1450, 1569, 1688, 1844, 1839, 1904, 1809, 1737, 1826, 1905, 1823, 1793, 1762, 1681, 1600, 1646, 1691, 1670, 1648, 1574, 1500, 1520, 1539, 1565, 1590, 1522, 1454, 1502, 1551, 1600, 1649, 1659, 1669, 1703, 1576, 1605, 1635, 1745, 1695, 1666, 1638, 1651, 1502, 1590, 1679, 1707, 1735, 1797, 1699, 1781, 1703, 1606, 1509, 1523, 1537, 1667, 1798, 1871, 1783, 1797, 1811, 1865, 1758, 1717, 1675, 1557, 1438, 1486, 1534, 1633, 1570, 1566, 1561, 1637, 1552, 1644, 1737, 1789, 1681, 1697, 1713, 1719, 1726, 1701, 1676, 1652, 1627, 1703, 1779, 1788, 1797, 1762, 1726, 1731, 1736, 1757, 1779, 1680, 1581, 1638, 1696, 1687, 1677, 1709, 1741, 1772, 1804, 1853, 1902, 1893, 1725, 1697, 1670, 1790, 1749, 1779, 1808, 1751, 1693, 1726, 1598, 1628, 1657, 1708, 1758, 1741, 1725, 1674, 1624, 1614, 1604, 1746, 1887, 1720, 1554, 1606, 1659]
3680A659O6r5Rj51K2K2J6J6n2n1KJJ33k8PQQ8p3K8K8J49j3opJ14m7l3l3K4K4L4L4oon2n2j3
3674A766j2p1p2N0M9k5k5k4k5k7k7O7O6J8J7n0n0p4p4J54J54j0j0j0j0l1l1N3N2O6r5m5m5
3669A669k0k1j11N0Q9R0L2L2n3n3n3n4k5k5M2M2K2K1K2K2J54J54O0k07j42J9M3M3j30L1QQ
3664A759O3O4n8n7k1k1Q9R0P9q2QQR9R8MNq0q0J4J3M5M4Q4Q4N6N6J53J53J09L78L94J26j9
3659C657K48L22N4j48J3j76j75o4o5K6j35k72k71k82k81j23j22J1J2K2K2p9Q3M3j18n8J03
3655B247j47J3J20J20k6k5O5O5nJ56J06J05P5P5O5K25L15L15K08K08K15M83L83K22ppq7J81
3651E663J63J63m74m73n33k65j3j3l10l10k12k13k40K8j23j23LMl7l7P0O9jjnJ56j5j5q3q2
3646B741O2O1K3J84R4R3O2O1n9L16L39M99J91L1m4K24J03J03nmj69j69l02P3R6o4j73j2k87
$$ y = [1659, 1725, 1630, 1639, 1488, 1510, 1532, 1548, 1564, 1512, 1461, 1463, 1464, 1597, 1569, 1576, 1584, 1672, 1599, 1627, 1655, 1804, 1791, 1785, 1778, 1892, 1845, 1812, 1779, 1803, 1827, 1861, 1895, 1889, 1883, 1831, 1779, 1766, 1754, 1683, 1611, 1661, 1710, 1685, 1660, 1636, 1611, 1584, 1557, 1624, 1690, 1708, 1725, 1675, 1625, 1551, 1477, 1631, 1785, 1775, 1765, 1755, 1745, 1714, 1683, 1736, 1788, 1854, 1759, 1714, 1669, 1649, 1628, 1517, 1567, 1656, 1746, 1778, 1810, 1757, 1704, 1651, 1597, 1572, 1547, 1589, 1631, 1653, 1674, 1696, 1718, 1872, 2026, 2086, 1879, 1737, 1756, 1799, 1842, 1712, 1743, 1751, 1759, 1822, 1886, 1828, 1771, 1750, 1729, 1818, 1908, 1987, 1905, 1913, 1921, 2020, 2118, 2122, 2127, 2047, 1967, 1981, 1994, 2039, 2083, 2167, 2251, 2307, 2363, 2516, 2669, 2778, 3156, 3550, 3676, 3657, 3905, 4227, 4281, 4133, 4146, 3970, 3795, 3731, 3666, 3692, 3557, 3285, 3014, 2732, 2451, 2328, 2206, 2217, 2229, 2251, 2273, 2194, 2277, 2320, 2202, 2144, 2247, 2100, 2113, 2233, 2353, 2327, 2302, 2367, 2432, 2427, 2583, 2689, 2794, 2869, 2944, 3009, 3234, 3549, 3864, 4072, 4280, 4495, 4978, 5361, 5583, 5576, 5569, 5482, 5663, 5826, 5989, 5515, 5042, 4509, 4244, 4231, 4218, 3908, 3598, 3386, 3173, 2933, 2961, 2838, 2715, 2718, 2722, 2685, 2648, 2718, 2787, 2786, 2785, 2780, 2936, 2921, 2906, 2823, 2741, 2803, 2864, 2887, 3071, 3165, 3258, 3320, 3381, 3322, 3638, 3977, 4476, 4667, 4698, 4654, 4878, 4981, 5084, 5079, 5075, 4906, 4737, 4435, 4508, 4604, 4540, 4367, 4355, 4068]
3642D068j9j72R6J9J9j15J53RJ70j7K52J20J20l7J24N0N0j31J37l8L38J26J27P6K37J5K83
3637F060J33K93n4n5j31J36O1M36N17J428J878J180o55m95o74j91k18M79K43M04R6O86K18
3634A1775P00P00J397Q82J043M73J063P24J528J079J883J628K754K755M094L679N770O466
3631E0393R630J1483J7542K3385L8022N7553R9534J65526K24985N7379j58313j59171j29629
3629C08319r4656o3612m0204k7389j7788j3661r425q084n848n044l294l294j994j995j156
3627A0875j318p50j234p94p95k79m40o8m43oj67N4l21rk77k19q10l55l55J11n86n0M33P60
3623B957L86J55k21k48m09q7k49r8r7J14m7o0o0K1j41J51j0N8j04N7j03R5o5J06n5o2o3j13
3619A808j12N4N5M5M5L7j24K4K3O8r3K1j39m5m5J56nmmP6q5l6l6j6j6J28l4o4o3n6n5M8M9
$$ y = [4068, 4049, 3877, 3973, 3992, 4011, 3896, 4049, 4058, 4228, 4211, 4463, 4583, 4703, 4666, 4790, 4840, 4890, 4759, 4896, 4858, 5196, 5322, 5449, 5525, 5762, 5777, 6060, 6193, 6486, 6432, 6377, 6246, 6382, 6443, 6879, 7396, 8824, 10702, 11882, 11227, 10732, 10058, 9867, 9649, 10128, 10371, 10775, 10871, 11557, 11775, 12475, 13175, 14572, 15454, 16497, 16970, 18033, 18757, 20285, 21364, 23247, 24875, 27629, 30384, 34478, 38157, 43927, 50393, 60023, 71506, 89048, 112433, 150455, 208008, 307542, 473068, 698053, 755432, 597119, 437948, 308319, 213663, 150051, 109847, 82458, 64670, 51009, 41584, 33500, 27652, 22608, 19314, 16020, 14026, 12031, 10875, 9557, 8807, 7573, 6779, 5984, 5705, 5265, 5197, 4754, 4748, 4581, 4635, 4314, 4305, 4028, 3809, 2999, 2644, 2289, 2400, 1814, 1764, 2197, 2957, 3343, 3498, 3277, 3029, 2620, 2533, 2284, 2186, 2089, 2203, 2156, 2096, 2036, 2057, 1916, 2067, 2057, 2115, 2011, 2068, 1965, 2060, 1995, 2101, 2046, 1984, 1921, 1808, 1696, 1750, 1805, 1850, 1895, 1932, 1808, 1832, 1855, 1923, 1830, 1851, 1712, 1667, 1622, 1778, 1773, 1769, 1765, 1841, 1756, 1720, 1684, 1668, 1652, 1780, 1746, 1682, 1619, 1563, 1508, 1556, 1605]
3614A605J55j13L7L8l5l5p5p5J6J5J46j5lmj3j4n4n3j4j3LLLLJ30J30m5m4q9q9NM%%m0m1N
3608A434OJ35k5P4P4j04N7J05n6l3l3j4j75j14J53KLN9N9K0K0k0k0k4k3k4k3K0K1K1K1OOO
3603A614Nj6j7j7j7j6j6n6n6N5N5j2j2m6m6K0K1q2q1L9L9K1K2j9j9P1P2K1K2nj65r3O8MQ4
3598A442N4k6m3m2p1R0k6k6M1M1J33k8j49J2K8K9j7J44N0l1j11N0k5j06r5j5Q1Q1l5l4nmO2
3593A449O3lklko9o9J06J06l8l7j8J44L6j25k15N3K3K2RRp2Q8R4o7j00j9K8J08J%q9q8n6n6
3587A211R1R1k7k8M0L9llm4m4N3N3N2N3qqo5o5K3J84J8o3l6l7K6K5ppj03N8M8l3l8J23Q6p6
3582A579l0J30k1j01poj5j6j5j5l3l3O2O1J07J08j48j47J0J0N0N0k6k6k6k6M5M5j1j2m0J22
3577A625m1m1J44O4j82k1l4l4k4k4M1M2n3n2M7M8M7M7PPQPj25j24N0M9l7l8l8l8j9j8K1K2
$$ y = [1605, 1760, 1647, 1684, 1722, 1687, 1652, 1577, 1502, 1518, 1533, 1679, 1664, 1661, 1657, 1644, 1630, 1576, 1523, 1509, 1496, 1499, 1502, 1505, 1508, 1638, 1768, 1723, 1679, 1590, 1501, 1506, 1510, 1510, 1510, 1470, 1429, 1434, 1440, 1575, 1550, 1624, 1698, 1594, 1651, 1756, 1700, 1667, 1634, 1620, 1445, 1331, 1484, 1486, 1489, 1548, 1607, 1627, 1647, 1627, 1607, 1583, 1560, 1536, 1513, 1533, 1554, 1575, 1596, 1602, 1608, 1614, 1619, 1603, 1586, 1569, 1552, 1536, 1520, 1464, 1408, 1463, 1518, 1506, 1494, 1448, 1402, 1422, 1443, 1361, 1280, 1319, 1358, 1379, 1401, 1382, 1363, 1434, 1506, 1527, 1549, 1544, 1379, 1286, 1354, 1358, 1442, 1496, 1470, 1427, 1385, 1314, 1404, 1378, 1352, 1393, 1434, 1567, 1539, 1390, 1402, 1430, 1459, 1442, 1586, 1636, 1605, 1494, 1544, 1519, 1413, 1318, 1303, 1384, 1465, 1430, 1396, 1391, 1387, 1449, 1512, 1509, 1507, 1504, 1502, 1433, 1364, 1470, 1576, 1538, 1501, 1483, 1627, 1663, 1538, 1323, 1376, 1399, 1421, 1430, 1439, 1367, 1455, 1549, 1482, 1382, 1363, 1391, 1499, 1500, 1500, 1411, 1323, 1267, 1211, 1302, 1393, 1366, 1338, 1378, 1417, 1414, 1411, 1367, 1323, 1376, 1429, 1481, 1534, 1526, 1518, 1453, 1388, 1411, 1595, 1613, 1550, 1514, 1477, 1503, 1528, 1521, 1514, 1411, 1469, 1517, 1484, 1446, 1569, 1655, 1579, 1549, 1679, 1658, 1557, 1550, 1544, 1529, 1513, 1498, 1483, 1450, 1417, 1479, 1540, 1647, 1755, 1607, 1460, 1470, 1480, 1530, 1580, 1554, 1528, 1502, 1476, 1521, 1566, 1555, 1543, 1503, 1625, 1584, 1543, 1687, 1751, 1569, 1548, 1514, 1480, 1456, 1432, 1473, 1515, 1462, 1410, 1457, 1505, 1552, 1599, 1606, 1613, 1621, 1628, 1503, 1379, 1429, 1478, 1441, 1403, 1365, 1327, 1308, 1290, 1311, 1333]
3572A333N4N4k1N9n9J01Q2Q3m2m2j09j08N5N5O2r9j36K5J8J8k9k9L8L8P4P3m8m7rrN9N8q7
3567A465q8k0k0L4L3L3L4J9J9l6M4K3j38p7Lr2P0P9jmJ58M0m1O0O0R5R5o8o7j89Q0N8j04J9
3562A576o1q4P7rq9p8Lr3j3J18J17KKm7m6J17m5m4L7pP4J02n8L7L7L8L8j10j09OOK1n9j07
3556A349N4K8J09K3n8j08N2Q6p5j9O1L9L9p6p7L4L3P3P4m9m8J3J3q5j66o9R2Q4Lp7Q3R6J5
3551A546j01k0K5n4O2O3j25j26N0M9O8O8k6k6O8O8n3n3p5p6O2O2J07n4o6J5p1R0Q9J0p1p1
3546A434J7J8LLP0P0o9o9LLm6L4m0J22K7n3o5o5L2L2J62Kj06j06J9J8R4R3m0m0l1l0N0N1r7
3541A500r7j6j7L9L9L9L9K2K2n8n8j4j5j4j5k4k4J10J09m6m7L3L4llm3m3L5L5m6m6P7P6j4
3536A566j4J53qr4r5p9Q2P2P2q4q4N0N0l7l7l7l7n8n9o9R2o7o8K3K3J10J10L0K9J5J5o6o5
$$ y = [1333, 1387, 1441, 1420, 1479, 1420, 1521, 1603, 1686, 1644, 1602, 1493, 1385, 1440, 1495, 1557, 1458, 1322, 1347, 1365, 1383, 1354, 1325, 1363, 1401, 1475, 1548, 1500, 1453, 1444, 1435, 1494, 1552, 1465, 1377, 1357, 1337, 1371, 1404, 1437, 1471, 1490, 1509, 1473, 1517, 1540, 1402, 1325, 1328, 1236, 1306, 1385, 1384, 1380, 1538, 1578, 1537, 1597, 1657, 1752, 1847, 1779, 1712, 1523, 1603, 1661, 1557, 1576, 1515, 1431, 1508, 1499, 1410, 1332, 1335, 1242, 1229, 1347, 1464, 1466, 1468, 1421, 1375, 1492, 1447, 1403, 1440, 1433, 1507, 1609, 1551, 1588, 1625, 1663, 1701, 1591, 1482, 1488, 1494, 1515, 1456, 1349, 1403, 1431, 1540, 1563, 1505, 1397, 1449, 1535, 1460, 1441, 1502, 1541, 1580, 1504, 1427, 1461, 1494, 1567, 1641, 1592, 1544, 1557, 1570, 1485, 1319, 1250, 1342, 1426, 1429, 1352, 1435, 1531, 1546, 1445, 1425, 1450, 1396, 1458, 1521, 1396, 1270, 1320, 1369, 1437, 1505, 1479, 1453, 1521, 1589, 1536, 1483, 1408, 1332, 1394, 1456, 1563, 1509, 1443, 1458, 1387, 1477, 1566, 1576, 1505, 1434, 1451, 1469, 1472, 1475, 1545, 1615, 1546, 1477, 1480, 1483, 1437, 1471, 1431, 1553, 1580, 1527, 1462, 1397, 1429, 1461, 1623, 1625, 1519, 1413, 1432, 1450, 1544, 1637, 1597, 1557, 1526, 1496, 1546, 1597, 1500, 1403, 1387, 1370, 1409, 1448, 1487, 1526, 1548, 1570, 1512, 1454, 1440, 1425, 1411, 1396, 1372, 1348, 1458, 1567, 1521, 1474, 1507, 1541, 1538, 1535, 1492, 1449, 1484, 1519, 1473, 1427, 1504, 1580, 1566, 1552, 1705, 1697, 1603, 1508, 1429, 1511, 1583, 1655, 1571, 1487, 1537, 1587, 1550, 1513, 1476, 1439, 1381, 1322, 1253, 1345, 1278, 1210, 1233, 1256, 1366, 1476, 1506, 1535, 1550, 1565, 1499, 1434]
3531A434j7j8K4K3L9L9jjl3l4L7L7J08n3r2O8o9o8o9R3R4R5k9l0l1l1l1l1j6j6O4O4N5N6o8
3526A592o8l0J31J75J74J95J95K88O64J052J212J06j020r53o84l97l96k18k18l1l0l4l3j15
3522A557j14Q7Q7m7m8N7N7p8p7n0n0n9J01J9J9p2Q9J28l4o7o7JJM1M1q3q4R7o3j62jJ77J6
3517A419k0k0k9l0K9K9K8K9M3M2L2L2Jj59JJO8r3j33K8J1J1k9J32N3N4j6j7k9k9M1M1M4j17
3512A448N4N4R2R3j49j49RRJ0RP1P1o2o3MMl9k00O0O1N0N1o4o3k3k3qpJ27J27jkjjq3q2kk
3506A380J0J0M0M0M8j13k3k2n2n2Q2Q2NMMNM5M6ONK5K5n6n5n9o0J29J28j6j6j53p1P0r1j1
3501A339P0J21m0l5J26K7K7L7L6l6l7j18j17n5n5O8O9O9r3j1J49o0o0L1L1L2L3K2K3N1j09
3496A535j00r9RRK0J9q0Q0Q0q0O0O0l0l1O3O4j8j7j1j0j1j1k6k6k7k6opooL1L2L1L2l2l1L9
$$ y = [1434, 1417, 1399, 1423, 1446, 1485, 1524, 1523, 1522, 1489, 1455, 1492, 1529, 1637, 1584, 1492, 1560, 1491, 1423, 1354, 1447, 1541, 1636, 1607, 1577, 1546, 1515, 1484, 1453, 1437, 1421, 1485, 1549, 1604, 1660, 1592, 1524, 1494, 1625, 1800, 1974, 2169, 2364, 2652, 3316, 4368, 5580, 5686, 4666, 3713, 3029, 2632, 2236, 2018, 1800, 1769, 1739, 1705, 1672, 1557, 1443, 1530, 1617, 1570, 1522, 1579, 1636, 1558, 1481, 1431, 1381, 1322, 1423, 1442, 1461, 1389, 1478, 1606, 1572, 1505, 1438, 1439, 1440, 1481, 1522, 1439, 1355, 1452, 1389, 1227, 1226, 1403, 1419, 1399, 1379, 1350, 1320, 1349, 1378, 1406, 1435, 1478, 1520, 1552, 1584, 1585, 1426, 1427, 1428, 1496, 1403, 1270, 1298, 1309, 1320, 1291, 1423, 1476, 1530, 1514, 1497, 1468, 1439, 1480, 1521, 1565, 1448, 1502, 1556, 1648, 1741, 1592, 1443, 1452, 1461, 1471, 1480, 1551, 1622, 1560, 1497, 1501, 1505, 1466, 1266, 1326, 1387, 1437, 1488, 1424, 1361, 1338, 1315, 1307, 1300, 1427, 1554, 1553, 1551, 1550, 1549, 1466, 1384, 1382, 1380, 1390, 1400, 1440, 1480, 1528, 1415, 1392, 1370, 1318, 1266, 1348, 1430, 1435, 1439, 1443, 1448, 1493, 1539, 1545, 1550, 1575, 1600, 1544, 1489, 1430, 1370, 1499, 1627, 1611, 1595, 1442, 1371, 1441, 1350, 1339, 1409, 1530, 1490, 1455, 1581, 1608, 1635, 1672, 1708, 1672, 1635, 1517, 1400, 1345, 1290, 1358, 1427, 1496, 1403, 1392, 1541, 1481, 1421, 1452, 1483, 1515, 1548, 1570, 1593, 1644, 1535, 1435, 1336, 1345, 1354, 1374, 1393, 1313, 1393, 1473, 1393, 1453, 1513, 1483, 1452, 1515, 1579, 1561, 1544, 1533, 1523, 1512, 1501, 1475, 1449, 1422, 1396, 1390, 1383, 1377, 1371, 1402, 1434, 1465, 1497, 1465, 1434, 1473]
3490A473L9K4j36j52J17lP8J10n1n6J06j29j29%JJ%PPPOj7j8J8J8mq5nJ55N2j09qqn7n8Q7
3485A281Q6m1J20L0L0p0o9J1J1L3L3j38K3J12J13j2j2M2M2r2r3j2j3J21J22n5n4K6K6j5j6
3480A570j5j5M0M0r4r4Q7Q6NOk6k6k6k6l0l0N1N1J1J1N2N1r8r8L5L6%JM0M1L4L5L4L4p7p7
3474A619LLj8j9O2O2j19j19k8k9p9Q1P1P1jjJ0Rj39K2J03n9%jj0j1klL7L8o9o9J1J1L6L5m5
3469A463m5kjo6o5m9K20P8q2o5o6N9N8kkj2J48j2j2klj6j7j6j7j14j14P4P4o9p0O5O4o6o7
3463A251J5J4J35J35n3n2J1J1J1J1K5K5K5K5J9K0k1k1o0o0K1K1K9K9j2j1J3J2J2J3P3P3o0
3458A679o1j04j04K9L0L8L8L8L8o5o5J6J5J18J17p0p0j14j15K0J9j3j2O8O8j8j7j8j7qrP3
3454A524P2m4m4mlL4L5nnrrqrJ7J7J8J7L4L5m7m6p7p7LMJ4J4N4N5p7p7LLO5O5o9p0P2P1o2
$$ y = [1473, 1512, 1536, 1400, 1248, 1365, 1362, 1440, 1550, 1499, 1443, 1549, 1420, 1291, 1291, 1292, 1293, 1293, 1300, 1307, 1314, 1320, 1303, 1285, 1303, 1321, 1317, 1232, 1227, 1382, 1434, 1325, 1317, 1309, 1252, 1194, 1281, 1367, 1326, 1446, 1476, 1506, 1436, 1367, 1378, 1389, 1422, 1455, 1317, 1340, 1452, 1565, 1553, 1541, 1583, 1625, 1533, 1440, 1428, 1415, 1536, 1658, 1603, 1549, 1575, 1601, 1586, 1570, 1555, 1540, 1580, 1620, 1526, 1432, 1519, 1605, 1610, 1616, 1590, 1564, 1538, 1512, 1482, 1452, 1503, 1554, 1565, 1576, 1628, 1679, 1581, 1483, 1518, 1554, 1554, 1555, 1595, 1636, 1670, 1705, 1739, 1773, 1696, 1619, 1622, 1625, 1607, 1588, 1650, 1712, 1593, 1474, 1446, 1417, 1338, 1419, 1490, 1561, 1560, 1559, 1569, 1578, 1439, 1461, 1564, 1505, 1505, 1504, 1494, 1483, 1481, 1478, 1515, 1553, 1484, 1415, 1426, 1437, 1473, 1508, 1463, 1418, 1416, 1415, 1349, 1284, 1235, 1455, 1533, 1451, 1386, 1320, 1379, 1437, 1435, 1433, 1421, 1569, 1557, 1545, 1543, 1540, 1524, 1507, 1491, 1474, 1360, 1246, 1320, 1394, 1325, 1255, 1320, 1384, 1318, 1251, 1266, 1280, 1415, 1550, 1497, 1445, 1456, 1467, 1478, 1489, 1514, 1539, 1564, 1589, 1608, 1628, 1607, 1586, 1526, 1466, 1487, 1508, 1537, 1566, 1554, 1543, 1556, 1568, 1580, 1593, 1666, 1739, 1679, 1618, 1514, 1410, 1439, 1469, 1507, 1545, 1583, 1621, 1556, 1491, 1507, 1522, 1640, 1757, 1687, 1617, 1503, 1388, 1408, 1427, 1414, 1402, 1470, 1538, 1520, 1503, 1485, 1468, 1460, 1451, 1524, 1596, 1552, 1508, 1504, 1501, 1535, 1570, 1565, 1560, 1551, 1542, 1534, 1525, 1542, 1559, 1577, 1594, 1628, 1663, 1616, 1570, 1493, 1416, 1419, 1423, 1437, 1451, 1505, 1560, 1483, 1406, 1409, 1412, 1477, 1542, 1473, 1403, 1475, 1546, 1484]
3447A484o3ppP3P3m5m6L5L4OOOOk3k3N8N8K9L0q8q8r5J73J14m8PPllq4q4mlppM3j18Q4Q5o0
3441A505o0O2O3j15j15r4O8N7N8J3J3J3J3J0J1M0M1J22l8k9k8L7L7m4m3l1l1RROOM6M6m1m0
3436A576m0m1n1n1qJ53M6M6j68qQ8Q8j27j27p1J97J36k4KLqqo2o2P2P2k9k8j9j8j93l2J1J2
3431A327R0R0M7j14J1J2Q2Q2j04j04l4l4M7j14k3k3o0o0J27J28N4N4N3N4n4n4n5n4l0l0R0
3426A401R0J9J9k1k1ppr0r1j04N7P0P0r9O1O4O4JJn0J11m9n0N4N5J6J5m1m1j21M1P0P0l4l4
3421A489l5l4J5J4R2R1n0J10J10n1j23j24j90P8J08J07o7o7r9O2O5O5J7J6p7p7j34j34Q4Q4
3416A345J78J7mlj10N1J07J08p1p1p1p0j5j4L7L6p0R2JJO0O0J11n0L0L1p2p3r0q9n0m9N0M9
3411A392N0M9ppopm5m5K3K2L5L6J25l5l9l9JJm6J14Q4p6j29L1N2N2k2k1k1k1J5J4p9p9k5k6
$$ y = [1484, 1421, 1414, 1407, 1480, 1553, 1508, 1462, 1497, 1531, 1537, 1543, 1549, 1555, 1532, 1509, 1567, 1625, 1654, 1684, 1596, 1508, 1413, 1586, 1700, 1652, 1659, 1666, 1663, 1660, 1576, 1492, 1488, 1485, 1478, 1471, 1514, 1396, 1480, 1565, 1505, 1445, 1507, 1570, 1455, 1340, 1246, 1314, 1371, 1429, 1442, 1455, 1468, 1481, 1491, 1502, 1542, 1583, 1705, 1667, 1638, 1610, 1647, 1684, 1640, 1597, 1566, 1535, 1544, 1553, 1559, 1565, 1611, 1657, 1616, 1576, 1536, 1495, 1444, 1393, 1385, 1538, 1584, 1630, 1462, 1454, 1542, 1630, 1503, 1376, 1305, 1502, 1638, 1614, 1616, 1619, 1611, 1603, 1541, 1479, 1551, 1623, 1594, 1566, 1547, 1529, 1336, 1304, 1315, 1327, 1417, 1507, 1554, 1440, 1451, 1463, 1545, 1627, 1523, 1419, 1385, 1351, 1398, 1284, 1261, 1238, 1178, 1118, 1245, 1373, 1427, 1481, 1534, 1588, 1534, 1480, 1425, 1371, 1341, 1311, 1401, 1491, 1510, 1529, 1508, 1487, 1480, 1473, 1383, 1292, 1188, 1245, 1315, 1385, 1286, 1347, 1411, 1475, 1476, 1477, 1427, 1538, 1489, 1439, 1493, 1548, 1564, 1579, 1538, 1497, 1376, 1417, 1487, 1557, 1523, 1489, 1454, 1420, 1435, 1449, 1541, 1632, 1582, 1692, 1802, 1751, 1628, 1504, 1314, 1392, 1500, 1607, 1540, 1473, 1374, 1436, 1501, 1566, 1583, 1599, 1522, 1445, 1311, 1177, 1261, 1345, 1523, 1540, 1536, 1533, 1423, 1474, 1581, 1689, 1618, 1547, 1476, 1406, 1391, 1377, 1414, 1450, 1380, 1472, 1473, 1474, 1534, 1594, 1705, 1655, 1685, 1716, 1644, 1571, 1481, 1392, 1342, 1293, 1343, 1392, 1442, 1491, 1484, 1477, 1471, 1464, 1419, 1374, 1397, 1419, 1454, 1490, 1615, 1580, 1541, 1502, 1503, 1504, 1458, 1572, 1656, 1580, 1451, 1482, 1534, 1586, 1564, 1543, 1522, 1501, 1516, 1530, 1451, 1372, 1347, 1321]
3405A321J22J22L7L7K8K7M0j21K6K7J38k3l6l7k9j90ooJJo7o6L5L5JJ62O6r5NOm6m6M8M9o5
3400A501o5k5k5Q3Q3J5J6LLJ34k7o7o7p8p7M1M1J%J8J9j03j02L0L0o4o4J26J26L3L2K9K8K8
3395A656K8J8J8m9m9k9k9k8k9k1k0J11n0j6j6k6k6K9K9K9K9q1q2J09J10Lj57k7k6L0L0J%o2
3390A407J00q5q5J5J5J05n6l3l2llN5N5j2j2M0M1O4r7j01j00%J61O4O4PPn2n2O9O9N0N1K0
3385A736j41n1n2NNk3k3PJ68MMJ3J4l6l6l7l6k3k3M4M4m9n0J8J8J01J01j00r9k8k8L9L9m7
3379A478m7J00J00j5j5j4j5l6l6N4j06K6K6J5J6o6o7rrJ03n7P4P3p2p2K1K2N7N7j0j0k5k4
3374A517j15M6L5L6p6p5L8L7P8P8o2o3N9N8%jm0m1m5m6K1K1k4k4J7J6o2o1N9N9j4j5N3N2O7
3369A583O8%%m8m8qqm4m5N0N0o1o1L2L3R4R3k7k7o3o3o3o3J03J04m4m4J8J9m8m9j3j2K7K7
$$ y = [1321, 1443, 1565, 1602, 1639, 1667, 1694, 1734, 1613, 1639, 1666, 1804, 1781, 1745, 1708, 1679, 1489, 1483, 1477, 1478, 1479, 1412, 1346, 1381, 1416, 1417, 1579, 1645, 1550, 1555, 1561, 1515, 1469, 1517, 1566, 1501, 1436, 1411, 1386, 1469, 1552, 1567, 1583, 1586, 1589, 1723, 1696, 1629, 1562, 1484, 1407, 1448, 1489, 1490, 1490, 1508, 1527, 1424, 1322, 1352, 1382, 1318, 1254, 1380, 1506, 1539, 1571, 1600, 1628, 1656, 1684, 1702, 1720, 1671, 1622, 1593, 1564, 1536, 1507, 1486, 1466, 1577, 1527, 1511, 1495, 1469, 1443, 1472, 1501, 1530, 1559, 1478, 1396, 1505, 1615, 1618, 1461, 1434, 1408, 1438, 1468, 1469, 1469, 1407, 1507, 1422, 1337, 1352, 1367, 1472, 1416, 1383, 1351, 1348, 1345, 1400, 1455, 1443, 1431, 1471, 1512, 1576, 1479, 1378, 1278, 1278, 1439, 1503, 1567, 1574, 1581, 1529, 1477, 1546, 1615, 1665, 1716, 1736, 1595, 1544, 1492, 1497, 1502, 1479, 1456, 1463, 1631, 1635, 1639, 1652, 1666, 1630, 1594, 1557, 1521, 1498, 1475, 1519, 1563, 1514, 1464, 1482, 1500, 1601, 1702, 1602, 1503, 1475, 1447, 1486, 1525, 1478, 1431, 1531, 1631, 1616, 1601, 1587, 1572, 1536, 1500, 1554, 1448, 1474, 1500, 1515, 1531, 1465, 1398, 1389, 1380, 1483, 1426, 1500, 1573, 1501, 1429, 1450, 1472, 1529, 1586, 1576, 1566, 1541, 1517, 1402, 1448, 1483, 1519, 1443, 1368, 1406, 1443, 1521, 1599, 1537, 1474, 1533, 1591, 1591, 1590, 1550, 1509, 1464, 1418, 1439, 1460, 1436, 1412, 1429, 1445, 1383, 1322, 1381, 1440, 1426, 1411, 1464, 1516, 1583, 1651, 1651, 1651, 1603, 1555, 1547, 1539, 1495, 1450, 1500, 1550, 1489, 1428, 1460, 1493, 1587, 1680, 1653, 1626, 1563, 1500, 1437, 1374, 1477, 1581, 1537, 1493, 1511, 1530, 1482, 1433, 1420, 1408, 1435, 1462]
3364A462j4j3j4j4O9O8KKp4p4K0K0M7M8M7M8p3p2l2l2O1O1K0K1p6p7M5M4K1K0j00r9Q9Q9N0
3358A590M9q4q4j7j7k8k8qJ53J04n8M4M3p1p0mmMLppP0r2j31K9K3K3l4l4P5P5QPppL3L3K5
3353A599K4j5j6j5j5q2q2l0k9J18J18J3J4LLL6j25OOJ00R9p4p5m0m1K7K7p5p4ONjkkjK6K6
3347A462K6K6j6j6j6j6k3k3J48j2j4j4o4o3j9j9O2O2L9L9m1m1j7j6j6j7k8k8N2N3P8P8n6n5
3342A495NNl4l5n4n4K6K6O1O1O0O1j04j05L0L0l0l0J0J1RJ0Q0Q0M1j21l0k9N7N8N7N8m2m2
3337A621q3q2j7j6O4O4j4j4k4J37oop6p7o6o7o6R4n4J06L7j25M8M8P8P8j5j4n5n5J5J5J5J5
3331A503k0k1o0o0R3R3m2m1O1O2j0rn0J10J46j5j11j91o4R8J14L5m5m4K8K8n3n2q6q6M8M8
3326A407k4k4N2N1N3k9j53PJ1J0L6m4M3K03P0r2p5OnmJ8R8J29j40j26m6k7k7J8J8Q2Q1K08
$$ y = [1462, 1448, 1435, 1421, 1407, 1476, 1544, 1546, 1548, 1474, 1400, 1420, 1440, 1487, 1535, 1582, 1630, 1557, 1485, 1453, 1421, 1482, 1543, 1563, 1584, 1508, 1431, 1476, 1520, 1541, 1561, 1461, 1362, 1451, 1540, 1590, 1639, 1555, 1471, 1454, 1437, 1409, 1381, 1373, 1526, 1630, 1572, 1616, 1659, 1588, 1518, 1514, 1510, 1514, 1517, 1510, 1503, 1573, 1481, 1350, 1379, 1402, 1425, 1391, 1357, 1432, 1507, 1515, 1522, 1515, 1508, 1541, 1574, 1599, 1623, 1608, 1592, 1577, 1562, 1480, 1398, 1368, 1339, 1457, 1575, 1588, 1602, 1605, 1608, 1644, 1519, 1525, 1531, 1631, 1730, 1656, 1581, 1541, 1500, 1527, 1554, 1479, 1405, 1411, 1416, 1415, 1413, 1411, 1410, 1436, 1462, 1488, 1514, 1498, 1482, 1466, 1450, 1427, 1404, 1552, 1540, 1526, 1512, 1448, 1385, 1366, 1347, 1409, 1471, 1510, 1549, 1508, 1467, 1450, 1434, 1418, 1401, 1373, 1345, 1397, 1450, 1528, 1606, 1550, 1495, 1500, 1505, 1471, 1436, 1382, 1328, 1354, 1380, 1441, 1502, 1562, 1623, 1519, 1414, 1444, 1474, 1444, 1414, 1424, 1435, 1444, 1454, 1534, 1614, 1655, 1534, 1504, 1475, 1532, 1590, 1647, 1705, 1663, 1621, 1538, 1456, 1439, 1423, 1487, 1551, 1537, 1523, 1499, 1636, 1630, 1624, 1548, 1471, 1405, 1338, 1272, 1366, 1312, 1418, 1455, 1330, 1378, 1426, 1504, 1582, 1567, 1553, 1498, 1443, 1458, 1473, 1488, 1503, 1483, 1462, 1402, 1342, 1435, 1528, 1486, 1445, 1506, 1568, 1558, 1549, 1499, 1609, 1755, 1740, 1629, 1438, 1374, 1472, 1586, 1621, 1576, 1532, 1560, 1588, 1535, 1483, 1397, 1311, 1359, 1407, 1383, 1359, 1411, 1462, 1515, 1486, 1333, 1340, 1351, 1361, 1397, 1353, 1396, 1599, 1669, 1577, 1502, 1508, 1503, 1499, 1517, 1615, 1744, 1604, 1478, 1432, 1405, 1378, 1396, 1414, 1496, 1577, 1785]
3321A785o0m0M1K8n1j73j1LMJ09n2j14l3R2o8k0J40M0M0K8K8M8j12k40p9QQM8M9M8M8L1L1
3316A604L1L1K3K2K3K3j03j04Q5Q5o3o3o3o3j6j7O3O4K6K6j4j5n3n4K7K6LKP8P8L9m1j66o
3311A518R7R7K7K7n7n7j6j7J3J4K3j37l8l7KLp6Q5P4P5m6m6q7q6J27J27M7M7m5m5M6j16J7
3306A560J7o3o3j54OJ04J04L1L0m9n0j5j4K5K5QQlkJ06n6L6L5M3M3LKq8q9qrl2l3N8N8r9O2
3300A537J06J05j5j5j5j5m3m4m3m3k8k8k8k8Q5Q6ONM6M7j78j7llj23L8K6K7M7M6J1J71L8j24
3295A634n6n5J4J5J4J4k7k6rrqrK6K7o4R7P9P8r9r9l9l9m0l9Q0P9n4n4O3O3j8j7R4R5j36j37
3290A438m6J14J14m6J9J9RQ%%j1j0j2j72j32K9O0O0j1j1Q0Q0L0K9R8o2j7O3j12j12K7K7n0
3285A500m9L1L1llL7L7L5L4r9j00R6R5l8l8m2m2R2R2j9k0j53j53O8O8K8K8j3j3O7O8j5j4j4
$$ y = [1785, 1725, 1685, 1726, 1754, 1703, 1530, 1519, 1522, 1526, 1635, 1583, 1469, 1436, 1528, 1460, 1440, 1580, 1620, 1660, 1688, 1716, 1764, 1652, 1412, 1333, 1341, 1349, 1397, 1446, 1494, 1542, 1573, 1604, 1635, 1666, 1689, 1711, 1734, 1757, 1654, 1550, 1635, 1720, 1657, 1594, 1531, 1468, 1452, 1435, 1498, 1562, 1588, 1614, 1600, 1585, 1532, 1478, 1505, 1531, 1534, 1536, 1614, 1692, 1731, 1690, 1524, 1518, 1615, 1712, 1739, 1766, 1709, 1652, 1636, 1619, 1632, 1646, 1669, 1532, 1494, 1457, 1459, 1462, 1386, 1471, 1545, 1620, 1574, 1528, 1441, 1355, 1482, 1609, 1656, 1703, 1658, 1613, 1659, 1543, 1560, 1577, 1514, 1451, 1297, 1303, 1407, 1511, 1542, 1572, 1523, 1473, 1458, 1444, 1469, 1494, 1502, 1510, 1507, 1505, 1611, 1555, 1591, 1626, 1669, 1712, 1715, 1717, 1629, 1540, 1532, 1523, 1491, 1458, 1516, 1574, 1475, 1537, 1643, 1748, 1733, 1718, 1703, 1688, 1645, 1601, 1558, 1515, 1487, 1459, 1431, 1403, 1488, 1574, 1580, 1585, 1631, 1678, 1500, 1483, 1480, 1477, 1354, 1392, 1418, 1445, 1492, 1538, 1549, 1720, 1758, 1634, 1578, 1523, 1537, 1552, 1566, 1580, 1553, 1527, 1518, 1509, 1501, 1492, 1518, 1545, 1481, 1578, 1657, 1735, 1636, 1537, 1498, 1459, 1419, 1380, 1460, 1539, 1485, 1431, 1494, 1557, 1539, 1522, 1616, 1711, 1575, 1438, 1392, 1506, 1620, 1574, 1593, 1612, 1621, 1629, 1629, 1629, 1618, 1608, 1596, 1424, 1292, 1321, 1381, 1441, 1430, 1419, 1499, 1579, 1609, 1638, 1736, 1674, 1657, 1720, 1608, 1496, 1523, 1550, 1500, 1451, 1482, 1513, 1510, 1507, 1544, 1581, 1616, 1650, 1551, 1451, 1547, 1642, 1604, 1566, 1524, 1482, 1574, 1666, 1647, 1627, 1474, 1321, 1389, 1457, 1485, 1513, 1500, 1487, 1554, 1622, 1607, 1593, 1579]
3280A579j4M3M4l7l7QQl2l2j1j2O8J48L2j29j24L7M7M6J6J6n6n6K5K4m3m3L7L7l9l9M2M1q
3274A586qP3P2n4n4j4j4p9p9l9l9m4m5Q0P9J14m7j1O8J17m5q2q3KLKLK8K8K8K8N3N3k7k7L
3269A629MR3o7j12j12J2J1N6N7o8o8j15M6o4R6J92L1N1N1j40j40JJ62J13m8k8k8n1n0Q3Q4
3264A681j04j03n4n3l1J30L9M0k0k0k0k0J1J1J2J1L0L0%Jn6J05o6o6J9K0J9K0N6N7N6N7r3
3259A699r3M2M1n5n5j05N6j04j04R3R4MMM4M5o8o8k8k8jjQ0P9o3o3J7J8l8l8R6R6J6J5J6J5
3254A658K8K7n3n3l7l6m7J14POPPP0r1jjn7n8n8n7opooQ7Q7m7m7M6M6NOl9l9JJL7L6nmj1j2
3247A498K9K8NNNNn2n3n3n3J5J5J4J5Q5Q5l9m0j02N8M9M8m7m6oon2n2J29l2j37K4LML9M0P9
3242A507Q0M5M6O5r5j30L1O4O5p6p6ooJ48j4llLLp7p7O9O9j2j2k9l0m9J11P2q9j29L2K7j34
$$ y = [1579, 1565, 1608, 1652, 1615, 1578, 1586, 1594, 1562, 1530, 1519, 1507, 1575, 1723, 1755, 1626, 1502, 1539, 1586, 1632, 1648, 1664, 1608, 1552, 1577, 1601, 1558, 1515, 1552, 1589, 1550, 1511, 1553, 1594, 1586, 1578, 1651, 1723, 1669, 1615, 1601, 1587, 1508, 1429, 1390, 1351, 1307, 1262, 1342, 1421, 1535, 1488, 1477, 1545, 1662, 1617, 1535, 1452, 1454, 1457, 1459, 1462, 1490, 1518, 1546, 1574, 1627, 1680, 1653, 1626, 1629, 1633, 1726, 1659, 1547, 1435, 1447, 1458, 1514, 1571, 1503, 1435, 1320, 1366, 1302, 1398, 1590, 1621, 1672, 1723, 1583, 1443, 1444, 1606, 1719, 1671, 1643, 1615, 1564, 1514, 1597, 1681, 1577, 1474, 1420, 1367, 1336, 1466, 1505, 1545, 1525, 1505, 1485, 1465, 1476, 1487, 1499, 1510, 1540, 1570, 1570, 1571, 1515, 1620, 1554, 1488, 1507, 1527, 1546, 1566, 1622, 1679, 1735, 1792, 1699, 1606, 1648, 1689, 1634, 1579, 1474, 1530, 1426, 1322, 1415, 1509, 1513, 1517, 1561, 1606, 1538, 1470, 1442, 1414, 1413, 1412, 1492, 1571, 1508, 1445, 1462, 1480, 1442, 1404, 1500, 1596, 1612, 1627, 1643, 1658, 1686, 1713, 1660, 1607, 1570, 1534, 1487, 1601, 1608, 1614, 1621, 1628, 1698, 1607, 1606, 1605, 1548, 1490, 1432, 1375, 1369, 1362, 1356, 1350, 1437, 1524, 1477, 1430, 1476, 1522, 1527, 1533, 1494, 1455, 1456, 1457, 1494, 1530, 1525, 1521, 1510, 1498, 1527, 1555, 1560, 1565, 1570, 1575, 1523, 1470, 1417, 1364, 1379, 1394, 1408, 1423, 1508, 1593, 1554, 1514, 1412, 1470, 1519, 1567, 1520, 1474, 1468, 1462, 1410, 1358, 1487, 1455, 1318, 1342, 1345, 1349, 1388, 1428, 1507, 1587, 1632, 1678, 1743, 1648, 1518, 1549, 1613, 1678, 1602, 1526, 1520, 1514, 1662, 1648, 1645, 1642, 1645, 1648, 1571, 1494, 1563, 1632, 1620, 1608, 1579, 1549, 1500, 1611, 1683, 1594, 1465, 1497, 1524, 1390]
3236A390M7M6lmJ17m4N9j01k2k1j0j1j0j0QQR8o2M1M1m9n0K7K7K7K7L2L2rqm1m0L9M0KKLK
3231A620m0m1%%P2P2Q1p9p2p3m2m2R7R8l7l7KJP1P2Q8p3l14j53N5N5O4O5j7j7j8j7N2N1N1
3225A595N2N9N8l1l2R7o3n4n3q7q7M8M7o5o6k6k5K9K9K8K9R5R5r3r2j7j7O4O4J4J4q6P5J23
3220A721l8K2K2n6n5o6R5j05j05j4j4%JQ1Q1mmr4O6L2L1j30L2O0O0rj0l0l0N0N0o4o3J6J6
3215A545j3j4lmp8Q4Q3p8L1L0K1K0K0K0k1k1r1r1M4M3MNM5M4N4N5J0j50m2m1J9J8J52j0o3
3209A627o4R2p0p0R1K8K7M8M7j66nR2R3q9q9M5M5K9K9o1R9n2n1j32K9j03j03o0J02K10N0J5
3205A683J6J8J8o2o2J8J8o3o2k2k2J12J12M4M4q9r0j4j4M6j14l6J25j5j6o2o2P2P2n4n4K7
3200A512K7N5N6J5J5K9K9j06j05j9j8n9n9R6R6J6J6m9m8P6P6Pj53j22L8J11n0j21M1LMM4M4
$$ y = [1390, 1437, 1483, 1480, 1476, 1593, 1549, 1608, 1507, 1485, 1464, 1454, 1443, 1433, 1423, 1431, 1439, 1537, 1475, 1516, 1557, 1508, 1458, 1485, 1512, 1539, 1566, 1598, 1630, 1621, 1613, 1572, 1532, 1571, 1611, 1613, 1615, 1618, 1620, 1580, 1539, 1539, 1539, 1611, 1683, 1764, 1685, 1613, 1540, 1498, 1456, 1553, 1651, 1614, 1577, 1579, 1580, 1651, 1723, 1811, 1738, 1424, 1271, 1326, 1381, 1445, 1510, 1493, 1476, 1458, 1441, 1493, 1544, 1595, 1647, 1706, 1764, 1733, 1701, 1798, 1735, 1681, 1628, 1541, 1454, 1502, 1549, 1484, 1418, 1392, 1367, 1396, 1425, 1453, 1482, 1577, 1672, 1579, 1487, 1470, 1453, 1517, 1581, 1595, 1609, 1523, 1598, 1721, 1683, 1705, 1727, 1671, 1616, 1550, 1645, 1540, 1435, 1421, 1407, 1407, 1408, 1489, 1570, 1566, 1562, 1468, 1534, 1566, 1597, 1467, 1499, 1559, 1619, 1610, 1600, 1570, 1540, 1590, 1640, 1576, 1513, 1529, 1545, 1532, 1518, 1515, 1511, 1433, 1517, 1600, 1522, 1553, 1583, 1604, 1624, 1644, 1664, 1643, 1622, 1531, 1440, 1484, 1527, 1531, 1536, 1581, 1625, 1679, 1734, 1744, 1594, 1552, 1511, 1530, 1548, 1700, 1690, 1627, 1563, 1655, 1585, 1515, 1606, 1634, 1661, 1709, 1756, 1590, 1585, 1677, 1770, 1681, 1592, 1637, 1682, 1711, 1740, 1679, 1778, 1726, 1675, 1543, 1572, 1469, 1366, 1306, 1408, 1618, 1668, 1683, 1699, 1717, 1735, 1673, 1611, 1629, 1647, 1584, 1522, 1500, 1478, 1590, 1702, 1746, 1790, 1701, 1611, 1597, 1583, 1629, 1515, 1479, 1604, 1589, 1573, 1511, 1449, 1521, 1593, 1539, 1485, 1512, 1539, 1594, 1650, 1665, 1680, 1709, 1738, 1632, 1527, 1508, 1490, 1431, 1372, 1468, 1564, 1580, 1596, 1547, 1499, 1575, 1651, 1658, 1505, 1383, 1421, 1532, 1482, 1361, 1402, 1405, 1409, 1453, 1497]
3195A497J59km5m5OOk8j89n7J04Q4Q4j7j7P4q7j1j1k1k1P4P3opqrM2M2q4P7M7j14p4Q8L2m8
3189A588L3L3K8K8p5p4m1J19R5o6m6m6n6n6K4K4N1N0l0l0N9N9RRO0j01r1j0l7M3M3M4r7r7
3184A446L8L7mlJ22l9N2k9l9M2l6l6K9j31j62kP6P5P2q8j4J48J03K3n6n6l1l2RRJ9K0K0J9
3179A601q7q6M7M7ONNOJ3J3J3J4L0L1L1L1QRl2l1N8N8p6p6L9M0r5r4N1N1M7M6l5j16q1Q0J08
3173A679J08Q5p7j04N7lml0l0p0p1j1j2J60kq3q4M1M0klm2m3rj0j0j0J01J02P4q6k25M2J60
3168A628%k2k1j11j12M7M7POn6n7K4K3R7R7l8l7p7p6J01J01P9q1q2P9O0O0o4o4n9n8P5P5p2
3163A519p2q3P9QRQJ69l6l6N4N4MMJ4J4q3P7j3j4k8k8k8k9K8K7n2n3J13J13p5p4K5K6n5n5
3157A531J6J6k4k4N3N3k8k8qpL2L3M5M5M5M5p2p1p2p1O6O7j14M7R2o9L2L2JJJJk6k7J05n7
$$ y = [1497, 1656, 1654, 1609, 1564, 1570, 1576, 1548, 1359, 1302, 1406, 1490, 1574, 1557, 1540, 1614, 1527, 1516, 1505, 1484, 1463, 1537, 1610, 1604, 1597, 1589, 1580, 1622, 1664, 1580, 1657, 1704, 1590, 1516, 1604, 1636, 1588, 1621, 1654, 1682, 1710, 1635, 1561, 1520, 1639, 1734, 1668, 1622, 1576, 1520, 1464, 1488, 1512, 1563, 1613, 1583, 1553, 1612, 1671, 1680, 1689, 1749, 1648, 1557, 1547, 1510, 1553, 1596, 1640, 1543, 1446, 1484, 1521, 1517, 1514, 1636, 1597, 1649, 1620, 1581, 1623, 1587, 1551, 1580, 1449, 1287, 1285, 1361, 1436, 1508, 1420, 1406, 1554, 1657, 1680, 1624, 1568, 1537, 1505, 1514, 1523, 1542, 1562, 1582, 1601, 1514, 1428, 1475, 1522, 1528, 1533, 1538, 1544, 1557, 1570, 1583, 1597, 1627, 1658, 1689, 1720, 1728, 1737, 1705, 1674, 1732, 1790, 1714, 1638, 1677, 1717, 1622, 1528, 1579, 1630, 1677, 1723, 1688, 1572, 1491, 1571, 1679, 1787, 1872, 1795, 1691, 1748, 1745, 1741, 1711, 1681, 1611, 1540, 1529, 1517, 1677, 1675, 1592, 1508, 1549, 1589, 1587, 1584, 1542, 1499, 1490, 1480, 1470, 1460, 1561, 1663, 1737, 1651, 1426, 1468, 1628, 1628, 1606, 1585, 1474, 1362, 1409, 1456, 1463, 1469, 1413, 1356, 1380, 1403, 1500, 1597, 1559, 1522, 1445, 1369, 1470, 1571, 1650, 1569, 1487, 1566, 1626, 1686, 1622, 1558, 1499, 1441, 1516, 1591, 1519, 1447, 1364, 1443, 1451, 1460, 1468, 1637, 1601, 1565, 1619, 1673, 1677, 1681, 1695, 1709, 1626, 1703, 1690, 1676, 1648, 1620, 1592, 1563, 1591, 1618, 1566, 1513, 1626, 1739, 1664, 1590, 1615, 1641, 1586, 1531, 1547, 1563, 1539, 1515, 1568, 1621, 1593, 1565, 1557, 1550, 1582, 1615, 1660, 1705, 1750, 1795, 1723, 1652, 1580, 1509, 1575, 1642, 1528, 1575, 1667, 1598, 1630, 1662, 1663, 1664, 1665, 1666, 1640, 1613, 1718, 1661]
3152A661l3l3j24j23K1K2J02J01P1P0j08j07m0J20L0L0j6j6j6j6J7J7J8J7k9k8P8q2r1J77
3147A690J07n3j72j71O0O0M5M5nnJ15m5MNo7o7p7Q3ooNMK7K6j3j3o2o1K0J9M3M3M2M3POl3
3142A643l4l6l6M4M4l2l2l3l2M8M7j60J07J98o9r0r0j6j5O5O5J4J5MNR4o6j46J5%%J01o0k2
3136A540k1k2k1k5J36M5M6q2q2jkl7l8OJ67N2N1j26j26mmOOm9J13J12m8K4K3k6k7q2q2N2N3
3131A527RJ0l1l0Q1Q0m3m3q9P2N2N2K7j34lmMLl6l7popok0k0O0O1L8L8lkmlr5O7j1j1kjP3
3125A606P3pqp3p3QQL3L4m7m6j9j9O1O1KKM2M2p6p6NMN2N1q2q3l8l9R5R5mnJ67Nq4q4mlj28
3119A448L3P4q7K6K7R7R7k1k0p1R0j8j9qqJ1J0J1J1p7p6MLo3o3J7J7l6l5MNL0L1L0L1nnK0
3113A515J01N3j07k7N3L6j26m9J11P2q8m3L8n4k13q0Q1J00K1n5K5R5J4j4r5k2J38Q8p3qq9
$$ y = [1661, 1628, 1595, 1471, 1348, 1369, 1391, 1493, 1594, 1665, 1735, 1627, 1520, 1480, 1600, 1630, 1660, 1644, 1628, 1612, 1596, 1613, 1630, 1648, 1665, 1636, 1608, 1686, 1604, 1513, 1690, 1797, 1744, 1572, 1401, 1461, 1521, 1566, 1611, 1606, 1601, 1716, 1671, 1675, 1680, 1613, 1546, 1469, 1552, 1546, 1540, 1545, 1549, 1576, 1602, 1589, 1576, 1514, 1453, 1473, 1492, 1535, 1578, 1620, 1663, 1670, 1676, 1643, 1609, 1573, 1537, 1581, 1625, 1593, 1561, 1528, 1496, 1544, 1591, 1431, 1538, 1736, 1667, 1577, 1487, 1471, 1456, 1521, 1586, 1600, 1615, 1619, 1624, 1718, 1652, 1506, 1521, 1521, 1521, 1622, 1562, 1540, 1519, 1497, 1476, 1451, 1587, 1632, 1678, 1596, 1514, 1513, 1511, 1474, 1436, 1442, 1609, 1661, 1712, 1586, 1460, 1456, 1452, 1458, 1464, 1415, 1528, 1640, 1592, 1616, 1639, 1613, 1586, 1504, 1422, 1474, 1527, 1536, 1546, 1515, 1485, 1566, 1646, 1603, 1560, 1471, 1543, 1595, 1647, 1674, 1540, 1537, 1533, 1537, 1540, 1504, 1467, 1460, 1454, 1447, 1441, 1421, 1401, 1461, 1522, 1560, 1598, 1595, 1593, 1589, 1586, 1491, 1558, 1547, 1536, 1534, 1533, 1606, 1679, 1672, 1664, 1591, 1518, 1526, 1534, 1567, 1601, 1554, 1508, 1489, 1470, 1531, 1592, 1594, 1596, 1638, 1680, 1604, 1528, 1533, 1537, 1589, 1640, 1558, 1475, 1437, 1398, 1493, 1588, 1584, 1579, 1746, 1751, 1667, 1583, 1579, 1576, 1448, 1481, 1555, 1468, 1494, 1521, 1618, 1715, 1694, 1674, 1603, 1693, 1675, 1656, 1648, 1640, 1651, 1661, 1672, 1683, 1606, 1530, 1534, 1537, 1474, 1411, 1428, 1445, 1409, 1374, 1378, 1383, 1413, 1444, 1474, 1505, 1500, 1495, 1515, 1616, 1669, 1562, 1535, 1588, 1624, 1498, 1449, 1560, 1632, 1544, 1501, 1539, 1485, 1272, 1192, 1273, 1373, 1394, 1339, 1364, 1459, 1473, 1459, 1364, 1342, 1480, 1568, 1495, 1487, 1398]
3108A398k4N7J3o7O4O4O1O1k0j9L6L5nnL5L6j0j0Rp2j12M8Q0J60K8j33p2p2kkPPmlJ39k1o5
3103A620o5k0k0K1K0l7l8LLL0L1%%r7O3J44j7M0M0j04j04m3m2r8O4R5J4n6K5M4M4J09n1j57
3097A461NQ3Ll7l8L8L8J2J3o8o8O8O8O8O8K5K4j00r9j07N5N4j06k7k6N5N4m4J18J6J7M0j21
3092A542l0l0K5K5J05J06K2K3j8j8j0j1j01N9L2L2r2r2l1l1l1l1R2R1J02o0r6r7o3R8L8L8
3087A588n3J08M8j13j03N8J24J23n4n4m4m4m4m4L1L1m9m9O2O1j8j9K0K1j03j04J7J77M7M6
3083A667k1k1k1k2r7r7L7L7J08J08k5k6k0k0n0n1j34K6J06n4K8K8J8J8L0K9m0m1j11N0R3R4
3078A626l2l3l2l2j5j6O6O5J0J1k9l0O3O3j25j25O2O3O3O2oom7m6%JM0M1mmmmm9m9J7J8NM
3072A592J5J4o9R1JKo5o5k5k5N4N3N3N3m1m1j32K9J9J9j1j1M6M6OONMm6J15K0K0j18j17M3
$$ y = [1398, 1374, 1431, 1444, 1377, 1441, 1505, 1566, 1627, 1607, 1588, 1624, 1659, 1654, 1649, 1684, 1720, 1710, 1700, 1709, 1637, 1525, 1573, 1653, 1813, 1841, 1708, 1636, 1564, 1562, 1560, 1567, 1574, 1570, 1567, 1706, 1685, 1620, 1555, 1535, 1515, 1536, 1556, 1519, 1481, 1484, 1487, 1517, 1548, 1548, 1548, 1451, 1514, 1658, 1641, 1681, 1721, 1617, 1513, 1470, 1428, 1330, 1394, 1489, 1503, 1447, 1472, 1516, 1560, 1669, 1618, 1461, 1466, 1549, 1552, 1515, 1477, 1515, 1553, 1565, 1578, 1510, 1442, 1510, 1578, 1646, 1714, 1739, 1763, 1663, 1564, 1457, 1512, 1566, 1460, 1433, 1407, 1462, 1516, 1472, 1590, 1606, 1623, 1663, 1542, 1512, 1482, 1507, 1532, 1637, 1743, 1765, 1788, 1770, 1752, 1742, 1731, 1630, 1689, 1721, 1753, 1661, 1569, 1538, 1507, 1476, 1445, 1537, 1628, 1730, 1670, 1574, 1477, 1414, 1512, 1550, 1588, 1535, 1643, 1691, 1578, 1475, 1533, 1657, 1780, 1726, 1672, 1628, 1584, 1540, 1496, 1527, 1558, 1509, 1460, 1522, 1583, 1565, 1546, 1566, 1587, 1484, 1380, 1397, 1574, 1621, 1667, 1646, 1625, 1604, 1582, 1485, 1388, 1425, 1462, 1570, 1678, 1653, 1627, 1607, 1587, 1537, 1486, 1352, 1378, 1484, 1430, 1458, 1486, 1504, 1522, 1552, 1581, 1541, 1500, 1389, 1439, 1532, 1626, 1594, 1561, 1529, 1497, 1482, 1466, 1532, 1597, 1607, 1618, 1589, 1559, 1622, 1685, 1560, 1435, 1497, 1560, 1623, 1685, 1679, 1673, 1626, 1580, 1580, 1581, 1621, 1662, 1658, 1654, 1650, 1646, 1597, 1548, 1565, 1583, 1588, 1592, 1607, 1621, 1552, 1643, 1644, 1646, 1581, 1516, 1491, 1466, 1520, 1573, 1626, 1679, 1638, 1597, 1465, 1494, 1513, 1532, 1521, 1510, 1556, 1602, 1608, 1614, 1619, 1623, 1577, 1692, 1712, 1732, 1614, 1497, 1540]
3067A540M2j8J44K6j35l4l4qqm9m8R4R5n3n3J7J7p6p7N2N1J2J1QQJ8J9l0J31J31l0j37j37
3062A489N4N4k6k6O7O7j3j4j4j4p5p5J9J9M8M9RRqqpqK0K0k0k0p1p1M9N0J1J1m9J12R2o8p
3056A655qk8k8J2J3o0n9O1O1j2j1L0K9J1J2n6n5l5l6j66nQ1Q0j3j4J28l4j17j17L2L2P2P2
3051A527L2L2rqk7k7M0M1JKn6n5l2J29kjj9j8K1K2qqj39K3k5k5M2M3Q9p2m8m8Q5Q6J9J9L9
3046A665L9j08j08K3K2j8j7k1k1J26J26j0j0j0j0jkp8p8J87K7q4q4q0p9j3j2N7N7N7N7k6k6
3040A547O8O8j07j07R4R4R6R6n2n1J9J9p5p5%jo8o8n7n8J00R9K02o6r0r0l0l0L7L6O5O5j5
3035A665j6k0j9O0O1j32j32N6N5k6k7k6k6m0l9R5R5m1m1M0L9k1k0O0O0j4j4r4r5L5L4m6m6
3030A420j3j2O8O8l8l8M2M2J13J13p5p5j03j03J38J38%Jrj0P4q7j47J21Q5Q5l3l2j2j2K8K8
$$ y = [1540, 1582, 1564, 1708, 1734, 1599, 1565, 1531, 1523, 1515, 1466, 1418, 1512, 1607, 1554, 1501, 1518, 1535, 1459, 1382, 1434, 1485, 1497, 1508, 1516, 1524, 1542, 1561, 1531, 1662, 1793, 1763, 1626, 1489, 1543, 1597, 1571, 1545, 1612, 1679, 1666, 1652, 1638, 1624, 1549, 1474, 1493, 1512, 1560, 1609, 1618, 1627, 1619, 1611, 1604, 1596, 1616, 1636, 1616, 1596, 1525, 1454, 1503, 1553, 1564, 1575, 1526, 1638, 1730, 1662, 1655, 1647, 1619, 1591, 1603, 1616, 1556, 1497, 1558, 1619, 1607, 1596, 1626, 1655, 1666, 1678, 1622, 1567, 1532, 1496, 1330, 1325, 1406, 1486, 1473, 1459, 1587, 1553, 1436, 1319, 1351, 1383, 1455, 1527, 1559, 1591, 1582, 1574, 1547, 1520, 1560, 1601, 1602, 1604, 1548, 1493, 1461, 1590, 1588, 1587, 1568, 1550, 1571, 1593, 1585, 1577, 1438, 1461, 1436, 1411, 1453, 1496, 1585, 1513, 1465, 1417, 1502, 1588, 1607, 1626, 1665, 1704, 1596, 1488, 1511, 1533, 1515, 1498, 1477, 1456, 1582, 1708, 1698, 1688, 1678, 1668, 1667, 1665, 1587, 1509, 1696, 1723, 1639, 1555, 1475, 1396, 1383, 1371, 1428, 1485, 1542, 1599, 1573, 1547, 1615, 1683, 1576, 1469, 1563, 1657, 1753, 1849, 1797, 1746, 1765, 1784, 1709, 1634, 1634, 1633, 1565, 1497, 1440, 1382, 1482, 1581, 1783, 1717, 1627, 1537, 1507, 1477, 1514, 1550, 1615, 1680, 1665, 1649, 1629, 1610, 1670, 1731, 1599, 1467, 1523, 1578, 1552, 1525, 1499, 1473, 1433, 1394, 1489, 1584, 1543, 1502, 1542, 1581, 1560, 1540, 1600, 1660, 1646, 1632, 1538, 1443, 1478, 1512, 1466, 1420, 1407, 1395, 1463, 1531, 1493, 1455, 1497, 1539, 1652, 1765, 1690, 1615, 1512, 1409, 1547, 1685, 1685, 1686, 1677, 1667, 1741, 1654, 1507, 1628, 1713, 1798, 1765, 1733, 1721, 1709, 1737, 1765]
3026A765n0m9n0n0J3J3J4J3j4j5K6K6n0m9L1L1rj0L1L1n7n7K3K4%JJ%L9L9L8L9L8L8r6r6J6
3020A638J6k5k4m8m8L3L3M7M8PQj06j06k5k5l1l2N0M9J1J0J1J1R8R8l6l7klklm7m7L3L3ml
3014A580mmr7r6L7L7KKM2M2klJ28l3j4j4k5k4O9P0k1k1L7j25l4l5o3o4k0J40J28J28r3r3m9
3009A508J11j9k0l9m0J1J1j5J46O5r5J6J6q5P7p4p4n4n3n7J05J05n7M7M7mlM4M5l7l6J5J4
3004A621NML9j22RRk0k0O1O0k9l0J0J0P8P8lln8n8K3K2l9m0J%P4P3j14j14o1o2J9J9j5j5J5
2998A427J5K44Q3j58KkkL8L8Q2p8J3J2LKKLJ2J2k8k8J1J1o9o9M0M1r4r3N1N1J2J1R6R5l8l8
2993A710o4o4J4R5J07n4r2r3K0K0K0J9m5m5L5L6l8l7KLP1P1rrr5r6qJ53J18m2k2k2l5l4p5
2987A515p5l2l1L8L9R7o5K7K6M0M1J5o5o9R3P7P7K3K2n8n8k8k8l8l8M7j14j4j3j06N5J34N3
$$ y = [1765, 1715, 1666, 1616, 1566, 1579, 1592, 1606, 1619, 1605, 1590, 1616, 1642, 1592, 1543, 1574, 1605, 1596, 1586, 1617, 1648, 1591, 1534, 1557, 1581, 1581, 1582, 1583, 1583, 1622, 1661, 1699, 1738, 1776, 1814, 1718, 1622, 1638, 1654, 1629, 1605, 1557, 1509, 1542, 1575, 1622, 1670, 1677, 1685, 1579, 1473, 1448, 1423, 1392, 1360, 1410, 1459, 1470, 1480, 1491, 1502, 1600, 1698, 1662, 1625, 1623, 1620, 1618, 1615, 1568, 1521, 1554, 1587, 1583, 1580, 1576, 1572, 1475, 1379, 1416, 1453, 1455, 1457, 1499, 1541, 1539, 1536, 1664, 1631, 1617, 1603, 1578, 1554, 1623, 1693, 1672, 1651, 1688, 1563, 1529, 1494, 1431, 1367, 1347, 1487, 1615, 1743, 1650, 1557, 1508, 1619, 1600, 1580, 1541, 1501, 1512, 1523, 1508, 1654, 1719, 1624, 1640, 1656, 1571, 1648, 1574, 1500, 1446, 1393, 1336, 1441, 1546, 1489, 1536, 1583, 1579, 1576, 1620, 1665, 1628, 1592, 1607, 1621, 1626, 1630, 1669, 1547, 1556, 1565, 1545, 1525, 1586, 1646, 1617, 1587, 1597, 1607, 1685, 1763, 1760, 1757, 1699, 1641, 1664, 1686, 1647, 1607, 1608, 1608, 1682, 1755, 1641, 1527, 1466, 1404, 1423, 1442, 1427, 1412, 1427, 1442, 1686, 1769, 1611, 1613, 1611, 1609, 1647, 1685, 1767, 1689, 1702, 1714, 1717, 1719, 1721, 1724, 1736, 1748, 1720, 1692, 1703, 1714, 1645, 1576, 1616, 1657, 1563, 1470, 1521, 1572, 1584, 1595, 1691, 1786, 1748, 1710, 1646, 1582, 1596, 1691, 1798, 1744, 1652, 1559, 1579, 1599, 1619, 1638, 1593, 1548, 1583, 1619, 1581, 1544, 1546, 1549, 1620, 1691, 1682, 1673, 1578, 1482, 1474, 1627, 1745, 1703, 1681, 1659, 1624, 1590, 1515, 1440, 1408, 1377, 1415, 1454, 1551, 1486, 1513, 1539, 1579, 1620, 1635, 1570, 1501, 1594, 1671, 1748, 1771, 1793, 1735, 1677, 1649, 1621, 1583, 1545, 1592, 1478, 1464, 1451, 1345, 1400, 1534, 1587]
2982A587J42k0j16j17j2O9J54pq3q2ppk7N4N8j02k0k0M9J29O1j00nnK0K0k0k0k3k3N8N8jj
2977A641jjL2L2rqj02j02k1k2J25J26J52j16j67po9R1R4R4j9k0q9P2N1N2J2j48j09N3K4K5
2972A666L4L5l2l2n1J09Kj58n7n8M6M7M6M6l2l2J02J02l6l7l6l6K7K7j3j4l6l5M4M5l5l5l5
2967A578l5rj0r0r0L1L2m9m8R7R7J6J7k7k8j8j7m9J11J02J01K8K8n3n3p6p6p6p6R4R4Q4Q4
2962A714O8r2jkL8L7m3m3LKKKj8j7j09N3K5K5L4L5n0n0j0j0J04J03l1l1ppppl6l5j9j9j25
2956A476J43Q2p8k5k4o8R2J10n1m4m5k4k4R6R7j11j11RJ0O3O4O3O3qrqrqrqrk1k0k1k1K9K9
2951A670K8K9KKn8J02M4j17q3q4j9j9Q1q0pJ54J44j7k0k0l0l0L5L5q6q5QRj22L9j7j6opM5
2945A504M4m6J15n6n6ooJ10J10o5o4K5K5j5j5m1m1m1m1R4R4k7k7L7L7k0k0r0P2J28J28n8n9
$$ y = [1587, 1729, 1709, 1593, 1476, 1464, 1533, 1687, 1680, 1597, 1515, 1508, 1501, 1474, 1528, 1586, 1484, 1464, 1444, 1493, 1622, 1683, 1583, 1578, 1573, 1593, 1613, 1593, 1573, 1550, 1527, 1585, 1643, 1642, 1641, 1640, 1639, 1671, 1703, 1694, 1686, 1584, 1482, 1461, 1439, 1564, 1690, 1842, 1726, 1559, 1552, 1483, 1574, 1668, 1762, 1743, 1723, 1634, 1706, 1757, 1809, 1821, 1673, 1564, 1617, 1641, 1666, 1700, 1735, 1703, 1671, 1620, 1729, 1731, 1573, 1516, 1458, 1504, 1551, 1597, 1643, 1611, 1579, 1681, 1783, 1747, 1710, 1674, 1638, 1665, 1692, 1679, 1665, 1629, 1594, 1638, 1683, 1648, 1613, 1578, 1543, 1534, 1524, 1434, 1344, 1375, 1407, 1358, 1310, 1407, 1504, 1520, 1537, 1510, 1482, 1464, 1447, 1398, 1509, 1611, 1712, 1740, 1768, 1715, 1662, 1586, 1510, 1434, 1358, 1452, 1546, 1630, 1714, 1782, 1690, 1689, 1687, 1725, 1762, 1719, 1676, 1679, 1681, 1683, 1685, 1667, 1650, 1541, 1594, 1619, 1644, 1678, 1713, 1663, 1613, 1603, 1593, 1697, 1800, 1769, 1738, 1731, 1724, 1717, 1710, 1674, 1639, 1620, 1601, 1476, 1619, 1701, 1623, 1598, 1574, 1506, 1598, 1708, 1657, 1613, 1568, 1544, 1520, 1616, 1713, 1602, 1491, 1500, 1510, 1573, 1637, 1700, 1763, 1755, 1746, 1738, 1729, 1721, 1712, 1704, 1695, 1674, 1654, 1633, 1612, 1641, 1670, 1698, 1727, 1729, 1731, 1673, 1775, 1819, 1702, 1619, 1535, 1516, 1497, 1578, 1498, 1491, 1645, 1789, 1772, 1752, 1732, 1702, 1672, 1707, 1742, 1656, 1571, 1579, 1588, 1466, 1505, 1488, 1472, 1466, 1459, 1504, 1548, 1502, 1617, 1561, 1505, 1499, 1493, 1603, 1713, 1648, 1584, 1609, 1634, 1619, 1604, 1563, 1522, 1481, 1440, 1534, 1628, 1601, 1574, 1611, 1648, 1628, 1608, 1518, 1590, 1718, 1846, 1788, 1729]
2940A729n8n8j5j5O9O9L6j24j25L6K2K1L1L1J%j20j20O5O5J55nj9j9k8k9J18J19k9k9o3o4
2936A647LMK9K9o4o4%%J0J0m5J15K6K5K3K4L1j31q4P6J61jo8o9l1J29P5q5j05j05k6k5p6Q5
2930A523RRJ9J9N4N5J4J4r5r6jkn9n9J51rk0k1L6L7O0O0K0K0n1n2n1n1M4M4Q4Q4L6L6j38j38
2925A585L3L3J00J00m8m9j08N2M1j20j10N1R5R5o9o9J5J5k5k5P0P0R3o7l4l5j01j02n8J03
2920A531N2N3P2P2MNpppoJ6J7o3o4p9p8N5N5N0M9l0l1j1j1k1k1R6o5K6K6p3p2l2l2O2O3j7
2915A577j8N3N3J3J2l9m0m0l9k2k3l2l2J06n5L6L6L6L5n4J06K1K2K2K2L6j24j65mJ08J09j6
2910A700j5k0j9j10N0K5K4L5L4M4M4l7l7j2j3n3n3j5j5nnp4Q7lllmllk1k2k1k2J35J34j07
2904A617j07K6K7K6K6JJp9q0m1m0L9M0L1L1J12J11j9k0k0j9NOJ5j45l3l3L8L8L0L0n0n0N3
$$ y = [1729, 1671, 1613, 1598, 1583, 1652, 1721, 1757, 1633, 1508, 1544, 1566, 1587, 1618, 1649, 1650, 1650, 1530, 1410, 1475, 1540, 1695, 1690, 1671, 1652, 1624, 1595, 1713, 1832, 1803, 1774, 1711, 1647, 1650, 1654, 1683, 1712, 1648, 1584, 1584, 1584, 1594, 1604, 1559, 1674, 1700, 1725, 1748, 1772, 1803, 1672, 1588, 1664, 1825, 1824, 1756, 1687, 1656, 1785, 1860, 1775, 1670, 1565, 1539, 1514, 1438, 1523, 1532, 1541, 1560, 1579, 1633, 1688, 1702, 1716, 1621, 1525, 1524, 1522, 1463, 1404, 1555, 1546, 1526, 1505, 1541, 1578, 1638, 1698, 1718, 1738, 1687, 1635, 1584, 1533, 1577, 1621, 1705, 1789, 1825, 1861, 1723, 1585, 1618, 1651, 1751, 1851, 1803, 1754, 1646, 1698, 1739, 1619, 1509, 1560, 1655, 1750, 1681, 1612, 1627, 1642, 1617, 1592, 1662, 1732, 1825, 1758, 1724, 1689, 1588, 1486, 1428, 1531, 1583, 1636, 1708, 1780, 1784, 1789, 1782, 1775, 1768, 1762, 1778, 1795, 1732, 1668, 1589, 1511, 1566, 1621, 1671, 1720, 1690, 1659, 1648, 1637, 1616, 1595, 1691, 1626, 1652, 1678, 1605, 1533, 1501, 1469, 1531, 1594, 1577, 1559, 1612, 1665, 1678, 1690, 1651, 1611, 1571, 1532, 1510, 1487, 1455, 1423, 1529, 1474, 1510, 1546, 1582, 1617, 1563, 1669, 1690, 1712, 1734, 1756, 1792, 1668, 1503, 1499, 1607, 1716, 1700, 1685, 1665, 1646, 1536, 1586, 1611, 1635, 1670, 1704, 1748, 1792, 1755, 1718, 1706, 1693, 1640, 1587, 1572, 1557, 1552, 1547, 1473, 1560, 1557, 1554, 1551, 1547, 1544, 1541, 1520, 1498, 1477, 1455, 1590, 1724, 1617, 1510, 1536, 1563, 1589, 1615, 1616, 1617, 1538, 1458, 1417, 1377, 1416, 1456, 1487, 1518, 1630, 1741, 1722, 1702, 1682, 1663, 1668, 1674, 1689, 1544, 1511, 1478, 1516, 1554, 1584, 1614, 1564, 1514, 1567]
2899A567N3J3J3o0o0P4P4r0q9j0rJ22J21j2j2o1o0J20m0j12N0j1j1Q2Q1POo6J5J10n0j40K1
2894A636n5K6R9o2m7m7K8K8n3n3L5L4L4L5k6k7k6k6J7J7N6N7O0N9p5p4o7o6K9n1J5J76n4n4
2889A578j4j4K7K6PQp4p3R1R1J1J0rrn0n0M9M8QQM9M8QRj09j08P9Q0l2l2q6P3pq8kP8P3ql8
2883A656l8N8N8L2m8p7Q3L9m2j00k0J06n4q3kj7j7m0m0Q4Q5K7j34L7L7m5m5L5L6K5K5K6K5
2878A672QPl2l2N3N4j34j33k6k6k6k6R8R7J7J6m7m7Q8Q7mlmlo9o9J1J2k3k2J48j2O1O2q3q3
2872A587N3N3k8k7N7N7k4k3o1o1k0k1R6R6l8l8o1o1P3P3p4p4J7J7q5P5J25l5j28L2O6O7l1
2867A654l0O1j01o8o9N6N5n6n7P8P7j7j7K3K3k7k8N2N3m8m8m8m8qpL3L3J2J3j12j12KJ63P3
2862A560P2lmL7L6P6P6n8n8j02j03L2L1M4M3M3M4r3r2M1M2l0l1N0N0o5o6J5J5rrqrJ7J6J6
$$ y = [1567, 1620, 1633, 1646, 1586, 1526, 1600, 1674, 1584, 1495, 1485, 1476, 1598, 1719, 1707, 1695, 1634, 1574, 1694, 1654, 1542, 1592, 1581, 1570, 1652, 1733, 1740, 1746, 1680, 1695, 1805, 1755, 1615, 1636, 1581, 1607, 1706, 1644, 1597, 1550, 1578, 1606, 1553, 1500, 1535, 1569, 1603, 1638, 1612, 1585, 1559, 1533, 1550, 1567, 1623, 1680, 1740, 1799, 1724, 1650, 1583, 1517, 1546, 1495, 1510, 1686, 1632, 1578, 1564, 1550, 1577, 1603, 1610, 1618, 1544, 1471, 1562, 1653, 1664, 1674, 1665, 1656, 1606, 1556, 1605, 1653, 1661, 1669, 1718, 1766, 1774, 1783, 1674, 1566, 1645, 1725, 1693, 1661, 1575, 1648, 1641, 1553, 1551, 1629, 1702, 1694, 1656, 1618, 1676, 1734, 1766, 1718, 1641, 1724, 1763, 1721, 1621, 1601, 1707, 1653, 1570, 1568, 1551, 1534, 1494, 1454, 1538, 1623, 1650, 1516, 1553, 1590, 1545, 1500, 1535, 1571, 1596, 1621, 1647, 1672, 1680, 1687, 1655, 1623, 1676, 1730, 1596, 1463, 1437, 1411, 1385, 1359, 1457, 1554, 1571, 1587, 1540, 1493, 1581, 1668, 1664, 1661, 1657, 1654, 1585, 1516, 1527, 1539, 1516, 1494, 1642, 1630, 1691, 1753, 1670, 1587, 1640, 1693, 1665, 1638, 1695, 1752, 1728, 1705, 1644, 1583, 1563, 1542, 1638, 1734, 1696, 1658, 1597, 1536, 1609, 1682, 1608, 1534, 1551, 1568, 1483, 1558, 1683, 1648, 1520, 1552, 1618, 1685, 1654, 1624, 1685, 1584, 1516, 1447, 1503, 1558, 1502, 1445, 1523, 1600, 1583, 1566, 1589, 1612, 1585, 1557, 1609, 1662, 1614, 1566, 1518, 1470, 1462, 1455, 1488, 1521, 1533, 1546, 1434, 1322, 1324, 1487, 1560, 1632, 1629, 1625, 1662, 1698, 1774, 1850, 1792, 1734, 1632, 1529, 1561, 1592, 1636, 1679, 1722, 1766, 1673, 1581, 1622, 1664, 1634, 1603, 1653, 1703, 1638, 1572, 1587, 1602, 1593, 1584, 1576, 1567, 1584, 1600, 1616]
2857A616J7J0J1J0J1Q5Q6M8j14n9K1j30L1J05K5n4n5n3n4m3m4o0J00J5J5j1O9L9j22m9L1J2
2852A509J1M3l7q7P4J06K6n3n2k4k4N6N7klQ9p3q9q9j9j9N4N4R4R4k3k3k4k3q1q1N3N3J00
2847A647J00J10n1j6j5j07j06M7M7M7M7n4n4r5r5R4R4J4J3j5j6j17M5J92L1ppoq6j36K4J00
2842A669K0j1j0j4r3n9J03P4P4j0j0k7k6P4q7j69pL9L9J00J01j28j28n4n4M0L9ppqpn8n8n8
2836A282n8J39J39qrM9M8J39k1mllmn8J02O2r9o9p0M1M1O7O6k7k7J8J8k2k2mmK0j41r1r1P3
2831A469P4J03J03p1p2NMl6l6KJO9O9p9p9N9N9J07n4l1l0o7o6K7K7j0j0j00O0Q7Q7L1L0lk
2826A727lkj20j20Q2Q1k8k8k8k8j1j0M7M6N9j01p8p8J04J05J1J0L7L7j4j3J13m7k3k4p8p9
2821A546k8k8q7P4N1N1L0L0l7l7NNl5l6p8p8R6R6k4k5J6J5k2k3J8J8PPP4P3K2K1K1K1j7j7
$$ y = [1616, 1633, 1643, 1654, 1664, 1675, 1760, 1846, 1894, 1780, 1721, 1742, 1612, 1643, 1748, 1773, 1719, 1664, 1611, 1557, 1514, 1470, 1410, 1510, 1525, 1540, 1529, 1598, 1637, 1515, 1466, 1497, 1509, 1520, 1563, 1526, 1439, 1513, 1619, 1645, 1592, 1540, 1516, 1492, 1548, 1605, 1603, 1600, 1689, 1616, 1527, 1438, 1419, 1400, 1454, 1508, 1602, 1696, 1673, 1650, 1626, 1603, 1522, 1441, 1494, 1547, 1647, 1747, 1857, 1806, 1790, 1775, 1668, 1562, 1609, 1656, 1703, 1750, 1696, 1642, 1547, 1452, 1546, 1640, 1654, 1667, 1652, 1636, 1519, 1564, 1756, 1787, 1780, 1773, 1767, 1681, 1545, 1569, 1669, 1689, 1678, 1668, 1654, 1561, 1502, 1605, 1679, 1753, 1743, 1733, 1706, 1680, 1754, 1667, 1498, 1491, 1530, 1569, 1669, 1770, 1642, 1514, 1460, 1406, 1446, 1485, 1478, 1471, 1463, 1456, 1398, 1340, 1282, 1224, 1363, 1502, 1494, 1485, 1534, 1582, 1721, 1700, 1696, 1693, 1690, 1686, 1628, 1730, 1792, 1693, 1624, 1554, 1595, 1636, 1703, 1769, 1742, 1715, 1733, 1751, 1729, 1707, 1703, 1699, 1719, 1578, 1487, 1396, 1469, 1543, 1646, 1749, 1678, 1606, 1611, 1615, 1579, 1543, 1545, 1546, 1615, 1684, 1605, 1526, 1585, 1644, 1751, 1697, 1666, 1636, 1569, 1503, 1530, 1557, 1547, 1537, 1437, 1497, 1584, 1671, 1702, 1732, 1729, 1727, 1724, 1722, 1602, 1482, 1564, 1645, 1617, 1589, 1561, 1533, 1522, 1512, 1559, 1605, 1664, 1563, 1485, 1407, 1511, 1616, 1627, 1637, 1674, 1711, 1697, 1684, 1797, 1750, 1727, 1703, 1625, 1546, 1518, 1490, 1403, 1477, 1528, 1579, 1609, 1639, 1602, 1565, 1570, 1575, 1540, 1504, 1426, 1348, 1444, 1540, 1516, 1491, 1507, 1522, 1500, 1477, 1495, 1513, 1520, 1527, 1601, 1674, 1696, 1717, 1738, 1759, 1742, 1725]
2815A725K3K2m0m1m1m1mnJ26l5k5k5N8N9n6n5j5j5M3M4p7p7L2L3L3L2q5q6QRR8R9m9m8K1K0
2810A665K1K1q5q6L5L5m2m2K4K5noo6R5J56ol5l6Q5p6j42J8J5J6m1m1j%L9L9M1M1k6k6L5L4
2804A678L4L5n1n0n0n0M1M2KKq6q5O2O2J4J4J4J5K1K1Q9Q8m6m7q6q7J00J00POo0o0n9o0P8
2799A648P8L7L8m8m9J9J8l2l2QQJ1J1p2p2p1R1M0M1O2O2nnp3p4l3l2n1n1J7J6O3O4O3O3K8
2793A786K8o3R9j4j3m3m3L1L1j16j16o6o5k6k6J17J17mmo3o3L0L1N8N8o2o3M7M7M7M7o0n9
2788A605k0j9K0J9j0j1k9J32O5r6j50j50J48J48j21j22R6R7J56nq8q9o2o1Q5Q6n3n4O7O7J
2784A652JJJM2M1p9p9j9j8j9j9N7N7o4o3K2K3Q9R0J3J3m4m4j67nJ32J32p7p6M4M5k0k1k0k0
2778A601k2k2K6J85L1j29o3R8K9j32q1Q0J5J5K5K5L6L5n8n8k2k3P2P2l2l1J9J9j51J0J04n8
$$ y = [1725, 1748, 1770, 1730, 1689, 1648, 1607, 1603, 1598, 1724, 1689, 1664, 1639, 1697, 1756, 1700, 1645, 1630, 1615, 1658, 1702, 1625, 1548, 1580, 1613, 1646, 1678, 1593, 1507, 1515, 1524, 1622, 1721, 1672, 1624, 1645, 1665, 1686, 1707, 1622, 1536, 1571, 1606, 1564, 1522, 1546, 1571, 1566, 1560, 1494, 1589, 1745, 1739, 1704, 1668, 1753, 1677, 1535, 1553, 1568, 1584, 1543, 1502, 1501, 1501, 1540, 1579, 1620, 1661, 1635, 1609, 1644, 1678, 1712, 1747, 1696, 1646, 1596, 1546, 1587, 1629, 1631, 1633, 1547, 1462, 1524, 1586, 1600, 1614, 1628, 1643, 1664, 1685, 1774, 1862, 1816, 1769, 1683, 1596, 1696, 1796, 1803, 1809, 1749, 1689, 1630, 1570, 1648, 1726, 1763, 1801, 1753, 1704, 1723, 1741, 1709, 1677, 1685, 1693, 1704, 1715, 1643, 1571, 1500, 1591, 1631, 1672, 1734, 1796, 1791, 1786, 1713, 1639, 1606, 1574, 1523, 1472, 1489, 1505, 1568, 1632, 1695, 1758, 1786, 1814, 1751, 1850, 1836, 1823, 1780, 1737, 1768, 1799, 1683, 1567, 1501, 1436, 1410, 1384, 1501, 1618, 1614, 1610, 1547, 1484, 1514, 1545, 1603, 1661, 1599, 1536, 1583, 1630, 1677, 1724, 1664, 1605, 1585, 1566, 1586, 1605, 1595, 1584, 1555, 1687, 1752, 1656, 1506, 1356, 1504, 1652, 1531, 1409, 1505, 1602, 1758, 1753, 1665, 1576, 1514, 1453, 1538, 1624, 1571, 1517, 1584, 1651, 1652, 1653, 1654, 1655, 1697, 1738, 1659, 1580, 1561, 1543, 1524, 1505, 1562, 1619, 1555, 1492, 1514, 1537, 1626, 1716, 1729, 1742, 1698, 1654, 1487, 1482, 1614, 1746, 1669, 1593, 1637, 1682, 1662, 1641, 1621, 1601, 1579, 1557, 1583, 1768, 1799, 1670, 1607, 1705, 1734, 1602, 1521, 1601, 1616, 1631, 1656, 1681, 1717, 1752, 1694, 1636, 1614, 1591, 1663, 1735, 1703, 1672, 1691, 1710, 1559, 1569, 1673, 1615]
2773A615qqj8j8N2N2N2N2J8J7j19j20n8J03k7k8J2J1J1J2J7J7O8r4M2M1N5j07n9n9o6R5M5
2768A598M6J5J6j3j4q0q0N4N5L4j27j05N6K3K2J5J5L9j23k3k4L3L4K1K2Q9Q8m5m6K2K2J3J2
2763A664k7k7k5k5o5o5L8L9L8L9k5k4k4k5N5N4J45j6kjj2j2lkl3l3j61jJ34k7m9m9K1K1L8
2758A553L7m3m3O3O4J75r4r9j00P2P1o4o4J6J7P3P3R4o8j61jK3K3P1q9JJQ9Q9r2O9J13m8k25
2753A596o4P6P6J36k4o5o5l4l5J5J5o6o6L3L2j01j02O6O6j5j4M2M3M2M3k3k2k3k2J1J1J1J1
2748A584J4J4J4J4N9N9j1j1q3P8j3j2l9l8k8k9q0Q0L1L0K8K7j43J8R2R1p6p6r2O8N8N8n5n4
2743A577P9P9RRRRj4j4j4j4kjkjj3j4K7K7n6n6J5J4Nj55q5P6J17m5j24L6L7j24J7J7N2N3k8
2737A502k7N0N0k0k0k2J39Q9Q8k1k2o2o2O7O7K3j37j14j14l4l4n5J06K5K5j39K2J65Nl1J29
$$ y = [1615, 1607, 1599, 1581, 1563, 1615, 1667, 1719, 1771, 1789, 1806, 1687, 1567, 1509, 1612, 1585, 1557, 1569, 1580, 1591, 1603, 1620, 1637, 1705, 1611, 1653, 1694, 1749, 1642, 1583, 1524, 1458, 1553, 1598, 1644, 1659, 1675, 1662, 1648, 1568, 1488, 1542, 1597, 1631, 1504, 1399, 1455, 1478, 1500, 1515, 1530, 1569, 1446, 1423, 1399, 1432, 1466, 1487, 1509, 1598, 1686, 1641, 1595, 1617, 1639, 1652, 1664, 1637, 1610, 1585, 1560, 1495, 1430, 1468, 1507, 1545, 1584, 1559, 1535, 1511, 1486, 1541, 1595, 1740, 1724, 1722, 1721, 1709, 1697, 1694, 1692, 1659, 1626, 1465, 1464, 1598, 1571, 1522, 1473, 1494, 1515, 1553, 1590, 1547, 1504, 1567, 1631, 1806, 1712, 1613, 1513, 1585, 1656, 1592, 1528, 1544, 1561, 1634, 1707, 1801, 1733, 1572, 1571, 1594, 1617, 1688, 1599, 1600, 1601, 1690, 1779, 1687, 1756, 1869, 1821, 1596, 1532, 1608, 1684, 1820, 1796, 1731, 1666, 1632, 1597, 1612, 1627, 1561, 1495, 1528, 1560, 1459, 1357, 1423, 1489, 1474, 1460, 1502, 1545, 1587, 1630, 1607, 1585, 1562, 1540, 1551, 1562, 1573, 1584, 1598, 1612, 1626, 1640, 1699, 1758, 1747, 1736, 1653, 1731, 1718, 1706, 1667, 1629, 1601, 1572, 1492, 1572, 1603, 1633, 1661, 1688, 1545, 1563, 1655, 1746, 1670, 1594, 1502, 1570, 1628, 1686, 1631, 1577, 1656, 1735, 1744, 1753, 1762, 1771, 1757, 1743, 1729, 1715, 1713, 1712, 1710, 1709, 1696, 1682, 1709, 1736, 1680, 1624, 1639, 1653, 1658, 1503, 1418, 1494, 1611, 1566, 1442, 1478, 1515, 1391, 1408, 1425, 1477, 1530, 1502, 1475, 1525, 1575, 1555, 1535, 1513, 1652, 1741, 1829, 1808, 1786, 1724, 1662, 1729, 1796, 1819, 1682, 1568, 1454, 1420, 1386, 1331, 1437, 1462, 1487, 1348, 1370, 1535, 1540, 1509, 1638]
2732A638K8K9L5L5m5m6P8P7j11j11R6R5N2j09m6m7K3K4l3l3j33K8N2j09K1K2J34k8j8j7K7
2728A608K7M7j14r7O3M4M3P2P1rro0o0k0j9K9K9K9K9J2J3J53pj59LL6L6q5q4L6L5J9J8m9m8
2722A632k8k9L9L9N2N3j5j5M9N0RRONo1o1M8M9j53j52K6K5K6K6N7N7j0j0n5n4J2J3m7m7pp
2717A531N8N8J7J8j5j4j5j4M2M1KJn5n6j5j6J2J1k9k8N2N3j5j4j6j5k4k4O9o4l0l0L6L6O7
2711A615O8M6q8n8K3L2L1llm0l9K8K7m2m3l3J02J15j9p9JL4m7MMnmm5Q9Q3Lj07K6l9M1R9R8
2706A875j28j28l4M7j3j47m9Q6Q3Q3K5K5l8l8l7l8M4M5J04n6p6Q4j6j6RRRRj11j11RRP0P0
2701A659n1n1L2L3n9J03LLr1r1J17m4M0K01m7k07l9m0lllkQ0Q0P7q5l2l3kkp3p3n9K08J55
2695A701nk0j9L0K9l7l8J6J7j48j48m7J13O3O4P5P6m5m5J5J5N6N5n0m9j00O0LLJ3J3Q6Q6l4
$$ y = [1638, 1666, 1695, 1730, 1765, 1720, 1674, 1752, 1829, 1718, 1607, 1703, 1798, 1850, 1741, 1695, 1648, 1671, 1695, 1662, 1629, 1496, 1524, 1576, 1467, 1488, 1510, 1644, 1616, 1598, 1581, 1608, 1635, 1682, 1568, 1471, 1534, 1578, 1621, 1693, 1764, 1755, 1746, 1686, 1626, 1606, 1587, 1616, 1645, 1674, 1703, 1715, 1728, 1881, 1874, 1715, 1718, 1754, 1790, 1705, 1621, 1657, 1692, 1711, 1729, 1680, 1632, 1604, 1575, 1614, 1653, 1705, 1758, 1743, 1728, 1777, 1827, 1836, 1845, 1851, 1856, 1795, 1734, 1782, 1831, 1678, 1526, 1552, 1577, 1603, 1629, 1686, 1743, 1733, 1723, 1668, 1614, 1626, 1639, 1592, 1545, 1538, 1531, 1589, 1647, 1664, 1682, 1667, 1653, 1638, 1624, 1666, 1707, 1709, 1710, 1655, 1599, 1584, 1568, 1580, 1591, 1562, 1534, 1586, 1639, 1624, 1610, 1594, 1579, 1555, 1531, 1600, 1536, 1506, 1476, 1512, 1548, 1615, 1683, 1729, 1641, 1583, 1606, 1638, 1669, 1666, 1663, 1623, 1584, 1612, 1639, 1597, 1554, 1521, 1623, 1738, 1719, 1640, 1641, 1675, 1628, 1632, 1636, 1631, 1627, 1582, 1671, 1754, 1757, 1650, 1676, 1637, 1678, 1777, 1875, 1747, 1619, 1585, 1632, 1619, 1472, 1423, 1509, 1592, 1675, 1700, 1725, 1687, 1649, 1612, 1574, 1618, 1663, 1767, 1711, 1635, 1719, 1703, 1687, 1696, 1705, 1714, 1723, 1612, 1501, 1510, 1519, 1589, 1659, 1608, 1557, 1589, 1622, 1563, 1666, 1669, 1672, 1581, 1490, 1607, 1563, 1603, 1804, 1757, 1550, 1511, 1471, 1468, 1465, 1462, 1460, 1540, 1620, 1697, 1612, 1580, 1547, 1545, 1543, 1470, 1397, 1338, 1546, 1701, 1696, 1676, 1657, 1687, 1716, 1679, 1641, 1657, 1674, 1526, 1378, 1331, 1444, 1507, 1571, 1646, 1722, 1677, 1632, 1647, 1662, 1718, 1773, 1723, 1674, 1574, 1634, 1637, 1640, 1653, 1666, 1752, 1838, 1804]
2690A804l5k2k2M5M5o7o7k6k7oor6O5P2P2J5J5l4l4l4l4q1q0q0q0N0N0J16J17%J%%qqn8J02
2684A664j4j5mnkkkklkllO9O9K9K9p2p3l2l2j9j9P5P4L3L3j14j14rrL1L1qqQ6Q5%jn7n8n2
2678A574J10J8J9kjjkM8M8m6m6k9k9k9k9NOl5l5M6M6OOl4l4PON0M9J6J78Mj56j23j23L2L2
2672A552L2L3O9P0LLj52j52P5P6O9O9KKl1l0l1l1K8K8O8O8r9r9j59KJ26l4RJ0o5R7P3P3j9
2667A735j9M9M8r0r1k3k4L9M0q2q1J3J3J4J3J6J6M6M6R9o2l9l8n5n5N6N6J18m3k0k0l7l7N6
2662A657N7j7j6j7j6o7o7%%K2K3K3K2j5j5j4j5QPQ5Q5p5Q6nn%Jo7o7M7M6M7M6j15j15NNL2
2656A596L3qqQRl1l2M9M8QQL3L2k5k4n7J03J04n7qqj8j8PPOPJ2J3J03n8j7j7q3q4J6J78Q7
2650A914Q7J01J01K91K92k05l66j55j54o7o7k7k6j7j6N0N1k4k4J6J6poO0O1qqrqm3m4m3m3
$$ y = [1804, 1769, 1747, 1725, 1770, 1815, 1748, 1681, 1655, 1628, 1622, 1616, 1520, 1585, 1657, 1729, 1744, 1759, 1725, 1691, 1657, 1623, 1542, 1462, 1382, 1302, 1352, 1402, 1518, 1635, 1635, 1636, 1636, 1636, 1628, 1620, 1562, 1664, 1650, 1635, 1631, 1626, 1624, 1622, 1620, 1618, 1615, 1613, 1610, 1607, 1676, 1745, 1774, 1803, 1731, 1658, 1626, 1594, 1575, 1556, 1631, 1705, 1738, 1771, 1657, 1543, 1534, 1525, 1556, 1587, 1579, 1571, 1657, 1742, 1742, 1741, 1684, 1626, 1574, 1684, 1702, 1721, 1719, 1718, 1717, 1715, 1763, 1811, 1765, 1719, 1690, 1661, 1632, 1603, 1608, 1614, 1579, 1544, 1590, 1636, 1642, 1648, 1614, 1580, 1587, 1593, 1643, 1692, 1708, 1886, 1890, 1734, 1611, 1488, 1520, 1552, 1584, 1617, 1686, 1756, 1759, 1762, 1610, 1458, 1533, 1609, 1678, 1747, 1749, 1751, 1720, 1690, 1659, 1628, 1656, 1684, 1752, 1820, 1721, 1622, 1463, 1465, 1591, 1557, 1566, 1576, 1511, 1608, 1681, 1754, 1735, 1716, 1765, 1813, 1723, 1632, 1609, 1585, 1624, 1664, 1582, 1501, 1514, 1527, 1541, 1554, 1570, 1586, 1632, 1678, 1777, 1715, 1676, 1638, 1583, 1528, 1584, 1640, 1758, 1715, 1695, 1675, 1638, 1601, 1657, 1714, 1697, 1681, 1664, 1648, 1581, 1514, 1514, 1514, 1536, 1559, 1582, 1604, 1589, 1574, 1560, 1545, 1553, 1560, 1645, 1730, 1655, 1741, 1736, 1731, 1731, 1732, 1665, 1598, 1645, 1691, 1738, 1784, 1669, 1554, 1559, 1564, 1596, 1629, 1621, 1613, 1621, 1630, 1599, 1567, 1616, 1664, 1672, 1680, 1713, 1745, 1720, 1696, 1639, 1742, 1846, 1789, 1781, 1773, 1755, 1737, 1744, 1751, 1757, 1764, 1776, 1789, 1892, 1834, 1817, 1800, 1717, 1633, 1649, 1827, 1914, 2001, 2102, 2203, 2494, 2786, 2581, 2215, 2060, 1906, 1839, 1772, 1745, 1719, 1702, 1686, 1736, 1787, 1763, 1739, 1755, 1771, 1764, 1758, 1818, 1879, 1871, 1863, 1854, 1846, 1803, 1759, 1716, 1673]
2645A673N2N2m1m2j7j7P6P7q0q0j3j3k8k8L9L8L9L8n5n6k8k9O0O0j6r6r7O5J3R4L6m3k0j9
2640A594k4k4J9J8J9J8J3J3J3J2M5M4NMP8P8r6r7J6J6p7p8mlm3m4J22J23k5k5n3n2n3J07K
2635A661p8l3M7O2j8L1L2L2L3q8q9L5L4O8r3l7J24J24l7j36K5m5m6J39k2o2R9j2j2kkJ1J1
2630A756l0k9k6k6J5J4j9j9p4Q6J4o8N5N5oopoO4O4j10j11m4m4P6P7KJJ42j8j73j2K13n5N
2624A756Np9p9l9l8N5N5O3O3J13m8m8m9n8n9M6M6m8m8MNNNK7K7K7K8j10j11q0Q1P8P8onRR
2619A680N0M9mmm4m5k9k9O4O5j03j03M4M5J08J08l9m0l3l3p3p3L3L4o0n9k5k4R7R7O1O1n9
2614A717n9N6N6r1r1o1o1q5P6J04J03J0Rj10J58R7o3l3l2lkL2L3l4l5J3J2J3J2kll2l3r3O7
2608A645k3k3MNP1P2j8j9o8o8R3o8J3J3P6q6j25L5Q2Q1n6n6M4M4n0n1l5l5N9N9p1p2mnQ6Q6
$$ y = [1673, 1725, 1777, 1736, 1694, 1677, 1660, 1736, 1813, 1733, 1653, 1640, 1627, 1599, 1571, 1610, 1648, 1687, 1725, 1670, 1614, 1586, 1557, 1617, 1677, 1661, 1565, 1468, 1533, 1546, 1640, 1676, 1633, 1613, 1594, 1570, 1546, 1565, 1583, 1602, 1620, 1633, 1646, 1659, 1671, 1716, 1760, 1765, 1769, 1847, 1925, 1829, 1732, 1748, 1764, 1687, 1609, 1605, 1602, 1559, 1515, 1637, 1760, 1735, 1710, 1657, 1605, 1552, 1659, 1661, 1583, 1550, 1597, 1659, 1641, 1672, 1704, 1736, 1769, 1681, 1592, 1627, 1661, 1729, 1636, 1599, 1723, 1847, 1810, 1674, 1699, 1654, 1608, 1747, 1725, 1663, 1762, 1750, 1738, 1736, 1734, 1745, 1756, 1726, 1697, 1671, 1645, 1660, 1674, 1655, 1636, 1562, 1648, 1662, 1594, 1649, 1704, 1698, 1692, 1685, 1679, 1743, 1807, 1697, 1586, 1542, 1498, 1574, 1651, 1653, 1654, 1796, 1778, 1605, 1593, 1806, 1751, 1756, 1761, 1682, 1603, 1564, 1526, 1581, 1636, 1699, 1762, 1875, 1827, 1779, 1730, 1672, 1613, 1659, 1705, 1657, 1609, 1613, 1618, 1623, 1628, 1655, 1682, 1709, 1737, 1627, 1516, 1436, 1517, 1595, 1673, 1667, 1662, 1671, 1680, 1730, 1779, 1775, 1771, 1727, 1682, 1653, 1624, 1688, 1753, 1650, 1547, 1591, 1636, 1744, 1852, 1813, 1773, 1740, 1707, 1634, 1561, 1594, 1628, 1568, 1509, 1484, 1460, 1557, 1654, 1715, 1776, 1717, 1658, 1714, 1770, 1679, 1588, 1527, 1466, 1381, 1457, 1561, 1664, 1674, 1683, 1573, 1731, 1828, 1765, 1732, 1700, 1697, 1695, 1727, 1760, 1726, 1691, 1704, 1716, 1729, 1741, 1739, 1736, 1704, 1671, 1578, 1645, 1622, 1599, 1603, 1608, 1679, 1751, 1733, 1714, 1646, 1578, 1671, 1603, 1616, 1629, 1705, 1619, 1494, 1529, 1611, 1692, 1636, 1580, 1624, 1668, 1618, 1567, 1532, 1497, 1556, 1615, 1544, 1472, 1468, 1463, 1549, 1635]
2603A635KLk19n8jjJ29J30j8j8j29j28P2P3M8M8M8M8L9L8jkp2p3l3l2j3j2L8L8o6R5l6l6P7
2598A613P8j7j6J4J3J4J4rrqrm1m0l7J23O6O6p2p1llm3m3PQP4P5k9k9k8k9K6K6k4k4J07n3
2592A687r4O7K0K0l7l7m2m2P9P8R5R5KJk1k2k1k1q6q6j9j9q4q3O4O4OOo0o1R0R0M9N0J9J9
2586A766p5p5J3J3J3J4k3k3L4L4J5j45J2J3K6K7K7K7n8n8l7J23N0j11J9K0J24l8j31L0J4J3
2581A653m3m3L7L7n6n7Q0Q1J3J3n0n0P0P0m3m4N0N0L2L2q9q9n7n7L7L7%jJ91p7l5l6j2j3n0
2576A581n1P0O9l5l6MMP0O9n1n1L1L0Q1Q0j23L8lkr8O3k7k7l0l0L7L7qqL2L2m5m4m4m5k6k5
2571A519MMN7j04n3n4Q6Q6J8J9m5m5mnN5N5J5J5k5k5Q5Q5Pj53o8J2kkl7l7M7M7L7L6O5r6M
2565A603Mr7O4P3q7j02N9R3J3M2l9KKN0M9m4m4RRq4q5jjO7O6O8O9j33j32l9l9Q2Q2J6J7k4
$$ y = [1635, 1637, 1640, 1421, 1363, 1362, 1361, 1490, 1620, 1602, 1584, 1455, 1327, 1399, 1472, 1520, 1568, 1616, 1664, 1703, 1741, 1740, 1738, 1666, 1593, 1560, 1528, 1515, 1503, 1541, 1579, 1513, 1608, 1572, 1536, 1613, 1691, 1674, 1658, 1672, 1685, 1699, 1713, 1704, 1695, 1687, 1678, 1637, 1597, 1560, 1683, 1749, 1815, 1743, 1672, 1669, 1666, 1623, 1580, 1587, 1595, 1669, 1744, 1715, 1686, 1658, 1629, 1655, 1681, 1657, 1633, 1740, 1687, 1593, 1660, 1680, 1700, 1663, 1626, 1584, 1542, 1621, 1699, 1794, 1889, 1891, 1892, 1871, 1849, 1828, 1807, 1721, 1635, 1616, 1597, 1513, 1430, 1494, 1558, 1564, 1570, 1510, 1449, 1539, 1629, 1678, 1728, 1747, 1766, 1691, 1616, 1629, 1642, 1655, 1669, 1646, 1623, 1657, 1691, 1706, 1561, 1573, 1586, 1612, 1639, 1666, 1693, 1635, 1577, 1540, 1663, 1713, 1602, 1621, 1641, 1765, 1727, 1596, 1626, 1640, 1653, 1610, 1567, 1604, 1641, 1585, 1528, 1608, 1689, 1702, 1715, 1665, 1615, 1685, 1755, 1712, 1668, 1718, 1768, 1800, 1832, 1743, 1654, 1597, 1540, 1577, 1614, 1614, 1613, 1804, 1727, 1692, 1656, 1644, 1631, 1581, 1530, 1600, 1669, 1634, 1598, 1602, 1606, 1676, 1745, 1694, 1643, 1674, 1704, 1785, 1865, 1742, 1780, 1777, 1775, 1677, 1740, 1713, 1686, 1656, 1626, 1663, 1700, 1692, 1684, 1716, 1748, 1703, 1659, 1615, 1570, 1544, 1519, 1523, 1527, 1584, 1480, 1427, 1373, 1459, 1545, 1563, 1582, 1537, 1492, 1488, 1483, 1538, 1593, 1608, 1623, 1598, 1573, 1658, 1743, 1750, 1597, 1529, 1541, 1539, 1537, 1500, 1463, 1510, 1557, 1594, 1630, 1695, 1599, 1603, 1607, 1510, 1574, 1647, 1560, 1458, 1517, 1610, 1623, 1665, 1626, 1628, 1630, 1680, 1729, 1685, 1641, 1650, 1659, 1575, 1490, 1489, 1488, 1555, 1621, 1689, 1758, 1625, 1493, 1454, 1415, 1497, 1579, 1595, 1612, 1588]
2559A588k4Q0Q1m1m1j3j3q0q0P9P9j5j4o8o7k8k7K2K2O3O2N0N0N0M9l5l4l5l5J9J9J9J9pp
2554A687ppL7L7n7n7l1l1L6L6n7n7J17J17k2k1N5N5j51J0l5l6qP3J68Qj04N7J2o9j14M6O8
2549A755j2j45o4j8O3P4oM4M3J3J4k7k8L9L8QQp5Q5R5o6j11M9n5k15L3L4R1R0J5J6l5l5J03
2544A818n8j78j8j9j9N8N8J7J6k4k4K7K8K7K7Q3Q3o5o5o4o4MLl7l7LLJ%JJk0k0P4P5k6k6J06
2538A749n6n0n0L4L4r5r5J32J33j0j0L0L0KJKKppQ4p7N8N9l5l6m1J19r2r1KLLL%JM0M1l3l2
2532A745k33L4M7j15j38K3R8R9O8O8r7r8mlK9K9J19m1m5m5r5r5J03J03R7R8m8j28o3R8J01
2527A711n9p2J0QRJ4J4K3K4m4m4M2M1k5k5M6M6Pp3r6O4K0o1m1M1L0L0O5O6n5n6l8l9KKO1O1
2522A709R1R2J8j42j03k1j8r7R1J1p0p0P2P3K5K6o9o8M9N0J0RL5L6L5L5l5l6M1M1j60JM6j14
$$ y = [1588, 1564, 1644, 1725, 1684, 1643, 1630, 1617, 1537, 1457, 1536, 1615, 1600, 1586, 1518, 1451, 1423, 1396, 1418, 1440, 1503, 1565, 1615, 1665, 1715, 1764, 1729, 1695, 1660, 1625, 1644, 1663, 1682, 1701, 1694, 1687, 1680, 1673, 1710, 1747, 1690, 1633, 1602, 1571, 1607, 1643, 1586, 1529, 1646, 1763, 1741, 1720, 1775, 1830, 1679, 1689, 1654, 1618, 1610, 1683, 1851, 1859, 1755, 1812, 1824, 1755, 1641, 1687, 1755, 1743, 1598, 1534, 1516, 1579, 1653, 1647, 1691, 1734, 1747, 1761, 1734, 1706, 1745, 1783, 1791, 1799, 1724, 1809, 1904, 1838, 1727, 1776, 1721, 1506, 1539, 1573, 1664, 1754, 1769, 1785, 1750, 1715, 1818, 1760, 1582, 1564, 1545, 1526, 1584, 1642, 1659, 1675, 1651, 1627, 1654, 1682, 1709, 1736, 1819, 1902, 1837, 1772, 1708, 1644, 1648, 1651, 1614, 1577, 1580, 1583, 1584, 1584, 1585, 1586, 1566, 1546, 1620, 1695, 1669, 1643, 1749, 1693, 1643, 1593, 1627, 1661, 1566, 1471, 1603, 1736, 1726, 1716, 1746, 1776, 1778, 1779, 1781, 1783, 1776, 1769, 1853, 1776, 1834, 1893, 1858, 1822, 1781, 1900, 1808, 1717, 1719, 1722, 1725, 1728, 1728, 1729, 1769, 1810, 1777, 1745, 1512, 1546, 1593, 1478, 1340, 1363, 1461, 1560, 1628, 1696, 1599, 1501, 1497, 1494, 1523, 1552, 1671, 1630, 1585, 1540, 1445, 1350, 1453, 1556, 1653, 1751, 1703, 1575, 1512, 1610, 1711, 1652, 1580, 1590, 1598, 1607, 1621, 1635, 1658, 1682, 1638, 1594, 1636, 1677, 1652, 1627, 1673, 1719, 1726, 1653, 1557, 1621, 1641, 1580, 1539, 1580, 1610, 1640, 1705, 1771, 1716, 1660, 1622, 1583, 1585, 1587, 1648, 1709, 1800, 1892, 1910, 1768, 1665, 1644, 1626, 1529, 1620, 1631, 1561, 1491, 1563, 1636, 1661, 1687, 1618, 1550, 1599, 1649, 1659, 1668, 1703, 1739, 1774, 1809, 1774, 1738, 1779, 1820, 1660, 1661, 1707, 1593]
2516A593j8O3QQLMRRmP6R2o9j08N3kq3ppj2j2l5l4OOL6L6L6L6j1j2P2P2K8j33n3K8R6J5r7
2511A688O5kq3k2k2o6J4J27l4NOm5m5k6k7P3P3m1M1R0p1r4j4N2N2L3L4l3l3m6m7P3P4q7q7
2505A575PPL1L2rrj0rj0rM4M5j2j73M6M6R2o9mP7q0Q2Q9p1j1j2M8M8p3p3K9K8K9K8m1m1jj
2499A665j1j1j1j1Q7Q8l4l3M2M2p8p9K0J9p0Q9RRPp4r9O2M3M3n4J07n9j40p6p7O6O6J19J20
2494A786jko8o9k9k9K5K4j6j7K8K7J7J8R5o6K5K4j6j7j6j7j4j4j5j4k1k1J9K0L4L4L4L5n6
2489A727n6J2J1L3L2o1o2r4r5%jNNM6M5pqM8l2J8J79J35k7j01j00J5J5k3N7M0j20j02k2N9
2484A571j03r5j5J30J31kjj59JL1L1OOQQ8J34k7j3j3J7J7r8r7l1l1llO4O3J9J8J9J8J3J3J2
2478A719J3j9j9j9j8J2J2m3L7J34k7r8j7O3O2k6k7j7j7M9N0K3K3p1p1k4k4o4o4J1J0J11m9
$$ y = [1593, 1575, 1638, 1646, 1654, 1657, 1661, 1670, 1679, 1675, 1751, 1843, 1774, 1666, 1719, 1717, 1634, 1627, 1620, 1608, 1596, 1561, 1527, 1533, 1539, 1575, 1611, 1647, 1683, 1672, 1660, 1732, 1804, 1832, 1699, 1646, 1674, 1770, 1785, 1688, 1753, 1751, 1668, 1646, 1624, 1558, 1572, 1699, 1665, 1670, 1676, 1631, 1586, 1560, 1533, 1606, 1679, 1638, 1679, 1769, 1698, 1604, 1590, 1642, 1694, 1727, 1761, 1728, 1695, 1649, 1602, 1675, 1749, 1662, 1575, 1582, 1589, 1620, 1652, 1643, 1634, 1624, 1615, 1605, 1596, 1640, 1685, 1673, 1500, 1546, 1592, 1684, 1615, 1611, 1688, 1608, 1690, 1779, 1708, 1697, 1685, 1733, 1781, 1708, 1635, 1664, 1692, 1721, 1749, 1708, 1667, 1666, 1665, 1654, 1643, 1632, 1621, 1708, 1796, 1762, 1729, 1771, 1813, 1735, 1656, 1676, 1695, 1625, 1714, 1723, 1732, 1739, 1665, 1566, 1628, 1671, 1714, 1660, 1767, 1708, 1568, 1492, 1415, 1481, 1547, 1666, 1786, 1785, 1783, 1715, 1646, 1617, 1588, 1613, 1637, 1621, 1604, 1632, 1659, 1676, 1694, 1789, 1723, 1748, 1772, 1756, 1739, 1723, 1706, 1692, 1678, 1663, 1649, 1628, 1607, 1626, 1646, 1680, 1714, 1748, 1783, 1727, 1671, 1683, 1694, 1727, 1759, 1698, 1636, 1542, 1447, 1447, 1446, 1451, 1456, 1502, 1547, 1540, 1532, 1580, 1548, 1566, 1745, 1880, 1853, 1752, 1652, 1667, 1682, 1659, 1716, 1756, 1636, 1534, 1512, 1571, 1468, 1373, 1358, 1488, 1619, 1617, 1616, 1457, 1458, 1489, 1520, 1526, 1532, 1540, 1628, 1762, 1735, 1722, 1709, 1726, 1743, 1645, 1548, 1517, 1486, 1483, 1480, 1544, 1607, 1626, 1644, 1663, 1681, 1694, 1707, 1719, 1732, 1713, 1694, 1675, 1657, 1669, 1681, 1638, 1675, 1809, 1782, 1684, 1667, 1730, 1792, 1766, 1739, 1722, 1705, 1754, 1804, 1827, 1850, 1779, 1708, 1684, 1660, 1596, 1532, 1543, 1553, 1664, 1615]
2473A615q6P5R5R5oom7m6P2P2k1k2J%m0m0K6K6m1m1k3k4k3k4NNM6M5N4N5j3j2l5l5L2L3L2
2468A799L2K9j32p5p6O2O2K0K0K1K0onQ5p6p9p9k3k2j3j2M4M4O1j00L0L1M3M3p8p7J7J7M0
2462A667M1J38j29L1L1j14M7Q7p3L8L9r2r2R5R4n2n3j2j2j2j2n8n8q2Q0O7O7p0p0M0M0J31
2457A742l0rrj8j9K9L0l7l8O8O8q0p9J6J7J07n3m9m8k8J33J7J7K4j37K7K8K7K7q4P7J7J6N6
2452A825j05n4n5JJN1N1j05N6NNk0k1k0k1M5M5m9m9K2K1K1K2M1M2JJJ6J6p7p8L4L4L4L4K0
2447A790K0Q7Q7k7k7r4r3j9j8j8j9rj0j0j0n8n9L6L5MMk0J42R4R5r7r6o8o8Q0Q0l9l9j30L1
2441A557J7J6L6L7o4R6POJ9J9J8J9J6J5p8p9mmO3O3n9n9PQq9r0r6O5J27l4k7k7R8R9N9N8k9
2436A786k9l0k9L1L1l6l6j5j5K5K5r9r9NNj19M1J24J25j0j0j%k7J34n0n1qrqqR7R7L0L0k3
$$ y = [1615, 1529, 1604, 1699, 1794, 1788, 1782, 1735, 1689, 1761, 1833, 1812, 1790, 1791, 1791, 1751, 1711, 1737, 1763, 1722, 1681, 1658, 1634, 1611, 1587, 1592, 1597, 1643, 1688, 1742, 1797, 1784, 1772, 1737, 1702, 1734, 1767, 1799, 1831, 1860, 1728, 1653, 1577, 1639, 1701, 1721, 1741, 1762, 1782, 1776, 1771, 1856, 1780, 1701, 1622, 1599, 1577, 1564, 1552, 1596, 1640, 1701, 1601, 1631, 1662, 1705, 1748, 1670, 1593, 1610, 1627, 1667, 1708, 1846, 1717, 1748, 1779, 1665, 1712, 1799, 1726, 1764, 1803, 1711, 1619, 1714, 1808, 1756, 1703, 1691, 1679, 1667, 1655, 1597, 1539, 1457, 1537, 1604, 1671, 1601, 1531, 1571, 1611, 1742, 1712, 1703, 1694, 1676, 1657, 1686, 1716, 1679, 1641, 1709, 1777, 1697, 1618, 1634, 1651, 1758, 1705, 1656, 1608, 1580, 1713, 1730, 1747, 1771, 1634, 1661, 1689, 1716, 1743, 1659, 1736, 1753, 1769, 1825, 1720, 1666, 1611, 1612, 1613, 1664, 1715, 1610, 1666, 1671, 1676, 1656, 1635, 1615, 1594, 1639, 1684, 1635, 1586, 1608, 1629, 1650, 1672, 1713, 1755, 1756, 1757, 1773, 1789, 1712, 1634, 1668, 1702, 1736, 1770, 1790, 1810, 1897, 1984, 1957, 1930, 1836, 1743, 1724, 1706, 1688, 1669, 1660, 1650, 1640, 1630, 1572, 1513, 1549, 1584, 1588, 1592, 1572, 1714, 1808, 1903, 1806, 1710, 1642, 1574, 1654, 1734, 1695, 1656, 1526, 1557, 1574, 1590, 1626, 1663, 1599, 1695, 1702, 1708, 1727, 1746, 1764, 1783, 1799, 1814, 1736, 1657, 1653, 1649, 1712, 1775, 1716, 1657, 1664, 1672, 1583, 1493, 1397, 1462, 1589, 1555, 1528, 1501, 1599, 1698, 1757, 1815, 1786, 1757, 1727, 1698, 1729, 1760, 1724, 1688, 1673, 1658, 1683, 1708, 1609, 1510, 1515, 1520, 1401, 1442, 1566, 1691, 1681, 1671, 1670, 1670, 1643, 1777, 1727, 1676, 1668, 1659, 1651, 1643, 1740, 1837, 1867, 1897, 1874]
2430A874k3k3k2j8j7Lp7j23J19O8j2j09k8J5J6J6J6O9j0p6N9M5M6m4m4q4q4L1L2rrl4l4O0
2425A589O0O4O5j09j10K4K4m4m3j8j8M9M8J16J16n9n8p2p2K1K2M9M9QQQQPQp0p0N1l0m1R3
2420A673Q8m7m3m3J5J6L6L7o6o6P1o3j61K7R5R4j5j4K6K5o8o8M2M2N8k2r1R6L0m9klL4L3K9
2414A746K9l8l8mmR0R0%j%jk8k8k8k8l3l3l3l4n0n1J6J6K5K4K4K4QQQQONONM6M6m0l9Kp8J38
2408A781k3j03j04P5P4J4J4J4J4J6J5n4n5r4O6J42j9j7r7j9J42n1n1R5J4j46J4%jKKKKn3n3
2403A558K7K7LKp8p8N9N9O5O4l2M9R4o7m6m5n5n6L4L3L4L4n9n9J7J7K9n1r2O9m3L8J03n8l8
2397A558J22O8j3N5N5N9O0j06N4M9l1l2l2j18j17M3M2l7l8n4n3j4j3M3M3M3M3K3K4jq2j36
2392A507K5J18J17k1k2k1k2k9k8J10J10K4J05K0j40n2K7N8k2r0r1j5j4O0O0p4p4onnoQ3Q2
$$ y = [1874, 1851, 1828, 1806, 1788, 1771, 1774, 1697, 1574, 1693, 1761, 1749, 1640, 1612, 1627, 1643, 1659, 1675, 1744, 1734, 1658, 1717, 1762, 1808, 1764, 1720, 1636, 1552, 1583, 1615, 1606, 1597, 1563, 1529, 1589, 1649, 1713, 1778, 1669, 1559, 1583, 1607, 1563, 1520, 1502, 1484, 1533, 1581, 1697, 1813, 1754, 1696, 1624, 1552, 1573, 1595, 1644, 1693, 1701, 1709, 1717, 1725, 1732, 1740, 1670, 1600, 1651, 1621, 1580, 1673, 1761, 1714, 1671, 1628, 1643, 1659, 1695, 1732, 1666, 1600, 1671, 1608, 1447, 1474, 1569, 1663, 1648, 1634, 1660, 1685, 1617, 1549, 1591, 1633, 1691, 1669, 1578, 1674, 1704, 1655, 1653, 1650, 1684, 1717, 1746, 1775, 1737, 1699, 1695, 1691, 1781, 1871, 1871, 1870, 1870, 1869, 1841, 1813, 1785, 1757, 1724, 1691, 1658, 1624, 1574, 1523, 1539, 1555, 1580, 1604, 1628, 1652, 1660, 1668, 1676, 1684, 1690, 1695, 1701, 1706, 1752, 1798, 1758, 1719, 1721, 1643, 1781, 1758, 1655, 1551, 1626, 1700, 1714, 1728, 1742, 1756, 1772, 1787, 1733, 1678, 1584, 1650, 1792, 1773, 1756, 1659, 1640, 1782, 1731, 1680, 1775, 1789, 1643, 1657, 1657, 1656, 1658, 1660, 1662, 1664, 1611, 1558, 1585, 1612, 1615, 1617, 1539, 1461, 1520, 1579, 1644, 1708, 1676, 1725, 1819, 1752, 1706, 1661, 1606, 1550, 1584, 1617, 1651, 1685, 1626, 1567, 1584, 1601, 1630, 1579, 1487, 1556, 1513, 1551, 1654, 1596, 1558, 1680, 1748, 1735, 1790, 1845, 1904, 1964, 1858, 1912, 1961, 1930, 1898, 1866, 1748, 1631, 1674, 1716, 1679, 1641, 1587, 1534, 1520, 1507, 1550, 1593, 1636, 1679, 1702, 1726, 1725, 1643, 1507, 1532, 1650, 1767, 1746, 1724, 1703, 1681, 1652, 1624, 1734, 1844, 1868, 1973, 1993, 1853, 1801, 1828, 1886, 1864, 1774, 1683, 1668, 1654, 1714, 1774, 1700, 1626, 1620, 1615, 1610, 1604, 1687, 1769]
2387A769j05j06J2J2PPJ45O5P7q4j68pL7L6j6J44k6k6nmj0rj1r2o1R9M6l5K1K1q1q1N4N3p
2382A671pppM8M7l3l3l3l3PQM7M7QPj37j37J05J04K4K4K4K4M1M2kj63K0K0l0l0J8J7J8J7j7
2377A719j8j8j8P5P5k2j83K3K2k8k8K8K9n2n3LKKKN5N5q5P5P5q7N0J30J2J2o4o3K8K8K7K8
2371A836o4o4o4o5N7N6N7N6MLMLJ8J8p6p6O9O9KKM3M3j41K0o6o5J1J1j9j9M7M8l1l1RRN4N3
2365A821LLk7j88l0l1n2n3N2N1PJ67J9K0j62jN6N6K1K2o3o2o6R5R4o6k3k2l3l3N1N1j6j7j4
2360A630j5j4j5N3N3J2J2k8k7k8k8RRl1l1L1L2rqL9L9%jP1P1l9m0n8J02P9P8o0o0OPM2M3L9
2354A965j22nnq1q2llQ1Q0Rj52nmJ37k3L7j24q2q3k6k6K9K9K9K8k2k3J09n3M2M1qrQ4Q3L4
2349A876L3M1j20p0p0l4l5l1J30J6J6o7o8l0l0R1R1n0m9n0m9L8L9kkL1L2rrm4m4j4J47k8k8
$$ y = [1769, 1664, 1558, 1570, 1582, 1589, 1596, 1741, 1806, 1883, 1799, 1631, 1624, 1661, 1697, 1681, 1825, 1799, 1773, 1768, 1764, 1754, 1745, 1734, 1642, 1581, 1680, 1726, 1691, 1712, 1733, 1652, 1571, 1625, 1678, 1671, 1664, 1657, 1650, 1698, 1745, 1712, 1679, 1646, 1613, 1620, 1628, 1675, 1722, 1730, 1737, 1600, 1463, 1568, 1672, 1696, 1720, 1744, 1768, 1809, 1851, 1849, 1686, 1706, 1726, 1696, 1666, 1684, 1701, 1719, 1736, 1719, 1701, 1683, 1665, 1740, 1815, 1793, 1610, 1633, 1655, 1627, 1599, 1627, 1656, 1604, 1551, 1554, 1556, 1558, 1560, 1615, 1670, 1585, 1660, 1735, 1648, 1698, 1828, 1840, 1852, 1788, 1725, 1753, 1781, 1808, 1836, 1772, 1708, 1644, 1579, 1636, 1692, 1749, 1805, 1809, 1812, 1816, 1819, 1837, 1855, 1779, 1703, 1772, 1841, 1843, 1845, 1888, 1931, 1790, 1810, 1744, 1679, 1690, 1701, 1682, 1663, 1710, 1758, 1727, 1696, 1705, 1714, 1768, 1821, 1824, 1827, 1800, 1612, 1582, 1551, 1499, 1446, 1498, 1549, 1556, 1723, 1742, 1762, 1600, 1599, 1655, 1711, 1732, 1754, 1691, 1629, 1563, 1658, 1752, 1686, 1663, 1641, 1608, 1575, 1626, 1677, 1661, 1644, 1630, 1615, 1601, 1586, 1639, 1692, 1704, 1716, 1688, 1661, 1633, 1605, 1614, 1623, 1592, 1561, 1592, 1624, 1615, 1607, 1646, 1685, 1685, 1684, 1755, 1826, 1787, 1747, 1689, 1791, 1870, 1948, 1888, 1828, 1834, 1841, 1883, 1926, 1965, 1843, 1838, 1833, 1752, 1670, 1667, 1664, 1745, 1825, 1834, 1682, 1677, 1673, 1810, 1787, 1824, 1700, 1618, 1535, 1509, 1483, 1512, 1541, 1570, 1598, 1576, 1553, 1662, 1609, 1651, 1692, 1684, 1675, 1759, 1842, 1876, 1909, 1950, 1830, 1760, 1690, 1656, 1621, 1590, 1720, 1736, 1752, 1685, 1617, 1587, 1557, 1648, 1739, 1689, 1640, 1590, 1541, 1579, 1618, 1616, 1614, 1645, 1677, 1668, 1659, 1615, 1571, 1557, 1704, 1676, 1648]
2343A648K3K2j9j9P4P4L7L6J6j45j12N0r1r2R2R3l9J23p1p0J04J04l2j92M5M6K7K7o7o7N5
2339A680N5q3q2M2K03M5M6p5p4p4p4K5K6j5j5N1N0m4m3m1m0l7J24L4L4k3k2K2K2O3O2r2r3
2334A657O5r6m3m3n4n3O7O7K7K6Q7Q7POj8j8o8R3o0o0J1j51m8J13J3J2m0m1R4R4N5N5k5k5
2329A793J0J0J1J0O0O0p4p4o2o2j62kJ08n4m8J13M0m0MJ66k9k8m9m9J6J77jj62j42J9n4K13
2324A718J0j52L4J15O0j00j00O1P9jk7k6l7l7N3j08JKQ6p4m9L2K1n9M3M2qqR9J8j13M9P8k
2318A700J04n8p0p0%JL9M0L9M0l1l1l0l1k4k4N6N6LKQ3Q3k5k5j01k0j38K4J8J9RRRRM7M7l3
2313A726l3m9n0rrQ8Q7PPj9j9j9j9k5k4j5j4j7J43J4J3P4P4L1j30l4l4J27l3q7q7M7M7q0Q1
2307A760P1P0l5l6M4M5l8l8j28L3p2p3P2P2k2k2k2k2N2N3p1p2k7J34Q4Q4j15j15K0J9opML
$$ y = [1648, 1671, 1693, 1674, 1655, 1729, 1803, 1840, 1876, 1892, 1747, 1635, 1685, 1594, 1502, 1594, 1687, 1648, 1771, 1700, 1630, 1734, 1838, 1806, 1614, 1659, 1705, 1732, 1759, 1692, 1625, 1680, 1735, 1652, 1570, 1612, 1815, 1860, 1906, 1831, 1757, 1683, 1609, 1634, 1660, 1645, 1630, 1681, 1731, 1687, 1644, 1603, 1563, 1526, 1650, 1684, 1718, 1695, 1673, 1695, 1717, 1780, 1842, 1750, 1657, 1722, 1626, 1583, 1540, 1486, 1433, 1500, 1567, 1594, 1620, 1707, 1794, 1801, 1807, 1789, 1771, 1703, 1796, 1736, 1676, 1687, 1536, 1488, 1601, 1614, 1626, 1586, 1545, 1639, 1733, 1788, 1843, 1818, 1793, 1803, 1813, 1824, 1834, 1894, 1954, 1880, 1806, 1744, 1682, 1520, 1518, 1626, 1572, 1524, 1637, 1677, 1637, 1641, 1807, 1778, 1750, 1701, 1652, 1668, 1845, 1844, 1682, 1540, 1559, 1505, 1718, 1728, 1576, 1610, 1725, 1785, 1685, 1585, 1646, 1725, 1724, 1697, 1671, 1634, 1597, 1650, 1542, 1543, 1545, 1631, 1557, 1508, 1540, 1561, 1502, 1545, 1587, 1579, 1571, 1670, 1688, 1575, 1624, 1702, 1700, 1804, 1746, 1676, 1606, 1606, 1607, 1646, 1686, 1725, 1765, 1734, 1703, 1673, 1642, 1618, 1594, 1650, 1706, 1709, 1711, 1794, 1877, 1852, 1827, 1726, 1706, 1568, 1592, 1610, 1629, 1638, 1647, 1656, 1665, 1712, 1759, 1726, 1693, 1644, 1594, 1585, 1576, 1664, 1751, 1758, 1765, 1746, 1727, 1708, 1689, 1664, 1640, 1625, 1611, 1594, 1737, 1751, 1764, 1838, 1912, 1943, 1813, 1779, 1745, 1872, 1839, 1752, 1665, 1712, 1759, 1679, 1760, 1831, 1901, 1866, 1830, 1874, 1919, 1881, 1843, 1715, 1748, 1676, 1603, 1675, 1747, 1725, 1703, 1681, 1659, 1711, 1764, 1693, 1621, 1594, 1728, 1812, 1896, 1781, 1666, 1686, 1705, 1699, 1692, 1696, 1699]
2302A699p6Q5Q5p6j09j09J5J6LML4L4J03n7m8m7P2P3qqpoopLKo8o9p4Q6J29J30k0j9j9j9q1
2297A640q1N3N2k2k3N8N7L3L2m7m8K4K3K4K4l3l4m3m3J37k4n9K2LLl2l2k3k2J8J9M9M9RRp
2291A765oppLLk3j03RJ69nq5j02N9O4r7j20M1K1K1M1M2M6M6KQ2N2j09q8pn3j33J4R5O0j02
2286A588p3ON2j08n3J08Q8Q8OOOOk2k3k2k2P9P8n5n6kjP9P9l8l8L3L3N7j04K7K7j8j9K7K7
2280A846p8Ln3J08j2j2m3m3l9l9M6M6L0J11j69rJ31l1j09k9K1K2k9N2O0j01nnNMNNj8j9j8
2275A634j8j4j3j04N7NNR5R6K5K5J4J5O1j00q0q0K3J83m8k09j09N1J39J39K9K8m2m2k45q4
2270A436N7N7K07M7r4r4kJ58P8q3k0k0N0N0j5j6o5o6J60%r8r7K4K5O4O5j9j9j9j9L9L9jjL6
2265A844L6m5m5q3q3m3m4P1P1L1L0N9N9p5p5r5r5L9L9LKL3L3O4r7r7O4P9P9M5j15J2J2JKj13
$$ y = [1699, 1623, 1708, 1793, 1717, 1608, 1499, 1514, 1530, 1533, 1537, 1571, 1605, 1708, 1651, 1603, 1556, 1628, 1701, 1693, 1685, 1678, 1672, 1666, 1659, 1662, 1664, 1596, 1527, 1453, 1539, 1668, 1798, 1778, 1759, 1740, 1721, 1640, 1559, 1612, 1664, 1642, 1619, 1677, 1734, 1767, 1799, 1752, 1704, 1728, 1751, 1775, 1799, 1766, 1732, 1689, 1646, 1783, 1759, 1700, 1722, 1725, 1728, 1696, 1664, 1641, 1619, 1637, 1656, 1705, 1754, 1763, 1772, 1765, 1759, 1752, 1745, 1748, 1751, 1728, 1625, 1634, 1803, 1798, 1713, 1611, 1670, 1734, 1637, 1517, 1558, 1579, 1600, 1641, 1683, 1729, 1775, 1777, 1859, 1911, 1802, 1714, 1707, 1654, 1521, 1535, 1630, 1690, 1588, 1515, 1521, 1573, 1465, 1412, 1520, 1608, 1696, 1702, 1708, 1714, 1720, 1698, 1675, 1653, 1631, 1710, 1788, 1733, 1677, 1675, 1674, 1753, 1832, 1794, 1756, 1789, 1822, 1879, 1775, 1802, 1829, 1811, 1792, 1819, 1846, 1768, 1771, 1718, 1826, 1814, 1802, 1759, 1716, 1677, 1638, 1684, 1730, 1760, 1871, 1702, 1693, 1824, 1793, 1684, 1655, 1676, 1698, 1669, 1721, 1781, 1680, 1675, 1670, 1675, 1679, 1684, 1689, 1671, 1652, 1634, 1616, 1602, 1589, 1485, 1542, 1547, 1552, 1647, 1743, 1768, 1793, 1807, 1822, 1883, 1783, 1703, 1623, 1646, 1829, 1781, 1572, 1463, 1514, 1653, 1792, 1821, 1849, 1807, 1765, 1520, 1436, 1493, 1550, 1757, 1804, 1710, 1616, 1614, 1772, 1850, 1767, 1747, 1727, 1777, 1827, 1812, 1796, 1731, 1665, 1825, 1825, 1727, 1630, 1654, 1679, 1743, 1808, 1789, 1770, 1751, 1732, 1771, 1810, 1809, 1808, 1844, 1880, 1835, 1790, 1707, 1624, 1581, 1537, 1608, 1679, 1710, 1740, 1799, 1858, 1783, 1708, 1613, 1518, 1557, 1596, 1599, 1601, 1634, 1667, 1731, 1634, 1537, 1601, 1680, 1759, 1804, 1689, 1701, 1713, 1714, 1716, 1603]
2259A603j14K0K1k4k4N6N6MMn7J04J03n7j28L3JJp0o9Q5Q6M5M5k1k0m1J19J31l0j27j28P3
2255A680q9m8L2O1j9L1L1j0j0N7N7k8k8k7k8L1L2k4N7P2q9JQ2MMl1l1J4J5J4J4o6o7o6o7L0
2249A591L0j0j0K9K9Q4Mj19M2j4j3m7m6P4P4m1m0l1l1j5J45O4j6o5J5R0R1j03k2J21l9l9M1
2244A823L7m4q3ln3n3K6K6K5K6K1K1K1K0n0n0J6J7l0k9k9k9l8l8pqR0p1q2Q0J12m9j5j5j7
2239A568j6K3K4JJo6o6K4K4K4K5M6M7PPqpN0N0L3j28LLJ22J23Kp8j69l5J23M2J1j24l6M4O2
2233A756j8j8O3Qp2j05K8J68L3p5Np9q0P3P3%jL9M0j28j28ppJ6J6J09J09m5m5l6l7k9J05J6
2228A747o4j34jQ5Q5L2j03J3J3P2P3L2L2K0K0k1k0j7j6j1j1k04j24J1J45mlNMj5j5j5j5J5
2223A611J5k6k5K4K5J0R2Q5m8n8K2Jp9k9k9L2L2q8qO3p1llJ07q2J5R5L8m3n9o0j4j5j4j5K7
$$ y = [1603, 1489, 1509, 1530, 1506, 1482, 1538, 1594, 1598, 1602, 1545, 1649, 1752, 1695, 1567, 1600, 1601, 1602, 1532, 1463, 1548, 1634, 1679, 1724, 1703, 1683, 1642, 1761, 1892, 1862, 1735, 1607, 1680, 1591, 1543, 1575, 1636, 1617, 1648, 1679, 1669, 1659, 1716, 1773, 1745, 1717, 1690, 1662, 1693, 1725, 1701, 1758, 1830, 1741, 1742, 1824, 1828, 1832, 1801, 1770, 1784, 1799, 1813, 1827, 1761, 1694, 1628, 1561, 1591, 1621, 1611, 1601, 1630, 1659, 1743, 1747, 1628, 1670, 1656, 1643, 1596, 1550, 1624, 1698, 1657, 1617, 1586, 1555, 1540, 1685, 1749, 1733, 1668, 1683, 1773, 1864, 1761, 1739, 1860, 1821, 1782, 1823, 1860, 1816, 1733, 1730, 1677, 1624, 1650, 1676, 1701, 1727, 1748, 1769, 1790, 1810, 1760, 1710, 1726, 1743, 1713, 1684, 1655, 1626, 1588, 1550, 1543, 1535, 1625, 1554, 1472, 1552, 1664, 1615, 1600, 1585, 1568, 1552, 1575, 1599, 1600, 1601, 1535, 1469, 1493, 1517, 1541, 1566, 1612, 1659, 1666, 1673, 1665, 1658, 1708, 1758, 1791, 1663, 1666, 1669, 1791, 1914, 1916, 1838, 1669, 1634, 1757, 1799, 1810, 1686, 1650, 1694, 1756, 1738, 1720, 1783, 1791, 1719, 1614, 1642, 1810, 1843, 1768, 1773, 1694, 1614, 1687, 1760, 1760, 1759, 1798, 1838, 1710, 1582, 1575, 1568, 1584, 1600, 1709, 1818, 1773, 1728, 1692, 1655, 1626, 1731, 1747, 1683, 1549, 1548, 1633, 1718, 1750, 1647, 1660, 1673, 1745, 1818, 1850, 1882, 1902, 1922, 1901, 1881, 1864, 1848, 1837, 1826, 1622, 1498, 1509, 1654, 1650, 1647, 1652, 1656, 1641, 1626, 1611, 1596, 1611, 1626, 1600, 1575, 1599, 1624, 1634, 1726, 1811, 1763, 1705, 1727, 1728, 1649, 1620, 1591, 1623, 1655, 1567, 1559, 1622, 1551, 1548, 1545, 1652, 1570, 1585, 1680, 1718, 1675, 1616, 1556, 1542, 1527, 1513, 1498, 1525]
2217A525K6q4N0J07J86R6J6l1j10p1p1J4J4N5N4O0O0p4p3j7j7j7j7P3P2o1o1J2J3N3N3l0l1
2212A774l0l0r1r2M3M2QPM8M7n0n1j1j0m1m1m1m0N1N2N2N1qrrr%%%jl0l0N0N0J2J2o9o8Q3
2206A621Q2n2n1k9k9N1N1J1J0l0l0%J%Jo1o1J27J27j4j5j4j4K5K5n6n5nnL5L5L5L5m5m6JJ
2201A662M1M2j5j5j5j5K9L0j05j04n0n0J37J38K9K9j1j1L9L9r6r5kjkjR0R1q7q7n2J09R9R8
2195A888p9q0l0k9j41J9J0J0R2R1N2N2j02j01k0k1J4J3J4J4n0m9Q5Q5qqq9q8N3N3J04n7k7
2190A670k7q8P4R9R9K8K9n3n4K7K7mnn5J07M3M3k7k7q1q0q1q1M8M7j3J49R9o1r4r5J4J3o7
2185A623o7P8P8j3j3K8j33K8K9M3j17p7Q4J06J07L6L6j5j5r5r6N4N4q0q1ppppk5k6R9R8J65
2180A865Ll9m0J1J2K1j39l1l1jjO4O5p0o9L8L8klL3L2qqM1M1JJJ3J3q0q0J0J0J1J0QPl3l4
$$ y = [1525, 1551, 1467, 1517, 1624, 1810, 1906, 1922, 1891, 1781, 1710, 1639, 1653, 1667, 1722, 1776, 1836, 1896, 1822, 1749, 1732, 1715, 1698, 1681, 1754, 1826, 1765, 1704, 1716, 1729, 1782, 1835, 1805, 1774, 1744, 1714, 1623, 1531, 1574, 1616, 1624, 1631, 1679, 1726, 1676, 1625, 1614, 1604, 1563, 1522, 1481, 1441, 1492, 1544, 1596, 1647, 1639, 1630, 1621, 1612, 1612, 1612, 1612, 1611, 1581, 1551, 1601, 1651, 1663, 1675, 1606, 1538, 1621, 1703, 1651, 1600, 1571, 1542, 1593, 1644, 1655, 1665, 1635, 1605, 1605, 1606, 1606, 1607, 1546, 1485, 1612, 1739, 1725, 1710, 1696, 1682, 1707, 1732, 1676, 1621, 1616, 1611, 1646, 1681, 1716, 1751, 1706, 1660, 1661, 1662, 1703, 1745, 1730, 1715, 1700, 1685, 1714, 1744, 1639, 1535, 1485, 1435, 1572, 1710, 1739, 1768, 1757, 1746, 1785, 1824, 1728, 1633, 1631, 1630, 1628, 1627, 1717, 1808, 1721, 1634, 1582, 1691, 1790, 1888, 1809, 1729, 1699, 1670, 1529, 1548, 1558, 1568, 1660, 1751, 1803, 1855, 1753, 1652, 1632, 1611, 1625, 1638, 1652, 1666, 1616, 1567, 1652, 1737, 1729, 1721, 1632, 1544, 1597, 1650, 1754, 1697, 1670, 1643, 1555, 1629, 1728, 1827, 1855, 1884, 1831, 1777, 1804, 1831, 1827, 1822, 1767, 1874, 1917, 1960, 1933, 1906, 1825, 1745, 1664, 1583, 1631, 1678, 1665, 1814, 1913, 1852, 1758, 1663, 1677, 1690, 1623, 1556, 1634, 1712, 1699, 1686, 1714, 1581, 1609, 1638, 1681, 1564, 1487, 1571, 1677, 1784, 1820, 1856, 1841, 1826, 1731, 1635, 1689, 1743, 1663, 1582, 1575, 1568, 1561, 1554, 1529, 1503, 1602, 1700, 1865, 1868, 1829, 1789, 1800, 1812, 1833, 1694, 1663, 1632, 1631, 1630, 1694, 1759, 1689, 1620, 1658, 1696, 1694, 1691, 1724, 1756, 1748, 1740, 1781, 1822, 1823, 1824, 1837, 1850, 1770, 1690, 1700, 1710, 1721, 1731, 1739, 1746, 1713, 1679]
2174A679J7J6J6J7j39j39O3O2Q1Q1j2j3k8k7J2J3l4l5OON4N4o7o7O9P0O9O9r4r4%%LLl7l7
2169A637O8O8O7O8r6r7N1j10j49J19P9P8l7l8p8p8Q0Q1m1m0J3J3J3J4J8J8k2k2JJKJl9l9K9
2163A633K8J1J2J2J1n4n5L9M0m4m3lln2n2O9O9N2N3Q3Q2J4j48k08O0Q2Q1k2k2K3K3O3O3q8
2158A809q8q8q8K1K2Q9Q8Q2Q1K4j36o3o3NMk7J33M0j21l6l7M8M7l2l3l3l2J19J19j26j26o9
$$ y = [1679, 1696, 1712, 1728, 1745, 1606, 1467, 1530, 1592, 1673, 1754, 1742, 1729, 1701, 1674, 1686, 1699, 1665, 1630, 1636, 1642, 1696, 1750, 1683, 1616, 1685, 1755, 1824, 1893, 1799, 1705, 1705, 1705, 1708, 1711, 1674, 1637, 1705, 1773, 1840, 1908, 1812, 1715, 1766, 1656, 1507, 1626, 1705, 1783, 1746, 1708, 1630, 1552, 1632, 1713, 1672, 1632, 1645, 1658, 1671, 1685, 1703, 1721, 1699, 1677, 1678, 1679, 1681, 1682, 1643, 1604, 1633, 1661, 1672, 1684, 1696, 1707, 1653, 1598, 1637, 1677, 1633, 1590, 1587, 1584, 1532, 1480, 1549, 1618, 1670, 1723, 1806, 1888, 1902, 1754, 1546, 1606, 1688, 1769, 1747, 1725, 1748, 1771, 1834, 1897, 1809, 1721, 1633, 1545, 1566, 1588, 1677, 1765, 1847, 1928, 1952, 1816, 1753, 1690, 1695, 1699, 1672, 1805, 1845, 1724, 1688, 1651, 1699, 1746, 1714, 1681, 1648, 1616, 1735, 1854, 1728, 1602, 1533]
$$ [...]
##END=	
##END=	
