##TITLE=	(1) kmi-Gal-CCH-1.10.fid



(2)  #1
##JCAMP-DX=	6.0	$$ MestReNova 14.1.1-24571
##DATA TYPE=	LINK
##BLOCK_ID=	1
##BLOCKS=	2    
##ORIGIN=	Mestrelab Research S.L.
##OWNER=	hrzepa
##$MNOVA/LINK_BLOCK_TYPE=	PAGE
##TITLE=	 #1
##JCAMP-DX=	6.0	$$ MestReNova 14.1.1-24571
##DATA TYPE=	LINK
##BLOCK_ID=	2
##BLOCKS=	1    
##ORIGIN=	Mestrelab Research S.L.
##OWNER=	hrzepa
##$MNOVA/LINK_BLOCK_TYPE=	ITEM	$$ Molecule
##$MNOVA/ITEM/POLYGON=	(XY..XY)
5557,6071
6665.98,6071
6665.98,6909.26
5557,6909.26
5557,6071
##$MNOVA/ITEM/Z=	1
##$MNOVA/ITEM/ANGLE=	0
##TITLE=	
##JCAMP-CS=	3.7	$$ MestReNova 14.1.1-24571
##ORIGIN=	Mestrelab Research S.L.
##OWNER=	hrzepa
##BLOCK_ID=	3
##NAMES=	
##ATOMLIST=	
$$ AN	AS	NH
	1	C	 
	2	C	 
	3	C	1
	4	C	 
	5	C	1
	6	C	 
	7	C	1
	8	C	 
	9	C	1
	10	C	 
	11	C	 
	12	C	 
	13	C	1
	14	O	 
	15	O	 
	16	C	 
	17	C	 
	18	H	 
	19	C	 
	20	C	3
	21	C	3
	22	C	3
	23	C	 
	24	C	3
	25	C	3
	26	C	3
	27	C	 
	28	C	3
	29	C	3
	30	C	3
	31	C	 
	32	C	3
	33	C	3
	34	C	3
##BONDLIST=	
$$ AN1	AN2	BT
	1	2	S
	2	3	D
	3	4	S
	4	5	S
	5	6	D
	6	1	S
	4	7	D
	7	8	S
	8	9	S
	9	10	D
	10	11	S
	11	12	D
	12	13	S
	13	8	D
	11	14	S
	12	19	S
	10	23	S
	2	27	S
	6	31	S
	1	15	D
	14	16	S
	16	17	T
	17	18	S
	19	20	S
	19	21	S
	19	22	S
	23	24	S
	23	25	S
	23	26	S
	27	28	S
	27	29	S
	27	30	S
	31	32	S
	31	33	S
	31	34	S
##MAXRASTER=	32768
##XY_RASTER=	
$$ AN	X	Y	Z
	1	-19658	3781	0
	2	-13109	0	0
	3	-6554	3781	0
	4	-6554	11347	0
	5	-13109	15134	0
	6	-19658	11347	0
	7	0	15134	0
	8	6554	11347	0
	9	13104	15134	0
	10	19658	11347	0
	11	19658	3781	0
	12	13104	0	0
	13	6554	3781	0
	14	26213	0	0
	15	-26213	0	0
	16	26213	-7566	0
	17	26213	-15134	0
	18	26213	-22701	0
	19	13104	-7566	0
	20	6554	-11353	0
	21	13104	-15134	0
	22	19658	-11353	0
	23	26213	15134	0
	24	32768	18915	0
	25	26213	22701	0
	26	32768	11347	0
	27	-13109	-7566	0
	28	-13109	-15134	0
	29	-6554	-11353	0
	30	-19658	-11353	0
	31	-26213	15134	0
	32	-26213	22701	0
	33	-32768	18915	0
	34	-32768	11347	0
##END=	
##END=	
##TITLE=	kmi-Gal-CCH-1.10.fid


##JCAMP-DX=	6.0	$$ MestReNova 14.1.1-24571
##DATA TYPE=	LINK
##BLOCK_ID=	4
##BLOCKS=	1    
##ORIGIN=	Mestrelab Research S.L.
##OWNER=	hrzepa
##$MNOVA/LINK_BLOCK_TYPE=	ITEM	$$ NMR Spectrum
##$MNOVA/ITEM/POLYGON=	(XY..XY)
5321,5835
8722,5835
8722,8208
5321,8208
5321,5835
##$MNOVA/ITEM/Z=	0
##$MNOVA/ITEM/ANGLE=	0
##TITLE=	kmi-Gal-CCH-1.10.fid
##JCAMP-DX=	6.0	$$ MestReNova 14.1.1-24571
##BLOCK_ID=	5
##DATA TYPE=	NMR SPECTRUM
##DATA CLASS=	XYDATA
##NUMDIM=	1
##ORIGIN=	Bruker BioSpin GmbH
##OWNER=	root
##.OBSERVE FREQUENCY=	500.13308850747802126
##.OBSERVE NUCLEUS=	^1H
##.SOLVENT NAME=	CDCl3
##.PULSE SEQUENCE=	zg30
##LONGDATE=	2016/02/12 20:42:00.000
##.ACQUISITIONMODE=	SIMULTANEOUS (DQD)
##$ORIGINAL FORMAT=	Bruker XWIN-NMR
##$MNOVA/SCALES_VERSION=	9
##$PARAMETER FILE=	(acqus, ASCII, /Users/hrzepa/Library/Mobile%20Documents/com~apple~CloudDocs/C2/Pure%20samples/kmi-Gal-CCH-1/2,6-di-tert-butyl-4-(3,5-di-tert-butyl-4-(ethynyloxy)benzylidene)cyclohexa-2,5-dien-1-one/acqus, 0)
$$ [...]
$$ 130000 130000 130000 130000 130000 130000 130000 130000 130000 130000 130000
$$ 130000 130000 130000 130000 130000 130000 130000 130000 130000 130000 130000
$$ 130000 130000 130000 130000 130000 130000 130000 0 0 0 0 0 0 0 0 0 0 0
$$ 0 0 0 0 0 0 0 0 0 0 0 0 0
$$ ##$ShimPowMaxUC= (0..63)
$$ 130000 130000 130000 130000 130000 130000 130000 130000 130000 130000 130000
$$ 130000 130000 130000 130000 130000 130000 130000 130000 130000 130000 130000
$$ 130000 130000 130000 130000 130000 130000 130000 130000 130000 130000 130000
$$ 130000 130000 130000 130000 130000 130000 130000 0 0 0 0 0 0 0 0 0 0 0
$$ 0 0 0 0 0 0 0 0 0 0 0 0 0
$$ ##$ShimPowMaxUG= (0..63)
$$ 524287 524287 524287 524287 524287 524287 524287 524287 524287 524287 524287
$$ 524287 524287 524287 524287 524287 524287 524287 524287 524287 524287 524287
$$ 524287 524287 524287 524287 524287 524287 524287 524287 524287 524287 524287
$$ 524287 524287 524287 524287 524287 524287 0 0 0 0 0 0 0 0 0 0 0 0 0 0 0
$$ 0 0 0 0 0 0 0 0 0 0
$$ ##$ShimPowRcbType= 3
$$ ##$ShimPowRes= (0..63)
$$ 1e-020 1e-020 1e-020 1e-020 1e-020 1e-020 1e-020 1e-020 1e-020 1e-020 1e-020
$$ 1e-020 1e-020 1e-020 1e-020 1e-020 1e-020 1e-020 1e-020 1e-020 1e-020 1e-020
$$ 1e-020 1e-020 1e-020 1e-020 1e-020 1e-020 1e-020 1e-020 1e-020 1e-020 1e-020
$$ 1e-020 1e-020 1e-020 1e-020 1e-020 1e-020 1e-020 0 0 0 0 0 0 0 0 0 0 0
$$ 0 0 0 0 0 0 0 0 0 0 0 0 0
$$ ##$ShimPowRng0= (0..63)
$$ 1 1 1 1 1 1 1 1 1 1 1 1 1 1 1 1 1 1 1 1 1 1 1 1 1 1 1 1 1 1 1 1 1 1 1 1
$$ 1 1 1 1 0 0 0 0 0 0 0 0 0 0 0 0 0 0 0 0 0 0 0 0 0 0 0 0
$$ ##$ShimPowRng1= (0..63)
$$ 1 1 1 1 1 1 1 1 1 1 1 1 1 1 1 1 1 1 1 1 1 1 1 1 1 1 1 1 1 1 1 1 1 1 1 1
$$ 1 1 1 1 0 0 0 0 0 0 0 0 0 0 0 0 0 0 0 0 0 0 0 0 0 0 0 0
$$ ##$ShimPowRng2= (0..63)
$$ 1 1 1 1 1 1 1 1 1 1 1 1 1 1 1 1 1 1 1 1 1 1 1 1 1 1 1 1 1 1 1 1 1 1 1 1
$$ 1 1 1 1 0 0 0 0 0 0 0 0 0 0 0 0 0 0 0 0 0 0 0 0 0 0 0 0
$$ ##$ShimPowRng3= (0..63)
$$ 1 1 1 1 1 1 1 1 1 1 1 1 1 1 1 1 1 1 1 1 1 1 1 1 1 1 1 1 1 1 1 1 1 1 1 1
$$ 1 1 1 1 0 0 0 0 0 0 0 0 0 0 0 0 0 0 0 0 0 0 0 0 0 0 0 0
$$ ##$ShimSysFunc= (0..63)
$$ 1 2 3 4 5 6 7 8 9 10 0 37 38 35 16 15 14 13 12 11 28 27 26 25 24 23 36
$$ 22 30 29 20 21 34 33 32 31 17 18 19 0 0 0 0 0 0 0 0 0 0 0 0 0 0 0 0 0 0
$$ 0 0 0 0 0 0 0
$$ ##$ShimSysMatrix= 0
$$ ##$ShimSysType= 4
$$ ##$TFXNUM= 0
$$ ##$TRIPLO2= 0
$$ ##$VTU= 2
$$ ##$VTUETH= <149.236.99.20>
$$ ##$VTUTY= <no>
$$ ##$WBREFAM= (0..15)
$$ 100 100 100 100 100 100 100 100 100 100 100 100 100 100 100 100
$$ ##$WBREFLM= (0..15)
$$ 1 0 0 0 0 0 0 0 0 0 0 0 0 0 0 0
$$ ##$WBREFPH= (0..15)
$$ 0.03 0 0 0 0 0 0 0 0 0 0 0 0 0 0 0
$$ ##$WBSGU= (0..15)
$$ 0 0 0 0 0 0 0 0 0 0 0 0 0 0 0 0
$$ ##$XFAC= 2
$$ ##END=
$$ 
##$DECIM=	2000
##$DSPFVS=	20
##XUNITS=	HZ
##YUNITS=	ARBITRARY UNITS
##FIRSTX=	8075.3841140267395531
##LASTX=	-1924.4632980826349922
##DELTAX=	-0.152587890625
##XFACTOR=	1
##YFACTOR=	0.0090288973054765998827
##FIRSTY=	15.579195022583007812
##MINY=	3.5880112648010253906
##MAXY=	35561.6484375
##NPOINTS=	65536
##XYDATA=	(X++(Y..Y))
$$ [...]
2353A221L1L2l0k9k9k9LMq1O9N0N0J5J4L0L1p5p5j1j0L4L5nnP0P0k1k0j16j17PJ57P3P2m2
2348A373m2L3L3onn1n0onO9P0ONOOk5k5k5k5M3M3K7o2j28K3QQK3K4K4K4m3m3L3L2rj0j0j0
2342A333noooo0o0M5M5l2l3M3M3J%J%L5L5p0p0kkP3P4m7m7jkL4L4L5L4j7j8p7J3J03m7l2l2
2336A309qpL7L8r2r3J3J3N6N5n0n0j0j1j0j1j5j5j6j5J03J03K8K7qqn4n3j25j25j9J30J03
2331A220J3K8K8O7O7o8o8j5j5L0L0NNNMM3M3kkp3p4j3j04o8Q1L7L6l9l8O6O7popojjO0l1j23
2324A174K7J3J2L1L2L1L1L4L5m0m1kkM4M3JJp3p4l7l7L8L8J8J8J8J8n1n2ooL5L6L5L6o6o6
2319A246k1k1rrrrQQPQj9j9K7K6l1l0p5p5M1M1M0M1n9o0P6P6J0Rl5l5k5k4N0N0KJKKPPN2N3
2312A325j5j5rj0PR7O1q9q5OP1j9j3j4n4n5j05M6Q7mQ8Q8n3n3l4l3l4l4Q8Q8m8m8L6L7rro7
$$ plain form
2353 1221 1252 1284 1254 1225 1196 1167 1170 1174 1093 1162 1212 1262 1277 1291 1321 1352 1277 1202 1191 1181 1215 1250 1245 1240 1310 1380 1359 1339 1223 1106 1113 1270 1343 1415 1373
2348 1373 1331 1364 1397 1391 1386 1335 1285 1279 1274 1343 1413 1419 1424 1430 1436 1411 1386 1361 1336 1379 1422 1449 1387 1259 1282 1290 1298 1321 1345 1369 1393 1350 1307 1340 1372 1363 1353 1343 1333
2342 1333 1328 1322 1316 1310 1250 1190 1235 1280 1248 1215 1258 1301 1302 1302 1303 1303 1338 1373 1303 1233 1231 1229 1302 1376 1329 1282 1281 1279 1313 1347 1382 1416 1399 1381 1304 1317 1420 1373 1341 1309
2336 1309 1301 1294 1331 1369 1277 1184 1197 1210 1266 1321 1271 1221 1211 1200 1190 1179 1164 1149 1133 1118 1221 1324 1352 1379 1371 1363 1309 1256 1131 1006 987 1117 1220
2331 1220 1233 1261 1289 1356 1423 1355 1287 1272 1257 1287 1317 1322 1327 1332 1336 1379 1422 1420 1418 1345 1271 1258 1154 1086 1167 1204 1240 1201 1163 1229 1296 1289 1283 1276 1270 1269 1268 1328 1297 1174
2324 1174 1201 1214 1226 1257 1289 1320 1351 1385 1420 1380 1339 1337 1335 1379 1422 1423 1424 1351 1277 1240 1203 1241 1279 1297 1315 1333 1351 1300 1248 1242 1236 1271 1307 1342 1378 1312 1246
2319 1246 1225 1204 1195 1186 1177 1168 1176 1184 1191 1199 1180 1161 1188 1214 1183 1153 1078 1003 1044 1085 1125 1166 1107 1047 1123 1199 1209 1218 1183 1148 1123 1099 1149 1199 1201 1202 1204 1206 1213 1220 1272 1325
2312 1325 1310 1295 1286 1276 1283 1380 1441 1352 1267 1273 1344 1325 1312 1298 1244 1189 1084 1130 1217 1213 1301 1389 1336 1283 1249 1216 1182 1148 1236 1324 1276 1228 1264 1301 1292 1283 1216
2307A216o8QQJ08J09KLl8l9PPl6l5P0P0n5n4n5n5J7J8O2O2l7l7KLK3o7j07M4R5MNR4L7j14
2301A277l0O1n6n7onP3P3l2l1NOp0o9j6j6N9N9MMLMl4l4J1J2L6L7Q1o8j27l7L9L8K1K2K1K2
2295A280k4k4k4k3J0J0l6l5L6L5rj0k1k0P8P9J9p1o6Q4R8Ql8j27j25K6R2JJ0J0NMK3K2n2n3
2290A172M5M4o1o1Q0Q0NNp2p2LLK2K3k2k3L8L8qpk0k0N5N5K9K9j07j06Q1Q1OOKKKKk6k6k0
2284A257k1l8N2J31j9rrj8j9r7r7QQN1N2N1N2j2j2j03M8L2n7M7M7n4n4n4n4N3N4QRL6L7L6
2278A342L7n3n2qpM3M3r2r2J0J0J0J0n1n0ooO2O2j2j3M5M5n9o0k6k5P9Q0l9l9OPR5R6K0K0
2273A432l2l2l2l3j6j6j6j6m3m2L3L2K7K7p8p8K4K3K3K3L0K9K9K9n3n4qrL1L1m4m4k6k6k6
2267A099k7Q2Q1OOj3j4n8n9P5P4%%l3l2J3J2Q0Q0n6n6q9q9j5j4M9M9MMK9K9K9K9n7n7M8M9
$$ plain form
2307 1216 1148 1156 1164 1272 1381 1383 1386 1348 1309 1316 1323 1287 1252 1322 1392 1337 1283 1228 1173 1190 1208 1270 1332 1295 1258 1260 1263 1286 1219 1112 1156 1251 1255 1260 1354 1391 1277
2301 1277 1247 1308 1252 1195 1189 1184 1257 1330 1298 1267 1272 1278 1208 1139 1123 1107 1166 1225 1229 1233 1236 1240 1206 1172 1183 1195 1231 1268 1349 1281 1154 1117 1156 1194 1215 1237 1258 1280
2295 1280 1256 1232 1208 1185 1195 1205 1169 1134 1170 1205 1196 1186 1165 1145 1223 1302 1321 1250 1184 1268 1366 1374 1336 1209 1084 1110 1202 1203 1213 1223 1228 1232 1255 1277 1225 1172
2290 1172 1217 1261 1200 1139 1219 1299 1304 1309 1237 1165 1168 1171 1193 1216 1194 1171 1209 1247 1239 1232 1212 1192 1247 1302 1331 1360 1253 1147 1228 1309 1315 1321 1323 1325 1327 1329 1303 1277 1257
2284 1257 1236 1198 1250 1381 1362 1353 1344 1326 1307 1210 1113 1121 1129 1180 1232 1283 1335 1323 1311 1208 1256 1288 1231 1278 1325 1271 1217 1163 1109 1162 1216 1224 1233 1269 1306 1342
2278 1342 1379 1326 1274 1266 1259 1302 1345 1253 1161 1171 1181 1191 1201 1150 1100 1094 1088 1150 1212 1200 1187 1232 1277 1218 1158 1132 1107 1186 1266 1227 1188 1194 1201 1296 1392 1412 1432
2273 1432 1400 1368 1336 1303 1287 1271 1255 1239 1196 1154 1187 1219 1246 1273 1195 1117 1141 1164 1187 1210 1240 1269 1298 1327 1274 1220 1212 1203 1234 1265 1221 1177 1151 1125 1099
2267 1099 1072 1154 1235 1241 1247 1234 1220 1162 1103 1178 1252 1252 1252 1219 1187 1200 1212 1292 1372 1316 1260 1171 1082 1067 1053 1102 1151 1155 1159 1188 1217 1246 1275 1218 1161 1209 1258
2262A258M6M6M7M6n7n7J9J8k7k6k7k7J8J7k8k7PPN2N2qpn3n2J8J7J8J8m9n0K6K5o2o1P3P4
2256A284P5P6l0k9o7o8k2k2l3l3J2J2L1L1j5j4K3K3Q9Q8P6p5l5l5m9m9o4Q6Q7lrrq8O2k3k3
2251A260qpO7O7POmlQ2o8p4J7l4N5N6N6K1K1k3k4m9m9m9m9L3L3j2j2L8L9r7r7o2o2P3P4M9
2245A271N0M0M0O8q2j24l3J0J0J5J5M1M1JJlQ7J5j35q0q1J6J5Q4Q5q2q1POOOn0n0J15J15j
2240A358%j%j2j2j1j2n4n4n4n4Q6Q5J1J0k5k5K0K0l4l4l4l4N0N1n5n4K7K8K7K8l4l3P1P2k7
2234A291k6M9M8P8P8KLK5K5K4K5JJj04j03n8n8J7J7k8k8q4R6O6O6KJk6k6J9J8o4o4J1J0K8
2229A332K8p8p7N2N3PQk6k7k6k6RJ0J0Rn5n5Q0Q0%J%Jk1k2Q4Q4q0q0K5K5q4q3N1N1PPl9l8
2223A197j%P4P4p5p6O0O0M3M3o2o3J0J0o6o5J02J02l4l3qqL8L7j3j3n9n8N9O0k8k7R2q9l3
$$ plain form
2262 1258 1304 1350 1397 1443 1386 1329 1348 1366 1339 1313 1286 1259 1277 1294 1266 1239 1246 1253 1305 1357 1349 1342 1289 1237 1255 1272 1290 1308 1259 1209 1235 1260 1198 1137 1210 1284
2256 1284 1359 1435 1405 1376 1309 1241 1219 1197 1164 1131 1143 1155 1186 1217 1202 1188 1211 1234 1323 1411 1487 1412 1377 1342 1293 1244 1180 1266 1353 1350 1341 1332 1244 1306 1283 1260
2251 1260 1252 1245 1312 1379 1386 1392 1388 1385 1467 1399 1325 1342 1308 1363 1419 1475 1496 1517 1494 1470 1421 1372 1323 1274 1307 1340 1328 1316 1354 1393 1296 1199 1137 1075 1148 1222 1271
2245 1271 1321 1361 1401 1469 1387 1263 1230 1240 1250 1265 1280 1321 1362 1363 1364 1361 1448 1463 1328 1248 1167 1183 1198 1282 1367 1285 1204 1211 1217 1223 1229 1179 1129 1244 1359 1358
2240 1358 1358 1357 1357 1345 1333 1322 1310 1256 1202 1148 1094 1180 1265 1276 1286 1261 1236 1256 1276 1242 1208 1174 1140 1190 1241 1186 1132 1159 1187 1214 1242 1208 1175 1246 1318 1291
2234 1291 1265 1314 1362 1440 1518 1520 1523 1548 1573 1597 1622 1623 1624 1520 1417 1359 1301 1318 1335 1307 1279 1195 1291 1357 1423 1425 1426 1400 1374 1393 1411 1347 1283 1294 1304 1332
2229 1332 1360 1282 1205 1257 1310 1317 1325 1299 1272 1246 1220 1229 1239 1249 1258 1203 1148 1228 1308 1308 1309 1309 1310 1289 1267 1351 1435 1355 1275 1300 1325 1241 1158 1209 1260 1267 1274 1235 1197
2223 1197 1196 1196 1270 1344 1269 1193 1253 1313 1356 1399 1337 1274 1284 1294 1228 1163 1265 1367 1333 1300 1292 1284 1322 1359 1346 1333 1274 1216 1275 1335 1307 1280 1372 1283 1250
2217A250l3n5n6K0K0N3N3PQM5M5M5M5j0rn5n5m6m6M3M4n5n4L5L5M1M0m9n0lkn4n3L5n5j0Q0
2212A194L3L3L9L9j4j4j5j4O2O2k3k3r4lj0rN0N0M4j06l2l1M3M4P7j2n8L2mmj00rM6m3l8N2
2206A244Q1Q0j4j03m6m5k5J85J07J6j6j6Mq7MR4l0l1j3j04j29l8N5N5O2O3Oj44j10M0J27k4
2201A248k6O5MNL5L6j0rK2K2n8n9l3J17L3L3J0J1q0q0K1K1P8j3j20l0J5p5rQ1o5o6O7O6L1
2196A288L1j10M0R7Oj9j9o9Q0L5n5q6q6M7M6m4m3O9O8O9O9l7l7l7l8N4N4l6l6l3l2J3J2K0
2191A281J9J9K0k5k4k4k4ppo8K3N8r2kkL2L1L2L2Q8Q9o2o2n1n1M0L9l2l2l2l2K1K0K0K1M8
2185A304M7M2j08L0L0k5k4mlmlK6K5o4j55O0K09N4r6l8l7m6m7K5K5P0P0o9o8K2K3o1o1L0L0
2180A209JJKJL0K9o0o1M3M3M2M3k9l0j20L1M4m5J4J5N8N8j7j8k1k1j67J3P2P1Q3Q4o9o8k3
$$ plain form
2217 1250 1217 1162 1106 1126 1146 1199 1252 1259 1267 1312 1357 1402 1447 1437 1428 1373 1318 1272 1226 1269 1313 1258 1204 1239 1274 1315 1355 1306 1256 1253 1251 1197 1144 1179 1124 1114 1194
2212 1194 1227 1260 1299 1338 1324 1310 1295 1281 1343 1405 1382 1359 1265 1262 1252 1243 1293 1343 1387 1281 1249 1218 1261 1305 1382 1370 1312 1344 1340 1336 1236 1227 1273 1230 1192 1244
2206 1244 1325 1405 1391 1288 1242 1197 1172 1357 1464 1480 1464 1448 1452 1365 1369 1463 1433 1402 1389 1285 1156 1118 1173 1228 1290 1353 1359 1215 1105 1145 1272 1248
2201 1248 1222 1287 1291 1296 1331 1367 1357 1348 1370 1392 1334 1275 1242 1359 1392 1425 1435 1446 1366 1286 1307 1328 1406 1393 1273 1243 1258 1183 1174 1255 1190 1124 1191 1257 1288
2196 1288 1319 1209 1249 1346 1352 1333 1314 1245 1325 1360 1305 1219 1133 1180 1226 1182 1139 1208 1276 1345 1414 1377 1340 1303 1265 1319 1373 1337 1301 1268 1236 1249 1261 1281
2191 1281 1300 1319 1339 1314 1290 1266 1242 1235 1228 1160 1183 1241 1149 1147 1145 1177 1208 1240 1272 1360 1449 1387 1325 1274 1223 1263 1302 1270 1238 1206 1174 1195 1215 1235 1256 1304
2185 1304 1351 1393 1285 1315 1345 1320 1296 1292 1289 1285 1282 1308 1333 1269 1114 1174 1383 1437 1341 1303 1266 1220 1173 1198 1223 1293 1363 1294 1226 1248 1271 1210 1149 1179 1209
2180 1209 1210 1211 1213 1214 1244 1273 1213 1152 1195 1238 1280 1323 1294 1264 1144 1175 1219 1174 1188 1203 1261 1319 1302 1284 1263 1242 1075 1088 1160 1231 1314 1398 1329 1261 1238
2175A238k3R8R8o7o7m4m5O1O0K9K9j6j6ONp0o9NOOOopL3L3Q9kj33M8R5Nl8l8QPQPPPl9l8O8
2168A344O8o6o7P6P6J20J21J92J91K42O2l7j28k24k23l6l5q0q1k9k8k9k9QQl7l7o2o2J3J2
2164A243P8P8Nq5n7J23J47N8N1J41K20K21O4O4j14k94j88r7q0J0m3j33jko1o1J04J04k2k2
2159A451k2k1j1j1j0j1r0r0j6j5Q7Q7Q7Q7noO9O9L8L7qqL1L1r5r5j00N1J7p3mlj0rM4M5l1
2153A487l1pqn2n3m9m9Q6Q6K5K5K5K4L5L5m1m0L0L1n9R1J63P3Q8Q9J23J24J24J24j15j15l9
2148B230m0j09j09j10j09L6L6l9l9r2r3m7m8M1M2mmJ8J8J7J8M9M9n1n1j33m3J01m9L5J24O5
2144A709O4N7N7N7N7J00R9l6l5p1p0k5k6m4m5q9q9lkkkk7k7P8P8l6l7j12j11K9K9K9L0n7n6
2138A471j1j1OOm0l9PPOPM4M4l2l1P0P0l5l5j4j4j4j4J2J1M5M5K1j59J8J7k6k5J9J9M7M7k8
$$ plain form
2175 1238 1215 1313 1411 1344 1277 1233 1188 1249 1309 1338 1367 1351 1335 1341 1346 1276 1207 1212 1218 1224 1230 1224 1217 1250 1283 1372 1370 1237 1285 1380 1385 1347 1309 1317 1324 1332 1339 1346 1353 1314 1276 1344
2168 1344 1412 1346 1279 1355 1431 1551 1672 1864 2055 2297 2359 2322 2194 1970 1747 1711 1676 1596 1515 1486 1458 1429 1400 1408 1416 1379 1342 1280 1218 1231 1243
2164 1243 1321 1399 1404 1319 1262 1385 1532 1590 1641 1782 2002 2223 2287 2351 2237 1943 1755 1658 1578 1588 1545 1412 1411 1409 1348 1287 1391 1495 1473 1451
2159 1451 1429 1408 1397 1386 1376 1365 1275 1185 1169 1154 1241 1328 1415 1502 1497 1491 1560 1629 1667 1704 1696 1688 1719 1750 1655 1560 1460 1511 1528 1455 1451 1448 1438 1429 1473 1518 1487
2153 1487 1456 1449 1441 1389 1336 1287 1238 1324 1410 1435 1460 1485 1509 1544 1579 1538 1498 1528 1559 1500 1591 1754 1827 1915 2004 2127 2251 2375 2499 2384 2269 2230
2148 2230 2190 2081 1972 1862 1753 1789 1825 1786 1747 1655 1562 1515 1467 1508 1550 1546 1542 1560 1578 1595 1613 1662 1711 1660 1609 1476 1433 1534 1485 1520 1644 1709
2144 1709 1773 1830 1887 1944 2001 2101 2200 2164 2129 2058 1988 1963 1937 1893 1848 1759 1670 1667 1665 1663 1661 1634 1607 1685 1763 1727 1690 1578 1467 1496 1525 1554 1584 1527 1471
2138 1471 1460 1449 1455 1461 1421 1382 1389 1396 1402 1409 1453 1497 1465 1434 1504 1574 1539 1504 1490 1476 1462 1448 1460 1471 1516 1561 1582 1423 1441 1458 1432 1407 1426 1445 1492 1539 1511
2133A511k8n0n1n1n0KLKLn7n7M9M8L8L7L8L7p6p6l1l2J4J3N9N9L6L6l9l9O8O9popoJ0q0j79
2127A210JN9N9J2J2J2J2k0j9k0j9P4P5j21j21N8N8M4m5m9J31jr0L7L7J4J05R6q4K3K3%%j05
2122A458j05l3l4J2J1j6j6j5j6n0m9j6j6J19o2j1Q0J12J12J3J2p2p2R3R3M6M6Q0Q0J01p9m1
2117A765m1k20l9onp9p8l3l4n8n9P7P6K6K6K6K6k4k4K1K1l9l9L6L6P9P9L4L4OPQ2Q2j04j04
2111A553O1O1r7r8k2k2L3L3L3L3llP3P2m1m1L4L4L6L6o9p0n0n1nnk7k6J8J9q5q5L9M0O0j20
2106A348r4r4N3N4N3N4L2L3m3m3J2J2N6N7L9M0L9L9J7J7J6J7L6L7rqj09j08l3l3k6k7k6k7
2101A381MLMMl5l4J0J1O1O1p3p4j1j2o1K8J16J15j4j3n8n7j2j2m2m3k0k0O7O6N9r2j35P6P9
2095A327j1n5L6L0o0m5m6K3K4L9L8l1l1q5NQ5mK6J17K0K1l7N2M7M7r4r5j4j3p6J5RJ0qpJ0
$$ plain form
2133 1511 1483 1433 1382 1331 1281 1283 1286 1288 1291 1234 1177 1226 1274 1312 1349 1387 1424 1348 1272 1241 1209 1223 1236 1295 1354 1390 1426 1387 1348 1416 1485 1478 1472 1465 1459 1469 1389 1210
2127 1210 1211 1270 1329 1341 1353 1365 1377 1357 1338 1318 1299 1373 1448 1327 1206 1264 1322 1366 1321 1272 1403 1402 1312 1349 1386 1400 1505 1601 1517 1540 1563 1563 1563 1458
2122 1458 1353 1320 1286 1298 1309 1293 1277 1262 1246 1196 1147 1131 1115 1234 1172 1161 1241 1353 1465 1478 1490 1418 1346 1439 1532 1578 1624 1704 1784 1885 1806 1765
2117 1765 1724 1504 1465 1459 1454 1375 1297 1264 1230 1172 1113 1190 1266 1292 1318 1344 1370 1346 1322 1343 1364 1325 1286 1322 1358 1437 1516 1550 1584 1590 1597 1679 1761 1657 1553
2111 1553 1614 1675 1578 1480 1458 1436 1469 1502 1535 1568 1565 1562 1635 1707 1666 1625 1659 1693 1729 1765 1696 1626 1576 1525 1520 1515 1488 1462 1480 1499 1414 1329 1368 1408 1468 1348
2106 1348 1254 1160 1213 1267 1320 1374 1406 1439 1396 1353 1365 1377 1433 1490 1529 1569 1608 1647 1664 1681 1697 1714 1750 1787 1778 1770 1661 1553 1520 1487 1461 1434 1408 1381
2101 1381 1385 1388 1392 1396 1361 1327 1337 1348 1409 1470 1397 1323 1312 1300 1239 1267 1383 1498 1484 1471 1413 1356 1344 1332 1290 1247 1227 1207 1274 1340 1399 1307 1172 1248 1327
2095 1327 1316 1261 1297 1327 1267 1222 1176 1199 1223 1262 1300 1269 1238 1153 1158 1243 1239 1265 1382 1402 1423 1386 1438 1485 1532 1438 1343 1329 1316 1240 1255 1264 1274 1266 1259 1269
2090A269J0M0n0p4p5O6O6O6O6m2m2qr8p9J0M9m0j0j0j6j5J19J19J1q0p0K1m7M3M3m8K7J18
2085A339J18K7j06j06m7M4L7L8j1j2J3J04n0n1q4q4kQ8L7L7l9l9L6L5n4n4P2j9k4k3l0k9J6
2080A177J6l5N5N6N6J7J6J2J2l3l3J6J5l0k9l0k9ppL8L8O1O0L7L6l9l9N8N7POk7j17l3J48
2074A506R7R7O3O3O9O9J72K62M51P51R33J114Q21L9p49j050r58o58m51k71j84j84r7r8m1m2
2070A724j9k0j15j16M8J38R9q3n0n0k6k6J40J39k7k7j4P7J32m7l7N4L22L22K13L04M17N98
2066D070R38J359K148L049L229K208j23k346l353k932k055j394q30n30l84k03k11k10j81j81
2063B068m5m6MLm2m1j9j9o4o3mmP7P7pQ2R4q7K1J10J33J34J55L06L56M47O17R48J622K373
2059I186L166L166J850n84k744l435k928j936j155o44m64m64k02k03j58j57j43j43pql5l6
$$ plain form
2090 1269 1279 1319 1269 1195 1120 1186 1252 1318 1384 1342 1300 1292 1194 1115 1125 1174 1134 1124 1114 1098 1083 1202 1321 1332 1252 1182 1203 1156 1199 1242 1194 1221 1339
2085 1339 1457 1484 1378 1272 1225 1269 1306 1344 1333 1321 1334 1438 1388 1337 1253 1169 1167 1255 1292 1329 1290 1251 1287 1322 1268 1214 1286 1267 1243 1220 1190 1161 1177
2080 1177 1193 1158 1213 1269 1325 1342 1358 1370 1382 1349 1316 1332 1347 1317 1288 1258 1229 1222 1215 1253 1291 1352 1412 1449 1485 1446 1407 1465 1522 1529 1535 1508 1391 1358 1506
2074 1506 1603 1700 1763 1826 1895 1964 2136 2398 2849 3600 4533 5647 6468 6507 5758 4708 3750 3092 2641 2370 2186 2002 1905 1807 1766 1724
2070 1724 1705 1685 1570 1454 1502 1640 1739 1656 1606 1556 1530 1504 1644 1783 1756 1729 1715 1792 1924 1877 1840 1894 2216 2538 2751 3055 3472 4070
2066 4070 5008 6367 8515 11564 14793 17001 16878 14532 11179 8247 6192 4798 3968 3438 3054 2851 2640 2430 2249 2068
2063 2068 2023 1977 1981 1984 1942 1901 1882 1863 1799 1736 1732 1728 1805 1882 1875 1957 2051 1964 1985 2095 2228 2362 2517 2823 3179 3626 4243 5191 6813 9186
2059 9186 12352 15518 17368 16784 14040 10605 7677 5741 4586 3942 3478 3014 2812 2609 2451 2294 2151 2008 2001 1993 1958 1922
2055A922q1q0j00j00M5M6r5N5K7o3o8K1O1k9J1J1J35J36J52O3J34K84M23M24P40J071R84M73
2051F602l35j025j020q10o20m70k71k71l6l6o9o9OOk1k2j05M4K9K8l7l7r7r6O8O9L9L9l0l0
2046A423o3K7O7q4o3K7LLQ8o2o3Q8L0L0L9L9p4p3L1L2o4o5j9j9J4J4J4J3N8N8m7m7m9m9Q6
2041A343Q6n4n3Q1Q2J3J3J3J4NOl9l9j3j2R0r1l2l2O2O2N0M9M5j34m7m6j3j3K5K5n0n0M3M4
2036A433M4M3N6N6N7N6k5k5N1N0p9q0l4l5j05j05L1L0j3j3kkp2J08J07p2pqj9j8J9K0L1L1
2030A509j21N9L3L3l1l2k0k1mJ77P5P6L3L3J08J08n9o0n9n9m5m4j38j38q5R6ool5l5l5l5p
2025A265pqpJ1J2N6N7R5R5K1K0k4k4j2j3j25N4K9K8PPl9l8L1L1P6P5j4j4j74j74L1J21M3j38
2020A354mQ5K4K4j1j0j1j1l3l3o7o7j22N8J93J2l6l6N8N8m8m7lkM6M7j19j19m8m8Q7Q7POo9
$$ plain form
2055 1922 1841 1761 1661 1561 1606 1652 1557 1612 1639 1576 1508 1529 1590 1561 1572 1583 1718 1854 2006 2069 2203 2487 2910 3334 4074 5145 6129 6602
2051 6602 6267 5242 4222 3412 2792 2322 2051 1780 1744 1708 1639 1570 1576 1582 1561 1539 1434 1478 1507 1535 1498 1461 1364 1268 1336 1405 1444 1483 1453 1423
2046 1423 1360 1387 1454 1370 1307 1334 1337 1340 1428 1366 1303 1391 1421 1451 1490 1529 1455 1382 1413 1445 1381 1316 1297 1278 1292 1306 1320 1333 1391 1449 1402 1355 1306 1257 1343
2041 1343 1429 1375 1322 1403 1485 1498 1511 1524 1538 1543 1549 1510 1471 1458 1446 1536 1445 1413 1381 1443 1505 1555 1604 1649 1515 1468 1422 1409 1396 1421 1446 1396 1346 1389 1433
2036 1433 1477 1520 1576 1632 1689 1745 1720 1695 1746 1796 1717 1637 1603 1568 1463 1358 1389 1419 1406 1393 1391 1389 1317 1425 1532 1460 1453 1445 1426 1408 1427 1447 1478 1509
2030 1509 1388 1447 1480 1513 1482 1450 1430 1409 1405 1582 1657 1733 1766 1799 1907 2015 1956 1896 1837 1778 1733 1689 1551 1413 1328 1424 1418 1412 1377 1342 1307 1272 1265
2025 1265 1258 1250 1243 1254 1266 1322 1379 1474 1569 1590 1610 1586 1562 1550 1537 1412 1466 1495 1523 1530 1537 1498 1460 1491 1522 1598 1673 1659 1645 1471 1297 1328 1449 1492 1354
2020 1354 1350 1435 1459 1483 1472 1462 1451 1440 1407 1374 1307 1240 1118 1176 1369 1381 1345 1309 1367 1425 1377 1330 1327 1325 1371 1418 1299 1180 1132 1084 1171 1258 1265 1271 1202
2015A202o9M9M9LMK2K1K2K1p1p1k6k6M6M5J%K8K8L9M0p2J09j5j96r6Q3k9k9R8R8J35m4j78
2010A221LmnM6M7k9k9jkm6m6rj0L6L5j2j1Q9r1k6k6QQmmP1P1r0r0P5P4k8k9M6M6opn1n1j6
2003A153j5L0K9Q6Q6j9j9p5p6L0L0NNO0O0j37J3N0j01L4j16k3O8Jq9n6R5J71m0pqoJ44J10
1998A473K0J0J1j30j30nmnmL1L1L1L2RQo6o6noM0M0J8J9n7n7j%j%K0K0K1K0QQpr7n7R3KLj
1992A269%QRj03M7QQL4L3L4L3kkkkr8r8k3k2llM2M3J12J11n3n4POl8l9m4m5L1L1K2K2O7O7
1986A413ppn2n3QQQQo6o6k2k1o6o6R9R9O6O6o0n9o2Q8N4l5m8m8K1K2l6l6m5J06lll8l9J3J2
1980A153J2J2j6j5K9K9RQRRJ1J2J2J1L1L1L1L1m5m5m5m5M4M4l2l1J4J4J3J4l2l2J4J3L9L8
1975A349l6l7q1q2l6J14N7l4k4O6RRN9N9%%%Jl5l5l4l5q8q8J07J07J0J1J0J0m4m5JJMLMMj5
$$ plain form
2015 1202 1133 1182 1231 1234 1238 1260 1281 1303 1324 1253 1182 1156 1130 1176 1221 1222 1222 1250 1278 1317 1357 1285 1394 1379 1183 1087 1170 1141 1112 1210 1308 1443 1399 1221
2010 1221 1224 1220 1215 1261 1308 1279 1250 1249 1247 1201 1155 1146 1136 1172 1207 1195 1184 1273 1182 1156 1130 1138 1146 1142 1138 1209 1280 1190 1100 1175 1249 1221 1192 1238 1284 1278 1271 1220 1169 1153
2003 1153 1138 1168 1197 1283 1369 1350 1331 1256 1180 1210 1240 1245 1250 1310 1370 1233 1246 1296 1195 1229 1113 1090 1158 1159 1070 1014 1109 1280 1240 1233 1225 1219 1363 1473
1998 1473 1493 1503 1514 1384 1254 1249 1245 1240 1236 1267 1298 1329 1361 1370 1378 1312 1246 1241 1235 1275 1315 1333 1352 1295 1238 1237 1237 1236 1236 1256 1276 1297 1317 1325 1333 1326 1229 1172 1265 1267 1270 1269
1992 1269 1269 1277 1286 1183 1230 1238 1246 1280 1313 1347 1380 1378 1376 1374 1372 1274 1176 1153 1131 1128 1125 1167 1210 1322 1433 1380 1326 1333 1339 1301 1262 1218 1173 1204 1235 1257 1279 1346 1413
1986 1413 1406 1399 1347 1294 1302 1310 1318 1326 1260 1194 1172 1151 1085 1019 1118 1217 1283 1349 1289 1230 1168 1256 1310 1275 1227 1179 1200 1222 1186 1150 1105 1211 1208 1205 1167 1128 1141 1153
1980 1153 1165 1177 1161 1146 1175 1204 1213 1221 1230 1239 1250 1262 1274 1285 1316 1347 1378 1409 1364 1319 1274 1229 1273 1317 1285 1254 1268 1282 1295 1309 1277 1245 1259 1272 1311 1349
1975 1349 1313 1276 1195 1113 1077 1191 1248 1214 1190 1256 1265 1274 1333 1392 1392 1392 1392 1393 1358 1323 1289 1254 1166 1078 1185 1292 1302 1313 1323 1333 1289 1244 1245 1246 1250 1253 1257 1261 1246
1969A246j4L1L1m5m5L0L0N1N1k4k5N8N8p7p7n7n7M9M8POl8l8j09j09K7K6M3M3L3L3J07m3o5
1963A185o4K5K4K5K4L9L9l7l6L7L7pqrqq4q4O7O7O7O7K1K1k4k4k4k4N2N1N7N6N6N6J09J09
1958A858MNl4l3J1J2j3j3j3j3q2q1q2q1l8l9l8l8l0l0J5J6K7K8K8K8J8J8q6q7J2J3J3J2M8
1953A335M8k6k7m5m4m4m5K1K0k4k5%jM5M5L7L7l8l8L1L2j4j4j7j6j7j6j0rL5L6L4L5j01j01
1947A119K5K5J00R9klM3M2L4L3L4L4M9N0n6n5j7j6r1r1llM2M3p9p9K7K6m9m8K6K7o1o1J4J4
1942A192L1L1m4m4p6p5J20J19ONNNk4k5k4k5M7M7O6q5q4O6M7M7KKm3m3m9m8Q6Q7opopj8j8
1936A260N7N7j5j6R0R0J45J45J90J90m5m5o5k16j57j57l1l1l2l2p7p8k3k3k3k2L8L8L8L8j7
1931A271j8j7j7J16J16M1j10j12k3KR2k3k4j7j8J4J5l0l1p0p0O6O5J8J8J9J8QQQQNOOOj1j1
$$ plain form
1969 1246 1232 1263 1294 1249 1204 1234 1264 1315 1366 1342 1317 1375 1433 1356 1279 1222 1165 1214 1262 1269 1275 1237 1199 1090 981 1008 1034 1077 1120 1153 1186 1293 1250 1185
1963 1185 1121 1146 1170 1195 1219 1258 1297 1260 1224 1261 1298 1291 1283 1274 1266 1182 1098 1165 1232 1299 1366 1387 1408 1384 1360 1336 1312 1364 1415 1472 1528 1584 1640 1749 1858
1958 1858 1862 1867 1833 1800 1811 1823 1810 1797 1784 1771 1689 1608 1526 1445 1407 1368 1330 1292 1262 1232 1247 1263 1290 1318 1346 1374 1392 1410 1324 1237 1249 1262 1275 1287 1335
1953 1335 1383 1357 1330 1285 1241 1197 1152 1173 1193 1169 1144 1144 1143 1188 1233 1270 1307 1269 1231 1262 1294 1280 1266 1249 1233 1216 1200 1190 1181 1216 1252 1286 1321 1220 1119
1947 1119 1144 1169 1269 1368 1366 1363 1406 1448 1482 1515 1549 1583 1632 1682 1626 1571 1554 1538 1447 1356 1353 1350 1392 1435 1356 1277 1304 1330 1281 1233 1259 1286 1225 1164 1178 1192
1942 1192 1223 1254 1210 1166 1090 1015 1135 1254 1260 1265 1270 1275 1251 1226 1202 1177 1224 1271 1337 1252 1168 1234 1281 1328 1330 1332 1289 1246 1197 1149 1235 1322 1316 1309 1303 1296 1278 1260
1936 1260 1317 1374 1359 1343 1433 1523 1668 1813 2003 2193 2148 2103 2038 1822 1665 1508 1477 1446 1414 1382 1305 1227 1204 1181 1158 1136 1174 1212 1250 1288 1271
1931 1271 1253 1236 1219 1335 1451 1492 1382 1270 1247 1249 1341 1318 1294 1277 1259 1273 1288 1258 1227 1157 1087 1153 1218 1236 1254 1273 1291 1299 1307 1315 1323 1328 1334 1340 1346 1335 1324
1926A324j05M5N3r7o0L0K2p0j2j3L4L3L4L3K2K3k3k3j48j48M8M7J13J14L8L8q1q1noK2K2k4
1921A199k3N1N2M2M3Q4o5p5P5J46mQ9R0r3r4q4q4j38J1N6r3R8R9J4J4p2p2L3n7j42RN3N4n4
1916A162n4N2N1qqO7O8k8k7k7k8k0j9k0k0K2K1O7O7j5j5j5j5J2J2J1J2N6N7j8j9R4R4m2m1
1910A486q7q8M8M8J39J40J40J40P1P1k14k14j53j53l9l8k4J26J7p4k2k3k8k8RQN4N3k1k1K4
1905A347K3j7j8j7j8j7j7j7j7m4m3L2L2L5L6rj0K5K4O0O1M5j04m5j35j4j5K5K5K0K1O5O5j1
1900A373j2q7q7j8j9N6N7N5N6N5N6j6j6J19K10J03m6r2j82j12L8r7r7ooooM4M5j1j0R4n6k3
1895A356O8l6l5l0l0n0n1nom0m1L5L5J1J1p3P6L9L9k7k8n6n6M9J39O2q8P8P7qqL6L7K9K9K8
1890A566K9l2l2J2J3LMp2p2o4o5J1J1l2l2M4M3M0M0L6n5L3j17p7P2K6K5j0j0J6J7q9q9J60
$$ plain form
1926 1324 1219 1264 1317 1220 1160 1190 1212 1142 1130 1117 1151 1184 1218 1251 1273 1296 1273 1250 1102 954 1002 1049 1162 1276 1314 1352 1271 1190 1185 1179 1201 1223 1199
1921 1199 1176 1227 1279 1321 1364 1448 1383 1308 1383 1529 1525 1614 1704 1611 1517 1433 1349 1211 1222 1278 1185 1283 1382 1396 1410 1338 1266 1299 1242 1100 1109 1162 1216 1162
1916 1162 1108 1160 1211 1203 1195 1262 1330 1302 1275 1248 1220 1200 1181 1161 1141 1163 1184 1251 1318 1303 1288 1273 1258 1270 1282 1293 1305 1361 1418 1400 1381 1475 1569 1527 1486
1910 1486 1399 1311 1359 1407 1546 1686 1826 1966 2037 2108 1894 1680 1527 1374 1335 1297 1273 1399 1416 1342 1320 1297 1269 1241 1250 1258 1312 1365 1344 1323 1347
1905 1347 1370 1353 1335 1318 1300 1283 1266 1249 1232 1188 1145 1177 1209 1244 1280 1271 1261 1286 1310 1370 1431 1476 1372 1327 1192 1178 1163 1188 1213 1233 1254 1319 1384 1373
1900 1373 1361 1274 1187 1169 1150 1206 1263 1318 1374 1429 1485 1469 1453 1572 1782 1885 1839 1747 1565 1453 1491 1394 1297 1291 1285 1279 1273 1317 1362 1351 1341 1435 1379 1356
1895 1356 1424 1388 1353 1323 1293 1243 1192 1187 1181 1141 1100 1135 1170 1181 1192 1119 1195 1234 1273 1246 1218 1162 1106 1155 1294 1356 1268 1346 1423 1415 1407 1443 1480 1509 1538 1566
1890 1566 1595 1563 1531 1543 1556 1559 1563 1491 1419 1355 1290 1301 1312 1280 1248 1292 1335 1375 1415 1451 1396 1429 1312 1235 1307 1333 1358 1348 1338 1354 1371 1282 1193 1353
1884A353J61mnK1K2M1J93K4K5j6j6j0j00o1L0M9m0o0n9J5J5J5J5n1n0J8J9M4m6m7M4l2l1k6
1879A450k5l0k9J6J6J01J01o4o4P9P9n0n1J3J03M6M6J81R1OOM8M9jr0j00ro0j50k2k1k7k8
1874A610p9p9nmRQN4l6K5o6l5J15k1j12L4J23L2L1pqJ9K0lJ47J26q3m1J10J52J51J07J7l9
1869B272l9%Jn5n5L9j11j42QM0n0l2l2l2l3n8L1j9k0k2k2p3J7mmP7P6K5K5M2m8j44L7J25J25
1864A945n3n4K2K2J0RKJ83J41l9l1l2r9r8n4n4j28j27n3n3K9K9K9K8l9l8o6J16J1J2K3K3j08
1859A508j08K8K8N1N1OPj6j5j6j5n2n2Q3Q3k4k3K2K2N9N9j18O3k0k1qrm0l9n1n0J55k4k8k8
1853A468m6m6p3J08K7K6L8L7p8p8lkL3L4p1p2Q4Q4k2k2J7J7J7J7llm8m9n8n9J7J7Q1Q0nnQ3
1848A542r6q2q1J02p9K3K3K3K3K3K3J1J2l3l4k2k2k2k2K3K3k2k3rj0O5O5N4N4k1k1m0m1m1
$$ plain form
1884 1353 1514 1510 1505 1526 1548 1589 1782 1806 1831 1815 1799 1789 1689 1628 1658 1707 1667 1607 1548 1563 1578 1593 1608 1557 1507 1525 1544 1588 1542 1495 1539 1507 1476 1450
1879 1450 1425 1395 1366 1382 1398 1499 1600 1536 1472 1551 1630 1580 1529 1542 1645 1691 1737 1918 2009 2015 2021 2069 2118 2117 2027 1927 1918 1858 1708 1686 1665 1638 1610
1874 1610 1531 1452 1447 1443 1452 1460 1514 1478 1503 1437 1402 1517 1496 1384 1418 1541 1573 1604 1597 1589 1608 1628 1625 1772 1898 1815 1774 1884 2036 2187 2294 2311 2272
1869 2272 2233 2233 2234 2179 2124 2163 2052 1910 1918 1958 1908 1876 1844 1812 1779 1721 1752 1733 1713 1691 1669 1596 1613 1609 1605 1682 1758 1783 1808 1850 1802 1658 1695 1820 1945
1864 1945 1892 1838 1860 1882 1892 1901 1903 2086 2227 2188 2157 2125 2026 1928 1874 1820 1692 1565 1512 1459 1488 1517 1546 1574 1535 1497 1431 1547 1558 1570 1593 1616 1508
1859 1508 1400 1428 1456 1507 1558 1564 1571 1555 1540 1524 1509 1457 1405 1488 1571 1547 1524 1546 1568 1627 1686 1568 1631 1611 1590 1582 1573 1533 1494 1443 1393 1548 1524 1496 1468
1853 1468 1422 1376 1303 1411 1438 1464 1502 1539 1461 1383 1380 1378 1411 1445 1374 1302 1386 1470 1448 1426 1443 1460 1477 1494 1491 1488 1440 1391 1333 1274 1291 1308 1389 1469 1464 1459 1542
1848 1542 1446 1364 1283 1385 1306 1329 1352 1375 1398 1421 1444 1455 1467 1434 1400 1378 1356 1334 1312 1335 1358 1336 1313 1304 1294 1359 1424 1478 1532 1511 1490 1450 1409 1368
1843A368m0K3K3k2k2RQQQl5l5M1M0onL9L9J1J0o5o5l9l9L6L7MNP9Q0mmmmmmM0M1MNMMK7K8
1836A624K7K7L5L5p1p0L0L0j5j4K5K6K5K6J00J00J09m1p8p8J8J8n0n1K5K4LLP8P8n7n6n6n6
1831A773J8J7R3R3j5j5%j51o2K8R7R8O9k1j05M5J36M7N3l8JKM0M1o5o5k0k1J5J4J4J5J2J2
1826B155j47LONJ5J5Q0P9k5k6l4l5J21J21K5j26r2kq9r0K1K2k4k4k4k4p0o9k5k5m2m1LLMM
1820A648MML5L5p1p0R4R4J9J9mlm9m9q6q6P9Q0mlm9m8p5p5L0L0N1N1R6n5p9J1N6l4j1J38q6
1815A637q7n0n1nnK9L0L5L5r5mJ04m6n9n9POL7L7L6L7qppqkklkr0r1J5J5M1M1lmj3j3j9j8
1808A391N7l2o6Q4L2L3M1M2q4q5rj0J7J7n8n8K2K2K2K2k2k2K3K3j8j9o4o4L1L2L1L1J6J6n8
1803A336n9lkklOON1N2L7L7l8l9m0m0NNL1L1m4m4k7k7J7J8J7J7J7J7m6m6%jJ9K0K0J9k9l0
$$ plain form
1843 1368 1328 1351 1374 1352 1330 1339 1347 1355 1363 1328 1293 1334 1374 1368 1363 1402 1441 1452 1462 1397 1332 1293 1254 1290 1327 1331 1336 1415 1495 1491 1487 1483 1479 1475 1471 1511 1552 1556 1561 1565 1569 1596 1624
1836 1624 1651 1678 1713 1748 1677 1607 1637 1667 1652 1638 1663 1689 1714 1740 1840 1940 2049 2008 1930 1852 1870 1888 1838 1787 1812 1836 1839 1842 1920 1998 1941 1885 1829 1773
1831 1773 1791 1808 1901 1994 1979 1964 1964 1813 1751 1779 1876 1974 2043 2022 1917 1962 2098 2145 2198 2160 2161 2163 2203 2244 2179 2114 2094 2073 2088 2102 2116 2131 2143 2155
1826 2155 2008 2011 2017 2022 2037 2052 2132 2211 2186 2160 2126 2091 2212 2333 2358 2232 2140 2138 2049 1959 1980 2002 1978 1954 1930 1906 1836 1767 1742 1717 1675 1634 1637 1640 1644 1648
1820 1648 1652 1656 1691 1726 1655 1585 1679 1773 1792 1811 1807 1804 1755 1706 1620 1534 1613 1693 1689 1686 1637 1589 1514 1439 1469 1499 1550 1601 1697 1642 1563 1574 1630 1596 1585 1723 1637
1815 1637 1550 1500 1449 1444 1439 1468 1498 1533 1568 1473 1469 1573 1527 1468 1409 1416 1422 1459 1496 1532 1569 1561 1554 1547 1539 1537 1535 1532 1530 1440 1349 1364 1379 1420 1461 1458 1454 1441 1428 1409 1391
1808 1391 1448 1416 1350 1434 1466 1499 1540 1582 1498 1413 1404 1394 1411 1428 1370 1312 1334 1356 1378 1400 1378 1356 1379 1402 1384 1365 1301 1237 1268 1300 1331 1362 1378 1394 1336
1803 1336 1277 1274 1272 1270 1267 1273 1279 1330 1382 1419 1456 1418 1379 1339 1299 1304 1309 1340 1371 1327 1283 1256 1229 1246 1264 1281 1298 1315 1332 1286 1240 1240 1239 1258 1278 1298 1317 1288 1258
1797A258M5M5m2m2L4L3K0K1k5k4L0K9m5m5l8l9R7R7o5o4J0J1ooL9L9n8n7J7J7k1k2k2k2oo
1792A187L9L9N2N2k3k3J05J05j%r7r6k2k1l7l6QRQ3Q3QQn2n2ppL6L5r9j00L1L1qqJ7J08J02
1786A449J2m5j36m2M9R8Pm7m7K7o3J2J03J8J8P5j6RRLLp6p6l2l1K2K3K2K2k9l0k9l0O0N9J5
1780A386J5L0L1K5K5Pq3J2J3j17j17J3J3Q8lK4o6k6k6L8L7N7l2J8J7J8J7k8k8J2J2K1j30J2
1775A285J2m9M2N4N4Nq6Q0P9MMO8J58K3o7m5m5r5r5j2j2L9n2o8o9O1O1J4J4P4j6j17L4P2P3
1770A482P7j2l7l8J%J9J09P6j5q8q8J0J00Jq9j57o7J2J2O9O8l6l7j5j4j5j5mmM1M1J2J1J1
1765A421J1J04J05K9K9n1n2n1n2j1j2j05j05r6Q4N8N8noj7j7J56k3n8n7j6j5K9L0Q4Q4j11
1760A422j11k5k6N0N0K1K0k4k5pqqqk5k5K0K0K0K0K0K0p5p5R1R0Q0Q1NNl7l7l7l7J33J34k
$$ plain form
1797 1258 1303 1348 1306 1264 1298 1331 1351 1372 1347 1323 1353 1382 1337 1292 1254 1215 1312 1409 1344 1280 1290 1301 1295 1289 1328 1367 1309 1252 1269 1286 1265 1243 1221 1199 1193 1187
1792 1187 1226 1265 1317 1369 1346 1323 1428 1533 1532 1532 1435 1339 1317 1296 1259 1223 1231 1240 1323 1406 1414 1422 1370 1318 1311 1304 1340 1375 1276 1176 1207 1238 1230 1222 1239 1347 1449
1786 1449 1461 1416 1280 1238 1287 1385 1392 1345 1298 1325 1262 1274 1377 1395 1413 1488 1472 1481 1490 1493 1496 1420 1344 1312 1281 1303 1326 1348 1370 1341 1311 1282 1252 1312 1371 1386
1780 1386 1401 1431 1462 1487 1512 1519 1436 1448 1461 1344 1227 1240 1253 1341 1338 1362 1296 1270 1244 1282 1319 1376 1344 1362 1379 1397 1414 1386 1358 1370 1382 1403 1273 1285
1775 1285 1297 1248 1290 1344 1398 1403 1317 1397 1476 1480 1484 1552 1710 1733 1666 1621 1576 1481 1386 1374 1362 1401 1349 1281 1212 1273 1334 1348 1362 1436 1420 1303 1337 1409 1482
1770 1482 1559 1547 1510 1472 1473 1473 1492 1601 1677 1662 1574 1486 1496 1596 1597 1508 1351 1284 1296 1308 1377 1445 1409 1372 1357 1343 1328 1313 1309 1305 1346 1387 1399 1410 1421
1765 1421 1432 1536 1641 1670 1699 1648 1596 1545 1493 1482 1470 1365 1260 1164 1248 1306 1364 1359 1353 1336 1319 1475 1452 1394 1337 1321 1306 1335 1365 1449 1533 1422
1760 1422 1311 1286 1260 1310 1360 1381 1401 1377 1352 1345 1337 1329 1321 1296 1271 1291 1311 1331 1351 1371 1391 1316 1241 1332 1422 1502 1583 1588 1593 1556 1519 1482 1445 1578 1712 1710
1754A710jnmn0m9j41j42N4N4l6l6O9O9n9o0MJ85L9L9k5k5k6k7k6k7j4j4O1O1k0k0J45J45J06
1749A934J06J32m8j79j78q5q5l8l8PPn3n3K2K2m7m7klP0O9onl0k9o5o5l1J20P9j0J4p6p6p6
1744A257M6M5M6M5Q9Q9J34J34N1N1M2M1m5j96j57j56j16j17j1j2MMm2m1noL9M0L6L5l9l9N3
1739A299N4n1n1ONOOk6k5J9J9N5N5k0k0M8M9M8M9nnL1L1Q3o6n7n7n6n6n6n6k6k6Q0P9j3j3
1733A337j4j3n5n4n5n4j2j1J24J24k6k5m1N0J07m4n8n8P9P8P9P9k4k5k4k4KKn2n2m5j94l0
1728A071J21K0K0L0L0n7n6j2j1mlmlJ02J02l4l3NNNNj%jjl1l1J3J4j7j8M7M6R0r0n3n2r8Q2
1722A198K7K6J3J3l2l2l5l5M0M1j8j8j8j8k1k2N4N3K9K9K9K9J7J7n8n8lmm8m8j7j6j6j7L7
1717A118L7L6L7J3J3J4J3m3m4KKl2l2l2l2j6j6K9K9P0O9K4K5m3m2N1N2J44l5j30j30K6K7K6
$$ plain form
1754 1710 1709 1704 1700 1650 1601 1460 1318 1372 1426 1390 1354 1423 1492 1433 1373 1377 1562 1601 1640 1615 1590 1564 1537 1511 1484 1470 1456 1517 1578 1558 1538 1683 1828 1934
1749 1934 2040 2172 2124 1945 1767 1682 1597 1559 1521 1528 1535 1482 1429 1451 1473 1426 1379 1377 1374 1444 1513 1507 1502 1472 1443 1378 1313 1282 1402 1481 1471 1485 1409 1333 1257
1744 1257 1303 1348 1394 1439 1528 1617 1751 1885 1936 1987 2029 2070 2025 1829 1672 1516 1400 1283 1272 1260 1264 1268 1226 1185 1180 1174 1213 1253 1289 1324 1285 1246 1299
1739 1299 1353 1302 1251 1257 1262 1268 1274 1248 1223 1242 1261 1316 1371 1351 1331 1379 1428 1476 1525 1520 1515 1546 1577 1660 1594 1537 1480 1424 1368 1312 1256 1230 1204 1284 1363 1350 1337
1733 1337 1323 1310 1255 1201 1146 1092 1080 1069 1193 1317 1291 1266 1225 1275 1382 1338 1280 1222 1301 1379 1458 1537 1513 1488 1464 1440 1442 1444 1392 1340 1295 1101 1071
1728 1071 1192 1212 1232 1262 1292 1235 1179 1167 1156 1152 1149 1145 1142 1244 1346 1312 1279 1284 1289 1294 1299 1298 1298 1297 1296 1265 1234 1247 1261 1244 1226 1273 1319 1409 1319 1266 1214 1116 1198
1722 1198 1225 1251 1264 1277 1245 1213 1178 1143 1183 1224 1206 1188 1170 1152 1131 1109 1163 1216 1245 1274 1303 1332 1349 1366 1308 1250 1247 1243 1195 1147 1130 1114 1098 1081 1118
1717 1118 1155 1191 1228 1241 1254 1268 1281 1238 1194 1196 1198 1166 1134 1102 1070 1054 1038 1067 1096 1166 1235 1259 1284 1241 1199 1250 1302 1446 1411 1281 1151 1177 1204 1230
1711A230K6j02j03L3L3Q3Q4k2k2j11j12poR4R4J8J9j2j2j14O7R1R1r3r3L8L8L9L8j1j2p5p5
1706A134j09P1P1j9n1L9o7K2K9L0J42l7q5NQ0rq0J01R6q5k1k1J3J2J4J4J3J4l0l1l0l1M4M4
1701A282N5N5j07P3J0j70j38M2L5L5rrO6O6j0j0j0j0K5K5q0q0O1O1J6J6J4J5J4J4j05j04O0
1696A198O0j6j5K9K9N1N0OOl5l5l4l5M3M4o2o2J3J3o2o1M8M8M8M8L7L7l8l8ppO8O9q7q7j2
1691A252j2RRl6l6q6q6J9J9L1L1L1L2N2N2k3k3J9J9J9J9k3k4l0k9M7m4j05P5J27n4j5j6l9
1685A181l9OOM6M6JJO0O0j5j5rrrrp9q0oQ4M2j38pQ3R9R8o1o2L7L8l7j26o8J12J77nr3j83
1680A127k9O1MMJ22n8j07P4Q6mk0k1k6k6M4M5O1k8j24N7N6l3j06P5J2J3p2p2O3O3J6J6O0O1
1675A394q8q7q8q8M9M8M9M8L2L1m3m4p9q0N4J43P3j08pQ4N6N6m3m4p0o9L5L5J07J06n9n9o6
$$ plain form
1711 1230 1256 1154 1051 1084 1117 1200 1284 1262 1240 1129 1017 1010 1004 1098 1192 1210 1229 1217 1205 1091 1158 1249 1340 1247 1154 1192 1230 1269 1307 1296 1284 1209 1134
1706 1134 1025 1096 1167 1148 1097 1136 1069 1091 1120 1150 1292 1255 1170 1175 1255 1246 1166 1267 1363 1278 1257 1236 1249 1261 1275 1289 1302 1316 1286 1255 1225 1194 1238 1282
1701 1282 1337 1392 1285 1358 1368 1198 1060 1102 1137 1172 1163 1154 1220 1286 1276 1266 1256 1246 1271 1296 1216 1136 1197 1258 1274 1290 1304 1319 1333 1347 1242 1138 1198
1696 1198 1258 1242 1227 1256 1285 1336 1386 1392 1398 1363 1328 1294 1259 1302 1346 1284 1222 1235 1248 1186 1125 1173 1221 1269 1317 1354 1391 1353 1315 1308 1301 1369 1438 1351 1264 1252
1691 1252 1240 1249 1258 1222 1186 1100 1014 1033 1052 1083 1114 1145 1177 1229 1281 1258 1235 1254 1273 1292 1311 1288 1264 1234 1205 1252 1208 1103 1178 1305 1251 1236 1220 1181
1685 1181 1142 1148 1154 1200 1246 1247 1248 1308 1368 1353 1338 1329 1320 1311 1302 1223 1143 1137 1221 1263 1125 1118 1201 1300 1398 1337 1275 1312 1350 1313 1187 1119 1231 1408 1403 1310 1127
1680 1127 1098 1159 1163 1167 1289 1231 1124 1198 1284 1280 1260 1239 1213 1187 1231 1276 1337 1309 1185 1242 1298 1265 1159 1234 1246 1259 1187 1115 1178 1241 1257 1273 1333 1394
1675 1394 1306 1219 1131 1043 1092 1140 1189 1237 1269 1300 1257 1213 1134 1054 1108 1251 1324 1216 1209 1293 1349 1405 1362 1318 1248 1179 1214 1249 1356 1462 1403 1344 1278
1670A278o5o6o5K8K9O5O4J24k5r7pJJPP%%J%lklkl4l4l3l4onk1O9J04m6n8L3N8l2n1n1K9K8
1663A186K9K9K1K1k5k4P5P5L0L0m6m7m6m7P7P6k3k3m3M7Oj45Q2Q1j53j53N7N6N7N7K2K3K3
1658A385K3P7P7n8n8L7L7L7L7K3K3K3K3J66J66O1O1R5R6J70J70K18K17J3J3P2p8k19k19q8
1654B600q7m3m2m2m2j22j23J4p6j16L4K25J35P4j5N9l2l1l1r8r8p7P4L8L9M8M8k2k2K3K4L
1649B319Mp2p2MMQ0P9O1O1J37J36jkjjkkJ33J33N7N7p9p8j28j28p7p7oQ4J36m6q5q6n1n2o2
1643B377o2M3M3M0L9r6r6m5m5j20j20M1M0M1M0m6m6o2K7Q3r8q0Rq5MP4J65J14J15J20J20R2
1638B626R3J67J68J26J26N1N2j34j33j33j33k04k04k05k04j02j02l8l8O4j17r1r0j7j7j7j7
1634A477n4n4n5n4m5m4R1R1k5k4J5J4N6l5j25N6J7J07qpk6k5k6k5j4j5k0j9O4k6p1J9ppkj
$$ plain form
1670 1278 1213 1147 1082 1110 1139 1204 1268 1392 1367 1270 1263 1264 1265 1272 1279 1279 1279 1280 1280 1277 1275 1272 1270 1236 1202 1169 1135 1129 1124 1103 1172 1276 1230 1172 1205 1263 1231 1180 1129 1158 1186
1663 1186 1215 1244 1265 1286 1261 1237 1312 1387 1417 1447 1401 1354 1308 1261 1338 1414 1391 1368 1325 1372 1378 1233 1315 1396 1243 1090 1147 1203 1260 1317 1339 1362 1385
1658 1385 1408 1485 1562 1504 1446 1483 1520 1557 1594 1617 1640 1663 1686 1852 2018 2079 2140 2235 2331 2501 2671 2889 3106 3119 3132 3204 3126 2907 2688 2600
1654 2600 2513 2470 2428 2386 2344 2222 2099 2113 2037 1921 1955 2180 2315 2389 2374 2433 2401 2370 2339 2241 2143 2066 2140 2178 2217 2265 2313 2291 2269 2292 2316 2319
1649 2319 2323 2251 2179 2183 2187 2267 2346 2407 2468 2605 2741 2740 2738 2737 2736 2734 2732 2865 2998 3055 3112 3033 2955 2827 2699 2622 2545 2539 2623 2759 2713 2628 2542 2491 2439 2377
1643 2377 2315 2358 2401 2441 2480 2384 2288 2243 2198 2078 1958 1999 2039 2080 2120 2074 2028 1966 1993 2076 1978 1898 1907 1822 1826 1900 2065 2179 2294 2414 2534 2626
1638 2626 2719 2886 3054 3180 3306 3357 3409 3275 3142 3009 2876 2672 2468 2263 2059 1957 1855 1817 1779 1843 1726 1635 1545 1528 1511 1494 1477
1634 1477 1423 1369 1314 1260 1215 1171 1262 1353 1328 1304 1319 1333 1389 1354 1229 1285 1302 1409 1401 1394 1368 1343 1317 1292 1278 1263 1243 1224 1288 1262 1191 1210 1203 1196 1194 1193
1629A193k2k2N3N3LMm2m1O7O7l7l8pqqp%%n1M0m1m2J0RL5L5m0m1P7P6n6L5J32M2n8n7q3O9
1623A299K8K9QRN3N4qpm7m7o6K4L0o0q5N%r0K7K8k3k3m1m1L8J29M2m7j81l0L0L1P9P9kr2m8
1617A084m7J5p6Q4J74L6n4KKj7j7p7J3O7q4l2l3O4J54qpJ07J7l7l7PPJJO2k9k2k3n9o0j4j4
1612A150L6L6q9%N1N2L2n8m8m8Q1Q2K7K7n8n7L1j18m0N0K7K7j2j3k8k8k8k9K1K0k4k4K6K6
1607A100K6K6MMJ09J8o9Q2Q1o9q3PM3m8mlO5O6o9p0L6L5M8M7mlkr1q1P0L5L4r1r1K9K8K9K9
1601A273l1l2l2l1J4J5NNJ31j9j51o0POJ2J2K5K5K5K5k7k7l6l6R9n0o2K8n9o0N2N2P7P6KK
1595A255J5J4k0k1j13L7klm6m7jjJ8J8J08m2o7K3J49N8p4p4M6M6l1j81k4O7J30n1j9j9J24
1590A272J24j1j1r9r8L6L7K3K4n2n1K0K1n4n4L7L7L7L7J6J5k9k9llM2M2j0j0rj0N7N6J2J2
$$ plain form
1629 1193 1171 1149 1202 1255 1258 1262 1220 1179 1246 1313 1276 1238 1231 1223 1215 1208 1208 1208 1157 1197 1156 1114 1124 1133 1168 1203 1163 1122 1199 1275 1219 1254 1386 1428 1370 1313 1230 1299
1623 1299 1327 1356 1364 1373 1426 1480 1472 1465 1418 1371 1305 1329 1359 1299 1214 1219 1219 1129 1156 1184 1161 1138 1097 1056 1094 1223 1265 1218 1037 1007 1037 1068 1147 1226 1224 1132 1084
1617 1084 1037 1052 976 1060 1234 1270 1216 1218 1220 1203 1186 1109 1122 1189 1105 1073 1040 1104 1258 1250 1243 1350 1367 1330 1293 1300 1307 1308 1309 1371 1342 1320 1297 1238 1178 1164 1150
1612 1150 1186 1222 1133 1133 1184 1236 1268 1210 1162 1114 1195 1277 1304 1331 1273 1216 1247 1129 1089 1139 1166 1193 1181 1168 1140 1112 1084 1055 1076 1096 1072 1048 1074 1100
1607 1100 1126 1152 1156 1160 1269 1287 1218 1300 1381 1312 1229 1236 1279 1231 1227 1224 1289 1355 1286 1216 1252 1287 1335 1382 1378 1375 1373 1282 1201 1271 1306 1340 1249 1158 1187 1215 1244 1273
1601 1273 1242 1210 1178 1147 1161 1176 1181 1186 1317 1298 1147 1087 1094 1100 1112 1124 1149 1174 1199 1224 1197 1170 1134 1098 1197 1147 1085 1113 1054 994 1046 1098 1175 1251 1253 1255
1595 1255 1270 1284 1264 1243 1130 1167 1165 1162 1116 1069 1068 1067 1085 1103 1211 1169 1102 1125 1274 1332 1258 1184 1230 1276 1245 1064 1040 1107 1237 1186 1167 1148 1272
1590 1272 1396 1385 1374 1275 1177 1213 1250 1273 1297 1245 1194 1214 1235 1181 1127 1164 1201 1238 1275 1291 1306 1277 1248 1245 1242 1284 1326 1316 1306 1297 1287 1344 1400 1412 1424
1585A424J8J8k7k7m3m4L1L1lmo0J21L5L5JJMLMLJ5J5J5J4j9k0K6K5O8O8j39M2mml8l7MNNM
1579A566R2R3L6L5J04p7K5K4l4l5M1M0j1j1q6q6KLm2m2Q1Q2k3k4j3j3J33m7K3K2J2J1k6k5
1574A830k6k5J9J9n5n6n3n3rqR2R1j4j4m1m2O4O4J3J3j22j23K1K0N7N6Q7o3o3Q7j%l1l1j13
1568A590k2K8J79Q3o7P2P2K8K7K8K8j04j03k9k9j1j2j2j2noq1q0O0O0j5j5%JJJm3m2m3m2j3
1563A472j3L2L2l2l1l2l2O7O7qqN3N3J28J28q3q3j36P4M3j08q5q5J42J41j68j9P6P6q0q0j8
1558A483j8o3o2J8J9k6k6K3K3K3K3j1j1n6n6J5J5J5J5L5L4jjj17L3J34M4K7K7O7O7NMj00j00
1553A501m6m6j%n8n8M8M8k2k2K3K3j48j49M7M7L3L3L3L2Q4Q3n1n2o0o0j5j5O1O2J7J6LKLK
1547A398Q3Q4n2n2L0L1L1L0r6r7RRk7k7k7k6N4N5J0J0P6P6L2L1l8l9n3R7J8p2j2j3l4l5l5
$$ plain form
1585 1424 1442 1460 1433 1406 1363 1319 1350 1381 1378 1374 1314 1435 1470 1505 1506 1507 1511 1514 1518 1521 1536 1551 1566 1580 1561 1541 1567 1592 1660 1728 1589 1631 1627 1623 1585 1548 1552 1557 1562 1566
1579 1566 1658 1751 1787 1822 1926 1849 1874 1898 1864 1829 1870 1910 1899 1888 1802 1716 1718 1721 1679 1637 1718 1800 1777 1753 1740 1727 1860 1813 1836 1858 1870 1881 1855 1830
1574 1830 1804 1779 1798 1817 1762 1706 1653 1600 1591 1583 1675 1766 1752 1738 1697 1655 1719 1783 1796 1809 1687 1564 1585 1605 1662 1718 1805 1742 1679 1766 1765 1765 1734 1703 1590
1568 1590 1568 1596 1775 1858 1791 1863 1935 1963 1990 2018 2046 1942 1839 1810 1781 1770 1758 1746 1734 1729 1723 1642 1562 1622 1682 1667 1652 1652 1653 1654 1655 1612 1570 1527 1485 1472
1563 1472 1459 1491 1523 1491 1460 1428 1396 1463 1530 1522 1514 1567 1620 1748 1876 1793 1710 1574 1648 1691 1583 1498 1413 1555 1696 1528 1509 1585 1661 1581 1501 1483
1558 1483 1465 1402 1340 1358 1377 1351 1325 1348 1371 1394 1417 1406 1395 1339 1283 1298 1313 1328 1343 1378 1412 1411 1410 1293 1326 1460 1504 1531 1558 1625 1692 1697 1701 1601 1501
1553 1501 1455 1409 1408 1408 1350 1292 1340 1388 1366 1344 1367 1390 1242 1093 1140 1187 1220 1253 1286 1318 1402 1485 1434 1382 1322 1262 1247 1232 1293 1355 1372 1388 1391 1393 1396 1398
1547 1398 1481 1565 1513 1461 1491 1522 1553 1583 1487 1390 1399 1408 1381 1354 1327 1301 1355 1410 1420 1430 1506 1582 1614 1645 1607 1568 1515 1612 1630 1558 1546 1533 1499 1464 1429
1542A429l5k9k9P6P6j15j16K0K0P2P1P2P1O9O9r7r6J7J7n7n8J2J2l3l2J3J3l2l2L2L2L2L2
1537A496K3K3n3n2RRJ0RQ3Q4Q3Q4J7J7J8J7q8q7J7J7m9m9nmK3K3K3K3P7P6q9q8k1k0o5o6q4
1531A441q5K1K1Q8Q8j7j7P1P2o4o4jjM4M4O5O5O6O5P8P8k6k7jjjjj21j20M7m4j14O5R4R4N
1526A907Om0l9JJj03j04n6n6n6n6jjM4M4m0l9L5L6NNN0N0n4n5n4n4J46J47P1P1K7K7j8j8p0
1520A759p0j02P8K4o6nmL7L7L8L7k9k9j3j02j29N1n6n5k5k5n8n9p7J02J36J37poL9L8j06j07
1515A383kkN4N4RQN8N8N8N7N3N3j66j67k4O7n4n3o5K5Q0P9j7j8j23l3J04m7q3Ql0l1k5k5k7
1510A216k7l2N8l3l2k7k7J9J9l1N9N4N4LR4L4n5OOM2J32k9k9j0j00mml2l2p7p8P2P1l4l4K4
1504A236K3J7j34n9J51O3q7PPj3P6P7j4n9L2J9p1lr3j34m3R5R6J0J0m6M3P2k0o4K6R0%k4k5
$$ plain form
1542 1429 1394 1365 1336 1412 1488 1373 1257 1277 1297 1369 1440 1512 1583 1652 1721 1624 1528 1545 1562 1505 1447 1459 1471 1438 1406 1419 1432 1400 1368 1400 1432 1464 1496
1537 1496 1519 1542 1489 1437 1446 1455 1465 1474 1557 1641 1724 1808 1825 1842 1860 1877 1789 1702 1719 1736 1687 1638 1633 1629 1652 1675 1698 1721 1798 1874 1785 1697 1676 1656 1591 1525 1441
1531 1441 1356 1377 1398 1486 1574 1557 1540 1611 1683 1619 1555 1554 1553 1597 1641 1706 1771 1837 1902 1980 2058 2032 2005 2004 2003 2002 2001 1880 1760 1807 1763 1649 1714 1808 1902 1907
1526 1907 1913 1873 1834 1835 1836 1733 1629 1573 1517 1461 1405 1404 1403 1447 1491 1451 1412 1447 1483 1488 1493 1543 1593 1539 1484 1430 1376 1522 1669 1740 1811 1838 1865 1847 1829 1759
1520 1759 1689 1587 1665 1689 1623 1618 1614 1651 1688 1726 1763 1734 1705 1692 1590 1461 1512 1456 1401 1376 1351 1293 1234 1157 1259 1395 1532 1525 1519 1558 1596 1490 1383
1515 1383 1381 1379 1433 1487 1496 1504 1562 1620 1678 1735 1788 1841 1675 1508 1484 1551 1497 1444 1379 1404 1484 1563 1546 1528 1405 1372 1476 1429 1346 1354 1324 1293 1268 1243 1216
1510 1216 1189 1157 1215 1182 1150 1123 1096 1115 1134 1103 1162 1216 1270 1273 1367 1401 1346 1352 1358 1400 1532 1503 1474 1464 1364 1360 1356 1324 1292 1215 1137 1209 1280 1246 1212 1236
1504 1236 1259 1276 1142 1083 1234 1297 1210 1217 1224 1211 1287 1364 1350 1291 1323 1342 1271 1268 1175 1041 998 1093 1189 1199 1209 1163 1206 1278 1258 1194 1220 1310 1310 1286 1261
1499A261Lq7l7l7O9O8ppm9n0K6K6M3M3N8r2q1J0J8J9P5j6m0m0L4L3ooJ9J09L4n6K4K4or7P
1493A289PJJj0j0j0j0N4N3n1n2J3J3l2l1k2k2K4K4Q5Q6n0n0l9l8OPL2L3m3m2K9K8N5j25l7
1488A166l6m7m8M2M2P5P6M5j34l4l3O8O8J62J63K50P0q4q4p7p7o6o6j89rQ5Q5j01j01MLMM
1483A226M9M9q3q4qrM0M0L9M0o3o3J2J2j8j8K7K7%%%%m6m5%%K8K7K8K8o3o2J44l6k4k3l5l4
1477A102OPOPM5M4%%LKM8M7n5n5j0j0p7p7k4J56R0r2p9J00O0O0R8q3q6q6L7L8J4J4N9N9l5
1471A333l6l6l5m9m8m9m9j9j9Q6Q6PPr4Q6l1l2Q6Q5p0p0R6R5j5j5n9o0l4l4M2M1J5J6o1o0
1466A106K5K4P0O9J8J8n7n7k8k8k8k9k7k7P8P7J3J3l2l2k0j9P4P4P1j09n3n2k4k4k4k4J00
1461A136J01O7j13J7J6p0p0P8P9L3L3p6p6L0K9j0j0j1j0L2L1L1L1K3K2q2q2M9N0M9N0l9l8
$$ plain form
1499 1261 1264 1177 1140 1103 1172 1240 1233 1226 1177 1127 1153 1179 1222 1265 1323 1231 1150 1160 1178 1197 1272 1256 1216 1176 1210 1243 1237 1231 1250 1359 1393 1337 1361 1385 1379 1282 1289
1493 1289 1296 1297 1298 1288 1278 1268 1258 1312 1365 1314 1262 1275 1288 1256 1225 1203 1181 1205 1229 1314 1400 1350 1300 1261 1223 1229 1236 1268 1301 1258 1216 1245 1273 1328 1203 1166
1488 1166 1130 1083 1035 1077 1119 1194 1270 1315 1181 1147 1114 1182 1250 1412 1575 1825 1895 1811 1727 1650 1573 1507 1441 1252 1243 1328 1413 1312 1211 1215 1218 1222 1226
1483 1226 1275 1324 1241 1157 1149 1140 1180 1220 1259 1299 1236 1173 1185 1197 1179 1161 1188 1215 1215 1215 1215 1215 1169 1124 1124 1124 1152 1179 1207 1235 1172 1110 1254 1218 1194 1171 1136 1102
1477 1102 1108 1115 1121 1128 1173 1217 1217 1217 1220 1222 1270 1317 1262 1207 1197 1187 1110 1033 1009 1165 1255 1163 1084 1184 1244 1304 1402 1319 1233 1147 1184 1222 1236 1250 1309 1368 1333
1471 1333 1297 1261 1226 1177 1129 1080 1031 1012 993 1079 1165 1172 1179 1085 1171 1140 1108 1194 1279 1209 1139 1235 1330 1315 1300 1241 1181 1147 1113 1155 1196 1211 1227 1166 1106
1466 1106 1131 1155 1225 1294 1312 1330 1273 1216 1188 1160 1132 1103 1076 1049 1127 1204 1217 1230 1198 1166 1146 1127 1201 1275 1346 1237 1184 1132 1108 1084 1060 1036 1136
1461 1136 1237 1304 1191 1208 1224 1154 1084 1162 1241 1274 1307 1231 1155 1185 1214 1204 1194 1183 1173 1205 1236 1267 1298 1321 1343 1261 1179 1228 1278 1327 1377 1338 1300
1456A300O6O7o1o1o1o2Q4Q3Q4Q3J02J02K7K7m4m4m3m4p9q0p9q0k2k2k3k2J08J08n8n7jjM4
1451A341M4K6K7K7K7j2j1K2j28k9j18p4J97J02m9p8p7l0O1M9j01j6j6Q1Q0L4L4L4L4m8m9m9
1446A335m8O3O3l2l3j01M9K1o9j5P6J9K0Q4Q5j34J5j5j6n1n1nnonO9O9O1j49m5J06j7j07M5
1441A276M5l6l6L5L6p0p0N0N0NNM8M9MMj6j6j6j7o0o0j5j6Q2Q2PPL0L1j05j05J6J6J6J6J2
1435A284J3J2J2P5P4j15L5JJj2j2QQK4o7q8O2ooj21j21P4P4K7K7J0J0l0N9Q8o3K4o6%R0PO
1430A398o3o2p8p8l3l3J9J8R4R3RRl6l6q2q2N3N3K0J9LK%R1J01m8l2l1O5O4k0k1LKk6k7ml
1424A321llJ13l6j07M4r5r4O1O1j4j5k7k8J7J8L7L7J5J4j9j9J2J3j07M4L4L4OOK9K8L4L3j2
1418A432j2K3K2n3n2P6P6n9o0o7o7L8L8K7K8NNK4K3k1k2k0k0k0k0l1l1M4M4m1m1m1m1K0K0
$$ plain form
1456 1300 1366 1433 1372 1311 1250 1188 1272 1355 1439 1522 1624 1726 1753 1780 1736 1692 1649 1605 1526 1446 1367 1287 1265 1243 1220 1198 1306 1414 1356 1299 1298 1297 1341
1451 1341 1385 1411 1438 1465 1492 1480 1469 1491 1363 1334 1216 1142 1339 1441 1392 1314 1237 1207 1268 1317 1216 1200 1184 1265 1345 1379 1413 1447 1481 1433 1384 1335
1446 1335 1287 1350 1413 1381 1348 1247 1296 1317 1248 1233 1309 1328 1348 1432 1517 1383 1398 1383 1367 1316 1265 1260 1255 1249 1244 1313 1382 1443 1294 1249 1355 1338 1231 1276
1441 1276 1321 1285 1249 1284 1320 1250 1180 1230 1280 1285 1290 1338 1387 1391 1395 1379 1363 1347 1330 1270 1210 1195 1179 1261 1343 1350 1357 1387 1418 1313 1208 1224 1240 1256 1272 1284
1435 1284 1297 1309 1321 1396 1470 1355 1390 1391 1392 1380 1368 1376 1384 1408 1341 1253 1315 1309 1303 1182 1061 1135 1209 1236 1263 1273 1283 1253 1312 1400 1337 1361 1295 1295 1385 1392 1398
1430 1398 1335 1273 1195 1117 1084 1051 1070 1088 1182 1275 1284 1293 1257 1221 1139 1057 1110 1163 1183 1202 1205 1207 1207 1298 1399 1351 1319 1288 1353 1417 1397 1376 1379 1381 1355 1328 1324 1321
1424 1321 1318 1315 1428 1392 1285 1329 1234 1140 1201 1262 1248 1233 1206 1178 1195 1213 1250 1287 1302 1316 1297 1278 1290 1303 1196 1240 1274 1308 1314 1320 1349 1377 1411 1444 1432
1418 1432 1420 1443 1465 1412 1360 1436 1512 1453 1393 1326 1259 1297 1335 1362 1390 1395 1400 1424 1447 1426 1404 1384 1364 1344 1324 1293 1262 1306 1350 1309 1268 1227 1186 1206 1226
1413A226K0K0J2J3J2J2k2k2k3k2k3k4Q2Q2ooJ7J6J4J3N9N9r2r1m6m6Q7Q6j8j8J7J7n8n8m3
1408A246m3KKMNNMN2N1q4q4P8P9L3L3J4J4l1l1NMm1m1K6K6MLJJK3K3j8j8j8j8O5O4j1j1o4
1402A354o4J0J1j2j2J1J0m6m6jjM7M6k8k9p3p3R3R2M7M6KJJ0J1J0J0J6J5k9l0k0k0LK%%k3
1396A340k3J0J0J0RJ3J2l3l3p0o9ONK2K2K2K1n3n3K2K2N9N9j7j6j5j4L0L1k3k3k3k3n0n0J16
1390A253J15lmmlJ8J8J8J8q2q3K3K3J2J2J2J2opL8L8l8l9l9l9n0n1nnJ6J6J6J6j0j1mnl8N1
1384A199M6j04RJ00L9M0k3k3k2k3KKM6M7p2p3O3O2R6R7l9l9n7n6J8J8O6O5j00j00o9o9OOJ7
1379A175J7J7J7L0K9L0K9K1K1K1K1k2k2K4K3K8K8p7p8j6j7o2o1J04J05l1l1K0K0K0K0n5n5
1374A293n6n5K1K0kJ48R2j17j37m6J1J62Q8kn7n7j8j7L6L7L7L7j15j15K0K0J3J3J3J2J5J5
$$ plain form
1413 1226 1246 1266 1278 1291 1303 1315 1293 1271 1248 1226 1203 1179 1261 1343 1337 1331 1348 1364 1378 1391 1450 1509 1417 1326 1280 1234 1321 1407 1389 1371 1388 1405 1347 1289 1246
1408 1246 1203 1205 1207 1211 1216 1221 1225 1277 1328 1244 1160 1238 1317 1350 1383 1397 1411 1380 1349 1354 1358 1317 1276 1302 1328 1332 1335 1336 1337 1360 1383 1365 1347 1329 1311 1376 1440 1429 1418 1354
1402 1354 1290 1300 1311 1299 1287 1298 1308 1262 1216 1215 1214 1261 1307 1279 1250 1177 1104 1197 1289 1336 1382 1384 1385 1395 1406 1416 1426 1442 1457 1428 1398 1378 1358 1361 1363 1363 1363 1340
1396 1340 1317 1327 1337 1347 1356 1369 1381 1348 1315 1245 1176 1182 1187 1209 1231 1253 1274 1221 1168 1190 1212 1271 1330 1313 1297 1282 1268 1298 1329 1306 1283 1260 1237 1187 1137 1253
1390 1253 1368 1365 1361 1357 1354 1372 1390 1408 1426 1344 1261 1284 1307 1319 1331 1343 1355 1349 1342 1380 1418 1380 1341 1302 1263 1213 1162 1157 1152 1168 1184 1200 1216 1206 1195 1191 1186 1148 1199
1384 1199 1245 1141 1150 1250 1289 1329 1306 1283 1261 1238 1240 1242 1288 1335 1263 1190 1253 1315 1411 1508 1469 1430 1373 1317 1335 1353 1419 1484 1384 1284 1215 1146 1152 1158 1175
1379 1175 1192 1209 1226 1256 1285 1315 1344 1365 1386 1407 1428 1406 1384 1408 1431 1459 1487 1410 1332 1316 1299 1237 1176 1280 1385 1354 1323 1343 1363 1383 1403 1348 1293
1374 1293 1237 1182 1203 1223 1221 1369 1461 1344 1207 1161 1172 1334 1422 1420 1363 1306 1288 1271 1307 1344 1381 1418 1303 1188 1208 1228 1241 1254 1267 1279 1294 1309
1369A309o1o0L1L1L2L1K9K9L0K9m1m2MLM4M4l1l2l4l4M1M1m4m3L1L2k8k8M8M7J3J3J3J2k7
1364A432k7J7J8opL8L9m3m2m3m2JKJKPOPPm0m1L5L5l3l3P1P2j4j4r0r0O7O7K2K2o2o3J2J3
1358A303m1m2R4R4m7m6K8K8q1q0K4K5J8J8k7k8N2N2N2N2j60j60O5O5J6J6J6J5m9m9J17J16
1353A456L9L9r5r6n1n1Q4Q4K8K7j8j7q6q5N0N0K8K8j7j7j0rO6O5K1K1R7R6o4o5j9j9q4q4q4
1348A308q3m3m2K24M4QQmlp7p8K8K8J7J7k8k7k7k7M8M8k1k0k1k1N1N0J07p3m8m9n9o0ooR9
1342A262R9k7k7r4Q6J18o3k5k5K6K6j9j9KKJKj7j7j7j8j3j3Q0Q1J07p3m7m6j2j2L3L3l3l3
1337A308l3l4R9R8l7l7J1J0J0J0o8o8k3k2K7K8p8p8R6R6rrL5L6L5L6l4l4J1J1j0rrrj1j1j1
1331A323j1K7K7m8m9k0k0K5K5poppJ6J6J6J6QRl7l6L3L3L3L3p6p5L0L0K1K0K1K1JKm3m3L8
$$ plain form
1369 1309 1248 1188 1219 1250 1282 1313 1342 1371 1401 1430 1389 1347 1351 1354 1398 1442 1411 1379 1345 1311 1352 1393 1349 1306 1337 1369 1341 1313 1361 1408 1421 1434 1447 1459 1432
1364 1432 1405 1422 1440 1434 1427 1465 1504 1461 1419 1376 1334 1335 1337 1338 1340 1347 1353 1360 1367 1327 1286 1321 1356 1323 1290 1361 1433 1419 1405 1315 1225 1292 1359 1381 1403 1341 1278 1290 1303
1358 1303 1262 1220 1314 1408 1361 1315 1343 1371 1290 1210 1234 1259 1277 1295 1268 1240 1292 1344 1396 1448 1288 1128 1193 1258 1274 1290 1306 1321 1272 1223 1340 1456
1353 1456 1495 1534 1439 1343 1292 1241 1325 1409 1437 1464 1446 1429 1343 1258 1308 1358 1386 1414 1397 1380 1370 1361 1427 1492 1513 1534 1631 1727 1663 1598 1579 1560 1476 1392 1308
1348 1308 1225 1182 1140 1364 1408 1416 1424 1420 1417 1340 1262 1290 1318 1335 1352 1324 1297 1270 1243 1291 1339 1318 1298 1277 1256 1307 1357 1464 1391 1343 1294 1235 1175 1169 1163 1262
1342 1262 1361 1334 1307 1213 1299 1417 1354 1329 1304 1330 1356 1337 1318 1320 1322 1323 1325 1308 1291 1274 1256 1243 1230 1310 1391 1498 1425 1378 1332 1320 1308 1341 1374 1341 1308
1337 1308 1275 1241 1340 1438 1401 1364 1375 1385 1395 1405 1337 1269 1246 1224 1251 1279 1201 1123 1219 1315 1306 1297 1332 1368 1403 1439 1405 1371 1382 1393 1383 1374 1365 1356 1345 1334 1323
1331 1323 1312 1339 1366 1318 1269 1249 1229 1254 1279 1272 1266 1259 1252 1268 1284 1300 1316 1324 1333 1296 1260 1293 1326 1359 1392 1316 1241 1271 1301 1322 1342 1363 1384 1385 1387 1344 1301 1339
1325A339L8o6o7O7O7K1K2M0M1M0M1o2o2o2o2J2J1J17J16r4r5k0j9O7O7qrK6K6j9j9n3n2K3
1320A412K3k4k5k5k5J8J8J7J8k2k3k2k2k4k4Q1Q1o0o0J6J5o2o2P3P3M8M7LKqqpqN9N9m6m6
1315A460OOPOJ44J44L9L9N8N7N8N8oon1n1%Jj35j34q6q6m1m0ppppM4M3j8P2R7q2K4K4K6K6
1309A675Q8r2q4PpQ4N9l1k0k0K1K1K0K1O4O5p1p0p3p2k8k7j4j3j3j4K9K9p6p7L5L4Q0P9j9
1303A590k0k0k0j1j0j1j0J2J2J2J2L2L2J33m7KKj0rM8M9M9M9J8J8J8J8j28j28k3k3ONNNn7
1298A600n8J8J7k4k5l0l1O3k8K3K3n0n1NR4L1L1o9K2P3p7l8N3k5k4J11m0N4N3q2RJ06J06J18
1293A958K8q5q4m5m5j4j5k1k0K2o9j7j8L4L4Q5on1n0j2j1M0M0nnm2m2L4L3j4j4j4j4k2k1p3
1287A479J8J05J04O1k9k2O8J62P1J03J2j08j08j18j17o9K2Nq4k9O2OR5l0l0rr9k9O0P5j6r8
$$ plain form
1325 1339 1377 1311 1244 1311 1378 1399 1421 1461 1502 1542 1583 1521 1459 1397 1335 1347 1358 1475 1591 1497 1402 1382 1363 1430 1497 1489 1480 1506 1532 1513 1494 1441 1389 1412
1320 1412 1435 1411 1386 1361 1336 1354 1372 1389 1407 1385 1362 1340 1318 1294 1270 1351 1432 1372 1312 1328 1343 1281 1219 1292 1365 1413 1460 1463 1465 1457 1449 1442 1434 1493 1552 1506 1460
1315 1460 1466 1472 1479 1485 1629 1773 1812 1851 1909 1966 2024 2082 2076 2070 2019 1968 1968 1969 1834 1700 1614 1528 1487 1447 1440 1433 1426 1419 1463 1506 1488 1560 1657 1575 1599 1623 1649 1675
1309 1675 1763 1671 1587 1594 1587 1671 1730 1699 1679 1659 1680 1701 1721 1742 1806 1871 1800 1730 1657 1585 1557 1530 1516 1503 1490 1476 1505 1534 1458 1381 1416 1450 1530 1609 1590
1303 1590 1570 1550 1530 1519 1509 1498 1488 1500 1512 1524 1536 1568 1600 1733 1686 1688 1690 1680 1671 1719 1768 1817 1866 1884 1902 1920 1938 1810 1682 1659 1636 1642 1647 1652 1657 1600
1298 1600 1542 1560 1577 1553 1528 1498 1467 1530 1502 1525 1548 1498 1447 1452 1546 1577 1608 1539 1561 1634 1557 1519 1572 1547 1523 1634 1594 1648 1701 1619 1628 1734 1840 1958
1293 1958 1986 1901 1817 1772 1727 1713 1698 1677 1657 1679 1610 1593 1575 1609 1643 1728 1722 1671 1621 1609 1598 1638 1678 1673 1668 1626 1584 1618 1651 1637 1623 1609 1595 1573 1552 1479
1287 1479 1497 1602 1706 1767 1738 1716 1784 1946 2017 2120 2132 2024 1916 1798 1681 1612 1634 1639 1555 1526 1588 1594 1689 1659 1629 1620 1521 1492 1552 1627 1611 1513
1282A513j88RR9R3MK9L0L5n5l1N9KLNOl4l4P7J67J22L2N2N3o8j57n1n1j02j01J04J04jjk0
1277A704k0k1k0%jm5m6N8N8j7j7N7N6j09j09j%m6m5J1J0J1J1K2K1K2K1K9L0j6j6P5P6l0k9
1272A684l8l8l8l8l5l5P0P1l3l3l3l3j1j1n6n7O6O6O5O6o4o4k0j9M4M3l1l2J8J7k8k7L4L4
1267A504J10J09l4l4p9p9K2K2K3K2m3m4m3m4l7l8R7R8L4L4m0m1rrqrm7m7m6m7R0R1m5m5k0
1261A368k0N6N5O1O1j4j4p8p8N8N7j09j10N6N5j1j0q6q6Q3Q3QQJ2J3N8N7j04j03JJO0N9p6
1256A371p5l8l7QQJ5J5J5J6M4M4j%MNo0n9l9J40M0L9m0l9ONO9O8opJ0J1l5l5q7q7J7J8J1J0
1250A344m6m6J11p0p5J05J27L6ppj34j33J21J22J04J04o2o1p4p3JKJ4J4LLJ17o4n8L2NMo4
1245A395o5l7l8R8R8k1k1k1k0j7j6N9N9k9l0M5M5j37j37N9N8m5m5O0O0PQPPj1j0j1j1N7N6
$$ plain form
1282 1513 1325 1334 1433 1526 1530 1559 1589 1624 1569 1538 1597 1599 1602 1607 1613 1579 1545 1622 1789 1911 1943 1995 2048 1980 1823 1772 1721 1619 1518 1622 1726 1725 1724 1704
1277 1704 1684 1663 1643 1643 1642 1597 1551 1609 1667 1650 1633 1690 1746 1637 1528 1527 1527 1481 1436 1447 1457 1468 1479 1501 1522 1544 1565 1594 1624 1608 1592 1667 1743 1713 1684
1272 1684 1646 1608 1570 1532 1497 1462 1532 1603 1570 1537 1504 1471 1460 1449 1393 1336 1402 1468 1533 1599 1535 1471 1451 1432 1476 1519 1488 1456 1474 1491 1463 1436 1470 1504
1267 1504 1614 1723 1689 1655 1576 1497 1519 1541 1564 1586 1543 1499 1456 1412 1375 1337 1434 1532 1566 1600 1560 1519 1510 1501 1493 1484 1437 1390 1344 1297 1387 1478 1433 1388 1368
1261 1368 1348 1404 1459 1520 1581 1567 1553 1475 1397 1455 1512 1403 1293 1349 1404 1393 1383 1297 1211 1294 1377 1385 1393 1405 1418 1476 1533 1429 1326 1327 1328 1388 1447 1371
1256 1371 1296 1258 1221 1229 1237 1252 1267 1282 1298 1342 1386 1385 1385 1389 1394 1334 1275 1236 1376 1416 1455 1415 1376 1382 1387 1456 1524 1518 1511 1521 1532 1497 1462 1375 1288 1305 1323 1334 1344
1250 1344 1298 1252 1363 1293 1218 1323 1450 1486 1479 1472 1338 1205 1326 1448 1552 1656 1594 1533 1459 1386 1387 1389 1403 1417 1420 1423 1540 1476 1418 1450 1455 1459 1395
1245 1395 1330 1293 1255 1353 1451 1430 1409 1388 1368 1351 1335 1394 1453 1424 1394 1439 1484 1347 1210 1269 1327 1282 1237 1297 1357 1364 1372 1379 1386 1375 1365 1354 1343 1400 1456
1240A456j8j8l6l6P0O9N4N3n2n1J9J9J9J9n2n2n2n2m3m3O3O2m5m4N5N4K3o7j29N1J28n2j5
1235A357j4llllK9K9K9K9K3K3n2n2l4l3l4l3O1O1j4j3jjopKq8o9J11N3l6j01j0j7j8O4O3j7
1229A272j6j7j6O2O2l1l2o5J15J20o0j24l5L9L8kllkn7n7j1j2J0J0n8J23J04p6rqK4K5J8J9
1224A347j9j10r0Q9R9Rk9k8m1N0J05p4j41n1N2N2J6J6M9N0O6j14o9J12O2O3P1j10j5j4j30
1219A273j31P3P4K8K8J05J06M7j33q0J1J3J93N3N3m0m1p0p0p0p0k8k8J7J8LLp2p2N7N6J02
1214A408J02m2m3m2m3j2j2j2j3J05J05j14j15l1N9J10p1j4j4k6k5M1M1mmnnnoM1M1M0M1L4
1209A510L4K8K8l8j28j03P7L3L3n0m9l7J44J8p2j9j8K0K1rrR8q3k8O2%jK9K9K9K9O5O4J9J9
1203A745j8j7r3r2j8j8o3o3J7J7J7J7o1o2j7j6RJ0l5l6L5L4L5L4o9p0k4k5J29J29oom3m4K
$$ plain form
1240 1456 1438 1420 1384 1348 1418 1487 1541 1594 1542 1491 1510 1529 1548 1567 1515 1463 1411 1359 1316 1273 1336 1398 1353 1309 1364 1418 1441 1374 1245 1296 1424 1372 1357
1235 1357 1343 1340 1337 1334 1331 1360 1389 1418 1447 1470 1493 1441 1389 1355 1322 1288 1255 1316 1377 1363 1350 1349 1348 1342 1335 1337 1249 1180 1291 1344 1308 1207 1197 1180 1162 1226 1289 1272
1229 1272 1256 1239 1223 1285 1347 1316 1284 1219 1334 1454 1394 1270 1235 1274 1312 1310 1307 1304 1302 1245 1188 1177 1165 1175 1185 1127 1250 1354 1278 1269 1261 1285 1310 1328 1347
1224 1347 1328 1218 1128 1217 1316 1325 1296 1268 1227 1277 1382 1308 1167 1116 1168 1220 1236 1252 1301 1351 1417 1303 1234 1346 1408 1471 1542 1432 1417 1403 1273
1219 1273 1142 1215 1289 1317 1345 1450 1556 1603 1470 1390 1401 1414 1607 1660 1713 1673 1632 1562 1492 1422 1352 1324 1296 1313 1331 1334 1337 1265 1193 1250 1306 1408
1214 1408 1510 1468 1425 1383 1340 1328 1316 1304 1291 1396 1501 1387 1272 1241 1300 1410 1339 1325 1311 1285 1260 1301 1342 1338 1334 1329 1324 1319 1313 1354 1395 1435 1476 1510
1209 1510 1544 1572 1600 1562 1434 1331 1408 1441 1474 1424 1375 1338 1482 1500 1428 1409 1391 1411 1432 1423 1414 1512 1429 1401 1463 1463 1462 1491 1520 1549 1578 1643 1707 1726 1745
1203 1745 1727 1710 1617 1525 1507 1489 1426 1363 1380 1397 1414 1431 1370 1308 1291 1275 1284 1294 1259 1223 1258 1292 1327 1361 1292 1222 1198 1173 1302 1431 1425 1419 1376 1332 1334
1198A334Jl1l2P4P4O4O5j1j1n4n5m1M9J12o9o2J17N4N4j0j0j7j8j7j8l7l7QQo5o6k0k0M6M6
1193A405J53k7j46n6Q8r2L2L2n5n5Q7Q7M2M2qrrqM5M5o1o0RRl7l6J5J6J5J6j04j03O1O2Q6
1187A481Q5n0n0jkM3M4j0j0j0j0m1m1MNMMm1m1K0K0J9K0j5j5o0o0K4K3n1n1n7n7M9M8O4O5
1182A349p1p1M4M5L3L4j5j94K1J12O3O4ooj5j5o1o0K9L0J6p3l3J47O7j13O7O8j9j9j8j9j8
1177A363j9%j%jj2j1j2j2l3l3P2P2klkkr5r5J0J0L8L8j2j2J8p1q3R8L3n6m0N1K7J17J06J06
1171A552J00q0j34m5m6m6L4L4j7j8K7K8M9M9k6k7K9K9K9K9JKO5O5P5j06n0m9O2O2J7J7klk
1166A704kk1k1k1k1llJ02J02NNNOJ4J5J5J4n0n0n0n0m7m8kkN5N5N5N5l9l8l9l8O3O2j2j2j6
1160A747j6Q9Q9LKLLN1N1N0N1L8L8l8l7J2J3l3l3j4j4O1O2n1n1oop4p5k9l0pqpqr4r5m4J06
$$ plain form
1198 1334 1335 1304 1272 1346 1420 1484 1549 1538 1527 1473 1418 1377 1426 1538 1469 1407 1524 1578 1632 1622 1612 1595 1577 1560 1542 1505 1468 1476 1484 1419 1353 1333 1313 1359 1405
1193 1405 1558 1531 1385 1329 1417 1325 1357 1389 1334 1279 1366 1453 1495 1537 1529 1520 1511 1503 1548 1593 1532 1472 1481 1490 1453 1417 1432 1448 1463 1479 1375 1272 1333 1395 1481
1187 1481 1566 1516 1466 1465 1463 1506 1550 1540 1530 1520 1510 1469 1428 1432 1437 1441 1445 1404 1363 1383 1403 1422 1442 1427 1412 1352 1292 1316 1339 1288 1237 1180 1123 1172 1220 1284 1349
1182 1349 1278 1207 1251 1296 1329 1363 1348 1154 1175 1287 1350 1414 1408 1402 1387 1372 1311 1251 1280 1310 1326 1253 1220 1367 1434 1321 1388 1456 1437 1418 1400 1381 1363
1177 1363 1344 1344 1343 1343 1342 1330 1319 1307 1295 1262 1229 1301 1373 1371 1368 1366 1364 1269 1174 1184 1194 1232 1270 1258 1246 1264 1193 1110 1208 1241 1185 1145 1196 1223 1340 1446 1552
1171 1552 1652 1572 1438 1393 1347 1301 1335 1369 1352 1334 1361 1389 1438 1487 1461 1434 1463 1492 1521 1550 1551 1553 1618 1683 1758 1652 1602 1553 1615 1677 1694 1711 1709 1706 1704
1166 1704 1702 1681 1660 1639 1618 1615 1612 1714 1816 1821 1826 1831 1837 1851 1866 1881 1895 1845 1795 1745 1695 1648 1600 1598 1596 1651 1706 1761 1816 1777 1739 1700 1662 1725 1787 1775 1763 1747
1160 1747 1731 1820 1909 1912 1914 1917 1920 1971 2022 2072 2123 2161 2199 2161 2124 2136 2149 2116 2083 2069 2055 2116 2178 2127 2076 2070 2064 1990 1915 1886 1856 1849 1841 1834 1826 1732 1637 1593 1699
1154A699J47J47l9l9M6M7M6M7J2J2Q8Q8n2n1N3N4J%JJp6p5l1l0OOj0r9j08M3K7K7K3K2J13
1149B146l8p5J5R9J00m5J05J14l6p8P3K3K3QPN2N2Q9Q9j6j7JJJJqqL7L6k3k3k3k4q7q7j47
1143B337n7R6n4j23K6l7l7p3p2JJJJL2L2j3j3K9K9j5j6j9j8K7K6ooooo8o9k4k4J2J1l3l4N0
1137A888N0N0N0k5k5K0K1j6j5r1r0K9L0L0K9m7m7m8m7M5M5l0l0o0n9J6J6P0P0l5l5POPOPP
1132A799PPq0p9nmrrJ26J26KKKKJ6J6J5J6QQJ73J73J22J21J67J66J70J71L5L5j05j05j80j79
1127B730j86j85j41j40m0l9q5q5m1m2O4O3n4n3N1N1n1n1n1n1MNM9M9K7K7j8j8k2k2k1k2Q5
1121A787Q4n1n1N9N8j7j6j05j04R2R1N1N1N1N1j7j7j6j7n9n9j4j4n6n7P9P9m0m0O5O5j8j8
1116A877j9j8J2J2Q8Q7J1J1Q7Q6Q0Q0J32L13M43P43J208J870K462J321j376k517j899j118
$$ plain form
1154 1699 1846 1993 1954 1915 1961 2008 2054 2101 2113 2125 2213 2301 2249 2198 2251 2305 2306 2306 2307 2308 2232 2157 2126 2096 2102 2108 2098 1999 1891 1934 1961 1988 2011 2033 2146
1149 2146 2108 2033 2048 2147 2247 2202 2307 2421 2385 2307 2380 2403 2426 2434 2441 2493 2545 2634 2723 2707 2690 2691 2692 2693 2694 2686 2678 2715 2751 2728 2705 2682 2658 2571 2484 2337
1143 2337 2280 2376 2322 2199 2225 2188 2151 2078 2006 2007 2008 2009 2010 2042 2074 2061 2048 2077 2106 2091 2075 2056 2038 2065 2091 2085 2079 2073 2067 1999 1930 1906 1882 1894 1905 1872 1838 1888
1137 1888 1938 1988 2038 2013 1988 2008 2029 2013 1998 1907 1817 1846 1876 1906 1935 1888 1841 1793 1746 1791 1836 1806 1776 1716 1657 1673 1689 1759 1829 1794 1759 1766 1772 1779 1785 1792 1799
1132 1799 1806 1813 1733 1654 1649 1645 1636 1627 1753 1879 1881 1883 1885 1887 1903 1919 1934 1950 1958 1966 2139 2312 2434 2555 2722 2888 3058 3229 3264 3299 3194 3089 2909 2730
1127 2730 2544 2359 2218 2078 2038 1999 1914 1829 1788 1746 1810 1873 1819 1766 1817 1868 1817 1766 1715 1664 1668 1673 1722 1771 1798 1825 1807 1789 1767 1745 1724 1702 1787
1121 1787 1871 1820 1769 1828 1886 1869 1853 1748 1644 1736 1827 1878 1929 1980 2031 2014 1997 1981 1964 1905 1846 1832 1818 1762 1705 1784 1863 1823 1783 1848 1913 1895 1877
1116 1877 1858 1840 1852 1864 1952 2039 2050 2061 2148 2234 2314 2394 2526 2839 3282 4025 5233 7103 9565 10886 9510 6993 5094 3976
1113C976o59l59k34n3j36j36MNNNpoR9R8R8R8K3K2J27J27K2K1j33j33j33j33p9p9j85j84k7
1108B054k7k8k7K9K9K9K8J5J5J5J5M4M4jjN9N9N9O0R2R3M8M7n6n7M9M8o2o3j08j07p2p1p1
1103B180p1j12j12l7l6l1l2l1l1O0N9j5j6MMMML4L3K3K2J0j72m5M5llJ6J06J34m6J62P2k2
1098B157O7Jj79j5j05j23N8J5J4m9m9q2q2l7l7k3k2k3k2o1o1P4P4RRl6l6J%JJO9O9J15J14
1092A806N3N2q2q3m9m9m9m8K2K3K2K2J8J7k7k8M8M9k7k7l7l8R8R8JJnmKq8l4J47N8N7J52L32
1087B403M19P19Q85J065O65m76j221j040n12l32k77j88q5q5j24j25n8n9n9n8j%j%O2O1m3m3
1083A492O9O8r7r6K6K7o9K1l7l7P0k0q0J0R6R5m9M1M8m3q3PmmJ8J7k7k8M5M4o1o0J6J6j09
1077A322k0M9M9k1k1M5M5n7L4O2k8j6j7o4o5M5J34L5n6%%R5R5p0p0lll8l9j48LK3K4K0K0j6
$$ plain form
1113 3976 3317 2958 2724 2671 2535 2399 2403 2408 2413 2418 2411 2405 2504 2602 2700 2798 2821 2843 2970 3097 3119 3140 3007 2874 2741 2608 2529 2450 2265 2081 2054
1108 2054 2027 1999 1972 2001 2030 2059 2087 2102 2117 2132 2147 2191 2235 2234 2233 2292 2351 2410 2470 2562 2655 2703 2750 2694 2637 2686 2734 2672 2609 2501 2394 2322 2251 2180
1103 2180 2109 1997 1885 1848 1812 1781 1749 1718 1687 1747 1806 1791 1775 1779 1783 1787 1791 1825 1858 1881 1903 1913 1741 1696 1741 1738 1735 1751 1857 1991 1945 2107 2179 2157
1098 2157 2224 2225 2046 2031 1926 1803 1861 1876 1890 1841 1792 1710 1628 1591 1554 1531 1509 1486 1464 1403 1342 1416 1490 1499 1508 1472 1436 1437 1437 1438 1439 1508 1577 1692 1806
1092 1806 1859 1911 1829 1746 1697 1648 1599 1551 1573 1596 1618 1640 1658 1675 1648 1620 1668 1717 1690 1663 1626 1588 1686 1784 1785 1786 1781 1777 1779 1691 1657 1804 1862 1919 2071 2403
1087 2403 2822 3541 4426 5491 6156 5680 4459 3419 2907 2575 2298 2110 2025 1940 1816 1691 1633 1574 1515 1457 1456 1456 1455 1455 1517 1578 1535 1492
1083 1492 1561 1629 1532 1436 1462 1489 1420 1441 1404 1367 1437 1417 1337 1347 1443 1538 1489 1530 1578 1535 1452 1459 1455 1451 1469 1486 1459 1431 1476 1520 1459 1399 1415 1431 1322
1077 1322 1302 1351 1400 1379 1358 1403 1448 1391 1425 1487 1459 1443 1426 1362 1297 1342 1476 1511 1455 1455 1455 1550 1645 1575 1505 1502 1499 1461 1422 1274 1277 1300 1324 1344 1364 1348
1072A348j6j1J40O6k5r2lrr8qppqK3J13N6N7J27L7r8qrrllmnMNj7J33N9r2MNn0m9k4k3K2K2
1065A543m0m0NNM3M4r2r2J08J07q8q8n5n4J10J10MLj02j01onR9J00R4R4p1p2j03j03k8k8J0
1060A311RQ5Q4N8N7j49n9K4J75J5j35ONlml4l4M1M2J7J7m4M7rj60ONP2P2P2P2Q2Q1POj4j5
1055A808j4j4K7K6l3N7J2j39n4L6M8M8N4N4j6j6j6j6n9n9M6M6qqO6O7lkm8m8M3M4o2o2J8J7
1049A840J7J7J4J5J4J4opn1n2L1L0j04j05L1L1m5m4L3L3j2j2MMMMPOo8o8M8M8M8M8opR9R8
1044A951P9P9qpJ50l0q1R9k3j14n2n1K3K4k2k1j16j15j06P4r4nm3m4K9K9m7m6j9j9Q7Q6L1
1038A678L1L1L1l3l3p8p8OOO7k2n3J28J22n8m9m9J5J5K5K5n0n1n9o0K26K26J12J13L8L7o3
1034B196o2o3o3j39j39mloonoL5L4Q0P9l6l5L9L9K8K8q2q3L7n4o4J15O8k2k3O8R0r0O2O2K7
$$ plain form
1072 1348 1332 1321 1461 1527 1502 1410 1407 1398 1300 1292 1285 1278 1270 1293 1406 1462 1519 1646 1683 1585 1577 1568 1559 1556 1553 1549 1544 1548 1553 1536 1669 1728 1636 1640 1645 1595 1546 1522 1499 1521 1543
1065 1543 1503 1463 1468 1473 1516 1560 1468 1376 1484 1591 1503 1415 1360 1306 1416 1526 1530 1533 1431 1330 1324 1319 1418 1518 1612 1706 1635 1563 1460 1357 1329 1301 1311
1060 1311 1320 1405 1489 1547 1604 1455 1396 1420 1595 1610 1475 1481 1486 1483 1479 1445 1411 1452 1494 1511 1528 1484 1531 1522 1362 1368 1373 1445 1517 1589 1661 1743 1824 1831 1837 1823 1808
1055 1808 1794 1780 1807 1833 1800 1857 1869 1730 1676 1712 1760 1808 1862 1916 1900 1884 1868 1852 1793 1734 1780 1826 1818 1810 1876 1943 1940 1938 1890 1842 1885 1929 1867 1805 1823 1840
1049 1840 1857 1874 1888 1903 1917 1931 1925 1918 1867 1815 1846 1876 1772 1667 1698 1729 1684 1640 1673 1706 1694 1682 1686 1690 1694 1698 1705 1711 1643 1575 1623 1671 1719 1767 1761 1754 1853 1951
1044 1951 2030 2109 2101 2094 2244 2214 2133 2232 2209 2095 2043 1992 2015 2039 2017 1996 1880 1765 1659 1733 1639 1634 1591 1547 1576 1605 1558 1512 1493 1474 1561 1647 1678
1038 1678 1709 1740 1771 1738 1705 1627 1549 1555 1561 1628 1606 1553 1681 1803 1745 1696 1647 1662 1677 1702 1727 1677 1626 1567 1507 1733 1959 2071 2184 2222 2259 2196
1034 2196 2134 2071 2008 1869 1730 1726 1723 1717 1711 1706 1700 1735 1769 1849 1928 1892 1857 1896 1935 1963 1991 1909 1826 1863 1809 1745 1860 1928 1906 1883 1951 2041 1951 2013 2075 2102
1028B102K7K6K7Q6Q6J0J1J07J07L1L2J44J44J90J89J39J38K44K44L94L94N89N90O35O35P26
1024H047J026J685K707M487P671J2408J6675J5097M581r293j6805j5445j0578o353l889k530
1022I491j628j140q39n96n95m12k32j97j98j56j55j82jn7n6m5m5p4p5j19j19J0J0l5l5o3o3
1018B394M2M2k0k0o5o6j09j09K6K6k2k3k3k2j9j9J17J16m3m3m3m3N6N7j9j8j4j3j4j3p9q0
1013A937j5j5J10p1L2L1l4l4M2M1opL9L9J47J48Q4r7k19k20nnJ6J5l0k9p6p5N9O0j%m6m5m4
1007A726m4J51J51o2o3J2J3LLP8P8J0Rl5l6llllK0K0R6R5J4J4j51j52K5K6k0k0j13j13P1P2
1002A866J57k2q7q6l7l7L9L9O4O4l0l0n2J30K7K8m9n0j24j24M9N0N0N0kkm7m7m2m2O3O3n3
997A776n3K1K2m6m6N9N9k4k4Q2Q1JJm4m4PQPQR7R8pqopn2n1j04j03O2O2K1K0k4k4L6L7l8l8
$$ plain form
1028 2102 2129 2155 2182 2268 2354 2364 2375 2482 2589 2620 2652 2796 2940 3130 3319 3458 3596 3840 4084 4478 4872 5461 6051 6686 7321 8047
1024 8047 9073 10758 13465 17952 25623 38031 54706 69803 74384 65091 48286 32841 22263 15910 12021 9491
1022 9491 7863 6723 5884 5288 4693 4281 4049 3852 3654 3498 3343 3161 3160 3103 3047 3002 2957 2883 2808 2689 2570 2580 2590 2555 2520 2457 2394
1018 2394 2436 2478 2458 2438 2373 2307 2198 2089 2115 2141 2119 2096 2073 2051 2032 2013 2130 2246 2203 2160 2117 2074 2130 2187 2168 2150 2136 2123 2109 2096 2017 1937
1013 1937 1922 1907 2017 1946 1978 2009 1975 1941 1983 2024 2018 2011 2050 2089 2236 2384 2468 2371 2152 1932 1927 1922 1938 1953 1923 1894 1818 1743 1802 1862 1861 1861 1815 1770 1726
1007 1726 1682 1833 1984 1922 1859 1871 1884 1887 1890 1968 2046 2056 2065 2030 1994 1991 1988 1985 1982 2002 2022 2118 2213 2227 2241 2090 1938 1963 1989 1969 1949 1836 1723 1794 1866
1002 1866 2023 2001 1914 1828 1791 1754 1793 1832 1896 1960 1930 1900 1848 1978 2005 2033 1984 1934 1810 1686 1735 1785 1835 1885 1883 1881 1834 1787 1745 1703 1766 1829 1776
997 1776 1723 1744 1766 1720 1674 1733 1792 1768 1744 1826 1907 1908 1909 1865 1821 1828 1836 1843 1851 1948 2046 2039 2031 2025 2018 1966 1915 1811 1708 1770 1832 1853 1873 1849 1825 1861 1898 1860 1822
991A822K6K7j9j8OPJ7J8o8J13o4o4m0m0J25J26RRRRk8k7j7j6r3Q7J09J10J05p5J31J32K12
986B640K12K88M68N99P81O37L37p8m99p35p36o18m38k96j15mnj58j58o1o0J4J5M1M1l4l4k8
982B016k8J8J7jjkjj9k0j20N9J41J40p4p3l9l8O6O7k5k6k5k5KKKLJ3J4J3J4j7j6j6j6M6M6
976B097JJL7L8l7l7N5N6N5N6M2M1j23j24LKr2r1j09P2l0l0K3K4m1m0q3R6J01J01l9l8l9l8
971A910J5J5J6J5J2J3J2J2M6M5j1j0P6j04p7p8j3j3O2O2QQN4N3p4p3p4p4l5l5M0L9Q9Q9m7
966A973m6o4o5J1J1K7K7K7K7L5L4L5L4qqL8L7o2o1J3J4k9l0J6J6j9j9j9j9J8J8k7k7L2L2L3
960B005L2L4L5L4L5m7m6jjO8O9l7l6K7K7J33J32l3l3p8p8m0m0O4O5j12j12K3K3LKm3m2l4l5
955A963o0J20Q2Q2m1m2q4q3K1K2N5N6k0k0J5J5o0o0m3m2R3R3l9l9l8l9j5j4j4j5M8M7LKJ37
$$ plain form
991 1822 1848 1875 1856 1838 1844 1851 1868 1886 1818 1931 1867 1803 1763 1723 1848 1974 1983 1992 2001 2010 1982 1955 1938 1922 1829 1916 2025 2135 2240 2165 2296 2428 2640
986 2640 2852 3140 3608 4207 4988 5625 5962 5884 5385 4650 3914 3296 2858 2562 2447 2443 2438 2280 2122 2061 2001 2015 2030 2071 2112 2078 2044 2016
982 2016 1988 2006 2023 2022 2021 2019 2018 1999 1979 1859 1918 2059 2199 2125 2052 2013 1975 2041 2108 2083 2057 2032 2007 2009 2011 2013 2016 2029 2043 2056 2070 2053 2037 2021 2005 2051 2097
976 2097 2098 2099 2136 2174 2137 2100 2155 2211 2266 2322 2364 2405 2282 2158 2161 2163 2071 1980 1871 1943 1913 1883 1906 1930 1889 1849 1766 1862 1963 2064 2025 1987 1948 1910
971 1910 1925 1940 1956 1971 1983 1996 2008 2020 2066 2111 2100 2090 2166 2062 1985 1907 1894 1881 1943 2005 2013 2021 2075 2128 2054 1981 1907 1833 1798 1763 1803 1842 1931 2020 1973
966 1973 1927 1863 1798 1809 1820 1847 1874 1901 1928 1963 1997 2032 2066 2058 2050 2088 2125 2063 2002 2015 2029 2000 1970 1986 2002 1983 1964 1945 1926 1944 1962 1935 1908 1940 1972 2005
960 2005 2037 2071 2106 2140 2175 2128 2082 2081 2080 2148 2217 2180 2144 2171 2198 2331 2463 2430 2397 2319 2241 2201 2161 2225 2290 2178 2066 2089 2112 2115 2117 2074 2032 1998 1963
955 1963 1903 2023 2105 2187 2146 2104 2020 1937 1958 1980 2035 2091 2071 2051 2066 2081 2021 1961 1918 1876 1969 2062 2023 1984 1946 1907 1892 1878 1864 1849 1897 1944 1947 1949 2086
949B086J37O1O2r1r2j67j66m8m7K8K7QQRQO6O6rrooooJ1J1Q7Q6l5l5l4l5L2L3j3j3j8j8K8
944B000K7l1l1J5J4j01j01LMPPQ2Q2QQP6j4q8J82O4q6k7k6j11j11J30J29K5K4k1k1r7r6KK
938A929KLP6P6n8n9m3m3L2L3Q3Q4k2k2o0o0P5P5l0l0j20L1P2j8Q8Q7m7m6N8N8R8R8o2o2r7
933B179pQ2o9o4Q6qpJ2J3r3r2mnP1P1OOOOo1o0j6j5J4J4o1o0L4L5N0J40j2j63k2J29N5N5j1
927B234j0n6n5Q0Q0l6l6q2q1Q6Q6J1J1j26j26M0L9J07J08J22k7qQ2n3n3PPPPL7L7m7J03J39
922B634J38K61M11L01j49l73l73k66j16o5o5o1o1o2o1L8L9L2L3l3j24j17L3J17K7j8j8N6N6
917B214m9m9j8j7P3p8n5L4l1N8O5O4nnK8K9j6j7m3m4K6K6j7j08j02M9J48N7J3J2K3K3k2k3
912B243J4J3J4J3N3N3k2k2j0j0N3l6j95J5K6J77N9l2o7K3k7k8k2k2k6k5k5k6J8J8O3O3j8j8
$$ plain form
949 2086 2223 2284 2346 2255 2163 1996 1830 1782 1735 1763 1790 1798 1806 1815 1823 1889 1955 1946 1937 1931 1925 1919 1913 1924 1935 2022 2108 2073 2038 2004 1969 2001 2034 2021 2008 1990 1972 2000
944 2000 2027 1996 1965 1980 1994 1893 1792 1795 1799 1806 1813 1895 1977 1985 1993 2069 2055 1967 2149 2213 2127 2100 2074 1963 1852 1982 2111 2136 2160 2139 2118 2021 1925 1927 1929
938 1929 1931 1934 2010 2086 2028 1969 1926 1883 1915 1948 2031 2115 2093 2071 2011 1951 2026 2101 2071 2041 1921 1952 2024 2006 2094 2181 2134 2088 2146 2204 2302 2400 2338 2276 2179
933 2179 2172 2254 2185 2121 2207 2199 2192 2204 2217 2124 2032 2028 2023 2094 2165 2171 2177 2183 2189 2128 2068 2052 2037 2051 2065 2004 1944 1978 2013 2063 2203 2191 2028 2006 2135 2190 2245 2234
927 2234 2224 2168 2113 2193 2273 2237 2201 2119 2038 2124 2210 2221 2232 2106 1980 2020 2059 2166 2274 2396 2369 2361 2443 2390 2337 2344 2351 2358 2365 2402 2439 2392 2495 2634
922 2634 2772 3033 3444 3745 3596 3223 2850 2584 2468 2403 2338 2277 2216 2154 2093 2131 2170 2202 2235 2202 2078 1961 1994 2111 2138 2120 2102 2158 2214
917 2214 2165 2116 2098 2081 2154 2076 2021 2055 2024 2082 2147 2211 2206 2201 2229 2258 2242 2225 2182 2138 2164 2190 2173 2065 1963 2012 2160 2217 2230 2242 2265 2288 2266 2243
912 2243 2257 2270 2284 2297 2350 2403 2381 2359 2349 2339 2392 2356 2161 2176 2202 2379 2438 2406 2339 2362 2335 2307 2285 2263 2237 2212 2187 2161 2179 2197 2260 2323 2305 2287
907B287N7N7noook0k0K4K5L5L5j0j0O4O4p1p1j5j5L1L0N0N1NNk2k3k3k3L8L7L7L7M0M0o5o5
901B573O6O6O6O6N4N5n1n0Q1Q1Q2Q1m2m3R3R2P8P8P8P8Q3Q4Q3Q4J01J01N7N6J19J19n1J28
896D546Q5J75J80J81K61K61L07L06L41L42L51N31O01O90P34J035J364J784K122K783L905N526
893B8411Q051J2197J9242L2282N3668P8246O6313j2107p4304p3764m7323k7433j6887j1057
891C5535p482n139l726k825k088j548j300j119q87p06n50m61m98l18l59k70k98k98k08k08
888E247j99m8j33j33k74k74j30m0j3j2j03j2r4r3o3K7p2p1k7k6pr7N3N3nr6m4m5M6M6n9n9
883C243M4M4MMj42n2j3P7n7L2n8n7QQKR2m3m4R3Lj11k0l2l1NOn0L9P9j2l1l1j3j3O2O2N5N6
877C208j31m0K9K9Q5mj8j8o9K2M8J39j02j02J4J5N3N4K9o2j1j1L4L3o3K8J13J13J88J89l4
$$ plain form
907 2287 2344 2401 2396 2390 2384 2378 2358 2338 2362 2387 2422 2457 2447 2437 2501 2565 2494 2423 2408 2393 2424 2454 2504 2555 2560 2565 2543 2520 2497 2474 2512 2549 2586 2623 2663 2703 2638 2573
901 2573 2639 2705 2771 2837 2891 2946 2895 2845 2926 3007 3089 3170 3128 3085 3178 3270 3348 3426 3504 3582 3665 3749 3832 3916 4017 4118 4175 4231 4350 4469 4418 4546
896 4546 4631 4806 4986 5167 5428 5689 5996 6302 6643 6985 7336 7867 8468 9158 9892 10927 12291 14075 16197 18980 22885 28411
893 28411 36462 48659 67901 100183 153851 232097 298410 286303 211999 138235 90912 63479 46592 35535
891 35535 28053 22914 19188 16363 14275 12727 11427 10308 9421 8715 8165 7704 7206 6888 6529 6259 5961 5663 5455 5247
888 5247 5048 5000 4867 4734 4460 4186 4056 4016 4003 3991 3888 3876 3782 3689 3626 3653 3581 3510 3483 3457 3450 3353 3406 3459 3454 3358 3314 3269 3315 3361 3302 3243
883 3243 3287 3331 3335 3339 3197 3145 3132 3209 3152 3184 3126 3069 3077 3085 3087 3179 3136 3092 3185 3188 3077 3057 3025 2994 2999 3005 2955 2994 3073 3061 3030 2999 2986 2973 3035 3097 3152 3208
877 3208 3077 3037 3066 3095 3180 3176 3158 3140 3071 3093 3141 3280 3178 3076 3090 3105 3158 3212 3241 3179 3168 3157 3191 3224 3161 3189 3302 3415 3603 3792 3758
872C758j23j78j78p3p3k7k8K1K1j04j5n5n6NR4noO0l0j19L2P7P7j4j3P1p9N3N3kkn5n6J10
867C141J10KKp3p3m9m9lmL5L6JKj03P8P2j8lkpqJ7J8O2O3QPK39K39L36M26M70J69j92j92k3
862D734J58R0l30n89m08r9r9q8q8k5k6k6k6K6K5p9q0j6j6j6j5J08J08LKL8L8o8o7L2L2J8p1
857C180j17O3J12K1k1k0k7k6J06J05O1O1j7j6j53j52p8p9p9p9M8M7M7M8N1N1j3j2j33M7M1
852C067m8m8m7K1K2NMO7k4j70J0J28J29J3J4K0J9M1J32J46l4j50%n1n0L4L5L5L5M7M7R2R2
847C633P7P6P2K23L45M35L63K14j14k63k94k94j37j38r3r3N7N6j8j9k8k9k8k9j4j5j4j5n1
843C865n0n1n1n4n4K0K1j2j2O3O3l3l4J1J2K2K1K2K2L7L7L6L7Q5Q6k0k0J33J34J55n4k7J24
838D534J82R2R3R3Q7Q7J40J40O5O5J88J88J13J12L08L09L53M43N64Q94J155J155J283J373
$$ plain form
872 3758 3635 3457 3279 3206 3133 3106 3078 3099 3120 3016 3001 2946 2890 2895 2989 2984 2978 3038 3008 2889 2921 2998 3075 3061 3048 3119 3040 3093 3146 3144 3142 3087 3031 3141
867 3141 3251 3253 3255 3182 3109 3060 3011 3008 3004 3039 3075 3076 3078 2975 3053 3125 3107 3104 3102 3095 3087 3104 3122 3184 3247 3255 3262 3501 3740 4076 4502 4972 5141 4949 4757 4734
862 4734 4892 4982 4652 4063 3655 3556 3457 3369 3281 3256 3230 3204 3178 3204 3229 3150 3070 3054 3038 3022 3007 3115 3223 3226 3228 3266 3304 3236 3169 3201 3233 3251 3180
857 3180 3063 3126 3238 3259 3238 3218 3191 3165 3271 3376 3437 3498 3481 3465 3312 3160 3082 3003 2924 2845 2893 2940 2987 3035 3086 3137 3124 3112 2979 3026 3067
852 3067 3019 2971 2924 2945 2967 2972 2976 3043 3019 2849 2859 2987 3116 3129 3143 3163 3182 3223 3355 3501 3467 3317 3317 3266 3216 3250 3285 3320 3355 3402 3449 3541 3633
847 3633 3710 3786 3858 4081 4426 4861 5224 5438 5324 5061 4767 4473 4336 4198 4105 4012 4069 4125 4107 4088 4060 4031 4003 3974 3960 3945 3931 3916 3865
843 3865 3815 3764 3713 3659 3605 3625 3646 3634 3622 3685 3748 3715 3681 3692 3704 3726 3747 3769 3791 3828 3865 3901 3938 4023 4109 4089 4069 4202 4336 4491 4437 4410 4534
838 4534 4716 4808 4901 4994 5081 5168 5308 5448 5513 5578 5766 5954 6067 6179 6487 6796 7149 7592 8156 9050 10205 11360 12643 14016
834A4016J286J075P52M21r3p84j190j340j365j364j183j032q46o36o13m02l34k43k23k24k63
831E415j12j8j09j04j5J26L7R2R3OOQ1Q2L8L8ppq0p9q0p9j08j08o2o3j5j5j5j5J1J1%%P0j11
825D904n4n4n2n1K3K4J3J4l2l1j8j8j7j8K7K7m9m9k8k9P6P7R8R8K3K3K7K8K7K8J2J2Q8Q7m9
820E187m9K6K7O8O9r7r6LMJ05p5o6o6l2l3J19J19P4P4J9J9R4R5%%J%QQQQj%j%p5p4R0R1J03
814E754J03K49P0P3P2j3j4Q7Q7Q7Q7J0J0K16L7k1k0M4M4q2q1q1q1p1p1MMm0l9j75j75q9q9
809E896j3j4L4L5j01j01l8l8O7O7N6N5N5N6J50J50O2j18j38m8K5K5O4O4J09J09O3O3O3O3M0
804F762L9j6j7J64j7j7P4J54O4P6P5MMp1p1mlO0O0N3j27k3J58O1O2P2P3m1m1O4O5k5k5N0N0
799G746O2O1m3m4K8K8J32J33J74J74R9R9m8m9m8m9P7P6J22J21R4R5J39J39M1M1J16J16J84
$$ plain form
834 14016 15302 16377 17129 17550 17457 16673 15483 14143 12778 11414 10231 9199 8353 7717 7104 6702 6368 6125 5902 5678 5415
831 5415 5303 5285 5176 5072 5057 5183 5220 5312 5405 5411 5417 5498 5580 5618 5656 5649 5642 5562 5483 5403 5324 5216 5108 5046 4983 4968 4953 4938 4923 4934 4945 4945 4945 5015 4904
825 4904 4850 4796 4744 4693 4716 4740 4753 4767 4735 4704 4686 4668 4651 4633 4660 4687 4638 4589 4561 4532 4608 4685 4783 4881 4904 4927 4954 4982 5009 5037 5049 5061 5149 5236 5187
820 5187 5138 5164 5191 5259 5328 5231 5135 5138 5142 5247 5172 5106 5040 5008 4975 5094 5213 5287 5361 5380 5399 5493 5588 5588 5588 5589 5589 5597 5605 5613 5621 5620 5620 5619 5619 5544 5470 5560 5651 5754
814 5754 5857 6106 6176 6249 6321 6308 6294 6381 6468 6555 6642 6652 6662 6878 6915 6894 6874 6918 6962 6880 6799 6718 6637 6566 6495 6499 6503 6463 6424 6249 6074 5985 5896
809 5896 5883 5869 5903 5938 5837 5736 5698 5660 5727 5794 5850 5905 5960 6016 6166 6316 6378 6260 6122 6074 6099 6124 6188 6252 6361 6470 6533 6596 6659 6722 6762
804 6762 6801 6785 6768 6932 6915 6898 6972 7126 7190 7266 7341 7345 7349 7278 7207 7203 7200 7260 7320 7373 7246 7223 7381 7442 7504 7576 7649 7608 7567 7631 7696 7671 7646 7696 7746
799 7746 7808 7869 7826 7782 7810 7838 7970 8103 8277 8451 8550 8649 8601 8552 8504 8455 8532 8608 8730 8851 8945 9040 9179 9318 9359 9400 9516 9632 9816
794I816J83N4N4J14K03K15L4QR8Q7lR6R6J01J01L42N22M17K37J32J32P6P5J72J71OOmmM0M1
790A3618J54J54J54J55J05J05K71K71K84K83K73K72L17J37J93J92K83K83K83K83K50K50L26
786A8896L25L17L17L91L92M51M52M06M06N57N57N57N57N27N26O01O02N19N20O25O24O66O66
783C0457Q01Q01Q30Q29Q33J013J067J066R42R43J087J087J203J204J361J541J635J635J656
780E1991J655J791J791J929J928K004K004K120K120K206K507K720K719K904L084L080L261
777I1814L414L415L669L970M376M375M370M190L855M036M893N554O118O539P226Q247R344
775A79405J0366J1666J3288J5346J7450J9402K1626K4804K8709L3631L8740M3576N0367O3975
772E72351Q8552J26576J81561K62509L79510N34820O86314P03069M03386j56561o07679p26255
$$ plain form
794 9816 9999 10053 10107 10221 10424 10639 10673 10681 10779 10866 10863 10959 11055 11156 11257 11599 12121 12538 12775 12907 13039 13115 13190 13362 13533 13539 13545 13541 13537 13577 13618
790 13618 13772 13926 14080 14235 14340 14445 14716 14987 15271 15554 15827 16099 16416 16553 16746 16938 17221 17504 17787 18070 18320 18570 18896
786 18896 19221 19538 19855 20246 20638 21089 21541 21947 22353 22910 23467 24024 24581 25108 25634 26235 26837 27356 27876 28501 29125 29791 30457
783 30457 31258 32059 32889 33718 34551 35564 36631 37697 38639 39582 40669 41756 42959 44163 45524 47065 48700 50335 51991
780 51991 53646 55437 57228 59157 61085 63089 65093 67213 69333 71539 74046 76766 79485 82389 85473 88553 91814
777 91814 95228 98643 102312 106282 110658 115033 119403 123593 127448 131484 136377 141931 148049 154588 161814 170061 179405
775 179405 189771 201437 214725 230071 247521 266923 288549 313353 342062 375693 414433 458009 508376 572351
772 572351 660903 787479 969040 1231549 1611059 2145879 2832193 3535262 3938648 3782087 3174408 2448153
771B448153o12979m47792l13604k19996j56358j12896q1827n8935m2650l3268k9482k8638
769C09728k8218k6799k4575k2283j9699j7333j4990j2901j1038r604q342p254o353n681n260
766H9398n176n175m488l587l075k414k154k155k404k585k445k025j669j368j346j345j370
764D4617j370j307j125j008j007j132j131r72r72q31q31n22m33n39l59k88k88l76l76l55k66
761B9129l8L83Q26J126J081L00j123k025k160j740j273r74p51n72l50l51j63j63k91n91p92
757A9488m92m07m97m04l13l53l52k61k61k93j13K6o4o7j58l14l14k34l24l35j56j55k45j72
754A3230k62j15k4j11k01j82k73j82j82j92j93L3L3R8R9J2J2J8j62j55j54j44L7qj88k22k22
750A0400j28j28j9j9n2n3o1J19j0j91p7J4m9m9k4k4o9o9l0l0p5p5kkkkn7n7M7M8J0RJ15J15
$$ plain form
771 2448153 1835174 1387382 1073778 853782 697424 584528 502701 443766 401116 367848 338366 309728
769 309728 281510 254711 230136 207853 188154 170821 155831 142930 131892 122288 113946 106692 100339 94658 89398
766 89398 84222 79047 74559 70972 67897 65483 63329 61174 58770 56185 53740 51715 50046 48678 47332 45987 44617
764 44617 43247 41940 40815 39807 38800 37668 36537 35565 34593 33762 32931 32409 31976 31437 31078 30790 30502 30126 29750 29395 29129
761 29129 29091 29474 30300 31426 32507 32807 31684 29659 27499 25759 24486 23512 22761 22189 21839 21488 21325 21162 20871 20280 19488
757 19488 18996 18589 18092 17688 17375 17022 16670 16409 16148 15855 15742 15768 15704 15637 15479 15165 14851 14617 14293 13958 13802 13647 13402 13230
754 13230 12968 12853 12829 12718 12517 12335 12062 11880 11698 11506 11313 11346 11379 11477 11576 11588 11600 11618 11456 11301 11147 11003 11040 11032 10844 10622 10400
750 10400 10272 10144 10125 10106 10054 10001 9940 10059 10049 9858 9781 9795 9746 9697 9673 9649 9580 9511 9481 9451 9376 9301 9299 9297 9295 9293 9236 9179 9226 9274 9284 9293 9408 9523
744I523J95J95J32m9k63k63k29k30r8r8R2R2J24L4rj89j90j89o6o5n9n8J7J7p9p9l4l4J1J1
740H162l4l4J30J29M3M3R9q1j15j15j46j46j47j46r7r7O8O8K00K00K76K75K69K68J69J69K06
736I616K97K83M64M23Lj55j55q9r0k43m24m16m17l59j78p8J2R8Rl6l5j5j5P9M98M92M91J18
731A0178l03m31m31l48j68k5J55J51J51K97K97M51M51N92N92N62O51N56L75K34N4j86l65l96
728A3094l07l68l68m56m57m56m57l97l97j41j42k53k54j78j78j04j05JJopm1m0O1K42K10L90
724H887O26P17P07K87l23n02o14n23l17l17j85r6j02P9J57K47K57K57L37L38M19M19P35P35
720A2225O23O24N62K62J92J02p3l73n44n44o32o32o17n27l64j83p3p3n7J23O8O8K14K14L09
716A0894L08N56P37J174J715K421L562N204O707O879L934j587n974p018n636m025k763j982
$$ plain form
744 9523 9718 9913 10045 9996 9733 9470 9241 9011 8913 8815 8907 8999 9123 9157 9148 8959 8769 8580 8514 8449 8390 8332 8349 8366 8287 8208 8174 8140 8151 8162
740 8162 8128 8094 8224 8353 8396 8439 8538 8457 8342 8227 8081 7935 7788 7642 7545 7448 7516 7584 7784 7984 8260 8535 8804 9072 9241 9410 9616
736 9616 9913 10196 10660 11083 11086 10931 10776 10687 10597 10354 9930 9514 9097 8738 8560 8482 8494 8592 8601 8565 8530 8515 8500 8579 9077 9569 10060 10178
731 10178 9875 9444 9013 8665 8497 8472 8627 8778 8929 9226 9523 9974 10425 11017 11609 12171 12822 13378 13753 13987 14041 13855 13490 13094
728 13094 12787 12419 12051 11595 11138 10682 10225 9828 9431 9290 9148 8895 8641 8463 8285 8181 8076 8077 8078 8072 8065 8024 7984 8045 8287 8497 8887
724 8887 9513 10230 10937 11224 10901 10399 9785 9262 8945 8628 8443 8347 8245 8324 8481 8728 8985 9242 9579 9917 10336 10755 11490 12225
720 12225 12848 13472 14034 14296 14488 14590 14517 14144 13600 13056 12424 11792 11175 10648 10284 10101 10028 9955 9898 10021 10089 10157 10371 10585 10894
716 10894 11202 11758 12495 13669 15384 17805 21367 26571 33278 40157 44091 42504 36530 29512 23876 19851 17088 15106
713A5106j320q02n01l28k38j83r4j12k92l42l41k96k96k65q5j87j86R6R7J82J83K53M33O07
710A1089P86J084J085P05J64j37M4N21J062J442J442R58O57R65J266J543J724J625Q45k90
707B8580j312j739j920j845j544j181r99p45l23m2K58N74P54J037J578K288K829L542L542
704C3332K239K56j212j752k181k962l103k321j323j022j150q50r1N70P57L37n11j293j635
701A6085j455r88l28J11K92J38n23q65q64p71n91m03k22KLQ9Q9J4J4J75J75J74J75K73K73
697A1072N59R79J432J851J859P18r84j765j435p74k61M0L32O33M70M9o34j055r93q13n04l25
694A0451k46o7N8K38L90L90L71J91j48n69o70m90l04l05o7o8L4L4j1j1J6J6k9k9mlmlL5L5
689I231J40J40K31K30K75K76K79K79K79K79Q8Q7Q8Q7M7M7M7M7O4O4J9J8K73K72K72K73M20
$$ plain form
713 15106 13786 12984 12483 12155 11917 11734 11640 11528 11236 10894 10553 10257 9961 9696 9611 9424 9238 9334 9431 9613 9796 10049 10482 11089
710 11089 11875 12959 14044 14749 14913 14776 14820 15341 16403 17845 19287 20245 20902 21867 23133 24676 26400 28025 28870 28580
707 28580 27268 25529 23609 21764 20220 19039 18040 17295 16972 16930 17188 17762 18516 19553 21131 23419 26248 29790 33332
704 33332 35571 35827 34615 32863 30682 27720 24617 22296 20973 19951 18801 17951 17860 18430 19187 19524 19013 17720 16085
701 16085 14630 13642 13314 13425 13717 13855 13332 12467 11603 10832 10241 9838 9616 9618 9621 9710 9799 9813 9827 10002 10177 10351 10526 10799 11072
697 11072 11631 12610 14042 15893 17752 18470 17486 15721 14286 13512 13251 13291 13623 14256 14726 14775 14141 13086 12093 11280 10776 10451
694 10451 10205 10138 10196 10434 10824 11214 11585 11776 11628 11059 10389 9899 9595 9290 9223 9155 9189 9223 9212 9201 9217 9233 9204 9175 9171 9168 9164 9161 9196 9231
689 9231 9371 9511 9742 9972 10247 10523 10802 11081 11360 11639 11727 11814 11902 11989 12036 12083 12130 12177 12241 12305 12324 12342 12615 12887 13159 13432 13852
685A3852M21O04O05O95R96J241J660K423L444M751O253P896Q077N117n92n801q025p469n846
682C0302m283l020k164j503j073p72n60l80l07k16j47n7l1j21j04j04j10k0j38M3R4q7P6J65
679A5483J56O6J37L17M21O02Q04R84J176J477J221Q00L36N17J206J296J64j098j630j209p28
675B2498l07P6K56K31N33P23Q14P67O77O28O28M85M85M59O39Q09Q08R19J100J221J312J426
672C7187J606J813J812J934K024K207K627L117L778M667N569O687P469O896N394M883O265
669A05935Q300J0042J1140J2761J5243J8187K1762K5669L0241L6671M6736O0979Q0545J07165
667E91376J42989J88238K32945K48630J92742N0743j18548k28818k51902k19752j71900j28572
665E28171r5048p0470n2476l9195k9618k2948j8704j6000j4371j3108j1755j0252q682o939
$$ plain form
685 13852 14273 14877 15482 16177 17173 18414 20074 22497 25941 30692 36945 44841 52918 58035 57443 51642 43617 36148 30302
682 30302 26019 22999 20835 19332 18259 17487 16927 16547 16240 16024 15877 15820 15789 15668 15564 15460 15350 15330 15192 15235 15329 15242 15318 15483
679 15483 15639 15705 15842 16159 16580 17182 17986 18970 20146 21623 22844 23644 23980 24497 25703 26999 27163 26065 24435 23226 22498
675 22498 22191 22267 22523 22754 23287 24010 24824 25591 26268 26896 27524 28009 28494 28953 29592 30401 31209 32128 33228 34449 35761 37187
672 37187 38793 40606 42418 44352 46376 48583 51210 54327 58105 62772 68341 75028 82497 89393 94787 99670 105935
669 105935 114235 124277 135417 148178 163421 181608 203370 229039 259280 295951 342687 403666 484211 591376
667 591376 734365 922603 1155548 1404178 1596920 1647663 1529115 1300297 1048395 828643 656743 528171
665 528171 433123 362653 310177 270982 241364 218416 199712 183712 169341 156233 144478 134226 125544 118605
663A18605n397m976n563n982n433m291l247k465j798j257j024m84L21J221K139L159M293N194
661I3015N276M255L475L896N654P517R387J1250J3301J5524J8290K1355K4878K9505L7424
658C04002M9983O8168R3829J29219J75671K28688K67449K48546J31665n3962k09302k68608
656A165348k48597j97969j48032j08889p9984n9034m3831l2664k4673j9436j6252j4196j2572
654A59219j1364j0342j0075j0256j0286r865q737p355o251n229m424l762l162k861k701k520
652E0029k167j747j595j174j008j009j080j080j035j034j073j072r79p98q04q04o16o16o25
649B9713m45m42m41l56l56j30j30p8p8K8K7J59J59K94M75N10O90R99J298J844K505L083L504
646D2832M277M458L617J273j382l244l774l774l284k864k228j568j123p03k45o5K02N03P99
$$ plain form
663 118605 113208 108232 102669 96687 91254 86963 83716 81251 79453 78196 77172 76688 77009 78230 80369 83528 87821 93015
661 93015 98291 102546 106021 109917 115571 123088 132475 143725 157026 172550 190840 212195 237073 266578 304002
658 304002 353985 422153 515982 645201 820872 1049560 1317009 1565555 1697220 1643258 1433956 1165348
656 1165348 916751 718782 570750 461861 381877 322843 279012 246348 221675 202239 185987 171791 159219
654 159219 147855 137513 127438 117182 106896 97031 88294 80939 74688 69459 65035 61273 58111 55250 52549 50029
652 50029 47862 46115 44520 43346 42338 41329 40249 39169 38134 37100 36027 34955 33976 33178 32374 31570 30954 30338 29713
649 29713 29268 28826 28385 28029 27673 27543 27413 27335 27257 27285 27312 27471 27630 27924 28399 28909 29599 30598 31896 33740 36245 39328 42832
646 42832 47109 51567 55184 56457 55075 51831 48057 44283 40999 38135 35907 34339 33216 32513 32268 32203 32405 32908 33707
643C3707R80J040J039J261K043L635O099J0076J5664K1491K1490O936j3435k2855k0391j4172
640E4608r183n991l888k634j732j105n64k26k26l65l66k75r4K15O35J275K175L558N060N090
637D5967J184k926l588j965j03J474K976M373N876P321P982O375J989l333p119q103p201n754
634D5425m371l094k193j589j168p53l32j71q1J18K09L39O39Q99J199J336J426J195P75O01
631D0409O01P92J093J861L003M971P675J0538R276M49p182p548m363j547P6O04J82o92j233
628E8965j421j421j530j710j826k006k009k190k165k165k170k170j982j892j725j424j117
626B8042r37q82r73q38o58n69n70n06n06m70l80l36j56J53N75J219K120L344M606L264j123
623C4419m477m477l086k063j480r39o84n93l78j97j59l40l51l51j90rM5m5k39k39k45k45j65
$$ plain form
643 33707 34687 35727 36766 38027 40070 43705 49804 59880 75544 97035 118525 125461 112026 89171 68780 54608
640 54608 45425 39434 35546 32912 31180 30075 29511 29285 29059 28694 28328 28053 27959 28174 28809 30084 32259 35817 40877 45967
637 45967 47151 44225 40637 38672 38569 40043 43019 47392 53268 60589 68571 74946 76935 73602 66483 58380 51179 45425
634 45425 41054 37960 35767 34178 33010 32257 31925 31754 31673 31791 32000 32339 32978 33877 35076 36412 37838 39033 39808 40409
631 40409 41010 41802 42895 44756 47759 52730 60405 70943 80219 80668 73486 65938 61575 60028 60104 60708 60890 60198 58965
628 58965 57544 56123 54593 52883 51057 49051 47042 44852 42687 40522 38352 36182 34200 32308 30583 29159 28042
626 28042 27105 26223 25250 24412 23754 23185 22615 22109 21603 21133 20753 20417 20261 20414 20989 22208 24328 27672 32278 35542 34419
623 34419 29942 25465 22379 20316 18836 17897 17213 16620 16242 16045 15886 15546 15195 14844 14654 14645 14690 14645 14406 14167 13922 13677 13512
619A3512j66N5N4L5n5o1J19M1M1R8R8M1M1lmN8N8j18m19m24m25j93j3Q7J78L09J28j88k77
615A2607j94j93j08j07j08j07j80j79k14k13j31M9j02j03N0m0r0R0J10J10l3l2M7K27L63L63
611A1882M51O33M70N0m48o29n43n42n01l21j15k6LJ84K21L11J42l9k48k47k14k13j09j08k7
607A0017k8o7o7j2P7J15K96L65K74M42O22N09K09j55j56m0J41M97P98P54M54J27n3j25j25
603A4869O6K47K51P0q4q4k11l92m46l56j83j83k34n35q74q74o77n87l80j99j20l0n7n6n7n6
599H828M6m5K2K02K79M60L25K4k52n54n04l24j53j52p2p2j4j05q0J00J29J29R5R6J38J38L23
595I007L23L98O99J018J198J013N91K03J13K04N05M33j08l18m08m70n61o75n85n89m08p4K26
592A1735K45K45O0k40o05p85p73n94n01m11k91k91k27m7j01j91j31M9l9j29J7J07M0M0J50
$$ plain form
619 13512 13346 13401 13455 13490 13435 13374 13493 13534 13575 13673 13771 13812 13853 13850 13846 13904 13962 13844 13425 13001 12576 12383 12370 12457 12635 12944 13072 12884 12607
615 12607 12413 12220 12112 12005 11897 11790 11610 11431 11217 11004 10873 10922 10820 10717 10767 10727 10637 10727 10837 10947 10914 10882 10929 11156 11519 11882
611 11882 12333 12966 13436 13486 13038 12409 11866 11324 10823 10502 10387 10361 10364 10548 10769 11080 11222 11183 10935 10688 10474 10261 10152 10044 10017
607 10017 9989 9922 9855 9843 9920 10035 10331 10696 10970 11412 12034 12543 12752 12597 12441 12401 12542 13039 13837 14591 15045 15172 15119 14994 14869
603 14869 14935 15182 15433 15503 15419 15335 15124 14732 14286 13930 13747 13564 13330 12795 11921 11047 10370 9783 9403 9204 9084 9054 8997 8941 8884 8828
599 8828 8874 8829 8851 9053 9332 9792 10117 10141 9889 9335 8831 8507 8354 8202 8130 8058 8044 7939 7859 7959 8088 8217 8312 8408 8546 8684 9007
595 9007 9330 9728 10427 11445 12643 13656 14247 14450 14563 14767 15272 15705 15597 15279 14871 14401 13840 13165 12580 11991 11583 11509 11735
592 11735 11980 12225 12285 12045 11440 10655 9882 9288 8787 8376 8085 7794 7567 7520 7419 7228 7097 7146 7107 6978 6995 7102 7142 7182 7332
588G332J51M06M07N21M31P7j03p7J3J2k90o29o29m16k35k43o3NNq9q9L0K9J05J04J29J29o
583G017oO8O8K8J19K80M60M60N50M14J14l71n51n41m50l58j78k49k50j32j33k5k5p0p0J6J6
579F201n8n9l9l8N5K36K65K66K43O3r5r6k11k12j53j54M2M2J35J34P1j10j84j85r1r1K2K2
575F021n4n3m3m3m4m3M4M4Q9Q9o2o2P3P3K6K5J31J31J12J12POP4P4J91J90L59N40N81J60k65
570H483n65n67m77k88j07J9p2k5O5N4N4m2m2R4R3QRJ43J44J46J46K35M15N13M22L94N75P14
566A0541Q95J026J026R10L69j90p32j079j259j001q22o94o04l42k53j58o9j9k0j55l35l38
563F697l39j87j86p6p6j39m9N8j22k22m1J3p7j23N7k5O5K7K8p2p2j31j31n6n5J02J02l4l3
558D903o4o3M1M1O4O4m2m1p2p3LLnnP1P0m6m6K9K9K2K3K2K3k4k3n0J30N8N9O9O9O4O4N8N7
$$ plain form
588 7332 7483 7889 8296 8817 9248 9325 9222 9145 9158 9170 8880 8251 7622 7206 6971 6728 6665 6670 6675 6586 6497 6527 6556 6661 6765 6894 7023 7017
583 7017 7011 7079 7147 7175 7294 7574 8034 8494 9044 9458 9572 9201 8650 8109 7659 7301 7123 6874 6624 6492 6359 6334 6309 6239 6169 6185 6201
579 6201 6143 6084 6045 6007 6062 6298 6563 6829 7072 7135 7040 6944 6733 6521 6368 6214 6256 6298 6433 6567 6638 6528 6344 6159 6068 5977 5999 6021
575 6021 5967 5914 5871 5828 5784 5741 5785 5829 5918 6007 5945 5883 5956 6029 6055 6080 6211 6342 6454 6566 6573 6579 6653 6727 6918 7108 7467 8007 8588 8748 8483
570 8483 7918 7351 6874 6586 6479 6498 6426 6401 6466 6520 6574 6532 6490 6584 6677 6685 6694 6837 6981 7127 7273 7508 7923 8436 8858 9252 9827 10541
566 10541 11436 12462 13488 14398 14767 14577 13845 12766 11507 10506 9684 8990 8386 8044 7791 7633 7564 7545 7525 7370 7035 6697
563 6697 6358 6171 5985 5909 5833 5694 5645 5703 5581 5359 5318 5331 5254 5131 5188 5163 5228 5255 5283 5211 5139 5008 4877 4821 4766 4868 4970 4936 4903
558 4903 4839 4776 4817 4858 4922 4986 4944 4903 4831 4758 4761 4764 4759 4754 4825 4895 4849 4803 4832 4861 4883 4906 4928 4951 4927 4904 4854 4984 5042 5101 5170 5239 5303 5367 5425 5482
553E482J90R9RJ90L27M17M31O11N08L27o7l67n73n74l85l86l11j31j27j28p5p5q1q1m9j40
549E041o2J20J4p5n9n8k2k2k2k2M7M6KJj6j5M8M8J04p7q2R8J14K5m5M6Q8kN4N5J8J8R3R2J13
543E706J12J87J88K45K46L75N55N58O48O53M73J73pk31l21k05k3J54L35O28Q08J138J680K317
540A6392L099L926M346L574J351j684l908m430l770k959k297j853j432r26p47n24m33l68l68
537F989k61k60k60k60j71j71o6j56j64j4m7j37j34m4k1P0kr1j65j4Q5Q5m0m1l1l1J4J4j00
533D576j01n5n5K5K6q0q0j0j0L4L5M8M8k7k7k9k8J7J7nmnnj3j3n8n8nnn0m9m1m1NML8L7L7
527D093L8%jl9m0K4J13J08m2j16k6J00J0k4k4J5J6nnM1M0J0J0l4l5N7N6J2p8n6R4Mq6N1l9
521D242O0J50K4K4K9K9o7o7k2k1O5O5J11J10L2L2K57K58L81L81J86J86j29j28j73l24l35k46
$$ plain form
553 5482 5672 5771 5780 5970 6297 6714 7145 7756 8264 8591 8524 8157 7584 7010 6625 6239 5928 5797 5670 5542 5467 5392 5311 5230 5181 5041
549 5041 4979 5099 5113 5038 4979 4921 4899 4877 4855 4833 4880 4926 4928 4929 4913 4898 4946 4994 5098 5021 4939 5037 5151 5176 5131 5177 5265 5263 5317 5372 5390 5408 5501 5593 5706
543 5706 5818 6005 6193 6438 6684 7059 7614 8172 8820 9473 9946 10119 10112 9881 9560 9355 9332 9486 9821 10449 11257 12395 14075 16392
540 16392 19491 23417 27763 31337 32688 31004 27096 22666 18896 15937 13640 11787 10355 9429 8682 8158 7725 7357 6989
537 6989 6728 6468 6208 5948 5777 5606 5540 5384 5220 5206 5159 5022 4888 4844 4823 4893 4891 4800 4635 4621 4706 4791 4751 4710 4679 4648 4662 4676 4576
533 4576 4475 4420 4365 4390 4416 4336 4256 4246 4236 4270 4305 4353 4401 4374 4347 4318 4290 4307 4324 4319 4315 4310 4305 4292 4279 4221 4163 4158 4153 4103 4054 4013 3972 3977 3981 4019 4056 4093
527 4093 4131 4131 4130 4091 4051 4075 4188 4296 4254 4138 4112 4212 4222 4198 4174 4189 4205 4200 4195 4236 4276 4286 4296 4262 4227 4284 4340 4352 4274 4218 4312 4316 4230 4281 4242
521 4242 4302 4452 4476 4500 4529 4558 4491 4424 4402 4381 4446 4511 4622 4732 4764 4796 5053 5311 5692 6073 6259 6445 6316 6188 6015 5691 5356 5110
517E110j70j71n4n3n4n3jjjjO6O6J23J22J95L75N44O34O77P68N72J52l27n08p89p90o57l58
513E416l21k32k19k19m9m8K9K9L0K9k9k9k9k9j59j59OPO4O5J09J10M7M8M8M7Q7Q7Q7Q7K01
508E111K01L77L77N34P14R96J176J618J919J475L34r51j612j755j454j093r12o19m39l87k07
505E403p1p2j02j02j02j03O6O6r9r9j14j13l9l8lkj08j08P9P9LMJ05J05J80J80J81J81K85
500E642K86K78K79L53L54N46N46M94J93j05n26p23o33o09m29l05j25K0J10J70J70K71J80O
497F443Ok8k8j19k7L56M47L61K70Q4j86l94m85m56m57l12k22k31j41n5j45j90j00j1P9J0J1
493D480J7J7L4L5L5L5m8m8m8m8m6m6m6m6N5N4N4N5QPJ04J3k6k6k6k6O3J53J58J57L21M72L30
488F177J81l7j26l35l35k64j73k9k9Q7Q6k2j12P2J63L5J85L04N14M51M50M20M19O7k04l36
$$ plain form
517 5110 4940 4769 4715 4662 4608 4555 4554 4553 4552 4551 4617 4683 4806 4928 5123 5498 6042 6676 7353 8121 8693 8845 8518 8010 7221 6431 5774 5416
513 5416 5095 4863 4644 4425 4376 4328 4357 4386 4416 4445 4416 4387 4358 4329 4170 4011 4017 4024 4088 4153 4262 4372 4419 4467 4515 4562 4649 4736 4823 4910 5111
508 5111 5312 5689 6066 6600 7314 8310 9486 11104 13023 14498 14832 13881 12269 10514 9060 7967 7055 6436 5997 5610 5403
505 5403 5332 5260 5158 5056 4954 4851 4917 4983 4884 4785 4671 4558 4519 4481 4478 4476 4368 4260 4339 4418 4421 4425 4530 4635 4815 4995 5176 5357 5642
500 5642 5928 6206 6485 6838 7192 7738 8284 8778 8971 8866 8340 7617 6984 6375 5946 5641 5516 5536 5646 5816 5986 6257 6437 6443
497 6443 6449 6421 6393 6274 6247 6603 7050 7411 7681 7765 7579 7185 6700 6244 5787 5475 5253 5022 4881 4826 4681 4491 4391 4380 4459 4469 4480
493 4480 4497 4514 4548 4583 4618 4653 4605 4557 4509 4461 4415 4369 4323 4277 4332 4386 4440 4495 4503 4510 4614 4627 4601 4575 4549 4523 4586 4739 4897 5054 5375 5847 6177
488 6177 6358 6321 6195 5860 5525 5261 5088 5059 5030 5117 5203 5181 5069 5141 5304 5339 5524 5828 6342 6793 7243 7663 8082 8149 7945 7609
484G609m86n43l92l51k61j57o8j6j7L4L4J4J3QR8J75J76L12M03K37K7j29j28k27j36j33m2
480F054k0k0j19j20r2r2m7m7j04j03k9k8M1M0l4l5K0K0n5n5M5M5R1R0J23J24P8P8LMMLLKM3
474E911M2l3j24j04P6K0o9O7O8R3R4R4R4pqk33k33r2r2r2r2M7M7KKK8K9K8K8p9q0mnJ39J39
469E701K15K14L0L0j05j05k02k01l7l6MNNNR1R2R2R2O0O0K47O8j2J69K66J76J22L1r2j83j49
464F653n8p1p0j82j81j37j37k4k4k5k4L1L2m4m4J60J61K63L54M39K59R2q9l11l11l22l22j23
460E945j22o6o6j23N7K11K11L4L3P9P8J05J05J04J05j25j26j25j25n9o0n9n9N1N1k5k4R3R3
455F191J95J4JJJ80J80J83R4M2K23K53K53J90J89j5j5j6j5l8l9J2J3N7J48K69M50M63K83L1
451I777j49j20j20O4O4J79J78J62K52K00K0N2N2J40J40J38L18M15L23K83J93K47M27K06J15
$$ plain form
484 7609 7123 6580 6188 5837 5576 5419 5351 5335 5318 5352 5386 5400 5413 5421 5519 5694 5870 6182 6585 6822 6849 6720 6592 6365 6229 6096 6054
480 6054 6034 6014 5895 5775 5683 5591 5544 5497 5393 5290 5261 5233 5274 5314 5280 5245 5265 5285 5230 5175 5220 5265 5356 5446 5569 5693 5771 5849 5852 5856 5860 5863 5866 5868 5911
474 5911 5953 5920 5796 5692 5768 5788 5719 5786 5854 5947 6041 6135 6229 6222 6214 5981 5748 5656 5564 5472 5380 5427 5474 5476 5478 5506 5535 5563 5591 5512 5432 5428 5423 5562 5701
469 5701 5916 6130 6160 6190 6085 5980 5778 5577 5540 5504 5508 5513 5518 5523 5614 5706 5798 5890 5950 6010 6257 6325 6313 6482 6748 6924 7046 7077 6985 6802 6653
464 6653 6595 6524 6454 6272 6091 5954 5817 5793 5769 5744 5720 5751 5783 5739 5695 5855 6016 6279 6633 7072 7331 7423 7334 7023 6712 6390 6068 5945
460 5945 5823 5757 5691 5568 5625 5836 6047 6081 6114 6193 6271 6376 6481 6585 6690 6565 6439 6314 6189 6130 6070 6011 5952 6003 6054 6029 6005 6098 6191
455 6191 6386 6400 6401 6402 6582 6762 6945 7039 7081 7304 7557 7810 8000 8189 8174 8159 8143 8128 8090 8051 8063 8076 8133 8281 8550 9000 9463 9746 9777
451 9777 9628 9508 9388 9452 9516 9695 9873 10035 10287 10487 10507 10559 10611 10751 10891 11029 11347 11762 12085 12368 12561 12808 13235 13441 13556
447A3556J4J5j27j27j10j09o5o5O4O3K89K89L06L06J71J71K73K73J62j38m09l18j78q7M2J33
443A4394K53K54K51K51L86L87M33M33J67j34J27J27K85N85O83O83P63O74N40jn62r82j022
440A8975j021q53p64o89l88j93j93o1J48K30L19J70P9lr4l7N3m8m9l5l5q1q0k00k00j46n6
436A4748P8P7P2J62J91J00J41K32K34Q3j23l4p3P6J48lk25l76m97n86o22m72m95m04k46l5
432A2151M2M2J20L0P6P5L9n2j6P5K0j29j44j45k07k07k53j62r7qN9N9R5J85K17J27k4k34l17
427A1417m07k83j33qr7q8q8J5J05N9l2j11j11l2l3j38m8j9j70j19j19n4L6O1O1m6m7m6m6%
423I479j%%N7N7O3O2K2J13J36J37n0n1r5r5p4p4j64p4p3J7k8k8m0m1r1r1l6j26j31m2p6j67
418H495j62p1N8N7N8N7O3k6q7q7l2j21p1p1q0q0j78k7N4j57j65j64o4o4J1J1j24j24m9m9P6
$$ plain form
447 13556 13570 13585 13458 13331 13221 13112 13047 12982 13046 13109 13398 13687 13993 14299 14470 14641 14914 15187 15349 15211 14802 14484 14306 14219 14261 14394
443 14394 14647 14901 15152 15403 15789 16176 16609 17042 17209 17075 17202 17329 17614 18199 18882 19565 20328 21002 21542 21541 20979 19997 18975
440 18975 17954 17101 16337 15648 15260 15067 14874 14813 14961 15191 15510 15680 15759 15756 15662 15625 15678 15630 15581 15546 15511 15430 15350 15150 14950 14804 14748
436 14748 14826 14903 14975 15137 15328 15428 15569 15801 16035 16118 15995 15961 15888 15964 16112 16109 15884 15508 15011 14425 13803 13331 12836 12432 12186 12151
432 12151 12193 12235 12355 12385 12461 12536 12575 12523 12507 12582 12602 12473 12329 12184 11977 11770 11517 11355 11258 11250 11309 11368 11463 11648 11865 11992 11968 11734 11417
427 11417 11010 10727 10594 10586 10489 10401 10313 10328 10433 10492 10460 10349 10238 10206 10173 10035 9987 9968 9798 9679 9560 9506 9542 9603 9664 9618 9571 9525 9479 9479
423 9479 9478 9478 9478 9535 9592 9655 9717 9739 9852 9988 10125 10075 10024 9929 9834 9760 9686 9522 9448 9375 9392 9364 9336 9296 9255 9164 9073 9037 8911 8780 8738 8662 8495
418 8495 8333 8262 8320 8377 8435 8492 8555 8529 8442 8355 8323 8202 8131 8060 7980 7900 7722 7695 7749 7592 7427 7263 7199 7135 7146 7157 7033 6909 6860 6811 6887
413F887P7j29k18j36j36j42n1q2QL7L8J24J23L9n2j0j1j6j6l2l2j37j38j49j49p5p4l4l4l3
408E447l4m0l9m5M5o6o6%R0j0P9K9L0J62P2J2J2o5j55j65p5K9j22p1p1q3Qm4m3m9m9n5L6N2
403D756N2N7N8j9j8L6J26J34J35k9j20l8N2L8j72j99k00j8j7j28j29n3n3k2k2o8o7K5K5q1
399D041q0m1m0MNL2L3m3m2K2K2j02j02p1J08J09p2mnj6j6o2o1n7n6l9N1J48l4l5l5m6m7l0
393C439l0J4J5j0j1j0j1O3O3O3O2OONOl6l7P0O9k7k7k6k7K8K7j8j8K5K4M8K27J07p4j56j56
388C693J9J9O5O4K5K4K5K4p4p4JJm0l9q5q5rrqrp8p9llK9K9K9K8k1k1r7r7nnn1n1M3M2qqP8
382C279j2j44L7Q4om9n0P1P1P1P1M6M7M7M6R1R0J5J5O4O4Q6Q6kkp8p7o7o7j42j42j10j11o6
377C256o6M0M0M0M0k7k6m9m9m1m2q6q6j9j8j9j8Q1Q1OOj1j0r1r1j9j10l6J44J08p2q0J0q6
$$ plain form
413 6887 6964 6835 6617 6481 6345 6203 6152 6070 6078 6115 6153 6277 6400 6439 6387 6377 6366 6350 6334 6302 6270 6133 5995 5846 5697 5622 5548 5514 5480 5447
408 5447 5413 5373 5334 5289 5334 5268 5202 5202 5292 5282 5361 5390 5420 5582 5654 5666 5678 5613 5458 5293 5218 5247 5125 5054 4983 4900 4908 4864 4821 4772 4723 4668 4704 4756
403 4756 4808 4865 4923 4904 4886 4922 5048 5182 5317 5288 5168 5130 5182 5220 5048 4849 4649 4631 4614 4486 4357 4304 4251 4229 4207 4139 4072 4097 4122 4041
399 4041 3961 3920 3880 3884 3889 3921 3954 3911 3869 3891 3913 3811 3709 3638 3746 3855 3783 3779 3774 3758 3742 3680 3619 3562 3506 3467 3518 3666 3632 3597 3562 3516 3469 3439
393 3439 3409 3423 3438 3428 3417 3407 3396 3459 3522 3585 3647 3653 3659 3664 3670 3634 3597 3667 3736 3709 3682 3656 3629 3657 3684 3666 3648 3673 3697 3745 3972 4079 4005 3849 3693
388 3693 3712 3731 3796 3860 3885 3909 3934 3958 3884 3810 3811 3812 3772 3733 3648 3563 3554 3545 3537 3528 3450 3371 3368 3365 3394 3423 3452 3480 3459 3438 3341 3244 3239 3234 3183 3132 3175 3217 3209 3201 3279
382 3279 3267 3123 3160 3244 3238 3189 3139 3210 3281 3352 3423 3469 3516 3563 3609 3700 3790 3805 3820 3884 3948 4034 4120 4118 4116 4038 3961 3894 3827 3685 3543 3433 3322 3256
377 3256 3190 3230 3270 3310 3350 3323 3297 3248 3199 3158 3116 3030 2944 2925 2907 2888 2870 2951 3032 3038 3044 3033 3023 2932 2841 2822 2712 2676 2820 2928 2856 2776 2786 2700
371B700MLMJ0J1N5N5jkkkrqn4n4L1L1RQm4m4K6K5L6n3j28N4J17J18l7l6r7r6k1k1L4L3j1j2
365B632j2j2L3L3M1M0l4l5n4n5K0K0j8j9M4m6r4Q6K4K5k2k1K3K4L7L7o8o7k2k2k2k2P2P2l
360B615lN0N1k5k5J3J2o2o3m9m9mmL4L4mQ6L4j16k6k6o0o0j4j5q2q1Q4Q4j05j05O1O0k2k2
355B196k2k2k4k4k4k5p5p6Q9R0J1J2J1J2Q9R0j6j5J2J2l3l2q0q0N5N6N6N7p9p8k7k6M9M9p5
349B113p6K6J16R7j13j15k5q1q0l0k9J5J5O0O0n8n7q0q0Q0P9MMPPQPm9m9k6k6K2K1O7O7J1
344A912J1o4o5N0N0NNl9l9j6j6l3l2M4M3R2R2m3m2o3o2j7j8J0RN4N4m1m0MNL8L9ppo3o2O3
338A811O3N7r3j04j4M0M1k9k9K3K4k2k1j25j25M1M1O5O5K0K0K7K8j8j8l3l3L3L3R9n1j56o
333A654j3j4j3j3J29k1QR7J36M5r4r4j4j3O1O2J6J7n9n9P0P0r5r5M8M9M8M9r5r4n0m9K9L0
$$ plain form
371 2700 2704 2707 2711 2721 2732 2787 2842 2841 2839 2837 2835 2826 2818 2764 2710 2741 2772 2781 2789 2745 2701 2727 2752 2788 2735 2607 2661 2778 2896 2859 2823 2726 2630 2609 2588 2622 2655 2644 2632
365 2632 2620 2608 2641 2674 2715 2755 2721 2686 2632 2577 2597 2617 2599 2580 2624 2578 2484 2570 2594 2619 2597 2576 2599 2623 2660 2697 2629 2562 2540 2518 2496 2474 2546 2618 2615
360 2615 2612 2662 2713 2688 2663 2676 2688 2626 2563 2514 2465 2461 2457 2491 2525 2521 2607 2641 2525 2499 2473 2413 2353 2339 2324 2242 2161 2245 2329 2224 2119 2180 2240 2218 2196
355 2196 2174 2152 2128 2104 2080 2055 1980 1904 1993 2083 2094 2106 2117 2129 2218 2308 2292 2277 2289 2301 2268 2236 2156 2076 2131 2187 2243 2300 2221 2143 2116 2090 2139 2188 2113
349 2113 2037 2063 2179 2276 2163 2048 2023 1942 1862 1832 1803 1818 1833 1893 1953 1895 1838 1758 1678 1758 1837 1841 1845 1852 1859 1867 1874 1825 1776 1750 1724 1746 1767 1834 1901 1912
344 1912 1923 1859 1794 1844 1894 1899 1904 1865 1826 1810 1794 1761 1729 1773 1816 1908 2000 1957 1915 1852 1790 1773 1755 1765 1774 1828 1882 1841 1801 1805 1810 1848 1887 1880 1873 1810 1748 1811
338 1811 1874 1931 1838 1734 1720 1760 1801 1772 1743 1766 1790 1768 1747 1622 1497 1538 1579 1644 1709 1729 1749 1776 1804 1786 1768 1735 1702 1735 1768 1867 1816 1660 1654
333 1654 1641 1627 1614 1601 1730 1709 1717 1814 1950 1995 1901 1807 1793 1780 1841 1903 1919 1936 1877 1818 1888 1958 1863 1768 1816 1865 1913 1962 1867 1773 1723 1674 1703 1733
328A733K9L0M6M5Jj49l3N7llj30j30k5k4M7M7LKP7P7k8k8OONOllllo8o8PPL6L7L6L6k1k2k2
322A610k2l1l1M4M4n5n4%%j26K4M5M5k1k2N3N4L4L4L5L4JJKJoppoJ8J9k6k7L0L0K4K5m1j31
316A594o5Q6J29L8o6o6L7L6l8l8k5k4N0N1m6m6m7m6Q3Q2j03j04j0J39O7k4k4O5j5j05J5J5
311A595N4N5RJ0l6l6RJ0o6o6M3M4kkq7q7j6J35O4q5q6O4J76K5p7p6M8M8M7M8k8k9o7Q2m0m1
305A639M4M3L6L5m9m9K7j23l8l9J1J0J1J0q8q9P7P7J8J8q8q7M8M9LLj5j6j5j5PQPQl8l7L7
300A440L8N5N5RJ0r4r3J1J2N4N4n0n1O4O5O4O5j4j4n9n9QPl7l8P6P5l0l0rrn5n4j3j2R2R3
294A626o9o9k4k4N8N9m7m7j7j7K8K9L1L2p3p3k3k3Q3Q3q4q3Q2Q2N8N8m8m7k7k7J8J8l9m0O
289A450OK1K1J1J2P9p1m3M7M4m6q6MJ07J07PPq8q9J7J6J4J4l1l2j4j5j5j4M8M8ooK0j30n1
$$ plain form
328 1733 1762 1792 1838 1883 1884 1735 1702 1759 1756 1753 1623 1493 1468 1444 1491 1538 1541 1543 1620 1697 1669 1641 1647 1653 1658 1664 1661 1658 1655 1652 1584 1516 1523 1530 1566 1603 1639 1675 1654 1632 1610
322 1610 1588 1557 1526 1570 1614 1559 1505 1505 1505 1379 1403 1448 1493 1472 1450 1503 1557 1591 1625 1660 1694 1695 1696 1698 1699 1693 1686 1679 1673 1691 1710 1684 1657 1687 1717 1741 1766 1725 1594
316 1594 1529 1615 1744 1782 1716 1650 1687 1723 1685 1647 1622 1598 1648 1699 1653 1607 1560 1514 1597 1679 1576 1472 1462 1601 1668 1644 1620 1685 1670 1565 1580 1595
311 1595 1649 1704 1713 1723 1687 1651 1660 1670 1604 1538 1581 1625 1623 1621 1534 1447 1431 1566 1630 1545 1459 1523 1699 1724 1647 1571 1619 1667 1714 1762 1734 1705 1638 1720 1680 1639
305 1639 1683 1726 1762 1797 1748 1699 1726 1603 1565 1526 1537 1547 1558 1568 1480 1391 1468 1545 1563 1581 1493 1406 1454 1503 1506 1509 1494 1478 1463 1448 1455 1463 1470 1478 1440 1403 1440
300 1440 1478 1533 1588 1597 1607 1513 1420 1431 1443 1497 1551 1501 1450 1514 1579 1643 1708 1694 1680 1621 1562 1570 1577 1540 1502 1578 1653 1623 1593 1584 1575 1520 1466 1453 1441 1533 1626
294 1626 1557 1488 1464 1440 1498 1557 1510 1463 1446 1429 1457 1486 1517 1549 1476 1403 1380 1357 1440 1523 1439 1356 1438 1520 1578 1636 1588 1541 1514 1487 1505 1523 1484 1444 1450
289 1450 1456 1477 1498 1509 1521 1600 1529 1486 1533 1577 1531 1445 1449 1556 1663 1670 1677 1589 1500 1517 1533 1547 1561 1530 1498 1484 1469 1454 1440 1488 1536 1530 1524 1544 1414 1363
283A363L9N0N0j9k0j9j9N6N6M8M8n7n7n5n4j0j0J0J1J1J1LMLMK1K1J15l5j27K3N4l5j5j5k0
278A434k1K1K2O6O6n4n4K1K2kkkko2o1J3J3K0K1K0K0m6m6jkO3O4j3j02l1J20Q2o9j88K1N9
272A410N9J1J1J2J1l0l1p5p5K1K2k4k3n4n3J7J08J72l8j04M6n5n5N9O0%Jl9J11j0j0jjl5l5
267A383P1P0l9m0l9m0l7l8L8L7L2L1L2L1k7k6J8J8J7J6J7J6j1j1q6q5M5M5L0o0q7O3k8k7J29
262A458J29M4m6j7j7k8k8%q9l3l4k2O8J2J2J8p3j06M4P8P7L3n7l5l5NMpqn8L2rqM3M2p5p5
256A239M0J30K9L0J6p3p4J7l5l4j0Q0Q0j1k9k9q0p9P1P2J6J7R0o1o7Q4R2Kr3mj1j1n6L4M8
251A430M7l1l2J39j2q6q7n8L2L2L2p0K1J05m5j09j8k8k8m0N0Q0Q0m9M1M7m4m9M1k1k2j1j02
245A235N4N4K6K7K7K6k2k2k2k2j3j3Q3pn8n8j9j8N8N8m7m7j2j3L3L2LMlkj8j08r7N3j3j3J01
$$ plain form
283 1363 1402 1452 1502 1483 1463 1444 1425 1481 1537 1585 1633 1576 1519 1464 1410 1400 1390 1400 1411 1422 1433 1436 1440 1443 1447 1468 1489 1604 1569 1442 1465 1519 1484 1469 1454 1434
278 1434 1413 1434 1456 1522 1588 1534 1480 1501 1523 1521 1519 1517 1515 1453 1392 1405 1418 1438 1459 1479 1499 1453 1407 1406 1404 1467 1531 1518 1416 1385 1505 1587 1518 1330 1351 1410
272 1410 1469 1480 1491 1503 1514 1484 1453 1378 1303 1324 1346 1322 1299 1245 1192 1209 1317 1489 1451 1347 1393 1338 1283 1342 1402 1402 1403 1364 1475 1465 1455 1454 1453 1418 1383
267 1383 1454 1524 1485 1445 1406 1366 1329 1291 1329 1366 1398 1429 1461 1492 1465 1439 1457 1475 1492 1508 1525 1541 1530 1519 1433 1348 1393 1438 1468 1408 1321 1384 1356 1329 1458
262 1458 1587 1631 1585 1568 1551 1523 1495 1495 1406 1373 1339 1317 1385 1397 1409 1427 1354 1248 1292 1370 1447 1480 1423 1388 1353 1358 1362 1355 1347 1289 1321 1312 1304 1347 1389 1314 1239
256 1239 1279 1409 1438 1468 1484 1411 1337 1354 1319 1285 1275 1355 1435 1424 1395 1366 1286 1207 1278 1350 1366 1383 1473 1412 1345 1429 1521 1523 1430 1426 1415 1404 1348 1382 1430
251 1430 1477 1446 1414 1553 1541 1455 1368 1310 1342 1374 1406 1336 1357 1462 1417 1308 1290 1262 1234 1194 1244 1324 1404 1355 1396 1443 1399 1350 1391 1370 1348 1337 1235
245 1235 1289 1343 1369 1396 1423 1449 1427 1405 1383 1361 1348 1335 1418 1411 1353 1295 1276 1258 1316 1374 1327 1280 1268 1255 1288 1320 1323 1327 1324 1322 1304 1196 1099 1152 1139 1126 1227
240A227J01L7L6l9l8jjkjj1j2j2j1J8J8k6k7N1N0n5n4J7J8J8J7jkO8O8m3j33l7J13R2LJ19
234A565K8o1K9k8k8n1n0K4K4o0o0o0o1Q2Q2OOn4n5N1N0KKr8r8mQ5J25k6o7K4L8L9K4K4K4K5
229A498J4J3NMR7n4j64j65M6M6l0k9p0p0R6R5L7L7L7L7lklkk6k7J9K0l4l4l3l4llp8p8M6M7
223A252M7M6J0RJ0Rk5k5k5k5j9j8K6K6P3P2o2o3K7K6m8m8mlmlnoonl0l0L5L6R2n9m9m9M1M1
217A267L2L2P1p8m5M5j5j5rrLMLLRRl6l6j8j7K8K8N9O0p6p5N3N4k2k2lmmmP6P5%Jp2p3L4L3
210A346L7L8qpk0k0j9k0n3n3Q2Q2KKq4Or1N9P6j5j0j0K9K9J4J5l0l1Q6Q6j9j9q9q8J6J7kj
205A333jjM3M3l1l2J7J7J7J7l9l8J17K7j%l0j21j2j3o3o3J16J16n3j43mQ7L0L0j5j6L0L0j6
199A378j6o7K4k3k3j1j02l1l1L8L9P4P5l0l0oonol5l5O1l0MLRq1MR5L8L8k8k7lQ7L9M0%jM
$$ plain form
240 1227 1328 1365 1401 1362 1324 1323 1322 1320 1319 1308 1296 1284 1273 1291 1309 1283 1256 1307 1357 1302 1248 1265 1283 1301 1318 1317 1315 1383 1451 1408 1275 1238 1351 1443 1446 1565
234 1565 1593 1532 1561 1533 1505 1454 1404 1428 1452 1392 1332 1272 1211 1293 1375 1381 1387 1333 1278 1329 1379 1381 1383 1285 1187 1183 1268 1393 1367 1300 1324 1362 1401 1425 1449 1473 1498
229 1498 1512 1525 1530 1534 1631 1577 1413 1248 1294 1340 1310 1281 1211 1141 1237 1332 1369 1406 1443 1480 1477 1475 1472 1470 1444 1417 1436 1456 1422 1388 1355 1321 1318 1315 1237 1159 1205 1252
223 1252 1299 1345 1355 1364 1374 1383 1358 1333 1308 1283 1264 1246 1272 1298 1371 1443 1381 1318 1345 1371 1323 1275 1271 1268 1264 1261 1256 1250 1244 1239 1209 1179 1214 1250 1342 1283 1234 1185 1226 1267
217 1267 1299 1331 1402 1324 1279 1324 1309 1294 1285 1276 1279 1283 1286 1289 1298 1307 1271 1235 1217 1200 1228 1256 1315 1375 1299 1224 1277 1331 1309 1287 1284 1280 1276 1272 1348 1423 1423 1424 1352 1279 1313 1346
210 1346 1383 1421 1413 1406 1386 1366 1347 1327 1274 1221 1303 1385 1387 1389 1305 1311 1220 1279 1355 1340 1330 1320 1349 1378 1392 1407 1377 1346 1432 1518 1499 1480 1391 1303 1319 1336 1334 1333
205 1333 1332 1331 1374 1417 1386 1354 1371 1388 1405 1422 1383 1345 1462 1489 1488 1488 1458 1337 1325 1312 1249 1186 1302 1418 1365 1222 1218 1305 1335 1365 1350 1334 1364 1394 1378
199 1378 1362 1295 1319 1296 1273 1262 1160 1129 1098 1136 1175 1249 1324 1294 1264 1258 1252 1247 1241 1206 1171 1232 1202 1206 1209 1218 1137 1141 1236 1274 1312 1284 1257 1254 1341 1380 1420 1420 1419 1423
193A423LJ8p1j37J4P9j1L5L5Q6nm4M6l5j25lmrrm6m7K8J19N9r1J2J2j13R7J09m2p3p3K3K3
188A283K4K5L4j16k2k3O4k6o0n9L9M0l8l8j3P7M3M3LMl2l1M4M4j7j6o1o2M8M7J15o5o8J13
183A343j%J1J0l4l5j4j5L1L0M5M6%%j17j18J7J7L8L8opk4k4K2K1L1L2j4j4LKm3m3POOOl0l0
177A193r8Q2J29n1p4p4ooooM7M7M8M7PPmmO9j11n4n5J3J3J19J18l4l3l4l4k9k9O5O5Nj75J
171A158JP0O9O6j14ONnol2l2M4M3l4l4O7j13k0k1J3J3j5j5j5j5J3J3J4J3j8j7J6J6J3j68J4
165I93J5K8J18O8O8k4k4j5j5k2J29J4p5Oq3q9JQ6Q7m4m3L5L5m1m0N3N4O4k5j30l9j5j5k4O6
160A157J5J5k6k7k7k7J2J1l9N1j6j7O4O4lmM1M1p0o9k5k4J1J0N0N0%r1J5J04MLl6l5kjjj%
154A177%M5M5k7k6J01j09r7N4K1K2J32j7m4m4M6m4n3L8J30k0o0o0J4J03k3k2k3k2N2N3k1k0
$$ plain form
193 1423 1426 1444 1373 1236 1250 1329 1318 1353 1388 1474 1469 1425 1471 1436 1311 1308 1304 1295 1286 1240 1193 1221 1340 1399 1308 1320 1332 1219 1316 1425 1383 1310 1237 1260 1283
188 1283 1307 1332 1366 1250 1228 1205 1269 1243 1183 1124 1163 1203 1165 1127 1114 1191 1234 1277 1280 1284 1252 1221 1265 1309 1292 1276 1215 1153 1201 1248 1363 1298 1230 1343
183 1343 1342 1342 1353 1363 1329 1294 1280 1265 1296 1326 1371 1417 1417 1417 1300 1182 1199 1216 1254 1292 1286 1279 1255 1231 1253 1274 1305 1337 1323 1309 1312 1314 1271 1228 1235 1241 1247 1253 1223 1193
177 1193 1095 1177 1306 1255 1181 1107 1101 1095 1089 1083 1130 1177 1225 1272 1279 1286 1282 1278 1347 1236 1182 1127 1140 1153 1272 1390 1356 1323 1289 1255 1226 1197 1262 1327 1332 1157 1158
171 1158 1159 1229 1298 1364 1250 1256 1261 1256 1250 1218 1186 1230 1273 1239 1205 1272 1159 1139 1118 1131 1144 1129 1114 1099 1084 1097 1110 1124 1137 1119 1102 1118 1134 1147 979 993
165 993 1008 1036 1154 1222 1290 1266 1242 1227 1212 1190 1319 1333 1258 1264 1181 1092 1093 1179 1266 1222 1179 1214 1249 1208 1168 1221 1275 1339 1314 1184 1145 1130 1115 1091 1157
160 1157 1172 1187 1161 1134 1107 1080 1092 1103 1064 1115 1099 1082 1146 1210 1207 1203 1244 1285 1215 1146 1121 1097 1108 1118 1168 1218 1218 1127 1142 1246 1250 1253 1217 1182 1180 1179 1178 1177 1177
154 1177 1177 1222 1267 1240 1214 1315 1206 1109 1163 1184 1206 1338 1321 1277 1233 1279 1235 1182 1220 1350 1330 1270 1210 1224 1327 1304 1282 1259 1237 1289 1342 1321 1301
149A301K4K4J4J5j22l1N5r5r0O1O7O8K3o7J5J6O0k9mlj05M5J11p1J7p4k5k5l1l1J0J0Q4Q5
144A302p9q0K6K5rj0O5O5l5l6M0M0m7m8J5p6j05P6J3J4NOQ1Q0n3n4n4n3PQN2N2J06J06j49
139A296j49J6J7O1O2L0K9p5p6o1o1j18O2M0L9j4j3k1J59J65j5j07j7n4L5J3J3J9J9mmm4m3
133A199n8L2Q8r1p7J3P5P5P2j08n8L2L6L6M2M1m8m8K7K6k9l0J6J6k7k7k7k7M3M4M3M4l8l8
128A269l8l8J06J07q9q8KLm3m3j2j3L2L3j6j5N9O0j2j2n7n6O1O2j3j4L3L2p2p3J5J4r8Q2J46
123A314l4k7k7l4l3l4l4J07J06j19j19L4L4j1j1j6j7P8P7N9j20N5N6lmm8m9poppO8O8K3K3
118A335j7j8j7j8l1l2J4J3o5o6k0k0l9l9R6R6L8L9ppN4N3n2n1l5l6M0M0M2M2l3l3k0k1o5o6
112A094k4k4J23n8J3J3P7P7j0j1j0j1n6n6J8J9l9m0l9m0O4O5j1j1M8M9LLm0m1NMJ7J6ONQ0
$$ plain form
149 1301 1325 1349 1363 1378 1256 1225 1280 1185 1095 1156 1223 1291 1314 1247 1262 1278 1338 1309 1305 1302 1197 1242 1353 1282 1299 1225 1200 1175 1144 1113 1123 1133 1217 1302
144 1302 1223 1143 1169 1194 1185 1175 1240 1305 1270 1234 1274 1314 1267 1219 1234 1158 1053 1129 1142 1156 1161 1167 1248 1328 1275 1221 1167 1114 1121 1129 1181 1233 1339 1445 1296
139 1296 1147 1163 1180 1241 1303 1333 1362 1287 1211 1150 1089 971 1033 1073 1112 1098 1085 1064 1223 1388 1373 1266 1249 1195 1230 1243 1256 1275 1294 1290 1286 1242 1199
133 1199 1141 1173 1261 1170 1093 1106 1181 1256 1328 1220 1162 1194 1230 1266 1308 1349 1301 1253 1280 1306 1277 1247 1263 1279 1252 1225 1198 1171 1214 1258 1301 1345 1307 1269
128 1269 1231 1193 1299 1406 1317 1229 1231 1234 1191 1148 1136 1123 1155 1188 1172 1157 1216 1276 1264 1252 1195 1139 1200 1262 1249 1235 1268 1300 1228 1155 1170 1184 1086 1168 1314
123 1314 1280 1253 1226 1192 1159 1125 1091 1198 1304 1185 1066 1100 1134 1123 1112 1096 1079 1157 1234 1293 1173 1228 1284 1281 1277 1229 1180 1173 1167 1160 1153 1221 1289 1312 1335
118 1335 1318 1300 1283 1265 1234 1202 1216 1229 1164 1098 1078 1058 1019 980 1076 1172 1210 1249 1242 1235 1289 1342 1290 1239 1204 1168 1208 1248 1290 1332 1299 1266 1246 1225 1160 1094
112 1094 1070 1046 1169 1111 1124 1137 1214 1291 1281 1270 1260 1249 1193 1137 1155 1174 1135 1095 1056 1016 1080 1145 1134 1123 1171 1220 1223 1226 1186 1145 1150 1154 1171 1187 1193 1198 1278
106A278j00L4L5J13o8p1p1m0m0NNlkO1O1K6j55rql4l4l4l3P9P9NMK6K5j9j9RQN4N4l1l1J5
101A174J4m9m9mmL8L8L9L8M6M6n9n9k2k2k1k2k0k0N5N5k2k2k3k2l1l1P4P4k0k0k0k0n8n9M8
95A040M7L3L3P8P8m9m9N7N6j3j3n8n8O6O5rrRJ0l6l6J4J4o1o1j8j8K8K7l2l2J3J3O2O2J7J6
90A286q5q6j1j1L5L5m0m0N6N7N6N6m5m5%%LMLMl9l9OPm3m3N3N2L8j13p8J1N1N0N6N6o1o0o1
84A075o0L9L9L9L9O4O5m1m1k2k2j7j6m7M4J58Qp7J3m6m7Q4Q5RRL6L6L6L6o2o2o2o2k6k6J09
78A287J09POo8o9o2o1j7j7k9k9J06J06K6K5K5K6o7o6L8L9l0l0j20L0L8n3m8M1O8k3m2m1K6
73A131K6K6K6j4j3O2O2r6r6RRL5L5L5L5j7j8j7j8m8m8K8K7J9J9k7k6N2N1OPmmQ1p0k8k7QR
67A227p4p3L2L1K3K3O9O8k2k2k2k2qqqqk4k4N1N1j0j0j0j0n0n1nnQ9Q8m6m7PPPPr0r0M6M5
$$ plain form
106 1278 1178 1212 1247 1360 1292 1221 1150 1110 1070 1075 1080 1077 1075 1136 1197 1223 1068 1059 1051 1017 983 949 916 995 1074 1079 1083 1109 1134 1115 1096 1105 1113 1167 1221 1190 1159 1174
101 1174 1188 1139 1090 1086 1082 1120 1158 1197 1235 1281 1327 1268 1209 1187 1165 1144 1122 1102 1082 1137 1192 1170 1148 1125 1103 1072 1041 1115 1189 1169 1149 1129 1109 1051 992 1040
95 1040 1087 1120 1153 1231 1309 1260 1211 1268 1324 1311 1298 1240 1182 1248 1313 1304 1295 1304 1314 1278 1242 1256 1270 1209 1148 1130 1112 1140 1167 1135 1103 1116 1129 1191 1253 1270 1286
90 1286 1201 1115 1104 1093 1128 1163 1123 1083 1139 1196 1252 1308 1263 1218 1218 1218 1221 1225 1228 1232 1193 1154 1160 1167 1124 1081 1134 1186 1224 1111 1033 1044 1095 1145 1201 1257 1196 1136 1075
84 1075 1015 1054 1093 1132 1171 1235 1300 1259 1218 1196 1174 1157 1141 1094 1138 1296 1304 1227 1240 1194 1147 1231 1316 1325 1334 1370 1406 1442 1478 1416 1354 1292 1230 1204 1178 1287
78 1287 1396 1403 1409 1341 1272 1210 1149 1132 1115 1086 1057 1163 1269 1295 1320 1345 1371 1304 1238 1276 1315 1285 1255 1135 1165 1203 1150 1102 1143 1211 1188 1146 1105 1131
73 1131 1157 1183 1209 1195 1182 1244 1306 1210 1114 1123 1132 1167 1202 1237 1272 1255 1237 1220 1202 1154 1106 1134 1161 1180 1199 1172 1146 1198 1249 1255 1262 1258 1254 1335 1265 1237 1210 1218 1227
67 1227 1153 1080 1112 1143 1166 1189 1258 1326 1304 1282 1260 1238 1230 1222 1214 1206 1182 1158 1209 1260 1250 1240 1230 1220 1170 1119 1114 1109 1198 1286 1240 1193 1200 1207 1214 1221 1131 1041 1087 1132
61A132O5O5j0j0M2M1J17J16P2P1K37K37M44M44M48K38Q5o4l95n46m23k73k32k32j71j72o6
57A260o7M6M7k9k8M2M3lkJ8J8k8k7MLMMJ5J4l0l0K1K1K1K2o6o7o6o6OOR6n4n0M0P1k0O4k6
51A227R3R4q2q2l7l7k9k9J5J6K0K1k5k5N3N2J57J58K3K3J39J40L01M81L14k27m54l65k04k5
46A706r9j00l2l2j45L5N9l0PQKKL0K9R3R3O4j16j40n1k5k5K6K6J4J5J4J5O4O3O4O4J7J7R2
41A824R2j9j9Q7Q6J84J84M9M9mlm9m9K6K7P1P2J4J5l6l6O9k1K2K03K93J13J63L44L21K31M47
36D750O28O84O84R28J108J257J076L41o81j674k093j666j245o97k76k61k61k31k31j28l8N6
33B030j24r2r2M5M4o1o0QPQQr6r6n1n1k3k3k8k9j2j02p7J02llO2O2j64j4R6R7MMLMn1n1o6
27A215Q5R6OqrK3K3k2k3j2j3j3j3J8J8J7J8M0M1l5l5k7k7P9P8J1J1l5l4l3l3M2M2K1K1K0K1
$$ plain form
61 1132 1197 1262 1252 1242 1284 1325 1442 1558 1630 1701 1938 2175 2619 3063 3511 3749 3834 3770 3375 2829 2406 2133 1901 1669 1498 1326 1260
57 1260 1193 1239 1286 1257 1229 1271 1314 1311 1309 1327 1345 1317 1290 1294 1297 1301 1305 1320 1334 1304 1274 1295 1316 1337 1359 1293 1226 1160 1094 1100 1106 1202 1148 1098 1138 1209 1189 1253 1227
51 1227 1320 1414 1332 1250 1213 1176 1147 1118 1133 1149 1169 1190 1165 1140 1193 1245 1402 1560 1583 1606 1745 1885 2186 2667 2981 2754 2300 1935 1731 1706
46 1706 1607 1507 1475 1443 1298 1333 1392 1362 1369 1377 1379 1381 1411 1440 1533 1626 1690 1574 1434 1383 1358 1333 1359 1385 1399 1414 1428 1443 1507 1570 1634 1698 1715 1732 1824
41 1824 1916 1897 1878 1965 2051 2235 2419 2468 2517 2513 2510 2461 2412 2438 2465 2536 2608 2622 2637 2601 2565 2634 2613 2635 2838 3131 3244 3407 3751 4072 4303 4750
36 4750 5378 6062 6746 7674 8782 10039 11115 11456 10775 9101 7008 5342 4097 3400 3124 2863 2602 2371 2140 2012 1974 2030
33 2030 1906 1814 1722 1767 1811 1750 1690 1698 1705 1713 1721 1625 1529 1478 1427 1404 1381 1353 1324 1312 1210 1133 1235 1232 1229 1291 1353 1189 1175 1271 1368 1372 1376 1379 1383 1332 1281 1215
27 1215 1300 1396 1402 1394 1385 1408 1431 1409 1386 1374 1361 1348 1335 1353 1371 1388 1406 1446 1487 1452 1417 1390 1363 1442 1520 1531 1542 1507 1473 1440 1407 1449 1491 1512 1533 1553 1574
21A574K1K0Q7Q6J1j38j06j5M0L9o1o0r4r3M2M1RQN3N4l5l5J9K0J5J66POq2q2o1Q9Q8Q8qqo
16A699opoK9K8K8K8L9M0l6l5O6O6qrL8L9ppllM2M2m2m3M2M2j6J33J24J24j6j6j6j6l7l7L8
10B321L8J01J00J00J00K7K7P8P8P8J68J6J96J29J29L5L5J15J15Q9K69J09J08P5K56J42L23
6E357K97K97K42N44K35K35L42P63P96J098J320K343L611N355M517J30l596l295j767j44N69
2A9249J591J912K933L692N194O553R378J2164J6551K1824L3903N6355J00043J60376J91926
0F43644O5099j29302j89295j40319q0271m6439k7574j8620j3609j1746r071o967m744l842
-2B6944k698k278j346j046J81J202L087L629L74m494n057l796k348j807r14p33m31q52p06
-5F911n25l03l03n7j46j37l18l26l27j63j62j8j08mj84q9q9q5q4q5q5n2n1r7r6m3m3KKo7o6
$$ plain form
21 1574 1595 1615 1702 1788 1799 1661 1555 1540 1580 1619 1558 1498 1404 1311 1353 1394 1403 1411 1464 1518 1483 1448 1467 1487 1502 1668 1675 1681 1599 1517 1456 1545 1633 1721 1713 1705 1699
16 1699 1693 1686 1680 1709 1737 1765 1793 1832 1872 1836 1801 1867 1933 1925 1916 1954 1993 1986 1979 1976 1973 2015 2057 2015 1972 2014 2056 2040 2173 2297 2421 2405 2389 2373 2357 2320 2283 2321
10 2321 2359 2460 2560 2660 2760 2787 2814 2892 2970 3048 3216 3232 3428 3557 3686 3721 3756 3871 3986 4075 4344 4453 4561 4636 4892 5034 5357
6 5357 5654 5951 6193 6737 6972 7207 7549 8312 9108 10206 11526 13869 17480 22835 27352 27482 23886 20591 18824 18680 19249
2 19249 20840 22752 25685 29377 34571 41124 50502 62666 79217 101041 134944 191299 291342 451718 643644
0 643644 708743 579441 390146 249827 169556 123117 95543 76923 63314 51568 42497 35530 30786 26944
-2 26944 24246 21968 20622 19576 19757 20959 24046 27675 28049 23555 18498 14702 12354 10547 9633 8900 8469 7617 6911
-5 6911 6386 6083 5780 5723 5577 5440 5122 4796 4469 4306 4144 4126 4018 4014 3830 3741 3652 3567 3483 3398 3313 3261 3210 3113 3017 2974 2931 2933 2935 2868 2802
-10B802LLNq6kj83r7pJ62j8p2j63p4J6Q1qpr7m2m3m2m3k8O1J12o8p4p3K0K0LLp2p1o0o0k0
-15A781k0Q4nJ46l4m8m8j4j4m7m8N7N8k9k9J6J7q8q7PON5j26k5k4nmM1M0P6P5o0o0k0k0K4
-21A628K5k0k0K4K5PQN2N3l1l1l2l1J4J4o1o1MNMNJ3J4l1l1K8K8K8K8k6k5k6k5m6m7N9N9M1
-27A622M0nnr1r2M4M4n4n4N2N1o1o0J4J5k9k8k9k8m1m1MMN0M9MMj7j6j7j6M1M0M1M1RJ0J0
-32A505J0r3r3m7m8M5M6%%Q9R0m6m6O2O1J6J6j9j9K5j24q5NP1j9k7k7M3M3j6j6j7j6K3K2k2
-38A392k3q3q4Q2Q2LMJ09J08P2P1l4l4j08j08L2L3j37m7J16l4Lq6j70M1J14K3j7j8K4K3K4
-43A373K3J5J5l0l0k4k5Q1Q1k7k7k8k7M6M5k9l0K7K7K7K6r1r1M8j02j08M3N3N4PPPPn3n3p
-48A230qM2M2M1M2M2M2q4q4q8O2P1p9o6Q3k4k3J18r3l4N6Q0p0M4J35n8n8l7J13N3l8p3p3r5
$$ plain form
-10 2802 2805 2808 2813 2727 2725 2542 2445 2438 2600 2582 2510 2347 2273 2289 2370 2362 2355 2258 2216 2173 2131 2088 2060 2121 2233 2165 2091 2018 2038 2058 2061 2064 1992 1921 1861 1801 1781
-15 1781 1761 1845 1840 1986 1952 1904 1856 1842 1828 1781 1733 1790 1848 1819 1790 1806 1823 1735 1648 1655 1661 1716 1590 1565 1541 1536 1532 1573 1613 1689 1764 1704 1644 1624 1604 1628
-21 1628 1653 1633 1613 1637 1662 1669 1677 1729 1782 1751 1720 1688 1657 1671 1685 1624 1563 1567 1572 1576 1581 1594 1608 1577 1546 1574 1602 1630 1658 1632 1607 1581 1556 1510 1463 1522 1581 1622
-27 1622 1662 1657 1652 1561 1469 1513 1557 1503 1449 1501 1552 1491 1431 1445 1460 1431 1403 1374 1346 1305 1264 1268 1272 1322 1371 1375 1379 1362 1346 1329 1313 1354 1394 1435 1476 1485 1495 1505
-32 1505 1515 1422 1329 1282 1234 1279 1325 1325 1325 1414 1504 1458 1412 1474 1535 1551 1567 1548 1529 1554 1430 1345 1350 1421 1402 1375 1348 1391 1434 1418 1402 1385 1369 1392 1414 1392
-38 1392 1369 1286 1202 1284 1366 1369 1373 1482 1590 1662 1733 1699 1665 1557 1449 1481 1514 1377 1330 1446 1412 1415 1329 1159 1200 1314 1337 1320 1302 1326 1349 1373
-43 1373 1396 1411 1426 1396 1366 1342 1317 1398 1479 1452 1425 1397 1370 1416 1461 1432 1402 1429 1456 1483 1509 1418 1327 1375 1273 1165 1208 1261 1315 1322 1329 1336 1343 1290 1237 1230
-48 1230 1222 1264 1306 1347 1389 1431 1473 1389 1305 1217 1279 1350 1271 1205 1288 1264 1241 1359 1266 1232 1288 1368 1298 1342 1477 1419 1361 1324 1437 1490 1452 1379 1306 1211
-53A211N5O6k4J0J0m7M4M6M7JR1J9J8q2q1M4M4n2L8j3j2kjo7K3k2k3l8N2Q2Q2RR8O5O4K3K93
-59B071L45L46L86N37L13j7k78m28m01m00l78k29j38m8o7o7p2J7kr2m2M9p2p1R0jk4k4o9p0
-64A164O4J53or7n8L1K6o4l3l3j29l9P9J68M9M8o9p0NNj4j4q9q9J06J06Q1qj1j2K8K8L6L6
-69A378j15k4r1jJ44oNNq0p9o4o5P1P1MNP9Q0j2j1j1j1L3L3m3m2%Jm5m5Q3Q3n2n3o8o8OPK0
-75A122K0K0K0j8j8j7j8Q4Q4L8L9k0k0nr6k4J25j0j0K1K0K0K0l3l3p9p8J9J8O4O3q0q0K5K6
-80A209KKKKk8k8J7J7K9K8K9K8J9J8k7k7k1k0J4J5J3j37j03j3pojjN8N9J3J3PPJKN0m0p4P6
-86A197O2O2nr4q8O3M8M7K4K3n1n2pqppJ0J1l5l4M5M5r0q9k7k6M9M9P6P6k9k9j5j4j4j5kk
-92A147M3M3O1O2j4j4jjp5p6m5m5L0L1M4M4l0l1opook2k1Q4Q3K2K1K1K2j8j8j8j8mlM1M2m4
$$ plain form
-53 1211 1266 1332 1308 1318 1328 1281 1325 1371 1418 1419 1510 1529 1547 1465 1384 1428 1472 1420 1458 1445 1433 1431 1430 1363 1386 1364 1341 1303 1355 1437 1519 1528 1626 1691 1755 1778 2071
-59 2071 2416 2762 3148 3685 3998 3981 3703 3275 2874 2474 2096 1867 1729 1681 1614 1547 1475 1492 1490 1398 1356 1405 1333 1262 1352 1351 1327 1303 1234 1164
-64 1164 1228 1381 1375 1278 1220 1251 1277 1213 1180 1147 1018 979 1058 1226 1275 1323 1254 1184 1189 1194 1180 1166 1077 988 1094 1200 1281 1273 1262 1250 1278 1306 1342 1378
-69 1378 1263 1239 1148 1147 1291 1285 1290 1295 1215 1136 1072 1007 1078 1149 1153 1158 1237 1317 1305 1294 1283 1272 1305 1338 1295 1253 1253 1254 1209 1164 1247 1330 1278 1225 1157 1089 1095 1102 1122
-75 1122 1142 1162 1182 1164 1146 1129 1111 1195 1279 1317 1356 1336 1316 1311 1215 1191 1316 1306 1296 1317 1337 1357 1377 1344 1311 1232 1154 1173 1191 1255 1318 1238 1158 1183 1209
-80 1209 1211 1213 1215 1217 1189 1161 1178 1195 1224 1252 1281 1309 1328 1346 1319 1292 1271 1251 1265 1280 1293 1156 1053 1040 1033 1027 1026 1025 1083 1142 1155 1168 1175 1182 1183 1185 1235 1195 1121 1197
-86 1197 1259 1321 1316 1222 1134 1197 1245 1292 1316 1339 1288 1236 1229 1221 1214 1207 1217 1228 1193 1159 1204 1249 1159 1070 1043 1017 1066 1115 1191 1267 1238 1209 1194 1180 1166 1151 1149 1147
-92 1147 1190 1233 1294 1356 1342 1328 1327 1326 1251 1175 1130 1085 1115 1146 1190 1234 1204 1173 1167 1160 1154 1148 1126 1105 1189 1272 1294 1315 1336 1358 1340 1322 1304 1286 1282 1279 1320 1362 1318
-98A318m4j49j49O6O6K1K1KJKJk6k6K0J9NNNNNNNNJ6J7J6J6k2k3k2k2L7L7rqm0l9m0m0K6K6
-104A109P1P1j6j6j6j7JJP5P6n7n6n7n6M9M9N0M9POOPr4r3J2J2N1N1n4n4J3J2N8N8mllmk7
-110A267k6k7k7M5M6M5M6m9n0m9n0l0l0P5P4O9O8N3r7r0%j4j5k6k5k5k5M9M9LMpon2n2L1L2
-116A184m4m4o5o5J1J0R1R1j4j5L7L6l9l9M3M3o3o2P6P7q9q9l2l2J2J3J01J01N6N6o3o2J3
-121A234J3k1k1k1k1K1K0o9Q0O0l0m6m5M3M3kkqqn3n2L2L2j2j3LMLLN9N9m7m6j1j0j1j1m5
-127A104m6%jNNNNJ3J4l2l2n0n0N6N5O0O1J5J5popoK0J9n5n5LLLLJ31J30l4l5NNNNm5m4J%
-133A241l7l8L7L7q1q1P2P3N5j24j25N6N3N3P5P6j47L3PPJ7J7J7J7o9o8M8M8j01P9K4K3l9
-138A255l9OPl8l8L7L7J8J8q7q7j3j4L1L1K5K5k1k0O3O4O3O4m1m1m1m0k0j9j9j9K5K5k0k1
$$ plain form
-98 1318 1274 1125 976 1042 1108 1129 1150 1152 1153 1155 1156 1130 1104 1124 1143 1148 1153 1158 1163 1168 1173 1178 1183 1199 1216 1232 1248 1226 1203 1181 1159 1196 1233 1224 1216 1176 1137 1097 1057 1083 1109
-104 1109 1180 1251 1235 1219 1203 1186 1187 1188 1263 1339 1282 1226 1169 1113 1162 1211 1261 1310 1317 1323 1329 1336 1242 1149 1161 1173 1224 1275 1221 1167 1180 1192 1250 1308 1304 1301 1298 1294 1267
-110 1267 1241 1214 1187 1232 1278 1323 1369 1320 1270 1221 1171 1141 1111 1186 1260 1329 1397 1450 1353 1263 1263 1249 1234 1208 1183 1158 1133 1182 1231 1234 1238 1231 1225 1173 1121 1152 1184
-116 1184 1140 1096 1031 966 977 987 1078 1169 1155 1140 1177 1213 1174 1135 1178 1221 1158 1096 1172 1249 1160 1071 1039 1007 1019 1032 1133 1234 1290 1346 1283 1221 1234
-121 1234 1247 1226 1205 1184 1163 1184 1204 1135 1215 1275 1245 1199 1154 1197 1240 1238 1236 1228 1220 1167 1115 1147 1179 1167 1154 1157 1161 1164 1167 1226 1285 1238 1192 1181 1171 1160 1149 1104
-127 1104 1058 1058 1057 1062 1067 1072 1077 1090 1104 1072 1040 990 940 996 1051 1111 1172 1187 1202 1195 1189 1182 1176 1196 1215 1160 1105 1108 1111 1114 1117 1248 1378 1344 1309 1314 1319 1324 1329 1284 1240 1241 1241
-133 1241 1204 1166 1203 1240 1159 1078 1150 1223 1278 1154 1029 1085 1138 1191 1266 1342 1195 1228 1235 1242 1259 1276 1293 1310 1241 1173 1221 1269 1168 1247 1271 1294 1255
-138 1255 1216 1222 1229 1191 1153 1190 1227 1245 1263 1176 1089 1076 1062 1093 1124 1149 1174 1153 1133 1196 1260 1323 1387 1346 1305 1264 1224 1204 1185 1166 1147 1172 1197 1177 1156
-144A156ONONo5o5P1P0r6r5L9M0O3O3j2j2jjkjo5o5M0M0KKLKL8L7L8L8o2o3j7j7L4L4j0j1
-150A172l9l8POR1R1m4m4j3j3L2L2o4o4j9j9POQ2Q2k3k2k3k2p6p6K9K9J4J4J4J4O0O1P0q1
-155A233n8n8o7o7M9N0n6L5J11m0p5J4k8k9K3K2P5P4L0L0r7r6L8L9QRQRj8j8j08M2J36M6k9
-161A237k9l8l8PPl1l2l1l1l4l3O2O3Q5o6K0J9llm7m8K9L0k2k1N2l7p1P9K9K9pj56o2K9J4
-166I51J3L9L9L9L9NOm0m0J2J3p7P2Q1j0k5j15m9J01J04m5j20L0J1J2J4J4N9O0J5J6l0k9m7
-171A118m8m7m7J05J06L0L0k4k4k4k4PPN7r4n8R2l9N1J53Kk13j24O3O4K3K4J0J1Q5Q6j51j51
-176A056J4J5O1O2j3j3l6l6M0L9n3n3Q2Q2M6M7n9n9n1n0onrqrqqpq3q2O4O4J8J9j3j4M7m4
-182A037o2Q8R4LJ6J6J0J0l9l9l9l9N1N0NNooopp1p1J24J24l4l5L5L5P1j9p3p3J1J1rj60o6
$$ plain form
-144 1156 1162 1167 1173 1178 1113 1048 1119 1189 1093 998 1037 1077 1140 1203 1191 1179 1178 1177 1175 1174 1109 1044 1084 1124 1126 1128 1131 1133 1171 1208 1246 1284 1222 1159 1142 1125 1159 1193 1183 1172
-150 1172 1133 1095 1102 1108 1199 1290 1246 1202 1189 1176 1208 1240 1176 1112 1093 1074 1081 1087 1169 1251 1228 1206 1183 1161 1085 1009 1038 1067 1081 1095 1109 1123 1183 1244 1314 1233
-155 1233 1175 1117 1050 983 1032 1082 1026 1061 1172 1132 1057 1071 1043 1014 1037 1059 1134 1208 1238 1268 1171 1075 1113 1152 1160 1169 1177 1186 1168 1150 1042 1084 1220 1266 1237
-161 1237 1208 1170 1132 1139 1146 1115 1083 1052 1021 987 954 1016 1079 1164 1098 1118 1137 1134 1131 1084 1036 1065 1095 1073 1052 1104 1067 996 1075 1104 1133 1126 970 908 937 951
-166 951 964 1003 1042 1081 1120 1125 1131 1091 1051 1063 1076 999 1071 1152 1142 1117 1002 953 1054 1158 1113 993 1023 1034 1046 1060 1074 1133 1193 1208 1224 1194 1165 1118
-171 1118 1070 1023 976 1081 1187 1217 1247 1223 1199 1175 1151 1158 1165 1222 1128 1070 1162 1123 1174 1327 1329 1116 992 1055 1119 1142 1166 1176 1187 1272 1358 1207 1056
-176 1056 1070 1085 1146 1208 1195 1182 1146 1110 1150 1189 1136 1083 1165 1247 1293 1340 1281 1222 1171 1121 1115 1110 1101 1093 1084 1076 1068 1061 978 896 960 1024 1042 1061 1048 1034 1081 1037
-182 1037 975 1063 1157 1160 1176 1192 1202 1212 1173 1134 1095 1056 1107 1157 1162 1167 1161 1155 1149 1142 1071 1000 1124 1248 1214 1179 1214 1249 1320 1301 1228 1155 1166 1177 1168 1008 942
-188I42o5R0R0POk2k2J04J5p1p0N4N3L1L2L6L6o9o9k0k1K5K5K2K2k2k3n9n8K1J10J03J2j2
-193A233j2n7j47p2J8N9N9K0K0M3M4o1o1Q0Q0o1o0K5o5m2M7M1M1q9q9l4l4J01J01L0L0j0r
-198A169j2P8m2m2l7N2L0o0j2j2n3n3l3J17K6K7P3j7l9N0q7q7ooO1O1O6k3m5m5n9R0N7N7o3
-203A181o3n5L6m4M7LLM3m8q6MK2K3k2k1N1l8j02j02Q8Q8j1j1L4L4O5O4K0J9%j%%p7p6kjJ9
-209A084J9J9J9J8J7n8n8Q8Q8m8m7j1j1O4O4l0l1l1l0m1m2R5R4JJm4m3r0q9J6J06R1o0j04
-214A016j05m2m2R2R3K8K8K8K8P9P9k7O4K5j25l4l5j%j%K1K1q4q4QRQRlkllN1N2k4k4K6K6
-220A152j9j9l2l2N3N3k8J23M9m1q9Kj0Q1O3q8p2p3J8J8J8J7J3J3J3J3j2j2j2j2M4M4l0l1
-225A175o7o7k2k2L1L1L1L0j9k0k0k0j6j7o2o2P0P1P0P0klllk1k0o6o6O3O3lkMJ54J6p5J8
$$ plain form
-188 942 877 967 1057 1064 1070 1048 1026 1130 1145 1074 1004 1058 1111 1142 1174 1210 1246 1177 1108 1088 1067 1092 1117 1139 1161 1139 1116 1057 999 1020 1130 1233 1245 1233
-193 1233 1221 1164 1017 945 963 1022 1081 1101 1121 1164 1208 1147 1086 1166 1246 1185 1125 1150 1085 1043 1090 1131 1172 1083 994 960 926 1027 1128 1158 1188 1178 1169
-198 1169 1157 1235 1193 1151 1114 1166 1196 1136 1124 1112 1059 1006 973 1090 1116 1143 1216 1199 1160 1210 1123 1036 1030 1024 1085 1146 1212 1189 1144 1099 1040 1130 1187 1244 1181
-203 1181 1118 1063 1099 1055 1102 1105 1108 1151 1103 1017 1021 1043 1066 1044 1023 1074 1036 934 832 920 1008 997 986 1020 1054 1119 1183 1203 1222 1222 1221 1221 1221 1144 1068 1066 1065 1084
-209 1084 1103 1122 1141 1159 1176 1118 1060 1148 1236 1188 1141 1130 1119 1183 1247 1217 1186 1155 1125 1084 1042 1137 1231 1232 1233 1189 1146 1056 967 983 1089 1180 1120 1016
-214 1016 911 869 827 919 1012 1040 1068 1096 1124 1203 1282 1255 1319 1344 1219 1185 1150 1149 1149 1148 1148 1169 1190 1106 1022 1030 1039 1047 1056 1053 1051 1048 1045 1096 1148 1124 1100 1126 1152
-220 1152 1133 1114 1082 1050 1103 1156 1128 1251 1300 1259 1170 1172 1162 1243 1306 1218 1146 1073 1091 1109 1127 1144 1157 1170 1183 1196 1184 1172 1160 1148 1192 1236 1206 1175
-225 1175 1108 1041 1019 997 1028 1059 1090 1120 1101 1081 1061 1041 1025 1008 946 884 954 1025 1095 1165 1163 1160 1157 1154 1133 1113 1047 981 1044 1107 1104 1102 1106 1260 1276 1201 1219
-231A219J7J2J2m4m3m4m4QQq2O8N1l9KJ53M6j04j39J0P9Q0p7p7M2M1r3r4J9J9R4R4J4J3r2
-236A129r1l0l0J05J06l7l6l6l7M7M6n8n9M1M1M0M1l8l7PPn2n2opM0M1Q5Q6k5k4p0o9NONN
-242A089ONm0l9J2J3J2J3K4K5n1n0M5M5k9l0K5K4n0n1L7L6rqJ4J4o2o1P0O9L4L3j54mM7M7
-247A101k8k7M8M8mlmmo9p0OOk0j9k9J21L4L4kkk4k4k4k5K4K3J4J4R9n2j23l3j5j6J59n1k0
-253A043P0OOKKJ07J07o0n9J6J6o0o0noj64j3L7L7N4N3N4N4p7p8kljjjkO2O2p4p3mlP1P2l5
-259A150l6P0P0p0p0k5k5n7n7M8M9j14j14K2K1O0O0O0O0rj0q5q5%%M5M4JJ%Jj2j3j2j3LLJ08
-265A069J08R9R8m4k24r0R0K8o2POmnK8o2j13O8P0P0OPJ%JJj6j6o2o1JJJJL0L1L1L1O3O3j3
-271A238j2m8m8lln2n3n2n3N9N8J3J3J7J7J7J7n8n7P8P7KKj03j03K6K7P1P2r3r2j8j7m0m0
$$ plain form
-231 1219 1236 1248 1260 1216 1173 1129 1085 1093 1101 1019 1087 1138 1099 1101 1254 1300 1196 1057 1067 1146 1226 1149 1072 1114 1155 1062 968 987 1006 1100 1194 1208 1221 1129
-236 1129 1038 1008 978 1083 1189 1152 1116 1080 1043 1090 1136 1078 1019 1060 1101 1141 1182 1144 1107 1114 1121 1069 1017 1011 1004 1044 1085 1170 1256 1231 1207 1137 1068 1073 1079 1084 1089
-242 1089 1095 1100 1060 1021 1033 1046 1058 1071 1095 1120 1069 1019 1064 1109 1080 1050 1075 1099 1049 998 1035 1071 1062 1054 1068 1082 1020 959 1029 1098 1132 1165 1011 1007 1054 1101
-247 1101 1073 1046 1094 1142 1138 1135 1131 1127 1058 988 994 1000 980 961 932 1053 1087 1121 1119 1117 1093 1069 1045 1020 1044 1067 1081 1095 1194 1142 1019 986 971 955 1114 1063 1043
-253 1043 1113 1119 1125 1127 1129 1236 1343 1283 1224 1240 1256 1196 1136 1131 1125 961 948 985 1022 1076 1129 1183 1237 1160 1082 1080 1077 1076 1075 1074 1072 1134 1196 1122 1049 1045 1042 1113 1185 1150
-259 1150 1114 1184 1254 1184 1114 1089 1064 1007 950 998 1047 933 819 841 862 922 982 1042 1102 1093 1083 998 913 913 913 958 1002 1003 1004 1004 1005 993 980 968 955 958 961 1069
-265 1069 1177 1276 1374 1330 1106 1016 1106 1134 1072 1079 1085 1081 1076 1104 1042 929 997 1067 1137 1143 1150 1151 1151 1152 1153 1137 1121 1059 998 999 1000 1001 1002 1032 1063 1094 1125 1188 1251 1238
-271 1238 1226 1178 1130 1127 1124 1072 1019 967 914 973 1031 1044 1057 1074 1091 1108 1125 1067 1010 1088 1165 1167 1169 1066 963 989 1016 1087 1159 1066 974 956 939 899 859
-276H59NNj3j2O2O3%J%JopopL6L6m0l9N5N5N5N5k4k5Q0Q1q2q2K4K4k2k1k9J51M9j31K7K6k3
-282A181k3k3k4m9m9mmj1j1L4L5l0l0J5J06R9n0r6r5k4k3N2N2K3K4k2k1O4O4J9J8j5j5j5j5
-288A137j7j7j7j7j7j6j6j6o5o5J30J30N8N8m7m7l0l0M6M5P8P7n8n8p9p9nmK7K6j8j8MMr0
-293I94O1J19l0p2p2L4L5j1j1L6L6rqp3p3LLJ09J10MNn8n9j3P7O9q2o7o6L5L5L5L6j%j%o8
-299A062o7R8R8n0m9K5K6m3m3O2O2M4M3o2o1k9k8J7J6qrj4j5M8m2j51%O2O2lmM6M5J08p3j26
-304A047l6L7L7J2J3J2J2k7k7k2k1j07j6J69j1J16J16j21j20j4j3L2L2l0l0J05J05m1m1p5
-309A093p5o8J12O7k3%R0j4j05o8K2o9o8o0J21O4O4mmM1M0LKKLk6k6k6k6m4m5JJL2L3J28n1
-315A117L5n4j10k1RRl1l1K7K7p9p8J2J1J2J2J7J8K3K3m8M3J63j8L9n1o3K8J2J1O3O2q0q0
$$ plain form
-276 859 864 869 856 844 906 969 969 970 970 971 965 958 952 945 981 1017 977 938 993 1048 1103 1158 1134 1109 1189 1270 1188 1106 1130 1154 1132 1111 1082 1233 1282 1151 1178 1204 1181
-282 1181 1158 1135 1111 1062 1013 1009 1005 994 983 1017 1052 1022 992 1007 1113 1212 1162 1066 971 947 924 976 1028 1051 1075 1053 1032 1096 1160 1179 1197 1182 1167 1152 1137
-288 1137 1120 1103 1086 1069 1052 1036 1020 1004 939 874 1004 1134 1192 1250 1203 1156 1126 1096 1142 1187 1265 1342 1284 1226 1147 1068 1063 1059 1086 1112 1094 1076 1080 1084 994
-293 994 1055 1174 1144 1072 1000 1034 1069 1058 1047 1083 1119 1110 1102 1029 956 959 962 1071 1181 1185 1190 1132 1073 1060 1137 1206 1124 1057 991 1026 1061 1096 1132 1131 1131 1130 1130 1062
-299 1062 995 1093 1191 1141 1092 1117 1143 1100 1057 1119 1181 1225 1268 1206 1145 1116 1088 1105 1121 1113 1104 1090 1075 1123 1081 930 930 992 1054 1051 1047 1093 1138 1246 1173 1047
-304 1047 1011 1048 1085 1097 1110 1122 1134 1107 1080 1058 1037 930 914 1083 1072 1188 1304 1183 1063 1049 1036 1068 1100 1070 1040 1145 1250 1209 1168 1093
-309 1093 1018 950 1062 1129 1106 1106 1196 1182 1077 1009 1031 962 894 834 955 1019 1083 1079 1075 1116 1156 1159 1161 1163 1166 1140 1114 1088 1062 1018 973 974 975 1007 1040 1168 1117
-315 1117 1152 1098 988 967 976 985 954 923 950 977 898 820 832 843 855 867 884 902 925 948 900 943 1106 1088 1127 1076 1013 1041 1053 1064 1127 1189 1109 1029
-320A029nmK2K2K3K2LLM8M8l1l1l0l1m9n0QPn7J24J23n6mlL0L1QPP0j10p1K0m3m2L5L4L5L5
-325A170rrq4q4K5K5K5K5MMM9M9j08j08Q7Q8N7N6j08j09l4l5L0K9P1j10p0K0J32m8m9M2J13
-331A136o6j37M4M1M0OPN8N8j7j6k2k1k2k1K5K5k0k0Q1Q2n4n4K9K8K9K8m2m1LLj5j5Kq8j07
-336I47P4M1M2J9K0k6k6MLMLP9P9j17j16m3m2N1N2J13o7o2K9j6j6R2q9m5m6P9P8l7l7QQj5
-342A025j5N9O0RRl6l6j9k0o4o5lmM2M2MNMNK7K7K7K7K8K9p1p1l1O0M8j02k4k3M2M2k8k8J7
-347I98J7K8K7K7K8K3K4n1n2KKKKN0N0k5k5j17j17M9M8PPM3M3Q3o7j08j8K4K5J20l1j38m8
-353I32N7N7j7j6N9N9ppppn1n1n1n2K3K2K2K3m4m3L1L2O5O4j0j1l2l2p8p7O0O0O9P0r1O0K6
-358A107o4k7k8p8p8P3P3kkJ9J9k6k6J0J1N6N5%%J%o4o4j8j9L2L2L1L2p1p1NMJ22J21J6J6
$$ plain form
-320 1029 1024 1020 1042 1064 1087 1109 1112 1115 1163 1211 1180 1149 1119 1088 1039 989 997 1004 947 1071 1194 1138 1134 1131 1161 1192 1200 1207 1277 1167 1096 1116 1073 1031 1066 1100 1135 1170
-325 1170 1161 1152 1068 984 1009 1034 1059 1084 1088 1092 1141 1190 1082 974 1061 1149 1206 1262 1154 1045 1011 976 1006 1035 1106 996 926 946 1078 1030 981 1023 1136
-331 1136 1070 933 977 1018 1058 1064 1071 1129 1187 1170 1154 1132 1111 1089 1068 1093 1118 1098 1078 1159 1241 1187 1133 1162 1190 1219 1247 1205 1164 1167 1170 1155 1140 1142 1054 947
-336 947 1021 1062 1104 1123 1143 1117 1091 1095 1098 1102 1105 1184 1263 1146 1030 987 945 996 1048 1161 1094 1032 1061 1045 1029 1121 1032 987 941 1020 1098 1061 1024 1032 1040 1025
-342 1025 1010 1069 1129 1138 1147 1111 1075 1056 1036 972 907 904 900 942 984 988 993 997 1002 1029 1056 1083 1110 1138 1167 1096 1025 994 1054 1102 1000 976 953 995 1037 1009 981 998
-347 998 1015 1043 1070 1097 1125 1148 1172 1121 1069 1071 1073 1075 1077 1127 1177 1152 1127 1010 893 942 990 997 1004 1047 1090 1173 1106 998 980 1004 1029 1149 1118 980 932
-353 932 989 1046 1029 1013 1072 1131 1124 1117 1110 1103 1052 1001 950 898 921 943 965 988 944 901 932 964 1029 1093 1083 1072 1040 1008 930 853 913 973 1042 1112 1021 1081 1107
-358 1107 1043 1016 988 910 832 905 978 976 974 993 1012 986 960 970 981 1037 1092 1092 1092 1093 1093 1029 965 947 928 960 992 1023 1055 984 913 918 922 1044 1165 1181 1197
-364A197r4r5J0J1N1N1n4n4N5N6N0N0L8n3j62j1KLl3l3N2N2k4k3j1j1j2j1J03J03N2r9j12
-369A044j12p7p6NOQ0Q1Q3Q4QQk0k1k0k1noJ00R9l8l8k9k9m4J06K2K1n7n7M7M8p0p1k5k6J7
-374A017J7J6J7P9P9k7k6k2k3k2k3J5J6J5J5j1j1L4L4M7M7j18k8M6j04o4K5M9M8QRm0m0m1
-380A033m0J1J0J0J1L3L3j2j2n1n1noJ4J3N9N8m4m5O0O1mmm9m8O9P0onn7n6j1j1l8l9l8l8
-385H75K1K2O6O7j2j2j3j2m4m4J22J21o2o3J3J2ooooL1L1L2L1P0P0o4o5m6m7m6m6jjJ04J04
-391A190o3o3j19O1j7j6onN7N8j8j7N6N6p9p9p7p7N8N8L4L4m2m1O9O8J3J2J6j63o3o2N5N5
-396I43N5N5k7k8k7k7J00R9N5N4l7l7l7l7Q7Q7p8p9k6k6k6k6j2j2O3O3J6J5o0o0K4K4k2k1
-401A035J0J0J1J0o8o7k3k3l0l1P4P5l9l8O7O7j9j9K6K7k4k3k4k3l4l3J1J2J9K0N4N4L8j42
$$ plain form
-364 1197 1103 1008 1018 1029 1080 1131 1077 1023 1078 1134 1184 1234 1272 1219 1057 1046 1048 1051 1018 985 1037 1089 1065 1042 1031 1020 1008 997 1100 1203 1255 1156 1044
-369 1044 932 855 779 784 790 870 951 1034 1118 1126 1134 1114 1093 1073 1052 1047 1041 1141 1240 1202 1164 1135 1106 1062 1168 1190 1211 1154 1097 1144 1192 1122 1051 1026 1000 1017
-374 1017 1034 1050 1067 1146 1225 1198 1172 1150 1127 1105 1082 1097 1113 1128 1143 1132 1121 1155 1189 1236 1283 1165 1137 1183 1079 1015 1040 1089 1137 1145 1154 1114 1074 1033
-380 1033 993 1004 1014 1024 1035 1068 1101 1089 1077 1026 975 970 964 978 991 1050 1108 1064 1019 1079 1140 1136 1132 1083 1035 1104 1174 1168 1163 1106 1050 1039 1028 990 951 913 875
-385 875 896 918 984 1051 1039 1027 1014 1002 958 914 1036 1157 1095 1032 1045 1057 1051 1045 1039 1033 1064 1095 1127 1158 1228 1298 1234 1169 1123 1076 1030 984 983 982 1086 1190
-391 1190 1127 1064 945 1006 989 973 967 962 1019 1077 1059 1042 1098 1154 1075 996 919 842 900 958 992 1026 984 943 1012 1080 1093 1105 1121 958 895 833 888 943
-396 943 998 1053 1026 998 971 944 1044 1143 1198 1252 1215 1178 1141 1104 1191 1278 1200 1121 1095 1069 1043 1017 1005 993 1056 1119 1135 1150 1090 1030 1054 1078 1056 1035
-401 1035 1045 1055 1066 1076 1008 941 918 895 865 834 908 983 944 906 973 1040 1021 1002 1028 1055 1031 1008 984 961 927 894 905 917 936 956 1010 1064 1102 960
-406I60m6M4K0K0P1P1QQQPl8l8k7k8o7J12O2k9K4K4k6k7p6p6K8K9q2q2N3N4O0O1m4m5O4O3
-412A120m1m2%j%%k6k5M9M9J2J2l4l3M3M2J39m2r6j85j18O2J35M5j8j7o9J11K1o9p0K1K6o5
-417I36m9J32J71rq4q3k0k0MLJ85Ol7N3rrN1N1n5n4k9k9o3o3J5J96L0j49k6k6QPl1l2J4J3
-423I98N2N2k3k3J1J0J1J0K9L0m6m6j7j6j6j6J4J5O0N9J2J1l4l4K6K7P1P1r7r8L7L8l0l0J5
-428A133J5l5l5M1M0K5K5n1n0k7k7k8k7J7J8NOO7j14j3j2N0N1N0N1j5j5r0r0L4L4L4L5J5J5
-433A132o0o0L6L6L6L6m7m7K8K7m9m9Q7Q6j0j1j0j0q0q1o9o9n3J28K7K6klklM9M8m5m5j14
-439H63O6P0P1q3q2K3K3O4O3m7J32N3r7j22l1l8N3m3m3R0%N0N0J6J5qr9j4j3%R0N2l8n6n7
-444I73O2O2j04j03NMN5l5OOM6M5p6p7L8L8n0J01J6J7L5L5j0j0l2l1l2l1K4K5P6j5M6M7nm
$$ plain form
-406 960 914 958 978 998 1069 1140 1148 1156 1164 1171 1133 1095 1068 1040 973 1085 1147 1118 1142 1166 1140 1113 1037 961 989 1018 936 854 907 961 1021 1082 1038 993 1057 1120
-412 1120 1079 1037 1037 1036 1036 1036 1010 985 1034 1083 1095 1107 1073 1040 1083 1125 1264 1222 1126 941 823 885 1020 1065 1047 1030 961 1072 1093 1024 954 975 1001 936
-417 936 887 1019 1190 1181 1097 1014 994 974 978 981 1166 1172 1135 1188 1179 1170 1221 1272 1217 1163 1134 1105 1042 979 994 1190 1220 1071 1045 1019 1027 1034 1003 971 985 998
-423 998 1050 1102 1079 1056 1067 1077 1088 1098 1127 1157 1111 1065 1048 1032 1016 1000 1014 1029 1089 1148 1160 1171 1137 1103 1129 1156 1227 1298 1201 1103 1140 1178 1148 1118 1133
-428 1133 1148 1113 1078 1119 1159 1184 1209 1158 1108 1081 1054 1026 999 1016 1034 1039 1045 1112 998 985 973 1023 1074 1124 1175 1160 1145 1055 965 999 1033 1067 1102 1117 1132
-433 1132 1072 1012 1048 1084 1120 1156 1109 1062 1090 1117 1068 1019 1106 1192 1182 1171 1161 1151 1071 990 921 852 799 927 954 980 978 975 973 970 1019 1067 1022 977 863
-439 863 929 999 1070 987 905 928 951 1015 1078 1031 1163 1216 1119 997 966 928 981 938 895 985 985 1035 1085 1101 1116 1108 1009 995 982 982 1072 1124 1086 1030 973
-444 973 1035 1097 993 890 895 899 954 919 925 931 977 1022 946 869 907 945 895 996 1012 1029 1064 1099 1089 1079 1047 1016 984 953 977 1002 1078 1063 1109 1156 1151 1147
-449A147K3K3n8n8N4l6k4k5j28l8M3m7n4L6L1L1J2J03QPm2m2m2m2J3J2N8N8J7J7J7J8l3l2
-455A027l9l8P2j9k4O5N4l7p6J5J4J4K0J9o0o1j6j6M1M0R2Jm9m9n5n5N3N3Mq6K4J14J9J8p8
-460A001J3PPl6l5M0L9J1J1J0J1n0n1nnN2N3N8l2l6l7o1J49or7l3l2j4j3Q3qO6O6m1M9N4l7
-466A151q5q5J0J0J0J0M6M5k9k9K8K8P9j1j9j8L2n8n4L6N5N5PPr4mO2k8n2n2L4n6M0L9m4m4
-471A022L2L1n6n6j1j1J9K0P0k0o4o4J1J1qQ2L7n3L0L0K5K5k0k0o4o5k1k2k1k1Q0Q1J%Q3q
-477A085L8L8N1m0j48j48l5N6N0N0jkJ4J04R8n2r7r7KJJ07J06n5n6J9J9j3j4j3j3J3J4J4J4
-482A109kkkjRRJ0Rm7m6m7m7J5J4J4J4L8L7o8o8L4L3m1m2K2K1K2K1Q1Q1k5k4J2J2r2r3P8P8
-488A126LLo0n9P5P6j8j7o3o2qppqK3K3K2K3M0L9l5l5o5o4j9P0J28k3l8l8n1n1K4K4N5N5k1
$$ plain form
-449 1147 1170 1193 1135 1077 1131 1095 1071 1046 918 880 923 876 822 858 889 920 932 1035 1043 1050 1008 966 924 882 895 907 965 1023 1040 1057 1074 1092 1059 1027
-455 1027 988 950 1022 1003 979 1044 1098 1061 985 1000 1014 1028 1048 1067 1007 946 930 914 955 995 1087 1088 1039 990 935 880 933 986 990 904 928 1042 1061 1079 1001
-460 1001 1014 1021 1028 992 957 997 1036 1047 1058 1068 1079 1029 978 973 968 1020 1073 1131 1099 1063 1026 965 1114 1108 1011 978 946 932 919 1002 994 1060 1126 1085 1134 1188 1151
-466 1151 1066 981 991 1001 1011 1021 1067 1112 1083 1054 1082 1110 1189 1178 1159 1141 1173 1115 1061 1097 1152 1207 1214 1221 1127 1123 1185 1157 1105 1053 1087 1031 1071 1110 1066 1022
-471 1022 1054 1085 1029 973 962 951 970 990 1060 1040 976 912 923 934 926 1008 1045 992 1022 1052 1077 1102 1082 1062 998 933 912 890 869 848 928 1009 1010 1010 1093 1085
-477 1085 1123 1161 1212 1172 1024 876 841 897 947 997 996 994 1008 1112 1210 1158 1061 964 966 967 1074 1180 1125 1069 1088 1107 1094 1080 1067 1054 1067 1081 1095 1109
-482 1109 1107 1105 1103 1102 1111 1120 1130 1139 1092 1046 999 952 967 981 995 1009 1047 1084 1016 948 982 1015 974 932 954 975 997 1018 1099 1180 1155 1131 1143 1155 1063 970 1048 1126
-488 1126 1129 1132 1072 1013 1088 1164 1146 1129 1066 1004 996 989 982 974 997 1020 1042 1065 1105 1144 1109 1074 1009 945 926 996 1124 1101 1063 1025 974 923 947 971 1026 1081 1060
-493A060k0k6k6k6k6RRq2O9J06J6KJo1o1M5M4PPj29j28k3k3K1K2Q2Q1Q1Q1J6J6n8n9j9k0K0
-499A008K0N2l9O3k8J3J3l8l8k5k6j0P9J05m5o0o1N7N6N7N6l9m0n2n3J54n6r4mk3k2j7j7K6
-504I72K7L8n3n8L1J04m5j1j1K5K5k3k3K8o2m2m2n8L1N8l2k7O3Q6Q5M1m8l4N6n1n1M7m3j61
-509H42M9R1KJ4J4O0l0J4J5N9l0l0l1L8n2kkK2K2j7j8%R0m1m1M9m1M8M9K3o7o1o1L0L1n0n0
-515I38J8p2lQ8P6j4q3OO4O3l6l6rrmlQR9K3o7r4r4O6O6PQQ2Q3k6k7p1p1N3N3k2k2K2K2n3
-521A029n3RRJ0RK7K8j8j8j0j0n5n5Q0P9k6k6l6l7l6l7K8K7K8K7Q5Q6j10j09R6R7qqj8j8k3
-526A043k4M6m5m0J11m3j33k8k8M1M2M1M2k1k0k0k0o9o9J27J26P5P5l1l0j02j02O4O3j6j6
-531A039K9K9l8l9l9l8nnNMk8J22Q8kq1q2j2j2jkP4P3L9L9ook7k7J8J9oon2n1K8K8m8m7L5
$$ plain form
-493 1060 1040 1014 988 962 936 945 954 872 941 1047 1063 1065 1066 1005 944 989 1033 1040 1047 918 790 767 744 765 787 869 950 1031 1112 1128 1144 1086 1027 1008 988 1008
-499 1008 1028 1080 1041 1104 1076 1089 1102 1064 1026 1001 975 965 1044 1149 1104 1044 983 1040 1096 1153 1209 1170 1130 1078 1025 1179 1123 1029 1025 1002 980 963 946 972
-504 972 999 1037 984 926 957 1061 1016 1005 994 1019 1044 1021 998 1026 964 922 880 822 853 911 879 852 915 1001 1086 1127 1079 1045 1101 1050 999 1046 1003 842
-509 842 891 982 984 998 1012 1072 1042 1056 1071 1130 1100 1070 1039 1077 1025 1023 1021 1043 1065 1048 1030 1030 1120 1079 1038 1087 1046 1094 1143 1166 1099 1038 977 1007 1038 988 938
-515 938 956 884 881 969 1045 1031 948 954 1018 1081 1045 1009 1000 991 987 984 992 1091 1114 1047 953 859 925 991 998 1006 1088 1171 1145 1118 1047 976 1029 1082 1060 1038 1060 1082 1029
-521 1029 976 985 994 1004 1013 1040 1068 1050 1032 1022 1012 957 902 982 1061 1035 1009 973 936 900 863 891 918 946 973 1058 1144 1034 925 1021 1118 1110 1102 1084 1066 1043
-526 1043 1019 1065 1020 980 1091 1048 915 887 859 900 942 983 1025 1004 984 964 944 875 806 933 1059 1134 1209 1178 1148 1046 944 1008 1071 1055 1039
-531 1039 1068 1097 1059 1020 981 943 938 933 938 942 914 1036 1124 1122 1041 959 947 935 934 932 1006 1079 1118 1157 1151 1145 1118 1091 1109 1128 1122 1116 1064 1013 1041 1069 1021 974 1009
-537A009L5j0rL0L1L0L1p2p1O4O4o7o7L9L8q2q3ppK5K4K5K4jjkjK1K1k4k4M4M3kjmlM1M2r4
-543A049r5J01J01ooq1q1L5L5m0m0K6K6q0p9l7l7O9O8Q7Q8j8j8k8k7J8J8j2j1n7n6K3K2J08
-548A065m3J6J6PPK0K1J11m0j2P8p8J2l8l9l4l3p5p6l0l0Q6Q6M1M1KKKJm7m8J2p8p2P8J19
-554A050K9q9JP1k0m7m8o8Q2N2l7k2k3l9m0Q7Q6R3n9p4J5O5k6j4j4j6j7j7j6P9P9j16j16K0
-559H91K1K1K0M6M6M6M6l4l4l4l4l8l9L6L7K9L0K9K9j8j9j8j9kkkjnnnnKJm4m4M7M6k9k9K
-565I65JKJl0l1l0l0L2L3m2m2M0M1M0M1k9k9J7J6m7m6K8K9l3l3M2M2K7K7K7K7POOOj6j6j7
-571A032j6j1j0j1j1N7N7N7N7l3l2l3l3j3j3j3j3K4K4k1k1n0m9K6K6N3N4N3N3l9m0OOooq1
-576A030q1rrrqn3n3K3K2J42J42OPm5m5%jk0k1l6N5R3n7r3lJ05J04O5q5p3J7N3l8j20j20q0
$$ plain form
-537 1009 1044 1034 1025 1055 1086 1116 1147 1075 1004 1068 1132 1065 998 1037 1075 993 910 903 896 921 945 970 994 993 992 990 989 1010 1031 1007 983 1027 1070 1068 1067 1063 1060 1101 1143 1049
-543 1049 954 1055 1156 1150 1144 1063 982 1017 1052 1012 972 998 1024 944 865 828 791 860 928 1015 1103 1085 1067 1039 1012 1030 1048 1036 1025 968 912 935 957 1065
-548 1065 1022 1038 1054 1061 1068 1088 1109 1220 1180 1168 1246 1168 1180 1142 1103 1069 1036 961 885 855 825 911 997 1038 1079 1081 1083 1085 1086 1039 991 1003 925 853 931 1050
-554 1050 1079 990 991 1062 1042 995 947 879 961 1013 976 954 931 892 852 939 1025 1118 1059 985 1000 1065 1039 1025 1011 995 978 961 945 1024 1103 987 871 891
-559 891 912 933 953 999 1045 1091 1137 1103 1069 1035 1001 963 924 960 997 1026 1056 1085 1114 1096 1077 1059 1040 1038 1036 1034 1033 1028 1023 1018 1013 1015 1016 972 928 975 1021 992 963 965
-565 965 966 968 969 939 908 878 848 880 913 871 829 869 910 950 991 962 933 950 966 919 873 901 930 897 864 906 948 975 1002 1029 1056 1063 1069 1075 1081 1065 1049 1032
-571 1032 1016 1005 995 984 973 1030 1087 1144 1201 1168 1136 1103 1070 1057 1044 1031 1018 1042 1066 1045 1024 974 925 951 977 1030 1084 1137 1190 1151 1111 1117 1123 1117 1111 1030
-576 1030 949 940 931 922 914 861 808 831 853 995 1137 1143 1150 1105 1060 1060 1059 1039 1018 982 1037 1130 1073 980 977 1082 1186 1251 1166 1093 1110 1163 1125 1005 885 805
-582H05q1k0k1K5K4J09J09J19l2o0o0L6L6Q5Q4J0j41j04j5L1L1P2P2l3l3L9L9n7n6q9O2P3
-587A059j8K7K6q5q4L0L0L0L0llllN0N0M9N0o8o8o8o8l8l9l9l9Q8Q8j37J3L6n4L1J21M1M0
-592A072k8k9M3M3o3o2LMM8M9K8K8K8K8k9k8k8k8k8k8k9k8j4j5M5m5m7J04O4k6NNj%M6M6k8
-598A105k9k1k1N4N5n8n7J7J8m1m1m2m1J3J2Q7Q8r1r1M4M4m2m2L3L3j5j6J61j9r6r6P7P6J22
-603A180n9r2r2l4l5%J80N7N6l7l7n4n5rrO0O0m5m5rrL7L6L5L4L4L5j18j18m2m3kklkJ67J67
-608A187n9n8k3k3k3k3K9K9p7p6m3m2O3O3p1p0O4O5M8M8LKrrj0rO0N9p6p5N7N8M6M6k6k07
-614I18l1l0N1N0N0N1L1L1lj82j1j0k1k2L9L9l7l6K1K2K2K1N8N7m8m8J4J4J4J4N0N0q5q5L6
-619A004L6l8l9j5j4L1L0K6K7K6K6l6l7RRq7q8M7M8k4k5N1N1m0l9ONk3k3Q2Q2l0l0r9r9QR8
$$ plain form
-582 805 724 704 683 708 732 841 950 1069 1037 977 917 953 989 1074 1158 1168 1027 923 908 939 970 1042 1114 1081 1048 1087 1126 1069 1013 924 986 1059
-587 1059 1041 1068 1094 1009 925 955 985 1015 1045 1042 1039 1036 1033 1083 1133 1182 1232 1164 1096 1028 960 922 883 844 805 893 981 844 857 893 839 870 991 1032 1072
-592 1072 1044 1015 1058 1101 1038 976 979 983 1031 1080 1108 1136 1164 1192 1163 1135 1107 1079 1051 1023 994 966 952 937 982 937 890 994 1058 1032 1037 1042 1041 1041 1087 1133 1105
-598 1105 1076 1055 1034 1088 1143 1085 1028 1045 1063 1022 981 939 898 911 923 1010 1098 1007 916 960 1004 962 920 953 986 971 955 1116 1097 1001 905 982 1058 1180
-603 1180 1121 1029 937 903 868 868 1048 1105 1161 1124 1087 1033 978 969 960 1020 1080 1035 990 981 972 1009 1045 1080 1114 1148 1183 1065 947 905 862 860 858 855 853 1020 1187
-608 1187 1128 1070 1047 1024 1001 978 1007 1036 959 883 840 798 861 924 853 783 847 912 960 1008 1011 1013 1004 995 985 976 1036 1095 1019 944 1001 1059 1105 1151 1125 918
-614 918 887 857 908 958 1008 1059 1090 1121 1118 936 925 915 894 872 911 950 913 877 898 920 942 963 1021 1078 1030 982 996 1010 1024 1038 1088 1138 1053 968 1004
-619 1004 1040 1002 963 948 934 965 995 1021 1048 1074 1100 1064 1027 1036 1045 958 870 917 965 941 916 967 1018 978 939 945 950 927 904 986 1068 1038 1008 909 810 818 916
-625I16J48l1l9m0n0n0RJ0N4N5K7K8j8j7L6L7l8l9l6l6l7l6O4O5O4O5j4j3K6K6k3j12j63J7
-630H55L1L1lkM4M5l0l1M8M9k7k7KJm4m3k0k1k0k0PPN1N2k4k4K1K1oon1n1L3L2L3L3KLM8M8
-636A047l0l0l0l0J9J8J0RO5q5n2L8J1J0O0O1nnnnopn2n2O4O3j1j2r9r9O6O6L6L5l9l9j2j2
-642I61K7K7J0q1j5J35M0n1q4O6M0j11o2o2NMMMmmM1M1M6M6JKk6k6r2r2m9J01J00m9K6K7q2
-648H64q3M8J38R6n3JKqpK5K6k0k0l4l5l5l4L9M0onR0R1j5j5j0j0j1j0n5n4n4n5J6J6J5J6
-653H94mmP1P1k1k1k2k1qrj7j8J12l8n0M1J5J5k4k4M7M8k8k7oooollP3P2m8m8llL4L4L4L4
-659A127k8k8k8k8l4l3J1J2r9r8O6O7O8O7K8K8r4mJ05m5rqo4o3RRRRl0l0M6M5mmlmL4L3p2
-665I63p1J8J9J8J8J9J9q6q6PQQPO0N9J5J4l4l4k5k5m2J08Rj41k7O3M9M8RJ0J5J5KR2J15r6
$$ plain form
-625 916 1064 1033 994 954 904 854 863 873 927 982 1009 1037 1019 1002 1038 1075 1037 998 962 926 889 853 917 982 1046 1111 1097 1084 1110 1136 1113 1001 838 855
-630 855 886 917 914 912 956 1001 971 940 988 1037 1010 983 985 986 942 899 879 858 838 818 825 832 883 935 911 887 908 929 923 917 866 815 848 880 913 946 948 951 999 1047
-636 1047 1017 987 957 927 946 964 974 983 1048 963 911 949 960 970 1030 1091 1086 1081 1076 1071 1065 1058 1006 954 1018 1081 1070 1058 959 860 926 992 1028 1063 1024 985 973 961
-642 961 988 1015 1025 944 929 1064 1104 1053 969 1035 1075 964 902 840 845 849 853 857 853 849 890 931 977 1023 1024 1026 1000 974 882 790 741 842 942 893 919 946 864
-648 864 781 829 967 1063 1010 1011 1013 1005 998 1023 1049 1029 1009 975 940 905 871 910 950 944 939 1029 1120 1105 1090 1080 1070 1059 1049 994 940 886 831 847 863 878 894
-653 894 890 886 957 1028 1007 986 964 943 935 926 909 891 1003 965 915 956 971 986 962 938 985 1033 1005 978 972 966 960 954 951 948 1021 1093 1045 997 994 991 1025 1059 1093 1127
-659 1127 1099 1071 1043 1015 981 948 959 971 872 774 840 907 975 1042 1070 1098 1004 1000 1105 1060 1051 1043 979 916 925 934 943 952 922 892 938 983 979 975 972 968 1002 1035 963
-665 963 892 910 929 947 965 984 1003 917 831 838 846 854 861 921 980 995 1009 975 941 916 891 849 957 966 825 798 861 910 958 967 977 992 1007 1009 1101 1216 1120
-671A120m4m4n7n7q3q2pqQ4Q4L9L9MLM8M9K6K6j9j9nnmnNNm1m0K6K5K6K5n2n2qpm9m8m9m8
-677H01P5P5%JL5L5j1j0k4k5N1N1pon2n2l8l9l9l8P1P1lmk7k7J8J8j6j7N9N9j%ooP5j4P3j06
-683A000r1Q9r9r8L8L9poR3R3OPQ9r1j25j24O9O9l6l7J0J0J0J0M9M9k6k5j3j3j3j3O3O3O5
-689A104j16m8M2o4o5L3L4L3L3Q9Q9J15o5j03j04m0m0qpJ6p3j36J65J46N6p1p1o3K7J00q1
-693I27l5N4P1j10qQ1N6N5p4p5J6J6q9r0llP1P2M3M2M3M2L3L2j2j3o9o8L6L6j7j7j8j7Q6Q6
-699A180j9j9k2k1k2k2j2j2j2j3O5O5m0m1J2J3L8j42N6N6M5M5m3m2l1l2q9R1j1j0J0J0r5r6
-704H40L0K9O3O3P2j08q1q2l9l8J27J27J0J0j47L3R9q1j3j3L5L6L5L6k1k1k1k0m4m3m4m3K2
-709H08K1K1K2M1M1M2M1j4j3n8n8k9k8k5J56ONJ6J7mmm9m9nnnnL4L5L4L5l4l3M2M2l8l8l8
$$ plain form
-671 1120 1076 1032 975 918 835 753 746 738 822 906 945 984 988 991 1039 1088 1114 1140 1121 1102 1097 1092 1088 1083 1088 1093 1052 1012 1038 1063 1089 1114 1062 1010 1002 995 946 898 849 801
-677 801 876 951 951 952 987 1022 1011 1001 977 952 1003 1054 1047 1041 989 937 899 860 821 783 854 925 922 918 891 864 882 900 884 867 926 985 984 984 978 972 1047 1033 1106 1000
-683 1000 909 998 899 801 839 878 871 865 958 1051 1057 1064 1153 1062 937 813 882 951 915 878 888 898 908 918 967 1016 990 965 952 939 926 913 976 1039 1104
-689 1104 988 940 982 918 853 886 920 953 986 1075 1164 1279 1214 1111 1007 967 927 919 912 928 855 719 884 1030 1086 1015 944 881 908 1008 927
-693 927 892 946 1017 907 899 980 1036 1091 1017 942 958 974 885 795 792 789 860 932 975 1017 1060 1102 1135 1167 1155 1142 1073 1005 1041 1077 1060 1043 1025 1008 1094 1180
-699 1180 1161 1142 1120 1099 1077 1055 1043 1031 1019 1006 1071 1136 1096 1055 1067 1080 1118 976 1032 1088 1133 1178 1135 1093 1062 1030 941 1032 1021 1011 1021 1031 936 840
-704 840 870 899 962 1025 1097 989 908 826 787 749 876 1003 1013 1023 876 909 1008 927 914 901 936 972 1007 1043 1022 1001 980 960 916 873 829 786 808
-709 808 829 850 872 913 954 996 1037 1023 1010 952 894 865 837 812 968 974 979 995 1012 1008 1004 955 906 901 896 891 886 920 955 989 1024 990 957 999 1041 1003 965 927
-715I27l8OPOOj9j8j9j9L6L6j0rk3k3N2N2O8O9o7o6%%J3J04N0j30q0J1J31M1k0j9Q3r8n3L8
$$ plain form
-715 927 889 895 902 908 914 895 877 858 839 875 911 901 892 869 846 898 950 1018 1087 1020 954 954 954 967 1071 1121 991 911 922 1053 1094 1074 1055 1138 1040 987 1025
$$ [...]
##END=	
##END=	
##END=	
