##TITLE=	nt-4Ph-PyCCTMSOTf.10.fid


##JCAMP-DX=	6.0	$$ MestReNova 14.1.1-24571
##DATA TYPE=	LINK
##BLOCK_ID=	1
##BLOCKS=	1    
##ORIGIN=	Mestrelab Research S.L.
##OWNER=	hrzepa
##$MNOVA/LINK_BLOCK_TYPE=	ITEM	$$ NMR Spectrum
##$MNOVA/ITEM/POLYGON=	(XY..XY)
5321,5835
8722,5835
8722,8208
5321,8208
5321,5835
##$MNOVA/ITEM/Z=	0
##$MNOVA/ITEM/ANGLE=	0
##TITLE=	nt-4Ph-PyCCTMSOTf.10.fid
##JCAMP-DX=	6.0	$$ MestReNova 14.1.1-24571
##BLOCK_ID=	2
##DATA TYPE=	NMR SPECTRUM
##DATA CLASS=	XYDATA
##NUMDIM=	1
##ORIGIN=	Bruker BioSpin GmbH
##OWNER=	root
##.OBSERVE FREQUENCY=	500.13308850747802126
##.OBSERVE NUCLEUS=	^1H
##.SOLVENT NAME=	CDCl3
##.PULSE SEQUENCE=	zg30
##LONGDATE=	2017/02/11 18:26:00.000
##.ACQUISITIONMODE=	SIMULTANEOUS (DQD)
##$ORIGINAL FORMAT=	Bruker XWIN-NMR
##$MNOVA/SCALES_VERSION=	9
##$PARAMETER FILE=	(acqus, ASCII, /Users/hrzepa/Library/Mobile%20Documents/com~apple~CloudDocs/C2/Pure%20samples/kmi-4-PhPyCCTMSOTf-1/4-phenyl-1-((trimethylsilyl)ethynyl)pyridin-1-ium/acqus, 0)
$$ ##TITLE= Parameter file, TOPSPIN		Version 3.2
$$ ##JCAMPDX= 5.0
$$ ##DATATYPE= Parameter Values
$$ ##NPOINTS= 1	$$ modification sequence number
$$ ##ORIGIN= Bruker BioSpin GmbH
$$ ##OWNER= root
$$ $$ 2017-02-11 18:26:33.907 +0900  root@CZC31189P3
$$ $$ Z:/toriumi/nt-4Ph-PyCCTMSOTf/10/acqus
$$ $$ process C:\Bruker\TopSpin3.2\prog\mod\dirdata.exe
$$ ##$ACQT0= -2.52100840336134
$$ ##$AMP= (0..31)
$$ 100 100 100 100 100 100 100 100 100 100 100 100 100 100 100 100 100 100
$$ 100 100 100 100 100 100 100 100 100 100 100 100 100 100
$$ ##$AMPCOIL= (0..19)
$$ 0 0 0 0 0 0 0 0 0 0 0 0 0 0 0 0 0 0 0 0
$$ ##$ANAVPT= -1
$$ ##$AQSEQ= 0
$$ ##$AQ_mod= 3
$$ ##$AUNM= <au_zg>
$$ ##$AUTOPOS= <9 >
$$ ##$BF1= 500.13
$$ ##$BF2= 500.13
$$ ##$BF3= 500.13
$$ ##$BF4= 500.13
$$ ##$BF5= 500.13
$$ ##$BF6= 500.13
$$ ##$BF7= 500.13
$$ ##$BF8= 500.13
$$ ##$BYTORDA= 0
$$ ##$CAGPARS= (0..11)
$$ 0 0 0 0 0 0 0 0 0 0 0 0
$$ ##$CFDGTYP= 0
$$ ##$CFRGTYP= 9
$$ ##$CHEMSTR= <none>
$$ ##$CNST= (0..63)
$$ 1 1 1 1 1 1 1 1 1 1 1 1 1 1 1 1 1 1 1 1 1 1 1 1 1 1 1 1 1 1 1 1 1 1 1 1
$$ 1 1 1 1 1 1 1 1 1 1 1 1 1 1 1 1 1 1 1 1 1 1 1 1 1 1 1 1
$$ ##$CPDPRG= (0..8)
$$ <> <> <> <> <> <> <> <> <>
$$ ##$D= (0..63)
$$ 0 1 0 0 0 0 0 0 0 0 0 0 0 0 0 0 0.0002 0 0 0 0 0 0 0 0 0 0 0 0 0 0 0 0
$$ 0 0 0 0 0 0 0 0 0 0 0 0 0 0 0 0 0 0 0 0 0 0 0 0 0 0 0 0 0 0 0
$$ ##$DATE= 1486805187
$$ ##$DE= 6.5
$$ ##$DECBNUC= <off>
$$ ##$DECIM= 2000
$$ ##$DECNUC= <off>
$$ ##$DECSTAT= 4
$$ ##$DIGMOD= 1
$$ ##$DIGTYP= 12
$$ ##$DQDMODE= 0
$$ ##$DR= 22
$$ ##$DS= 2
$$ ##$DSPFIRM= 0
$$ ##$DSPFVS= 20
$$ ##$DTYPA= 0
$$ ##$EXP= <A.Proton>
$$ ##$F1LIST= <>
$$ ##$F2LIST= <>
$$ ##$F3LIST= <>
$$ ##$FCUCHAN= (0..9)
$$ 0 2 0 0 0 0 0 0 0 0
$$ ##$FL1= 90
$$ ##$FL2= 90
$$ ##$FL3= 90
$$ ##$FL4= 90
$$ ##$FOV= 20
$$ ##$FQ1LIST= <>
$$ ##$FQ2LIST= <>
$$ ##$FQ3LIST= <>
$$ ##$FQ4LIST= <>
$$ ##$FQ5LIST= <>
$$ ##$FQ6LIST= <>
$$ ##$FQ7LIST= <>
$$ ##$FQ8LIST= <>
$$ ##$FRQLO3= 23161.4925220013
$$ ##$FRQLO3N= 2
$$ ##$FS= (0..7)
$$ 83 83 83 83 83 83 83 83
$$ ##$FTLPGN= 0
$$ ##$FW= 125000
$$ [...]
$$ 130000 130000 130000 130000 130000 130000 130000 130000 130000 130000 130000
$$ 130000 130000 130000 130000 130000 130000 130000 130000 130000 130000 130000
$$ 130000 130000 130000 130000 130000 130000 130000 0 0 0 0 0 0 0 0 0 0 0
$$ 0 0 0 0 0 0 0 0 0 0 0 0 0
$$ ##$ShimPowMaxUC= (0..63)
$$ 130000 130000 130000 130000 130000 130000 130000 130000 130000 130000 130000
$$ 130000 130000 130000 130000 130000 130000 130000 130000 130000 130000 130000
$$ 130000 130000 130000 130000 130000 130000 130000 130000 130000 130000 130000
$$ 130000 130000 130000 130000 130000 130000 130000 0 0 0 0 0 0 0 0 0 0 0
$$ 0 0 0 0 0 0 0 0 0 0 0 0 0
$$ ##$ShimPowMaxUG= (0..63)
$$ 524287 524287 524287 524287 524287 524287 524287 524287 524287 524287 524287
$$ 524287 524287 524287 524287 524287 524287 524287 524287 524287 524287 524287
$$ 524287 524287 524287 524287 524287 524287 524287 524287 524287 524287 524287
$$ 524287 524287 524287 524287 524287 524287 0 0 0 0 0 0 0 0 0 0 0 0 0 0 0
$$ 0 0 0 0 0 0 0 0 0 0
$$ ##$ShimPowRcbType= 3
$$ ##$ShimPowRes= (0..63)
$$ 1e-020 1e-020 1e-020 1e-020 1e-020 1e-020 1e-020 1e-020 1e-020 1e-020 1e-020
$$ 1e-020 1e-020 1e-020 1e-020 1e-020 1e-020 1e-020 1e-020 1e-020 1e-020 1e-020
$$ 1e-020 1e-020 1e-020 1e-020 1e-020 1e-020 1e-020 1e-020 1e-020 1e-020 1e-020
$$ 1e-020 1e-020 1e-020 1e-020 1e-020 1e-020 1e-020 0 0 0 0 0 0 0 0 0 0 0
$$ 0 0 0 0 0 0 0 0 0 0 0 0 0
$$ ##$ShimPowRng0= (0..63)
$$ 1 1 1 1 1 1 1 1 1 1 1 1 1 1 1 1 1 1 1 1 1 1 1 1 1 1 1 1 1 1 1 1 1 1 1 1
$$ 1 1 1 1 0 0 0 0 0 0 0 0 0 0 0 0 0 0 0 0 0 0 0 0 0 0 0 0
$$ ##$ShimPowRng1= (0..63)
$$ 1 1 1 1 1 1 1 1 1 1 1 1 1 1 1 1 1 1 1 1 1 1 1 1 1 1 1 1 1 1 1 1 1 1 1 1
$$ 1 1 1 1 0 0 0 0 0 0 0 0 0 0 0 0 0 0 0 0 0 0 0 0 0 0 0 0
$$ ##$ShimPowRng2= (0..63)
$$ 1 1 1 1 1 1 1 1 1 1 1 1 1 1 1 1 1 1 1 1 1 1 1 1 1 1 1 1 1 1 1 1 1 1 1 1
$$ 1 1 1 1 0 0 0 0 0 0 0 0 0 0 0 0 0 0 0 0 0 0 0 0 0 0 0 0
$$ ##$ShimPowRng3= (0..63)
$$ 1 1 1 1 1 1 1 1 1 1 1 1 1 1 1 1 1 1 1 1 1 1 1 1 1 1 1 1 1 1 1 1 1 1 1 1
$$ 1 1 1 1 0 0 0 0 0 0 0 0 0 0 0 0 0 0 0 0 0 0 0 0 0 0 0 0
$$ ##$ShimSysFunc= (0..63)
$$ 1 2 3 4 5 6 7 8 9 10 0 37 38 35 16 15 14 13 12 11 28 27 26 25 24 23 36
$$ 22 30 29 20 21 34 33 32 31 17 18 19 0 0 0 0 0 0 0 0 0 0 0 0 0 0 0 0 0 0
$$ 0 0 0 0 0 0 0
$$ ##$ShimSysMatrix= 0
$$ ##$ShimSysType= 4
$$ ##$TFXNUM= 0
$$ ##$TRIPLO2= 0
$$ ##$VTU= 2
$$ ##$VTUETH= <149.236.99.20>
$$ ##$VTUTY= <no>
$$ ##$WBREFAM= (0..15)
$$ 100 100 100 100 100 100 100 100 100 100 100 100 100 100 100 100
$$ ##$WBREFLM= (0..15)
$$ 1 0 0 0 0 0 0 0 0 0 0 0 0 0 0 0
$$ ##$WBREFPH= (0..15)
$$ 0.03 0 0 0 0 0 0 0 0 0 0 0 0 0 0 0
$$ ##$WBSGU= (0..15)
$$ 0 0 0 0 0 0 0 0 0 0 0 0 0 0 0 0
$$ ##$XFAC= 2
$$ ##END=
$$ 
##$DECIM=	2000
##$DSPFVS=	20
##XUNITS=	HZ
##YUNITS=	ARBITRARY UNITS
##FIRSTX=	8041.3200580028296827
##LASTX=	-1958.52735410654509
##DELTAX=	-0.152587890625
##XFACTOR=	1
##YFACTOR=	0.0097780589127778021891
##FIRSTY=	15.893958091735839844
##MINY=	5.5796027183532714844
##MAXY=	66510.5859375
##NPOINTS=	65536
##XYDATA=	(X++(Y..Y))
$$ [...]
1715A412L2L2L3L2P4P4Lj53n5J00l6l7j9k0k0j9ppM2M2j02N4M4M3JJJJm6m7J71J5j5j4N4N4
1710A718N2N3N3N2J23J22J23K78M16N71Q90J356J979K135J039j089k254j890j197q33o04l45
1706B748k77k77j37J8o9p0r2r2mnj17L8n0m9M6M6n1J05L4j21k4k4j5j5K4K4K6K6n1n2J4J5
1701A572J4J4o1o1o1o1L2L2r9r8j7j7j05N1M5M5k4k4K4K3K4K3Q2Q2MMj8j8j8j8L2L2o5R1N5
1696A516j01mml3l3l3l2KLLLo7o8K7J82k5k5K4K4j3j3K5K6O4O4j59j60n9R6Q6Q6k8k9k8k8
1691A289RRRRMNMNL2L3P2P2o0o0J8J8j5j5j5j6k9l0J01J00k2k2o1o1QRRQMMl5l5L4L5m3m4
1685A337L1L0K1K1L4j23l4l5P3P4nnm4m5noj%m0m0K0K0K1K0N2N3N2N3l3l2OOm4m5L3L3k5k5
1679A403N2N3M0M1l8l7k8k9JJQj47n0n0K1J77m0m0k7k7J55J54o2o2o2o2PQp0p0J7J7R5R5N0
$$ plain form
1715 1412 1444 1476 1509 1541 1615 1689 1692 1539 1484 1584 1548 1511 1492 1472 1452 1433 1426 1419 1461 1503 1401 1455 1499 1542 1543 1544 1545 1546 1500 1453 1624 1639 1624 1610 1664 1718
1710 1718 1770 1823 1876 1928 2051 2173 2296 2574 2990 3561 4451 5807 7786 9921 10960 9871 7617 5727 4530 3697 3093 2748
1706 2748 2471 2194 2057 2075 2006 1936 1844 1752 1748 1743 1626 1664 1614 1565 1611 1657 1606 1711 1745 1624 1600 1576 1561 1546 1570 1594 1620 1646 1595 1543 1557 1572
1701 1572 1586 1600 1539 1478 1417 1356 1388 1420 1321 1223 1206 1189 1084 1135 1180 1225 1201 1177 1201 1224 1248 1271 1353 1435 1439 1443 1425 1407 1389 1371 1403 1435 1370 1461 1516
1696 1516 1415 1411 1407 1374 1341 1308 1276 1278 1281 1284 1287 1220 1152 1179 1361 1336 1311 1335 1359 1346 1333 1358 1384 1448 1512 1353 1193 1134 1230 1316 1402 1374 1345 1317 1289
1691 1289 1298 1307 1316 1325 1329 1334 1338 1343 1375 1408 1480 1552 1492 1432 1450 1468 1453 1438 1423 1407 1378 1348 1449 1549 1527 1505 1444 1383 1391 1400 1409 1417 1421 1425 1390 1355 1389 1424 1381 1337
1685 1337 1368 1398 1419 1440 1474 1351 1317 1282 1355 1429 1424 1419 1375 1330 1325 1319 1318 1318 1278 1238 1258 1278 1299 1319 1371 1424 1476 1529 1496 1464 1470 1476 1432 1387 1420 1453 1428 1403
1679 1403 1455 1508 1548 1589 1551 1514 1486 1457 1458 1459 1467 1320 1270 1220 1241 1418 1378 1338 1311 1284 1439 1593 1531 1469 1407 1345 1352 1360 1290 1220 1237 1254 1349 1444 1494
1673A494N1p6P9p9p9RQj9j9K0J9j8j8J12J12QRk09n3M3M2k6k6N4N4k4k5j1j1j0j1l6l5Q5Q4
1668A498P3q2q3q3Q0p6J1J1J8J7J8J8j2j2P6p9l0k9l9l9K0J9J9K0jkjjRQRQqqr5O0j2j2L7
1662A325L6O7O7o4o3R7R6l3l3O7O6o3o3m6m7L1L1q6q6q7P0J2J68J2J2k5k5J4J4k4k5k4k4o0
1657A307o0P0O9K8K9n0m9NNl4l4j1j0O7O8RRo8j45k7J28n7R9mq1K1K1j03N3M4M3l9m0%jN8
1651A320N8p2p1PPM6M6M5M5J1J1n2K5L0j26lmO4O4L4L4m4m4PPl2l2J0J0J0RJ8J7J7J7j6j6
1646A457j7j6qqqrQ6Q6r6r5j3j4O5O5P6P6n4n4l8l9p7p7QQJ3J3m4L3Q7o9j24L2J04K5N2k5
1640A401l6J21QRn9n9qrm7m7LMM2M2j7j7n6n6J21J22o0o0k9k8M9N0N8N8j9k0j5j6m6m6l2R7
1635A403n6j35K7J05Q8r3j02K8P0qm7L1O0O0j3j3j3j3K0J9J9K0%%q6q6Q9m1j1O6J9J8n5n5
$$ plain form
1673 1494 1545 1469 1548 1469 1390 1399 1407 1388 1369 1389 1408 1390 1372 1484 1596 1604 1613 1404 1351 1394 1436 1410 1384 1438 1492 1468 1443 1432 1421 1411 1400 1364 1329 1414 1498
1668 1498 1571 1489 1406 1323 1403 1327 1338 1349 1367 1384 1402 1420 1408 1396 1472 1393 1363 1334 1295 1256 1276 1295 1314 1334 1333 1331 1330 1329 1338 1346 1355 1363 1355 1347 1252 1312 1300 1288 1325
1662 1325 1361 1428 1495 1431 1368 1465 1561 1528 1495 1562 1628 1565 1502 1456 1409 1440 1471 1385 1299 1212 1282 1294 1462 1474 1486 1461 1436 1450 1464 1440 1415 1391 1367 1307
1657 1307 1247 1317 1386 1414 1443 1393 1344 1349 1354 1320 1286 1275 1265 1332 1400 1409 1418 1350 1205 1178 1306 1249 1348 1344 1263 1284 1305 1202 1255 1299 1342 1303 1263 1263 1262 1320
1651 1320 1378 1306 1235 1242 1249 1295 1341 1386 1431 1442 1453 1401 1426 1456 1330 1327 1323 1387 1451 1485 1519 1475 1431 1438 1445 1413 1381 1391 1401 1411 1420 1438 1455 1472 1489 1473 1457
1646 1457 1440 1424 1416 1408 1400 1391 1477 1563 1467 1372 1359 1345 1410 1475 1551 1627 1573 1519 1481 1442 1365 1288 1296 1304 1317 1330 1286 1319 1406 1337 1213 1245 1349 1374 1426 1401
1640 1401 1365 1486 1494 1503 1444 1385 1377 1368 1321 1274 1277 1281 1323 1365 1348 1331 1275 1219 1340 1462 1402 1342 1313 1285 1334 1384 1442 1500 1481 1461 1446 1430 1384 1338 1306 1403
1635 1403 1347 1212 1239 1344 1432 1339 1237 1265 1335 1327 1280 1311 1371 1431 1418 1405 1392 1379 1399 1418 1437 1457 1457 1457 1371 1285 1374 1333 1322 1388 1407 1425 1370 1315
1630A315L5L4L5L4l4l4l5l4k9k9J1J0J8J8o0o0P9P9n1n0MMNMP0P0qqK0K0j9j9r9j00L1L0m6
1624A211m6Q4Q4J6J7p6J57J2J1m4m3r5L5M0L9J1J0J1J0k0k1N8N7r9j00L1L0J7J6k2k2NMNN
1619A388M3M3p8p9n3P8MMLKp5p5L7L6L7L7L8L8l9m0MNp4p4K6K6K6K7k4k3J5J6o7o8J51oJ8
1613A327J7M7M7K5K4M3j11q9O8R6n9POr0O5j8j8q6q6P7P8%%m4m3L4L4K6K5o2R3j9j9m8m9%
1607A298jp8p8Q6Q6m3m3N1N2k6k6M3M3Q3Q2l1l0o9p0LLM2M2J8J8q7P0J12j48p9P7j3j3llJ2
1602A380J3L2j24j24L2J3J2OOPON6N6N7N6nonnn8n7j5J40M4M4p7p6K2K1o5Q9j9k0m9m9O1O1
1596A460o8o9O8O8Q3m6r7L2oq3L1L1l8l9rj0rj0P5P5m2m2nnN4N5k3j01j4J16k6k6R3l6o3o2
1591A312M6M6K4K4K5K4n0m9j15j14j3j3N2N1J8J8Q2Q3J0Rn5n5p6p5M1M1K6K6j3j3L0L1L1L0
$$ plain form
1630 1315 1350 1384 1419 1453 1419 1385 1350 1316 1287 1258 1269 1279 1297 1315 1255 1195 1274 1353 1302 1252 1256 1260 1265 1269 1339 1409 1401 1393 1413 1433 1414 1395 1296 1196 1227 1257 1211
1624 1211 1165 1249 1333 1349 1366 1290 1447 1459 1470 1426 1383 1288 1323 1363 1402 1413 1423 1434 1444 1424 1403 1461 1518 1419 1319 1350 1380 1397 1413 1391 1369 1374 1378 1383 1388
1619 1388 1431 1474 1396 1317 1264 1342 1346 1350 1353 1355 1280 1205 1242 1278 1315 1352 1390 1428 1389 1349 1353 1358 1284 1210 1236 1262 1288 1315 1291 1268 1283 1299 1232 1164 1315 1309 1327
1613 1327 1344 1391 1438 1463 1487 1530 1419 1330 1398 1494 1435 1442 1448 1358 1423 1405 1387 1301 1215 1292 1370 1370 1370 1326 1283 1317 1351 1377 1402 1340 1433 1414 1395 1347 1298 1298
1607 1298 1297 1219 1141 1227 1313 1270 1227 1278 1330 1304 1278 1321 1364 1447 1529 1498 1468 1399 1329 1332 1335 1377 1419 1437 1455 1368 1438 1550 1402 1323 1400 1387 1374 1371 1368 1380
1602 1380 1393 1425 1301 1177 1209 1222 1234 1240 1246 1253 1259 1315 1371 1428 1484 1479 1473 1468 1463 1405 1348 1333 1473 1517 1561 1484 1408 1430 1451 1386 1475 1456 1436 1387 1338 1399 1460
1596 1460 1392 1323 1391 1459 1542 1496 1399 1431 1425 1342 1373 1404 1366 1327 1318 1308 1299 1289 1364 1439 1397 1355 1350 1345 1399 1454 1431 1330 1316 1432 1406 1380 1473 1437 1374 1312
1591 1312 1358 1404 1428 1452 1477 1501 1451 1402 1287 1173 1160 1147 1199 1250 1268 1286 1368 1451 1461 1470 1415 1360 1284 1209 1250 1291 1317 1343 1330 1317 1347 1378 1409 1439
1586A439r6r6K1K1L7L7L7L7J4J3k5k6m9n0M1M1j7j7J25J25J1J0j32j33k5k6M0L9M5M4N7p2
1581A470p6KL8m1j35n7Q0Q0R0l9j10K1R0J3p0QJ5J4m6m5j4j3N1N1Q7Q7K3K2o4o5N3N2m5m6
1576A481m6m5j7j8N8N7j14M2opn5n5N2N3P0q5q4P0l0l1M4M4l5l6l5l5M6M6P6P6L5j21l3l3
1570A329J2J1Q6Q6j19L6J3J3o9o8o9o8R7R8R4o1J7J8l1l2j09j09n4J02N7N7JKo3o3k4k4N8
1565A224N9ool2l2N8N9M8M7j7j7m7m6qpP7P7J2J3L6L7k8k8q5q4L3L2m7m7m7m6R8R8Q9Q9l7
1560A519j93j4j4L7L7K2K1J01j58j2j2m4m5m4m5noN9O0l5l5L0L0P6P5m1m1O5O5n1n2q5q6Q3
1555A262Q4k6k6J3J4j5j6N0N0PPPPrqrqJ1J2J1J1K6K6j3j3j7j8K2K1p6p6J5J5K6K7j2j2ml
1549A363mmN9N9O0N9m2m2m2m2L6L7k9k8q5q4J10J10m7m8q6q6mmmnPPM6M6rrqrK1K1K1K1J7
$$ plain form
1586 1439 1343 1247 1268 1289 1326 1363 1400 1437 1451 1464 1439 1413 1364 1314 1355 1396 1379 1362 1487 1612 1623 1633 1501 1368 1343 1317 1357 1396 1441 1485 1542 1470
1581 1470 1394 1396 1434 1393 1258 1201 1281 1361 1451 1412 1302 1323 1413 1426 1356 1364 1379 1393 1347 1302 1288 1275 1326 1377 1464 1551 1574 1596 1532 1467 1520 1572 1527 1481
1576 1481 1435 1390 1373 1355 1413 1470 1356 1398 1392 1385 1330 1275 1327 1380 1450 1365 1281 1351 1321 1290 1334 1378 1343 1307 1272 1237 1283 1329 1405 1481 1516 1395 1362 1329
1570 1329 1341 1352 1438 1524 1405 1441 1454 1467 1398 1330 1261 1193 1290 1388 1482 1421 1438 1456 1425 1393 1284 1175 1121 1223 1280 1337 1338 1340 1277 1214 1190 1166 1224
1565 1224 1283 1277 1271 1239 1207 1265 1324 1372 1419 1402 1385 1338 1292 1284 1277 1354 1431 1443 1456 1492 1529 1501 1473 1388 1304 1337 1369 1322 1275 1228 1182 1280 1378 1467 1556 1519
1560 1519 1326 1312 1298 1335 1372 1394 1415 1516 1358 1346 1334 1290 1245 1201 1156 1151 1145 1204 1264 1229 1194 1224 1254 1330 1405 1364 1323 1388 1453 1402 1350 1265 1179 1262
1555 1262 1346 1320 1294 1307 1321 1306 1290 1340 1390 1397 1404 1411 1418 1409 1401 1392 1384 1395 1407 1418 1429 1455 1481 1468 1455 1438 1420 1442 1463 1387 1311 1326 1341 1367 1394 1382 1370 1366 1363
1549 1363 1359 1355 1414 1473 1533 1592 1550 1508 1466 1424 1460 1497 1468 1440 1355 1271 1381 1491 1444 1396 1310 1224 1220 1216 1212 1207 1214 1221 1267 1313 1304 1295 1287 1278 1299 1320 1341 1362 1379
1543A379J7J7J7OOn9n9O3O2n4n4K6K6K5K6k9l0k9k9K2K2j6j7q2q3L5L4K3K2j7j6KLO8O8N1
1537A446N2l9l9j8j8n6n7l0k9J0RL8L7P6P6k8k8p6P9J8J9K8K8j40j40Q1Q1j8j7P4P3QPr9j00
1532A308j7J38P3q3J6J6OOn6n6j8j7J8J9m7m6OOOOn2n2J3J3QRRRL1L2L2L2LKJ29k6m6m5j7
1526A368j6M2M2m9m9q8q7K9K9Q5Q6K1K1p2p3M5M4O6O5n1n1N2N1o5o5mlO1O2RJ0q2q1p5p5L2
1520A234L3J04n0r0O6K2K2l3l2m4m3j5J42O5O5M6j10p0o9JKP0q6L1J87m5m6p4p5J22J22k1
1516A431k1l8l7JJrj0n8R8j5j4nmJKKKJ0J1p0p1k8J28J27k8p0p0j5j5K7K7j25L0M3M3N3N3
1510A387n1n0J5J4K8K7l7l7j7j7R9J00l5l6l5l5J5J6k3k3j9j8K1K0K2K1J2J1R8n9q7q8M1M2
1505A322KLL9L8p7p8L9L9Q7o8q6q6M7M7KLKLM7M7J8j37J2J1KKK7K6k8k9r7N8J13J13n0n0J4
$$ plain form
1543 1379 1396 1413 1430 1436 1442 1383 1324 1387 1449 1395 1341 1367 1393 1418 1444 1415 1385 1356 1327 1349 1371 1355 1338 1256 1173 1208 1242 1265 1287 1270 1254 1256 1259 1327 1395 1446
1537 1446 1498 1459 1420 1402 1384 1328 1271 1241 1212 1222 1231 1269 1306 1382 1458 1430 1402 1326 1405 1423 1442 1470 1498 1358 1218 1299 1380 1362 1345 1419 1492 1500 1507 1408 1308
1532 1308 1291 1429 1502 1419 1435 1451 1457 1463 1407 1351 1333 1316 1334 1353 1306 1260 1266 1272 1278 1284 1232 1180 1193 1206 1214 1223 1232 1241 1272 1304 1336 1368 1371 1373 1502 1476 1430 1385 1368
1526 1368 1352 1394 1436 1387 1338 1250 1163 1192 1221 1306 1392 1413 1434 1362 1289 1334 1378 1444 1509 1458 1407 1459 1510 1445 1380 1376 1373 1434 1496 1505 1515 1433 1352 1277 1202 1234
1520 1234 1267 1371 1321 1231 1297 1319 1341 1308 1276 1232 1189 1174 1316 1381 1446 1492 1382 1312 1243 1244 1246 1316 1230 1261 1448 1403 1357 1283 1208 1330 1452 1431
1516 1431 1410 1372 1335 1336 1337 1328 1318 1260 1358 1343 1329 1324 1320 1321 1323 1325 1327 1337 1348 1278 1207 1179 1307 1434 1406 1336 1266 1251 1236 1263 1290 1165 1195 1238 1281 1334 1387
1510 1387 1336 1286 1301 1315 1343 1370 1333 1296 1279 1262 1361 1461 1426 1390 1355 1320 1335 1351 1328 1305 1286 1268 1289 1309 1331 1352 1364 1375 1473 1414 1327 1239 1280 1322
1505 1322 1324 1327 1366 1404 1327 1249 1288 1327 1414 1346 1260 1174 1221 1268 1270 1273 1275 1278 1325 1372 1390 1253 1265 1276 1278 1280 1307 1333 1305 1276 1179 1237 1350 1463 1413 1363 1377
1499A377J5J1J1k7k8Q2Q3l5l4k2k2k2k3l6l6J58KR2o4p7p7j2j2j2j2N3N3j35K0J05n1m2J14
1494A397ONJ5J5l8l9K6K7o1o1NMQ8Q8j32j33L2L2P1P1nonnj20j20j3J43L9M0Q7Q8m2m3K2K2
1489A500n7n7n6n7L0L1o0o0L7L8L7L7J%L9L9o9p0o9o9L0L1R5R6K2K2j05N1MLJ3J3p2p1ppP4
1483A357P3L5L4M2M1KKo1o2j10M5klQPJ0J0M8M9l7l7KJppm6m6m2m2R8R7p6P9N9O0J6j39n1
1477A407n2K5K5o3R2QPJ8J7n4n5n4n4J2J1J2J1k3k2j10M5J31J31M7j09n3n2J6J5J7J7K7j29
1472A261l9l9j0rl4l4R6R6P0O9rqn4n3j42J5k9k9N8N8K3K3n5n5Q9R0Q9Q9j02j01P9Q0r8r9
1467A286k1k0K5K5L5L5l8J18L0L0k4k5k5k5k5k4k5k5K8K7K7K8m3m2m2m3J18J18o4o4o5o6O4
1462A288O5P1P1k2j78J2J2J29k7k9l0L8L9O0O0o9o9l5l5l5l5K5K5n3n3l1l1M6M7k9k9M9N0
$$ plain form
1499 1377 1392 1403 1414 1387 1359 1441 1524 1489 1455 1433 1411 1389 1366 1330 1294 1452 1454 1546 1482 1405 1328 1316 1304 1292 1280 1333 1386 1251 1271 1376 1325 1283 1397
1494 1397 1403 1408 1423 1438 1400 1361 1387 1414 1353 1292 1297 1301 1389 1477 1345 1212 1244 1276 1347 1418 1413 1407 1402 1397 1277 1157 1144 1287 1326 1366 1453 1541 1499 1456 1478 1500
1489 1500 1443 1386 1330 1273 1303 1334 1274 1214 1251 1289 1326 1363 1364 1364 1403 1442 1373 1303 1234 1165 1195 1226 1321 1417 1439 1461 1356 1407 1411 1414 1427 1440 1368 1297 1290 1283 1357
1483 1357 1430 1465 1499 1541 1582 1584 1586 1525 1463 1353 1398 1396 1393 1401 1408 1418 1428 1476 1525 1488 1451 1453 1454 1447 1440 1394 1348 1306 1264 1362 1459 1383 1462 1521 1581 1597 1458 1407
1477 1407 1355 1380 1405 1342 1434 1442 1449 1467 1484 1430 1375 1321 1267 1279 1290 1302 1313 1290 1268 1158 1203 1334 1465 1512 1403 1350 1298 1314 1329 1346 1363 1390 1261
1472 1261 1222 1183 1173 1164 1130 1096 1192 1288 1358 1427 1418 1410 1356 1303 1161 1176 1147 1118 1176 1234 1257 1280 1225 1170 1259 1349 1438 1527 1425 1324 1403 1483 1385 1286
1467 1286 1265 1245 1270 1295 1330 1365 1327 1445 1475 1505 1481 1456 1431 1406 1381 1357 1332 1307 1335 1362 1389 1417 1374 1332 1290 1247 1365 1483 1419 1355 1290 1224 1288
1462 1288 1353 1424 1495 1473 1295 1307 1319 1448 1421 1392 1362 1400 1439 1499 1559 1490 1421 1386 1351 1316 1281 1306 1331 1278 1225 1194 1163 1209 1256 1227 1198 1247 1297
1457A297L3L4onl9m0L9L8n4n4j5j6k2k3N6N5N7N7k1k0opL3L3j3j3n3n2Q9Q9J1J1j45j46Q8
1452A270Q8J7J8k2k1m6m6J20J19R2j67k2k2qqL1L0p2p2ONM9M9k9k9p4p4R7R8o0k15j53J06
1446A055K20O3L8L8j7j8r6r5N4N5J6J5L3L2m5m5M9N0M9N0j01j02K9K8L5L5L5L5N1N0k8k7j33
1441A408j33n5n6J19J18j1j2POl2l2LMM3M2K2K1n6n6m5m5L3L3N8N8k0k0l6l6p5p5R4R3J6J6
1436A399l3l2p2p2J3J2N2N1l3l4M5M4qpm7m6kkjkR9J00q2q2P0P0o0o0J9J8k0k0N8N9k0j9l2
1430A323l2l2l1qqP1P0K6K7j3j2J3J2k6k6l9m0R1R0NNp3p3j9j9K0K1kjP6P6n5n5P5P4k6k7
1425A458J2J1M4M4l5l4J3J2j17j17Q5Q4m5m5ooL3L3K2K2j07j07j1j0O8O8OOj14j14j50NJ96
1420A204J17N4N4q0q0J8J9o0n9O8O8j0j0OOM4M5n8n7j9j8n2n2K6K6O5O5K6K6K7K8K8K7LKq0
$$ plain form
1457 1297 1330 1364 1358 1353 1314 1274 1313 1351 1297 1243 1228 1212 1190 1167 1223 1278 1335 1392 1371 1351 1345 1338 1371 1404 1391 1378 1325 1273 1362 1451 1462 1473 1328 1182 1270
1452 1270 1358 1375 1393 1371 1350 1304 1258 1378 1497 1589 1422 1400 1378 1370 1362 1393 1423 1351 1279 1285 1290 1339 1388 1359 1330 1256 1182 1279 1377 1317 1102 949 1055
1446 1055 1275 1338 1376 1414 1397 1379 1283 1188 1242 1297 1313 1328 1361 1393 1348 1303 1352 1402 1451 1501 1400 1298 1327 1355 1390 1425 1460 1495 1546 1596 1568 1541 1408
1441 1408 1275 1220 1164 1283 1401 1390 1378 1385 1391 1359 1327 1330 1334 1377 1419 1441 1462 1406 1350 1305 1260 1293 1326 1384 1442 1422 1402 1366 1330 1255 1180 1274 1367 1383 1399
1436 1399 1366 1334 1262 1190 1203 1215 1267 1318 1285 1251 1296 1340 1332 1325 1278 1232 1230 1228 1227 1225 1324 1424 1342 1260 1330 1400 1340 1280 1299 1317 1297 1277 1335 1394 1374 1355 1323
1430 1323 1291 1259 1228 1220 1212 1283 1353 1379 1406 1393 1381 1394 1406 1380 1354 1315 1275 1366 1456 1461 1466 1393 1320 1301 1282 1302 1323 1321 1320 1396 1472 1417 1362 1437 1511 1485 1458
1425 1458 1470 1481 1525 1569 1534 1500 1513 1525 1408 1291 1376 1460 1415 1370 1364 1358 1391 1424 1446 1468 1361 1254 1243 1233 1301 1369 1375 1381 1267 1153 1003 1008 1204
1420 1204 1321 1375 1429 1349 1269 1287 1306 1246 1187 1255 1323 1313 1303 1309 1315 1359 1404 1346 1289 1270 1252 1200 1148 1174 1200 1265 1330 1356 1382 1409 1437 1465 1492 1495 1497 1417
1414A417q0j3r1o6Q9M6j09K7K7N0N1N0N1J6J5J6J6j01j00k4N4P1q5l1l2n6n6J6J7L5m4J66
1409A342J1j%K9K9n5n5n4n5R6R5l4l5J5J4J4J4m9n0Q0Q0m8m7qrk2k3k2k3k3k4N5N4J7J6o1
1404A263o1llllK2K3K2K3K7K7K8K7o6o6m2L6J43j3j47QJ30k5n9n8R1R0M8j08j6j7o6o5O3O2
1399A312K4K4r2r2m9J06L7L7l1l1J05J06k5k4k3k3k3k3M2M2%j56L6L6K5K6j13j14O8O8K8K9
1394A332j1j1N5N4k3k4K1K0j8j9j0rj0rJ4J5p3Q3K8K8kjJ2J2L1j25n7R8J27k8o1o0J03J02
1388A584Q3p1J5J6j15j16l8l7M7M8l1l0J7J7o1o1J8J9J8J9N5N6k2k2o0o0P0P0J1J2o7o6J0
1383A328J1o8o7P1P1opqql8l7p6Q1P0P0l5l5M3M3J4J5k5k4m9m9Q1Q1L5L5m3m3J0Ro8o9LKM1
1378A359M1J5J5o3o3l9m0Q1Q1J41j5m6m7j01N6l3l2llJ26J27q7q6m8m8O3O2o8o7K9K9K9K8
$$ plain form
1414 1417 1337 1324 1233 1167 1256 1302 1193 1220 1247 1297 1348 1398 1449 1465 1480 1496 1512 1411 1311 1287 1341 1412 1327 1296 1264 1208 1152 1168 1185 1220 1176 1342
1409 1342 1353 1352 1352 1381 1410 1355 1300 1246 1191 1287 1382 1348 1313 1328 1342 1356 1370 1321 1271 1351 1431 1383 1336 1328 1319 1297 1274 1252 1229 1206 1182 1237 1291 1308 1324 1263
1404 1263 1202 1199 1196 1193 1190 1212 1235 1257 1280 1307 1334 1362 1389 1323 1257 1215 1251 1394 1381 1234 1242 1372 1347 1288 1230 1321 1411 1459 1351 1335 1318 1252 1187 1250 1312
1399 1312 1336 1360 1268 1176 1127 1233 1270 1307 1276 1245 1350 1456 1431 1407 1384 1361 1338 1315 1357 1399 1399 1243 1279 1315 1340 1366 1253 1139 1207 1275 1303 1332
1394 1332 1321 1310 1365 1419 1396 1372 1393 1413 1395 1376 1366 1357 1347 1338 1352 1367 1294 1377 1405 1433 1431 1430 1442 1454 1485 1360 1303 1401 1528 1500 1439 1379 1482 1584
1388 1584 1667 1596 1611 1627 1512 1396 1358 1321 1368 1416 1385 1355 1372 1389 1328 1267 1285 1304 1322 1341 1396 1452 1430 1408 1348 1288 1358 1428 1439 1451 1384 1318 1328
1383 1328 1339 1271 1204 1275 1346 1340 1333 1325 1317 1279 1242 1166 1247 1317 1387 1352 1317 1360 1403 1417 1432 1407 1383 1334 1285 1366 1447 1482 1517 1474 1431 1441 1450 1382 1313 1316 1318 1359
1378 1359 1400 1415 1430 1367 1304 1265 1225 1306 1387 1528 1513 1467 1420 1319 1375 1342 1310 1307 1304 1430 1557 1470 1384 1336 1288 1351 1413 1345 1278 1307 1336 1365 1393
1373A393K1K0j52j52m3J14J03J04l1l1RQq0q0j2j2J81K5j8j7KLQ0Q0k5k5j03j03J8J7o1o0
1368A173N9O0j8j8l7l8M0M1n3n3o2R3L0K9%%O6O7j1j2j03j02k6k5J17J17J36j9j69j3K0J9
1363A308n8n8L5J92m9m8QQk6J03q6rP8n2K0R9PPk1r8j70O4J20o1k6k6N4N4N1N2N1N1l8l9p8
1358A419p7NNP0P0nmnnl3l3l3l3j2j1j2j2K3K3K3K4k8k7POM4l4r7Q5O4j4m9n0J6J7N5N5RJ0
1352A456n5n6k2k3n1n0j02P9J15j5k6k6NMN8N8K0J9j9j9n8n8RJ0RRPPM6M6l3l4j08P4J00q2
1346A294L1L2LMLMmmlmQ0P9l7l7p6p7J4J4Q8Q7n5n5O4O5n3n3KKJKOPOOl7l7JKo4o4l5J21M2
1340A365M2K3j32m6m5Q8Q8NOl3l4KJJ1J2m1J15o3o3LKM2M1q4q4L3L2k8k9k6J30K6K6llO3O3
1334A505Pj48m0m1n0n0Q5Q6K0K1JJl8l8j09j09J4J70J64Qj1j1JKq7O9m3m2K2K2J15m1n0J06
$$ plain form
1373 1393 1414 1434 1282 1130 1087 1201 1304 1408 1377 1346 1355 1363 1283 1203 1191 1179 1360 1385 1367 1350 1352 1355 1435 1515 1490 1465 1362 1259 1277 1294 1233 1173
1368 1173 1232 1292 1274 1256 1219 1181 1221 1262 1209 1156 1094 1187 1217 1246 1246 1246 1312 1379 1368 1356 1253 1151 1125 1100 1217 1334 1470 1451 1282 1269 1289 1308
1363 1308 1250 1192 1227 1419 1370 1322 1330 1338 1312 1415 1329 1320 1398 1346 1366 1465 1472 1479 1458 1360 1190 1254 1374 1313 1287 1261 1315 1369 1420 1472 1523 1574 1536 1497 1419
1358 1419 1342 1347 1352 1422 1492 1487 1483 1478 1473 1440 1407 1374 1341 1329 1318 1306 1294 1317 1340 1363 1387 1359 1332 1339 1345 1389 1355 1258 1343 1407 1393 1344 1294 1310 1327 1382 1437 1446 1456
1352 1456 1401 1345 1323 1300 1249 1199 1097 1176 1291 1276 1250 1224 1229 1233 1291 1349 1369 1388 1369 1350 1292 1234 1243 1253 1262 1271 1278 1285 1331 1377 1344 1310 1202 1276 1376 1294
1346 1294 1325 1357 1360 1364 1367 1371 1367 1363 1360 1356 1436 1515 1478 1441 1365 1288 1302 1316 1404 1491 1436 1381 1445 1510 1457 1404 1406 1408 1409 1411 1417 1424 1430 1436 1399 1362 1363 1365 1301 1237 1202 1323 1365
1340 1365 1407 1430 1298 1252 1207 1295 1383 1388 1394 1361 1327 1329 1330 1341 1353 1312 1427 1364 1301 1304 1306 1348 1389 1305 1221 1254 1286 1258 1229 1203 1333 1359 1385 1382 1379 1442 1505
1334 1505 1512 1364 1324 1283 1233 1183 1268 1354 1374 1395 1396 1397 1359 1321 1212 1103 1117 1287 1451 1459 1448 1437 1438 1440 1353 1422 1379 1337 1359 1381 1496 1455 1405 1511
1329A511nj61o3o4J2J1J1J1J0RRJ0K7K7l8l7R1R1n1n1k3k3k3k3P2P1L2L3o5o5k6k6J1J1J1
1323A327J1L6L6R5o2j75k0N1N1K6K6K7K6q2q2P0q5l3l3P0O9M0l8j47Rj6j6pom1m0K4K4M1M0
1318A216M1M0n8n8N9N8k3k3o3o2J41J40M0M0K9j26l9l8j7j7K1K2L4L4j29j30J9R8J02n4J7
1313A314J6M5M6m5m5J8R6Q9o7j35n8N4N4N9N9o8o8r1O4L3L2j3j69k3k4L6L7m4L5P8p7onN0
1308A277N0M7M8o9o9j18j19P7P6N3N4N4N3ppN8N8j02j02M1M1o8o8o8o7mlllO4O5k6k6M8M8
1303A283RRL2L3L2L2j09j10POL5L4L5L4MMo2o1j7j8P4P3ooooJJq9r0Q3Q3J7J8kklkL2L2n9
1296A355n9K1K0K1K0J8J8m7m7nnnnL3L3l2l2K7K7l7l8j6j6P5P5k4k3k3k3lkL7L6J7J6m8m9
1291A310O1O1K3K2k4k3q8q8K0K1j9j8R6R7L2L2n9n9k1k0k2k3J6J7LLMLL7L8n4n3L0L0K9L0
$$ plain form
1329 1511 1506 1345 1282 1218 1230 1241 1252 1263 1273 1282 1291 1301 1328 1355 1317 1280 1371 1462 1411 1360 1337 1314 1291 1268 1340 1411 1443 1476 1411 1346 1320 1294 1305 1316 1327
1323 1327 1338 1374 1410 1505 1443 1268 1248 1299 1350 1376 1402 1429 1455 1373 1291 1361 1276 1243 1210 1280 1349 1389 1351 1204 1213 1197 1181 1174 1168 1127 1087 1111 1135 1176 1216
1318 1216 1257 1297 1239 1181 1240 1298 1275 1252 1189 1127 1268 1408 1448 1488 1517 1391 1352 1314 1297 1280 1301 1323 1357 1391 1262 1132 1151 1249 1351 1297 1314
1313 1314 1330 1375 1421 1376 1331 1349 1445 1534 1467 1332 1274 1328 1382 1441 1500 1432 1364 1273 1337 1370 1402 1389 1220 1197 1173 1209 1246 1202 1237 1315 1238 1232 1227 1277
1308 1277 1327 1374 1422 1353 1284 1166 1047 1124 1200 1253 1307 1361 1414 1407 1400 1458 1516 1414 1312 1353 1394 1326 1258 1190 1123 1119 1116 1113 1110 1174 1239 1213 1187 1235 1283
1303 1283 1292 1301 1333 1366 1398 1430 1321 1211 1218 1224 1259 1293 1328 1362 1366 1370 1308 1247 1230 1212 1286 1359 1353 1347 1341 1335 1336 1337 1248 1158 1241 1324 1341 1359 1357 1355 1352 1350 1382 1414 1355
1296 1355 1296 1317 1337 1358 1378 1396 1414 1367 1320 1315 1310 1305 1300 1333 1366 1334 1302 1329 1356 1319 1281 1265 1249 1324 1399 1375 1352 1329 1306 1303 1301 1338 1374 1391 1407 1359 1310
1291 1310 1371 1432 1455 1477 1453 1430 1342 1254 1274 1295 1276 1258 1354 1451 1483 1515 1456 1397 1376 1356 1334 1311 1327 1344 1347 1350 1354 1357 1394 1432 1378 1325 1355 1385 1414 1444
1285A444pop2p1j6j6n4J01J72q8p5p5kkP6P6n4n3K5K4ooooL1L1L1L1m3m4m4m3J5J6k3k4J%
1280A238P8P8O4O4o5o6r7r8k0j9L8L9L9L8OPOOk6k7k6k6J6J6J6J6Q5Q6q6q7o4R1MMl4l3R6
1274A357R6L3L4rj65r0r0k2k2Q8Q7J0J0N9N9j8j9NMM4M3k9l0%jJ05n2m2m2R9R8O3j97r9j00
1269A267J4J4R0R0M8j07J6J6J6J7j65rJ31k5p4Q2n4n5l4l3M3M4o6o6J2J2L9M0L9M0M6M6l2
1264A442l1l8l9l8l8O4O4j10M4P9p7K1K0l1l0l1l1K8K8K8K7LKKLj7j7j7j7n6n5m5m6LJ59P2
1258A325P1m1m1m1m1j4j5m3m3p3Q3P4P4J9J9o8Q7LMj17j17j5j5K4K3J2J1Q9R0J0J1J1J0jj
1253A364J8j37k0J35r2r2M5M5M5M5k6k6P1q5j33K3ppR8n9n8R7M8M8k0k1N8N8k0k1J5J4J4J4
1247A431K6K6K7K6p1p1j98m2J12J13qqk9k9o7o8l0l0J00J00j6j5j6j6POPPQRK8j28o5R1oo
$$ plain form
1285 1444 1437 1431 1359 1288 1272 1256 1202 1303 1475 1387 1312 1237 1235 1233 1309 1385 1331 1278 1303 1327 1321 1315 1309 1303 1334 1365 1396 1427 1384 1340 1296 1253 1268 1284 1261 1237 1238 1238
1280 1238 1316 1394 1458 1522 1457 1391 1294 1196 1176 1157 1195 1234 1273 1311 1317 1324 1330 1336 1310 1283 1257 1231 1247 1263 1279 1295 1380 1466 1380 1293 1229 1320 1324 1328 1294 1261 1357
1274 1357 1453 1486 1520 1511 1346 1256 1166 1144 1122 1210 1297 1307 1317 1376 1435 1417 1398 1403 1407 1451 1494 1465 1435 1435 1434 1539 1487 1445 1403 1502 1600 1663 1466 1367 1267
1269 1267 1281 1295 1385 1475 1523 1416 1432 1448 1464 1481 1316 1307 1438 1413 1339 1421 1367 1312 1278 1245 1288 1332 1266 1200 1212 1224 1263 1303 1342 1382 1428 1474 1442
1264 1442 1411 1373 1334 1296 1258 1322 1386 1276 1320 1399 1322 1343 1363 1332 1302 1271 1240 1268 1296 1324 1351 1354 1356 1358 1361 1344 1327 1310 1293 1237 1182 1137 1091 1094 1253 1325
1258 1325 1396 1355 1314 1273 1232 1218 1203 1160 1117 1044 1127 1201 1275 1294 1313 1245 1332 1335 1339 1222 1105 1090 1075 1099 1122 1134 1145 1234 1324 1334 1345 1356 1366 1365 1364
1253 1364 1382 1245 1225 1360 1268 1176 1221 1266 1311 1356 1330 1304 1375 1290 1157 1180 1173 1166 1264 1205 1147 1244 1292 1340 1320 1299 1357 1415 1395 1374 1389 1403 1417 1431
1247 1431 1457 1483 1510 1536 1465 1394 1196 1154 1266 1379 1371 1363 1334 1305 1238 1170 1140 1110 1210 1310 1294 1279 1263 1247 1254 1260 1267 1274 1282 1291 1319 1191 1126 1217 1211 1205
1242A205L1L1L1L1l3l2m3J13qpn6J00J08m7O0r6N4N3q6q6O3O4o2R3P3P3m7m7j17j17m0l9j1
1237A209j1j1j0M8M8Q8Q7l5l5M3M3p3p2J5J5j26K9k0k0J00R9l0l0M4M5l4l3r3r2L7L7N6N6
1232A374J8J7JJL0L1Q4p2o2o3m5m5L3L3J3J4R1R2o6o6o6o6O4O5o6o5K7K7K7K7j9j8j8j9k1
1227A292k0k1k1N4N3J4J5n1n1rJ46K7K6m1m2o1o1K7K7r1O5J43j3p3p3M7M7j5j6j5j6LKKLK4
1221A327K5K4K5k1k1k1k1J2J3p5Q0kkPQm0m0K9K8P7p8p9P7N5N5j4j3K0K1K1K0mmlmk4k3k3
1215A412k4kllkj0j0K9K9J9K0n8n9m3m4n3J02l9m0RRj2j2q9r0Q1Q2N3N2p0Q6q0q0P5P4r8r7
1210A114KJ59L2L2mnM4j12k1k2QPP4P4mmOPN5j00M3M3noj7j8o6Q9j5j6onq8q8M2M2r1r2L8
1204A126L8Q1Q2N0j07p2Q3P3q2l1l1Q9Q9m1m0jkm7m8n7R8J07J07llj15M0L1L1l1l0l0l0k6
$$ plain form
1242 1205 1236 1267 1298 1329 1296 1264 1221 1334 1326 1319 1263 1363 1471 1424 1484 1388 1442 1495 1409 1323 1386 1450 1388 1481 1554 1627 1580 1533 1416 1299 1259 1220 1209
1237 1209 1198 1187 1177 1225 1273 1361 1448 1413 1378 1421 1464 1391 1319 1334 1349 1223 1252 1232 1212 1312 1411 1381 1351 1395 1440 1406 1373 1280 1188 1225 1262 1318 1374
1232 1374 1392 1409 1410 1411 1441 1472 1556 1484 1422 1359 1314 1269 1302 1335 1348 1362 1453 1545 1479 1413 1347 1281 1345 1410 1344 1279 1306 1333 1360 1387 1368 1350 1332 1313 1292
1227 1292 1272 1251 1230 1284 1337 1351 1366 1315 1264 1255 1401 1428 1454 1413 1371 1310 1249 1276 1303 1212 1277 1420 1407 1334 1261 1308 1355 1340 1324 1309 1293 1296 1298 1300 1303 1327
1221 1327 1352 1376 1401 1380 1359 1338 1317 1329 1342 1267 1347 1345 1343 1350 1358 1318 1278 1307 1335 1412 1334 1255 1332 1387 1442 1428 1415 1435 1456 1477 1497 1493 1489 1486 1482 1458 1435 1412
1215 1412 1388 1386 1383 1380 1378 1368 1358 1387 1416 1435 1455 1397 1338 1295 1251 1198 1300 1261 1221 1230 1239 1227 1215 1126 1036 1117 1199 1252 1304 1234 1320 1240 1160 1235 1309 1211 1114
1210 1114 1116 1275 1307 1339 1335 1330 1374 1262 1241 1219 1227 1234 1308 1382 1378 1374 1380 1387 1442 1342 1385 1428 1423 1417 1400 1382 1316 1405 1390 1374 1368 1363 1275 1187 1229 1271 1180 1088 1126
1204 1126 1164 1245 1327 1377 1270 1198 1281 1354 1272 1241 1210 1299 1388 1347 1307 1306 1304 1257 1209 1152 1250 1357 1464 1461 1458 1343 1383 1414 1445 1414 1384 1354 1324 1298
1199A298k5k6k5J4J4J4J4K3K2n5n5j2j2m2m2p4Q0J23J23k4k4j5j4p5Q1opJJJ%K1K0K0K0m2
1193A315m2m3m2k0j9N8N8L2L2m6m6L0L0%%j28K7J7J8K0K1rqj16L9Q2Q1j23j24N9N8P1P1op
1188A340q4q5opk6k6J04J04p6p5l7l6k7k7J03J03k2k1k1k1R0R0l9m0Q2Q3Op2q3P2O8q8m5m5
1182A236L3L3o4R2Ro9QQP6P6K1n8j88l4J46j1r5r4L1L2K2K2P9p7J1J0l9l8l9l9J11J11p0p1
1177A181L6L6P5P4l2l2M5M6l8l7JJl2l2M6M6J4J4o4o4L0L0L0L0k7k7k7k8Q0Q0j02j02j5j6
1172A220O3O2k1k0k0k1jjP6P7j2j1n1n1j5j5J55%r7j9NOp5p4M6M6J0j46k0J35J04K7j01j02
1167A159K4K3K4K3MNMMMMMMJ7J7J7J6j5j6j6j5KLLKK3K2K2K2l8l9l9l8KKP9Q0j9k0j9j9L1
1161A353L1L1L0l2l3l3l2j06j06K4K4RQRQllJ48J8k5k6l3l4K1K1j8j8m1m1L7J15J10j8j9j9
$$ plain form
1199 1298 1273 1247 1222 1236 1250 1264 1278 1301 1323 1268 1213 1201 1189 1147 1105 1031 1111 1234 1357 1333 1309 1294 1280 1205 1286 1280 1273 1274 1275 1276 1276 1297 1317 1337 1357 1315
1193 1315 1273 1230 1188 1168 1149 1207 1265 1297 1329 1283 1237 1267 1297 1297 1297 1169 1196 1213 1231 1251 1272 1263 1255 1139 1178 1260 1341 1218 1094 1153 1211 1282 1353 1347 1340
1188 1340 1256 1171 1165 1158 1132 1106 1210 1314 1238 1163 1126 1090 1063 1036 1139 1242 1220 1199 1178 1157 1247 1337 1298 1258 1340 1423 1429 1357 1274 1346 1414 1326 1281 1236
1182 1236 1269 1302 1238 1330 1339 1270 1278 1286 1362 1438 1459 1401 1213 1179 1325 1314 1219 1125 1156 1188 1210 1232 1311 1234 1245 1255 1216 1178 1139 1100 1211 1322 1252 1181
1177 1181 1217 1253 1328 1402 1370 1338 1383 1429 1391 1354 1355 1356 1324 1292 1338 1384 1398 1412 1348 1284 1314 1344 1374 1404 1377 1350 1323 1295 1375 1455 1353 1251 1236 1220
1172 1220 1283 1345 1324 1304 1284 1263 1262 1261 1337 1414 1402 1391 1340 1289 1274 1259 1414 1414 1317 1298 1303 1309 1234 1160 1206 1252 1262 1116 1096 1231 1335 1362 1261 1159
1167 1159 1183 1206 1230 1253 1257 1262 1266 1270 1274 1278 1282 1286 1303 1320 1337 1353 1338 1322 1306 1291 1293 1296 1299 1301 1324 1346 1368 1390 1352 1313 1274 1236 1238 1240 1319 1399 1380 1360 1341 1322 1353
1161 1353 1384 1415 1445 1413 1380 1347 1315 1209 1103 1127 1151 1160 1168 1177 1185 1182 1179 1327 1345 1320 1294 1261 1227 1248 1269 1251 1233 1192 1151 1188 1303 1413 1395 1376 1357
1155A357r9r9L0L1O8O8o2J6J32KmlO0j7m7Q3l3l2k4k5mnnnm1m1l7l7o8QJ16j4m9n0J6J5mq2
1150A115l8R1J24M5l2l3nnj3j3O3o7o6O3K5K4nop7p8J93L6nnj4j5K7K7m2m1p2Q4J61Om4m5
1144A363P6P6r6r6L5L4m5m6ooP9Q0qqO7q8l9m0QRQ6Q6l5l4j22L4m9m9m9m9J33k3k3J33j8j8
1139A352q6q7L3L3L3L3j0j1N7N7pj63KKN9N9O9q7k6k5l6l5o0o0P0P0N0M9k8k9LKLKo7o8J7
1133A170J73J04n1PPm8m8rrk3k3n2n3r0O4R8R7R2o3j02N3K8K8L8L8l6l6l6l6POOOn2n2K6K5
1127A254k8k7N9O0rJ47Q0p7j07M8K9K8k1k1k2k1k3k2R7R8m5k01j14j13J9J9R7R6M1M1l7l7
1122A288J9J9N8N8j44j44nmj19L7Q0P9O3O4j5j5ooq4q4N3N3q3P2O4r2M8K04LLo5o5K2K2K2
1117A400K1j0j1j0j1l4l4M4M4k5k4k4k5M3M2m5m5R8n9m8m8PPQPn3n4k1J35Q9o7qqK0K0M9N0
$$ plain form
1155 1357 1258 1159 1189 1220 1288 1356 1294 1310 1442 1444 1440 1437 1497 1480 1433 1516 1483 1451 1427 1402 1398 1393 1388 1383 1342 1301 1264 1227 1159 1167 1283 1269 1220 1170 1186 1201 1197 1115
1150 1115 1077 1168 1292 1337 1305 1272 1267 1262 1249 1236 1299 1232 1166 1229 1254 1278 1273 1267 1190 1112 1305 1341 1336 1331 1317 1302 1329 1356 1314 1273 1201 1285 1446 1452 1408 1363
1144 1363 1439 1515 1419 1323 1358 1392 1347 1301 1295 1289 1368 1448 1440 1432 1499 1411 1372 1332 1340 1349 1435 1521 1486 1452 1330 1364 1315 1266 1217 1168 1301 1278 1255 1388 1370 1352
1139 1352 1266 1179 1212 1245 1278 1311 1301 1290 1347 1404 1397 1234 1236 1238 1297 1356 1425 1338 1312 1287 1251 1216 1156 1096 1166 1236 1286 1335 1307 1278 1281 1283 1286 1288 1221 1153 1170
1133 1170 1343 1447 1396 1403 1410 1362 1314 1305 1296 1273 1250 1198 1145 1055 1119 1217 1314 1406 1343 1241 1294 1322 1350 1388 1426 1390 1354 1318 1282 1289 1295 1301 1307 1255 1203 1229 1254
1127 1254 1226 1199 1258 1318 1309 1456 1536 1459 1352 1400 1429 1457 1436 1415 1393 1372 1349 1327 1424 1522 1477 1276 1162 1049 1068 1087 1184 1280 1321 1362 1325 1288
1122 1288 1307 1326 1384 1442 1298 1154 1149 1145 1026 1063 1143 1222 1285 1349 1334 1319 1313 1307 1223 1139 1192 1245 1162 1234 1298 1206 1254 1458 1461 1464 1399 1334 1356 1378 1400
1117 1400 1421 1411 1400 1390 1379 1345 1311 1355 1399 1374 1350 1326 1301 1344 1386 1341 1296 1394 1335 1287 1239 1246 1253 1261 1268 1215 1161 1140 1275 1364 1297 1289 1281 1301 1321 1370 1420
1111A420J10m5LMm1m0m1m0N2N1N2N2q6q6P9p6j2j1k1k1J1J1J1J2j4j4J15J16k4k4l3l4Q0p5
1106A441j18j18N3N2k5k6m5m4n5J01J01J01L3L3j01j02n9R7m6m5LLKKKKJ7J6J7J6k2k3J7J6
1101A296J1J2K1j34L2L3O2O2n9n9J9J9J1J2o6o6J4J5J5J5J2J3J2J3ppppNMNNJ3J3K2K3j30
1095A247K6O8O8n8n8J9J9%%j%m9m9o9Q7O9q7J07m8q1P4o2o2N9N9j9j9O7O8o2o2j7j6l7J20
1090A301Q6o9O6O7M3M4l5l5o2o2J6J5J6J6N5N5j05j05j5j4P4P3m3m3j8j7K1K2N1N2j4j3n9
1085A364n8OOLKO2r5j22L4N3N3Q7Q6l0l0J3J3j30j29KJKKl9l9K5K6K5K4R0R0p4p4j0ro5o6
1079A099k6k7Q1Q1M1M2k2k2O9O9k6k6O5O5k8k7k8k8Q4Q3J9J8j43j43K6K5N7N6J8J7k1k1o1
1074A366o0L5L6mlJ4J4M7j09j39J7M6j10L4L3K4K4o1o1M6M6J09m7q5P0M6M5K7K6j08M8%jP1
$$ plain form
1111 1420 1530 1485 1488 1492 1451 1411 1370 1330 1382 1433 1485 1537 1451 1365 1444 1368 1356 1345 1324 1303 1314 1325 1336 1348 1334 1320 1435 1551 1527 1503 1470 1436 1516 1441
1106 1441 1323 1205 1258 1310 1285 1259 1214 1170 1115 1216 1317 1418 1451 1484 1383 1281 1222 1319 1273 1228 1231 1234 1236 1238 1240 1242 1259 1275 1292 1308 1286 1263 1280 1296
1101 1296 1307 1319 1340 1206 1238 1271 1333 1395 1336 1277 1296 1315 1326 1338 1272 1206 1220 1235 1250 1265 1277 1290 1302 1315 1308 1301 1294 1287 1292 1296 1301 1306 1319 1332 1354 1377 1247
1095 1247 1273 1341 1409 1351 1293 1312 1331 1331 1331 1330 1330 1281 1232 1163 1250 1319 1232 1339 1291 1210 1284 1222 1160 1219 1278 1259 1240 1307 1375 1313 1251 1234 1218 1181 1301
1090 1301 1387 1318 1384 1451 1494 1538 1503 1468 1406 1344 1360 1375 1391 1407 1462 1517 1412 1307 1292 1278 1352 1425 1382 1339 1321 1304 1325 1347 1398 1450 1436 1423 1364
1085 1364 1306 1312 1318 1321 1323 1385 1290 1168 1202 1255 1308 1395 1481 1451 1421 1434 1447 1317 1188 1190 1191 1193 1195 1156 1117 1142 1168 1193 1217 1307 1397 1323 1249 1239 1230 1165 1099
1079 1099 1073 1046 1127 1208 1249 1291 1269 1247 1316 1385 1359 1333 1398 1463 1435 1408 1380 1352 1436 1519 1538 1556 1413 1270 1296 1321 1378 1434 1452 1469 1448 1427 1366
1074 1366 1306 1341 1377 1373 1370 1384 1398 1445 1336 1197 1214 1260 1150 1184 1217 1241 1265 1204 1143 1189 1235 1344 1297 1212 1282 1328 1373 1400 1426 1318 1366 1366 1365 1436
1069A436P0m6m6r6r7P3P2K7K7j2j2MMm5J11L0L0Lp6j01N4K7K6M3M3m8m8POl3l3J9J9p2p2k6
1064A268k6L9L9q3q3j8j8L7L6P5P6l1l0O1O1j3j3p8p7J7J7J7J7M7M7m5m4M4M3k1k1K3K3J4
1058A400J3K5j30o1R4J1Q9J03K5q0kr5j7k7k7M2M3qro2J6O2r3jjl2l2OOJ7J6J6J7K5K5N9N9
1053A492m0j18k3J31L3m5M6J24J31k5J16J16J37K93L68Q34J487K264J56k282j722q39l77l00
1049A957o7o7j01j02n1n1K7K7k3k3j21L6N9r6KJLLMLo5o5MLR5o1L7j19l0l0l0l0kJ54kko7
1043A210Q9Q9o7j03j04O8O9PPp0p0P8P8J27k9m7m8K1K0Q6Q6m4m3j19j18m1J15J95o4j43j42
1039A093O0O1j8j7KLLLO9O9P0O9l8l7l8l8n5n6J17J16Lj53o5o5K0K1K1K1K3K4K3K4n2n2j3
1033A218j3k2k3N6N5M4M4p6p6q1P5J14m2l8l7Q2Q2j%jjj2j2j2j2K7K8K7K7p3p2NNk1k2J8J7
$$ plain form
1069 1436 1506 1460 1414 1318 1221 1294 1366 1393 1420 1408 1396 1400 1404 1359 1470 1500 1530 1533 1457 1356 1410 1437 1463 1506 1549 1501 1453 1460 1466 1433 1400 1419 1438 1366 1294 1268
1064 1268 1242 1281 1320 1237 1154 1136 1118 1155 1191 1266 1342 1311 1281 1342 1403 1390 1377 1299 1222 1239 1256 1273 1290 1337 1384 1339 1295 1339 1382 1361 1340 1363 1386 1400
1058 1400 1413 1438 1308 1247 1341 1352 1441 1544 1569 1489 1487 1392 1375 1348 1321 1363 1406 1398 1389 1327 1343 1405 1312 1311 1310 1278 1246 1252 1258 1275 1291 1307 1324 1349 1374 1433 1492
1053 1492 1452 1334 1311 1442 1475 1430 1476 1600 1731 1706 1822 1938 2075 2368 2736 3570 5057 7321 7477 5195 3473 2634 2257 1957
1049 1957 1890 1823 1722 1620 1569 1518 1545 1572 1549 1526 1405 1441 1500 1404 1406 1407 1410 1413 1417 1420 1355 1290 1294 1297 1392 1331 1368 1249 1219 1189 1159 1129 1127 1281 1279 1277 1210
1043 1210 1299 1388 1321 1218 1114 1182 1251 1258 1265 1195 1125 1203 1281 1408 1379 1332 1284 1305 1325 1411 1497 1453 1410 1291 1173 1132 1247 1442 1378 1235 1093
1039 1093 1153 1214 1196 1179 1181 1184 1187 1190 1259 1328 1398 1467 1429 1392 1354 1316 1261 1205 1322 1438 1441 1288 1223 1158 1178 1199 1220 1241 1264 1288 1311 1335 1283 1231 1218
1033 1218 1205 1183 1160 1216 1271 1315 1359 1283 1207 1126 1201 1315 1273 1235 1198 1280 1362 1361 1361 1360 1359 1347 1335 1323 1311 1338 1366 1393 1420 1347 1275 1280 1285 1264 1242 1260 1277
1028A277k2k2N5N6N6N7j25j25R3R2l7l7J9K0j11j10n0n0J31J31M3M3M3M3%Jq7q7R5o2K6K7
1023A383o3o2J6J6l0k9J0RpqppQRRRRQRRj2j2j1j2R2R2J4J4M2M1j31j30j5J41O4j5j19m2P5
1017A367q0kkk1k1M7j08o5J4Q0P9L2J09K3j32j0O7Ro9o4J4QPJ3J2LKp5p5j1j2O7O6N1N0N0
1011A423N1j6j7j6j6p7p7p7p7Q3Q3M3M4MMM3M3n7n8o4R2J37j7J4J5k1k1k1k1N5N6rqJ24J25
1006A769L98N53O63j2p67n07k33k32p4p4q0q0N2N3J14m2j24j23J0J0L9L9P5q1L6L6R1o5m2
1002A402m2n6n7L5L4k9k9L6L6klo7o7J08J08O9O9j04j05K2j33M4M4L4L4p5p4j0rl3l3J09J10
997A366qqp3p3L5L5P4P4m2m2m2m2l8l8N3N3L2L3K9j27M2M1P0P1k9k8k9k9k7k7j7j7p9P7J32
991A402J32L0L0q7q6k6k5k5k6J33J33o2o2M8M9RRP9P9J5J4J56J56K73N32J012J687K504K245
$$ plain form
1028 1277 1255 1233 1288 1344 1400 1457 1332 1207 1300 1392 1355 1318 1337 1357 1246 1136 1086 1036 1167 1298 1341 1384 1427 1470 1470 1471 1384 1297 1392 1330 1356 1383
1023 1383 1320 1258 1274 1290 1260 1231 1241 1250 1243 1235 1228 1221 1229 1238 1247 1256 1265 1273 1282 1291 1279 1267 1256 1244 1336 1428 1442 1456 1498 1539 1408 1278 1263 1404 1468 1453 1334 1292 1367
1017 1367 1287 1285 1283 1262 1241 1288 1180 1115 1129 1209 1288 1320 1429 1452 1320 1310 1377 1386 1317 1253 1267 1275 1282 1295 1307 1310 1312 1237 1162 1151 1139 1206 1272 1323 1373 1423
1011 1423 1474 1458 1441 1425 1409 1332 1255 1178 1101 1184 1267 1310 1354 1358 1362 1405 1448 1391 1333 1269 1361 1498 1481 1495 1510 1489 1468 1447 1426 1481 1537 1528 1520 1644 1769
1006 1769 2167 2720 3383 3371 2604 2097 1864 1632 1558 1484 1404 1324 1376 1429 1543 1501 1377 1254 1264 1274 1313 1352 1427 1346 1382 1418 1509 1444 1402
1002 1402 1360 1304 1247 1282 1316 1287 1258 1294 1330 1328 1325 1258 1191 1299 1407 1476 1545 1441 1336 1358 1225 1269 1313 1347 1381 1306 1232 1222 1213 1180 1147 1256 1366
997 1366 1358 1350 1277 1204 1239 1274 1348 1422 1380 1338 1296 1254 1216 1178 1231 1284 1316 1349 1378 1251 1293 1334 1404 1475 1446 1418 1389 1360 1333 1306 1289 1272 1193 1270 1402
991 1402 1534 1564 1594 1507 1421 1395 1370 1345 1319 1452 1585 1523 1461 1509 1558 1567 1576 1655 1734 1749 1763 1919 2075 2348 2880 3892 5579 8083 10328
987A0328L94j941k649j870r95n29l25j69k84k85K4K3q9q9n1n0j2j2j3j2N3N2M3M3J7j38J4
983A478J4L9L9j0roj61r6N9j0j1m9J06L8L7m4m4POl2l3M0M0m1m2o1R5J34k2q4q4klRRJ0RK4
977A349K4O3O2j16j16P8P8J9J9k0k0n6n6RJ0J25J26r4r5J6J5k3k3q8q7MMJ2J3N1N2qqKKp0
971A253Q6L7L7m2m1lkj4j4K6K5pom6m5Q6Q6l1l1J18J17N3N3j22j22j11j12j8J38J08m7n6R8
966A451KKn2n3J3J3o2o2J33J33n0m9m9n0r4r3M8M9R9J00m4m3l7l7R6R6O2r5r9k1N2j04k6N2
961A281J12m3o8o8N6N6N7N6L8L9n3n2o8o8llQ9R0q0p9J1J1j05j05N8N9K0J9L1L0L0L0o4o4
956A250K6K7n8n8N9N9poppK1K0K0K0nonnj0rj0rN2N2M8l1j00J59R6o0p6p7NMM7M7QPl5l6l5
950A375l6mmL5L5O3O3J4J4l1j87j49QQ0P9n3n4P0P0L1L1j38j38q3P3PPJ7J6K3K2o8o9K8K8
$$ plain form
987 10328 10722 8781 6132 4262 3267 2738 2413 2244 1960 1675 1699 1722 1633 1544 1493 1443 1431 1419 1406 1394 1447 1499 1542 1585 1602 1464 1478
983 1478 1492 1531 1570 1560 1551 1545 1384 1288 1347 1337 1326 1277 1383 1421 1458 1414 1370 1377 1383 1351 1318 1358 1398 1357 1315 1254 1349 1483 1461 1377 1293 1291 1288 1297 1306 1316 1325 1349
977 1349 1373 1436 1498 1382 1266 1344 1422 1441 1460 1440 1420 1364 1308 1317 1327 1452 1578 1484 1389 1405 1420 1397 1374 1286 1199 1203 1207 1219 1232 1283 1335 1327 1319 1321 1323 1253
971 1253 1339 1376 1413 1371 1330 1327 1325 1311 1297 1323 1348 1341 1335 1289 1244 1330 1416 1385 1354 1472 1589 1642 1695 1573 1451 1340 1228 1210 1348 1456 1409 1353 1451
966 1451 1453 1455 1403 1350 1363 1376 1314 1252 1385 1518 1468 1419 1370 1320 1226 1133 1181 1230 1329 1429 1385 1342 1305 1268 1364 1460 1522 1427 1328 1307 1359 1255 1229 1281
961 1281 1393 1350 1282 1214 1270 1326 1383 1439 1477 1516 1463 1411 1343 1275 1272 1269 1358 1448 1368 1289 1300 1311 1206 1101 1159 1218 1238 1257 1288 1318 1348 1378 1314 1250
956 1250 1276 1303 1245 1187 1246 1305 1298 1292 1285 1278 1299 1319 1339 1359 1354 1348 1343 1338 1328 1319 1309 1300 1352 1404 1452 1421 1321 1480 1576 1516 1440 1363 1368 1372 1419 1466 1474 1481 1446 1410 1375
950 1375 1339 1335 1331 1366 1401 1464 1527 1541 1555 1524 1337 1188 1196 1276 1355 1302 1248 1318 1388 1419 1450 1312 1174 1091 1164 1171 1178 1195 1211 1234 1256 1188 1119 1147 1175
944A175R3R3J1J2k7k7r4r3P5P5nmL5L5N0M9j5j6q5q5N8N8JJj06j06j05N1P1P1J32k3n3n2K
939A252KO7O7J3J3k6k6K6K5K6K6m1m0m1m1Q1Q1j0j0o8o7r1O6l8l7J1J1n0n0J4J5L5L5P3P4
934A377M0M0n1n1j7j6J35k0j41j40J8J8LLLLJ3J4J3J4K2K2K3K2p0p0K4J80l2l2k2k2O3O3j5
928A414j4l0l0o9o8L5L6J14J14K0K0n8n8LKo6o6j00N6l2l2L2L1r8r9N4N3J31J31nmj31K4N3
923A363N4j5j5K7K7n1n0RJ0M9M9j3j3k3k3R0o6j05N1M8M8p1p2N3N3N3N4l5l4l5l4m7m7L1L1
918A351O6O7J54kj11j11m3m4K1K1K1K1%%m0l9l3l4M5M4K2K2n7n6PPQPL3L4m4m4J6J5N4N4o5
912A367o5QPoq5R6o1l5J21M3j13q7O8N8r7P6P5o2j40l4J21K9m9N0k7k7k7P2P2n8n7P5P5m5
907A338m5n4J03K5n3n6K3n5n5l0J26jjM3M3k5k5o7Q7O4j96Q3Nm1m0k8N0J32k3n7n7O4O3k1
$$ plain form
944 1175 1268 1361 1372 1384 1357 1330 1236 1143 1218 1293 1288 1284 1319 1354 1404 1453 1438 1422 1337 1252 1310 1368 1369 1370 1264 1158 1053 1104 1175 1246 1378 1355 1302 1250 1252
939 1252 1254 1321 1388 1401 1414 1388 1362 1388 1413 1439 1465 1424 1384 1343 1302 1383 1464 1454 1444 1376 1309 1218 1284 1246 1209 1220 1231 1181 1131 1145 1160 1195 1230 1303 1377
934 1377 1417 1457 1406 1355 1338 1322 1457 1437 1296 1156 1174 1192 1195 1198 1201 1204 1217 1231 1244 1258 1280 1302 1325 1347 1277 1207 1231 1411 1379 1347 1325 1303 1366 1429 1414
928 1414 1400 1370 1340 1271 1203 1238 1274 1388 1502 1522 1542 1484 1426 1429 1431 1365 1299 1199 1255 1223 1191 1223 1254 1156 1057 1111 1164 1295 1426 1421 1417 1286 1310 1363
923 1363 1417 1402 1387 1414 1441 1390 1340 1349 1359 1408 1457 1444 1431 1408 1385 1475 1409 1304 1355 1403 1451 1380 1308 1361 1414 1467 1521 1486 1452 1417 1383 1336 1289 1320 1351
918 1351 1417 1484 1638 1636 1525 1414 1371 1327 1348 1369 1390 1411 1411 1411 1371 1332 1299 1265 1310 1354 1376 1398 1341 1285 1292 1299 1307 1314 1347 1381 1337 1293 1309 1324 1378 1432 1367
912 1367 1302 1310 1317 1311 1226 1322 1261 1226 1347 1390 1277 1190 1258 1316 1219 1295 1370 1308 1168 1134 1255 1284 1235 1285 1258 1231 1204 1276 1348 1290 1233 1308 1383 1338
907 1338 1293 1239 1342 1367 1314 1258 1281 1226 1171 1141 1267 1266 1265 1308 1351 1326 1301 1234 1321 1385 1189 1272 1277 1236 1196 1168 1218 1350 1327 1270 1213 1277 1340 1319
902A319k2j00r9L7L8L7L8l0l0RJ0k0k0N8N8klm1m1k6k6N2N1L3L2r9k2R6o1n5K2M8l1J9J8n0
896A197n0O9P0J48qr1O5M3l5O3j6j34j34rrklP5P5O7O7K8K9q3q3QQLMM3M3j0j0j1j0K2K1j7
891A433j8J9J8k1k0j01j00O9O8K1K1J0o8o5R1R6o0m8J08m3L5Q0p5k2k2J8J8j50j51l4l3Q3
886A157Q3j7j7O4O5L7j18o9QM6J23J08m9m4m4L6L7L8L8n4K3R5o1j03k5MMoP2J14m1j4j4j10
881A366j10L3L3o6o6l2l2J69R2j47QL1L0KJK6K5K6K6o4o4n3n4o5R1Qp0N2N3Q7Q6K2K1j8j7
875A430R9R9m3m4r3r3n5n4Q4Q3J9J9L5L5O2r3j20m3K0K1l2l3P5P5Mj53m3L4K4K4m8k03N1J29
870A272R2J70K9m9r2r1PPP1P2llllJJl8l8K4K4j5j5l0k9RRO4O4J12m3j81j81MML8L9k7k6P
864A253OPPj1j1M5M4J10m6j20L5J96M0lq1j00N7k7j04q7j0J54P6K7K8o3o4j2O6Q6j73n1J05
$$ plain form
902 1319 1297 1197 1098 1135 1173 1210 1248 1218 1188 1197 1207 1187 1167 1225 1283 1281 1278 1237 1196 1170 1144 1196 1247 1280 1312 1213 1191 1287 1226 1171 1193 1241 1210 1229 1247 1197
896 1197 1147 1216 1286 1434 1426 1335 1400 1443 1408 1471 1455 1321 1187 1178 1169 1167 1164 1239 1314 1381 1448 1476 1505 1422 1339 1347 1355 1358 1362 1405 1448 1438 1428 1417 1407 1429 1450 1433
891 1433 1415 1434 1452 1431 1411 1310 1210 1279 1347 1368 1389 1399 1331 1266 1357 1453 1393 1345 1453 1410 1445 1525 1450 1428 1406 1424 1442 1292 1141 1107 1074 1157
886 1157 1240 1223 1206 1270 1335 1372 1254 1185 1193 1239 1362 1470 1421 1377 1333 1369 1406 1444 1482 1428 1451 1546 1485 1382 1357 1361 1365 1359 1431 1545 1504 1490 1476 1366
881 1366 1256 1289 1322 1256 1190 1158 1126 1295 1387 1240 1248 1279 1309 1311 1312 1338 1363 1389 1415 1351 1287 1234 1180 1115 1206 1214 1144 1196 1249 1336 1422 1444 1465 1447 1430
875 1430 1529 1628 1585 1541 1448 1355 1300 1246 1330 1413 1432 1451 1486 1521 1583 1490 1370 1327 1347 1368 1336 1303 1378 1453 1457 1304 1261 1295 1319 1343 1295 1092 1143 1272
870 1272 1364 1534 1563 1514 1422 1331 1338 1345 1416 1488 1485 1482 1479 1476 1477 1478 1440 1402 1426 1450 1435 1420 1390 1361 1370 1379 1443 1507 1619 1576 1395 1214 1218 1222 1260 1299 1272 1246 1253
864 1253 1259 1266 1273 1262 1251 1296 1340 1450 1404 1284 1319 1515 1555 1552 1471 1371 1428 1401 1297 1210 1200 1354 1430 1457 1485 1422 1358 1346 1412 1498 1325 1274 1379
859A379J17l8m2j98K6J04N4k4j3j4llllL4L4P3j86l5J20O1j8l1l1K9K8J3J3n2n1j4j4p2Q3
854A323J01n5M2M2KKp5p6k6k5J04J03N1N0k7k8K5K4K4K5k3k4k3k4n6n7j8j8jkP7P6J5J5k4
848A519k3k2k1k2k1N0N0k8k8opq5q5L5L4J12J12nnQ3p3l5l6m5m6O9O8j14j13R0R0m0m0L8L8
843A488m0m0K9K9j2j69j6j6N2N2M9M8k9k9J4J4J5J4L4L5m4m4ppL2L2L5L6m3m2q4q3R8R7J7
838A515J7o1o1RRQRN5N4k3k4P8P8j6j71l0l0o3o2n4K05j9j9J4J3N3N2J3J4J3J4n0n0q8q9J40
832A453J39p8P8KJKKk1j77j1j1L9L9L9L9noL4L3K0K0j97m2J08J09j2j2K4K3r7r6k7J29M1M1
827A623r0r0M0M0p0p0jkJ26l1p8P6Pj48K6K7L7L8P6P6QPl1l2L8L7kjq0q0m2m1Q7Q6J9J8j59
821A444lL9L9Q4Q4POk2k2o1o1R6R7J8J8q3q4ooL9L8J0Rj00N4POk1k1N7N7m4m4M3j13M9M8l9
$$ plain form
859 1379 1496 1458 1416 1218 1244 1348 1402 1378 1365 1351 1348 1345 1342 1339 1373 1407 1480 1294 1259 1379 1440 1422 1391 1360 1389 1417 1430 1443 1391 1340 1326 1312 1240 1323
854 1323 1424 1369 1411 1453 1455 1457 1382 1306 1280 1255 1359 1462 1513 1563 1536 1508 1533 1557 1581 1606 1583 1559 1536 1512 1456 1399 1381 1363 1362 1360 1437 1513 1528 1543 1519
848 1519 1496 1474 1453 1431 1410 1460 1510 1482 1454 1448 1441 1356 1271 1306 1340 1452 1564 1559 1554 1637 1564 1529 1493 1448 1402 1471 1539 1425 1312 1402 1492 1452 1412 1450 1488
843 1488 1448 1408 1437 1466 1454 1285 1269 1253 1305 1357 1406 1454 1425 1396 1410 1424 1439 1453 1487 1522 1478 1434 1427 1420 1452 1484 1519 1555 1512 1470 1386 1303 1401 1498 1515
838 1515 1532 1471 1410 1419 1428 1436 1445 1500 1554 1531 1507 1585 1663 1647 1476 1446 1416 1353 1291 1237 1442 1423 1404 1418 1431 1484 1536 1549 1563 1576 1590 1540 1490 1402 1313 1453
832 1453 1592 1514 1592 1594 1595 1597 1599 1578 1401 1390 1379 1418 1457 1496 1535 1530 1524 1558 1591 1611 1631 1434 1392 1500 1609 1597 1585 1609 1632 1535 1439 1412 1541 1582 1623
827 1623 1533 1443 1483 1523 1453 1383 1382 1380 1506 1475 1397 1473 1480 1332 1358 1385 1422 1460 1536 1612 1620 1627 1596 1564 1602 1639 1637 1636 1556 1476 1434 1393 1480 1566 1585 1603 1444
821 1444 1441 1480 1519 1603 1687 1694 1700 1678 1656 1595 1534 1630 1727 1745 1763 1680 1596 1590 1584 1623 1661 1671 1680 1580 1634 1641 1647 1626 1605 1662 1719 1675 1631 1674 1561 1610 1658 1619
816A619m0m7m7J24J25J2j43K3K2L1L1l6l7k9J27%%l1l2k1k2m1J15K7K8L0L1r9r9K5K6OJ62
810A840Q7o8j36J9K2K2m6m6M4M5J2j43j23L2J52mopK2K3K3K4O2O3L2L2opNNNNJ9J9k9k9P7
805B041p8j56jO7O7Q6o9m3m2K6K6L0L1J09J08o2o3o2o3J09J10L1L2k0k0k0k0k0k0j17L8J06
800B141n1l0l1R1R1J3J3n7n8K8J83N6r9kkJ8J9J8J9n3n3n3n3M0M0M0M0J1J1Q8Q9N8N8j0j1
795B602j22L4P6P5j0rr8N8J19J18n4n3n1n0K7K7K3K4J01J01L8L8RRn2J03R3R3K8K8jjn7R8
789C364J1J1J8J7QJ64k3k4O5O4Q6Q6q5q6qJ47j8j7J35J35O7O7l4J22P4P3P1P2J10J10Q9R0
785D961J1J1O8O9P7P8M2J98K08N2m6J09J42J42P9P9J57J57J5J5J96J97J88J89J10J11K34K34
780H083K34K34K39K39K38K39K28K28K29K28K41K41K83M39L51L52L51N07M29M29M49M48M75
$$ plain form
816 1619 1579 1532 1485 1609 1734 1746 1603 1626 1648 1679 1710 1674 1637 1608 1735 1735 1735 1704 1672 1651 1629 1588 1703 1730 1758 1788 1819 1720 1621 1646 1672 1678 1840
810 1840 1927 1859 1723 1742 1764 1786 1740 1694 1738 1783 1795 1652 1529 1561 1713 1709 1703 1696 1718 1741 1764 1788 1850 1913 1945 1977 1971 1964 1969 1974 1979 1984 2003 2022 1993 1964 2041
805 2041 1963 1807 1806 1873 1940 2026 1957 1914 1872 1898 1924 1954 1985 2094 2202 2140 2077 2015 1952 2061 2171 2202 2234 2214 2194 2174 2154 2134 2114 1997 2035 2141
800 2141 2090 2060 2029 2120 2211 2224 2237 2180 2122 2150 2333 2389 2290 2288 2286 2304 2323 2341 2360 2307 2254 2201 2148 2188 2228 2268 2308 2319 2330 2418 2507 2565 2623 2613 2602
795 2602 2480 2514 2590 2665 2655 2646 2548 2606 2725 2843 2789 2736 2685 2635 2662 2689 2712 2736 2837 2938 2976 3014 3023 3032 2980 3083 3176 3269 3297 3325 3324 3323 3266 3364
789 3364 3375 3386 3404 3421 3429 3593 3570 3546 3611 3675 3761 3847 3762 3676 3668 3815 3797 3780 3915 4050 4117 4184 4150 4272 4346 4419 4490 4562 4672 4782 4871 4961
785 4961 4972 4983 5051 5120 5197 5275 5317 5515 5723 5775 5729 5838 5980 6122 6201 6280 6437 6594 6609 6624 6820 7017 7205 7394 7504 7615 7849 8083
780 8083 8317 8551 8790 9029 9267 9506 9734 9962 10191 10419 10660 10901 11184 11623 11974 12326 12677 13184 13613 14042 14491 14939 15414
777A5414O30N43N43M99M98M90O44P79P79Q86P31O73Q30Q97P42O96O96P71R26Q54O98P95P95
773C1809O50O50O08M52M31M31J78J78O3r2j44j44k72m27n74n74o74o75o74o75q28q29r16p61
770B7191q30q30q11q10r31p75o81o81q23q23o32o31o23m67m96o52n53l97m95m94l82l82k94
766A2698m50m92m92k16k16l23l23k46k45k49k48k49k49j55j55r7k53k91j36j65j65j55l11
763F817j84j85n8n9n9n8j37j36j66j66q0P5lj58j65j64j36j35o1o1o1o1p8p8o8o9r2O4O3r2
758D249n1n1p0p0J0j44k9k8r2k48J25J26L6L6m2m2l8l9l8l8p0o9o9p0klllp7p7N3N3o4o4k5
753C072k5NNl4l4r4r4j7j6n1n1L6L7p4Q2q4q4L7L8J15J15q6q5j7j7J9j37jjr3O2J11m4j60
747B435mK8K9J3J4k5k5m7m6L1L1J2J2o6o6mlL5L5m5m5m4m5N8N9p2p1m2m2n2n1J67J1j70j5
$$ plain form
777 15414 16044 16587 17130 17629 18127 18617 19261 20040 20819 21705 22436 23109 23939 24836 25578 26274 26970 27741 28667 29521 30219 31014 31809
773 31809 32459 33109 33717 34169 34600 35031 35209 35387 35450 35358 35214 35070 34798 34371 33797 33223 32549 31874 31200 30525 29697 28868 27952 27191
770 27191 26361 25531 24720 23910 22979 22204 21523 20842 20019 19196 18564 17933 17310 16843 16347 15695 15142 14745 14250 13756 13374 12992 12698
766 12698 12248 11756 11264 11048 10832 10509 10186 9940 9695 9446 9198 8949 8700 8545 8390 8293 8040 7749 7613 7448 7283 7128 6817
763 6817 6633 6448 6390 6331 6272 6214 6077 5941 5775 5609 5529 5604 5601 5443 5278 5114 4978 4843 4782 4721 4660 4599 4521 4443 4375 4306 4214 4278 4341 4249
758 4249 4198 4147 4077 4007 4017 3873 3844 3816 3724 3476 3601 3727 3763 3799 3757 3715 3677 3638 3600 3562 3492 3423 3354 3284 3282 3279 3276 3273 3196 3119 3172 3225 3161 3097 3072
753 3072 3047 3052 3057 3023 2989 2895 2801 2784 2768 2717 2666 2702 2739 2665 2747 2663 2579 2616 2654 2769 2884 2798 2713 2696 2679 2698 2561 2560 2559 2466 2528 2639 2595 2435
747 2435 2431 2459 2488 2501 2515 2490 2465 2418 2372 2403 2434 2446 2458 2392 2326 2322 2319 2354 2389 2344 2299 2255 2210 2268 2327 2255 2184 2142 2100 2048 1997 2164 2175 2005 1990
742A990K2K2qpononk8k8k7k8M2M2M2M2M8M8k9l0J9J9o0n9j0j1j0j1J0J0J0J0j8j9j8j8n3n4
736A828J2J2J9J9m6m6m7m7P0P0qqL0L1M9M9m3m2r3r3r3r4R7R7O8q8N8N8m3m2KLLLk3k2J7J6
731A733MMM3M3l5l5MMM1M1k5k4K2K2q5q5r8N8l0l0R1R1n1n2J5J6j01j02O2O2K2K3m4m5m5m4
725A470J3J3O2r4m0m1j0j1J9J9k0k0M4M4M4M4J04J05k2k2M0j17o7o8M8M8QRr6r7l1l2P1P1
720A488NOM5M4m6m6NMn0n0j03N2N3j03K2K2J09m6NJ61jkooool8l8P9P9K0K1r6r6K9L0K0K0
714A580O3r2mnl3l3q9q8j10M5J79J78l4l4L0L1NONOk6k5o5o5R3R3KJj2j3j2j3KKR3R2J7J6
708A786J6J6q4q5m5m6%jjjk3k3J6J6OOl4l3L0L0rrklM7j09NNNNj36K0M8M9J06J06L5j21r9
702A489N8R2R3J49pq7q8NNJ6J5p8P9P8p7j2j3q7q6j8j8n7n7J36J37Q1p5l9l9j0rl7l7LKK6
$$ plain form
742 1990 2012 2034 2026 2019 2013 2008 2002 1997 1969 1941 1914 1886 1928 1970 2012 2054 2102 2150 2121 2091 2110 2129 2069 2010 2000 1989 1979 1968 1978 1988 1998 2008 1990 1971 1953 1935 1882 1828
736 1828 1840 1852 1871 1890 1844 1798 1751 1704 1774 1844 1836 1828 1858 1889 1938 1987 1944 1902 1809 1716 1623 1529 1626 1723 1791 1703 1761 1819 1776 1734 1736 1739 1742 1745 1722 1700 1717 1733
731 1733 1737 1741 1784 1827 1792 1757 1761 1765 1806 1847 1822 1798 1820 1842 1757 1672 1574 1632 1602 1572 1663 1754 1703 1651 1666 1682 1581 1479 1541 1603 1625 1648 1604 1559 1514 1470
725 1470 1483 1496 1558 1464 1424 1383 1373 1362 1381 1400 1380 1360 1404 1448 1492 1536 1640 1745 1723 1701 1741 1624 1557 1489 1537 1585 1593 1602 1506 1409 1378 1346 1417 1488
720 1488 1493 1499 1544 1588 1542 1496 1501 1505 1455 1405 1302 1354 1407 1304 1326 1348 1457 1411 1416 1577 1576 1574 1568 1562 1556 1550 1512 1474 1553 1632 1652 1673 1577 1481 1510 1540 1560 1580
714 1580 1643 1551 1547 1542 1509 1476 1387 1299 1189 1234 1413 1591 1557 1523 1553 1584 1589 1595 1600 1606 1580 1555 1490 1425 1518 1611 1613 1614 1602 1589 1577 1564 1566 1568 1661 1753 1770 1786
708 1786 1802 1818 1734 1649 1604 1558 1558 1557 1556 1555 1532 1509 1525 1541 1547 1553 1519 1486 1516 1546 1537 1528 1526 1523 1570 1461 1466 1471 1476 1481 1345 1365 1413 1462 1568 1674 1709 1588 1489
702 1489 1547 1639 1732 1881 1874 1787 1699 1704 1709 1725 1740 1662 1741 1819 1742 1730 1717 1630 1544 1526 1508 1451 1394 1530 1667 1748 1673 1634 1595 1585 1576 1539 1502 1505 1507 1533
697A533K6K6K5opm5m6N0M9j6j5O3O3q0q0k8k8Q9Q9K9K9l6l6n9n9k1k0mlmmO4O4k7k7j6j6M9
691A565M8o6o6k7k8j14j13KLR1R0K6K5k1k2M3M3M1M2k4k3ONM5M5nmm4m3j4j4j3j4J5J5n0n0
685A395K9L0o1o2J9J8J8J8j3j4j4j4M9M9M8M9n8n9POL4L4L4L4l9m0N1N1p5p4j0j0k4k3R2R3
680A568m5m5ooQ8Q8n4n5K5K5r2r1l5l5MMj5j6j5j6K6K6K6K5POp5p5j63qJ25J25L7L8L7L8j0
674A461j0rj0q0q1j7O1N0j06r6O0j6O2o3o3J4J4J20J21N1j05KJ58lj58K7n2j32n5Q9J0j02
669A142k5J13L6L2L2K8K7N7N6N7N7j8j7q2q2q6q6q6q6P5P6J63Pm8m7mq2m5J09m7m8O1O1P6
664A376lj08M7J15L7j5j6k0k1J3J3k6k6j6j5M9N0J8J9j9r6j25L1J47qn8J9J28k7o9Q7n3j31
659A297rO8J9K0N8N7J0RK7j29m1m1R9R9j7j8j25j26qrM6M5P5P5l5j90k2J34ppr4O1P8p8j9
$$ plain form
697 1533 1559 1585 1610 1604 1597 1552 1506 1556 1605 1589 1574 1637 1700 1620 1540 1512 1484 1573 1662 1691 1720 1684 1648 1589 1530 1509 1489 1485 1482 1478 1474 1538 1602 1575 1548 1532 1516 1565
691 1565 1613 1547 1481 1454 1426 1312 1199 1201 1204 1295 1385 1411 1436 1415 1393 1436 1479 1520 1562 1538 1515 1521 1526 1571 1616 1611 1607 1563 1520 1506 1492 1479 1465 1480 1495 1445 1395
685 1395 1424 1454 1393 1331 1350 1368 1386 1404 1391 1377 1363 1349 1398 1447 1495 1544 1486 1427 1434 1440 1474 1508 1542 1576 1537 1497 1548 1599 1524 1450 1440 1430 1406 1383 1475 1568
680 1568 1523 1478 1472 1466 1554 1642 1588 1533 1558 1583 1491 1400 1365 1330 1334 1338 1323 1307 1292 1276 1302 1328 1354 1379 1386 1392 1317 1242 1079 1071 1196 1321 1358 1396 1433 1471 1461
674 1461 1451 1442 1432 1352 1271 1254 1315 1365 1259 1163 1223 1207 1269 1206 1143 1157 1171 1291 1412 1463 1358 1360 1518 1515 1357 1384 1332 1200 1145 1234 1244 1142
669 1142 1117 1230 1266 1298 1330 1358 1385 1442 1498 1555 1612 1594 1577 1495 1413 1327 1241 1155 1069 1144 1220 1383 1390 1342 1295 1291 1209 1164 1273 1226 1178 1239 1300 1376
664 1376 1373 1265 1312 1427 1464 1449 1433 1413 1392 1405 1418 1392 1366 1350 1335 1384 1434 1452 1471 1452 1356 1231 1262 1409 1401 1343 1362 1490 1463 1394 1481 1428 1297
659 1297 1288 1356 1375 1395 1453 1510 1520 1529 1556 1427 1386 1345 1444 1543 1526 1508 1383 1257 1249 1240 1286 1331 1406 1481 1446 1256 1234 1368 1361 1354 1260 1321 1399 1321 1302
654A302j9KJk0J34L3L3j72j6R9n6n1n0l3l3L2L2J8J7p0Q6O9O8j2j2O9P0MNp9p9o2o3j80P9
648A146P6P6L2L1L1L2j8j7j7j8k4k4M1M1J8J8k1k1nnnnj8j7j8j8k4k5p3Q3O9O9J4J4N3N3l8
643A486l8r2r2K5K4pqL1L1n4n4j5j5L7L7k8k8K8K9O7O7j7j7rrp6N4k0j9K8K7l7l7LLl9R0O5
637A421o5k3k3K2K2j7j7K4K5m9Q1K9K8n4n4J0Rq1q1R0R0jjm8m9j0j0K5K4K4K4K2K2j7j7n6
631A319n6L4L5K9K9K1K1Kj27j6j6O1O1K1K2rrrrK1K1K1K1RRJ0Rr5r5mmO3O2m7m6PJ36N1p9
626A474o2J7LLL1L2L1L2m0m0k2J08j2j3mml0l0L5L4K3K3j7j6l1l1PQk8k8O3O2o2o2N4N5j8
620A545j8N6p5m7m6n2J04k4k4L4L4o4R2J01n4n5J02R1o4K1K0k8k8kkkkk3k4M2M2J8J8m7m6
615A593O3O3jkM8M8j56jm5m4l5l5J%O5O5N8N9m3m2P8p9RRK8K7l7l7P4P4L5L5r2r1K5K5qqN7
$$ plain form
654 1302 1283 1285 1286 1266 1400 1433 1466 1294 1278 1377 1321 1270 1220 1187 1154 1186 1218 1236 1253 1183 1269 1338 1406 1394 1382 1451 1521 1525 1530 1451 1372 1310 1247 1067 1146
648 1146 1222 1298 1330 1361 1392 1424 1406 1389 1372 1354 1330 1306 1347 1388 1406 1424 1403 1382 1377 1372 1367 1362 1344 1327 1309 1291 1267 1242 1169 1252 1321 1390 1404 1418 1471 1524 1486
643 1486 1448 1356 1264 1289 1313 1306 1298 1329 1360 1306 1252 1237 1222 1259 1296 1268 1240 1268 1297 1364 1431 1414 1397 1388 1379 1303 1357 1337 1318 1346 1373 1336 1299 1302 1305 1266 1356 1421
637 1421 1356 1333 1310 1332 1354 1337 1320 1344 1369 1320 1401 1430 1458 1404 1350 1360 1369 1288 1207 1297 1387 1386 1385 1337 1288 1278 1268 1293 1317 1341 1365 1387 1409 1392 1375 1319
631 1319 1263 1297 1332 1361 1390 1411 1432 1434 1307 1291 1275 1336 1397 1418 1440 1431 1422 1413 1404 1425 1446 1467 1488 1497 1506 1516 1525 1430 1335 1331 1327 1390 1452 1405 1359 1366 1502 1553 1474
626 1474 1412 1429 1432 1435 1466 1498 1529 1561 1521 1481 1459 1567 1555 1542 1538 1534 1504 1474 1509 1543 1566 1589 1572 1556 1525 1494 1501 1509 1481 1453 1516 1578 1516 1454 1508 1563 1545
620 1545 1527 1583 1508 1461 1415 1363 1467 1443 1419 1453 1487 1423 1515 1616 1562 1507 1609 1700 1636 1657 1677 1649 1621 1619 1617 1615 1613 1590 1566 1608 1650 1668 1686 1639 1593
615 1593 1656 1719 1718 1716 1764 1812 1656 1655 1610 1566 1531 1496 1497 1497 1562 1627 1685 1744 1701 1659 1737 1658 1667 1676 1704 1731 1694 1657 1731 1805 1840 1875 1783 1692 1717 1742 1734 1726 1783
609A783N7j4j4j4j4q0q1J0J1%%%%l0l1L4L4Q6Q5kJ53k3k4j3j4j5j6l8J17L4L4j1j1o2R3P1
603B095P1K9K8j9k0O2L21O10P66N79m07q18l52k07k07j13j13R7R8L3L2j6j7K2K2N0N1N0N1
599B778ppp2p1j7j8n6n6Q4Q4J9J9l6l5p4p5P4P4P4P3Q8Q7K53M09N87J105J602J083r38j664
594E367q70n58k67j11m6J09j3j4o9o9k11k11j20j20j22j22j23j22j8j7j08j09L0L0K9L0m4
590B131m3nmn3n2r1r2N3N3J4J4P6P6K96K96O31O31M01n34p25n70m11j00QRK7K8j29j29j2j2
585A782J7J7j52j52q4q4PPM3M4MNl4l4l3l4Q4Q4l3l2o8o8M9N0Q8Q8M9M9j33j32j6j6k3k4m6
580A269J09k0k1N5N4P7P7K1j33m8m8j9j9Q7Q8mlk3k3o2o2N5N5k6j81q4q5M9M9Q7Q7L9L8J1
575A446j46n8n8N1N2R0R0l5l5l5l5L8L7L4j22m2m1n1n2J0J0RJ0O1O2K2K3O5O4K6K6NNq6q6
$$ plain form
609 1783 1840 1826 1812 1798 1784 1704 1623 1633 1644 1644 1644 1644 1644 1614 1583 1617 1651 1737 1822 1820 1973 1950 1926 1913 1899 1884 1868 1830 1947 1981 2015 2004 1993 1931 2024 2095
603 2095 2166 2195 2223 2204 2184 2246 2567 3177 3943 4522 4115 3297 2945 2738 2531 2418 2305 2402 2500 2533 2565 2549 2532 2554 2576 2626 2677 2727 2778
599 2778 2771 2764 2692 2621 2604 2586 2530 2474 2558 2642 2661 2680 2644 2609 2535 2460 2534 2608 2682 2755 2843 2930 3183 3592 4179 5284 6886 7969 7031 5367
594 5367 4497 3939 3672 3561 3515 3624 3611 3597 3528 3459 3248 3037 2917 2797 2675 2553 2430 2308 2290 2273 2165 2056 2086 2116 2145 2175 2131
590 2131 2088 2083 2079 2026 1974 1883 1791 1844 1897 1911 1925 2001 2077 2373 2669 3300 3931 4332 3798 3073 2503 2092 1992 2000 2009 2036 2064 1935 1806 1794 1782
585 1782 1799 1816 1664 1512 1428 1344 1351 1358 1401 1445 1449 1454 1420 1386 1353 1319 1403 1487 1454 1422 1354 1286 1335 1385 1473 1561 1610 1659 1526 1394 1378 1362 1339 1315 1269
580 1269 1378 1358 1337 1392 1446 1523 1600 1621 1488 1440 1392 1373 1354 1441 1529 1525 1522 1499 1476 1414 1352 1407 1462 1436 1255 1171 1086 1135 1184 1271 1358 1397 1435 1446
575 1446 1300 1242 1184 1235 1287 1377 1467 1432 1397 1362 1327 1365 1402 1436 1314 1272 1231 1180 1128 1138 1148 1157 1167 1228 1290 1312 1335 1400 1464 1490 1516 1521 1526 1440 1354
569A354K0K1J11J11j01j02r8N8N2N2lkl2l3l2l2J8J7J8J7m1m1m1m1k4k5k5k4kkQ5p0J4J5M
564A196Nk3k3M1M2O3O3j8j74M8M9j%J1J1q0q0j3j3P7P7N4N3J5J4l5l5l5l5L2L3n9n8N9O0K1
559A342K1m0m1m1m0RRM8M7o3o3k4k5l2l3N9N8K4K4Q9Q8o0o1NMj2j2K7K6J7J7m8m8ooN8N9J4
553A390J4J4J4jko6o6l3l2l2l2O8O9K9L0q8q8k3k3nnJ12J12j7j7K2K2J2J3J3J3j22j22nnM9
547A212M9N0M9j3j4K6K6n2n2r1r1P2P1L2L3QRj09j08M8M8M9M8J5J5n0m9l9m0%%Q4Q3J9J9n
542A352nm3m4j3j3j2j3PQN9j8j07K3P4P5l3l3OOq1q0K1J50R4l5OPl2l1PQj27j26J07J07%j
536A270L9L8N8N8k0k0l7l7KKPPp1p1L5L4mnPOp2p2n5n6P4P4N5N6J6J7j9j9QQ5K7j03j37qK0
530A189K0K9K8N1N2j30j30N5N4k3k3MM%jpq5l6R4L8L9M7M6L9L9l9l9n8n8n9n8j9k0J11J10
$$ plain form
569 1354 1374 1395 1506 1617 1516 1414 1316 1374 1426 1478 1475 1473 1441 1408 1376 1344 1362 1379 1397 1414 1373 1332 1291 1250 1226 1201 1176 1152 1150 1148 1233 1163 1177 1192 1196
564 1196 1201 1178 1155 1196 1238 1301 1364 1346 1172 1220 1269 1268 1268 1279 1290 1210 1130 1117 1104 1181 1258 1312 1365 1380 1394 1359 1324 1289 1254 1286 1319 1260 1202 1261 1321 1342
559 1342 1363 1323 1282 1241 1201 1210 1219 1267 1314 1251 1188 1164 1139 1107 1074 1133 1191 1215 1239 1328 1416 1356 1295 1300 1304 1292 1280 1307 1333 1350 1367 1319 1271 1265 1259 1317 1376 1390
553 1390 1404 1418 1432 1431 1429 1363 1297 1264 1232 1200 1168 1236 1305 1334 1364 1276 1188 1165 1142 1137 1132 1244 1356 1339 1322 1344 1366 1378 1391 1404 1417 1295 1173 1168 1163 1212
547 1212 1261 1311 1360 1347 1333 1359 1385 1333 1281 1190 1099 1171 1242 1274 1307 1315 1324 1215 1107 1155 1203 1252 1300 1315 1330 1280 1231 1192 1152 1152 1152 1236 1319 1338 1357 1352
542 1352 1347 1304 1260 1247 1234 1222 1209 1216 1224 1283 1265 1158 1181 1255 1330 1297 1264 1270 1276 1195 1115 1136 1286 1380 1345 1351 1358 1326 1295 1302 1310 1183 1057 1164 1271 1271 1270
536 1270 1309 1347 1405 1463 1443 1423 1386 1349 1351 1353 1360 1367 1296 1225 1260 1294 1290 1285 1292 1298 1226 1154 1099 1043 1117 1191 1246 1302 1318 1335 1316 1297 1305 1390 1417 1314 1177 1169 1189
530 1189 1209 1238 1266 1317 1369 1239 1109 1164 1218 1195 1172 1176 1180 1180 1179 1172 1087 1051 1145 1183 1222 1269 1315 1354 1393 1354 1315 1257 1199 1140 1082 1063 1043 1154 1264
525A264m8m8qrp0o9O0O1n6n5P4P4P8P7rqOj24L7L7r3O2N2N3K1K2n7n6kkQQq3P3O3O3p3p2o3
519A188o3o3R2Q2Q3qpL1L2o2o2J6J6J1J2J2J1m2m3mmJ6J6o2o2M2M3M2M3J1J1p7P9L0L1j32
513A259j31j5J42P3q2j24L1KKM0j17N0M9K8K8J16m0p8p7j0rR3R3J5J5O7O8j50OPPk2k2r1r0
508A133L9L9J3J3o6o5Q4Q3OOk3k3o1o2p4p3N6N6L4L4m4m4P4P4j4J42rqp7p7O6O7jkj18L8K8
502A244K7NMo4o4p5Q2M2M2j18L7J25l1q1P4N4N4O2O1o8o8k1k1k2k1j14j15J19J19K8K8L8L8
497A400j35K0P3P3j37J9J0Rj0j1q8q9LLQ1Q1k8k8p7P9K8K9RRp7Q0qqo2o3O8O7K3K2j07j08
492A150N5N5k3k3o5o5J3J3J00J00j17L9O8O8%%k5k5k5k5NNl4l4rrj9J37m6m7M1M0J9J8o0o0
486A215q1q1j00N6J34k2L7L6p2p2M8M8N8r8K8K8KKJKK4K3m4m5J2J68R0o5j8j8J1J2p2p2NO
$$ plain form
525 1264 1216 1168 1160 1151 1081 1012 1072 1133 1077 1022 1096 1170 1248 1325 1316 1308 1314 1190 1227 1264 1171 1233 1285 1338 1359 1381 1324 1268 1266 1264 1272 1280 1197 1270 1333 1396 1323 1251 1188
519 1188 1125 1062 1154 1236 1319 1311 1304 1335 1367 1305 1243 1259 1275 1286 1298 1310 1321 1279 1236 1232 1228 1244 1260 1198 1136 1178 1221 1263 1306 1317 1328 1251 1330 1360 1391 1259
513 1259 1128 1113 1255 1328 1246 1122 1153 1155 1157 1197 1080 1130 1179 1207 1235 1351 1311 1233 1156 1146 1137 1230 1323 1338 1353 1420 1488 1338 1344 1351 1358 1336 1314 1223 1133
508 1133 1172 1211 1224 1237 1171 1106 1190 1273 1279 1285 1262 1239 1178 1116 1042 969 1025 1081 1115 1149 1105 1061 1135 1209 1195 1337 1328 1320 1243 1166 1232 1299 1298 1296 1178 1216 1244
502 1244 1271 1276 1280 1216 1152 1077 1159 1201 1243 1125 1162 1287 1256 1175 1249 1303 1357 1419 1480 1412 1344 1323 1302 1280 1259 1145 1030 1149 1268 1296 1324 1362 1400
497 1400 1265 1285 1358 1431 1294 1313 1323 1332 1322 1311 1223 1134 1137 1140 1221 1302 1274 1246 1169 1248 1276 1305 1314 1323 1246 1326 1318 1310 1248 1185 1253 1320 1343 1365 1258 1150
492 1150 1205 1260 1237 1214 1149 1084 1097 1110 1210 1310 1193 1232 1300 1368 1368 1368 1343 1318 1293 1268 1273 1278 1244 1210 1201 1192 1173 1310 1264 1217 1258 1298 1317 1335 1275 1215
486 1215 1134 1053 953 1009 1143 1121 1158 1194 1122 1050 1098 1146 1204 1106 1134 1162 1164 1166 1167 1169 1193 1216 1172 1127 1139 1307 1397 1332 1314 1296 1307 1319 1247 1175 1180 1186
481A186O7O6j15j15LLML%%%%n0m9Q0Q0K5K5l3J22O1r5j24L2j%Q7Q6j1j1j1j2J7J6j13j14M2
475A151M1l6l7O8O7J16l9j8j8o6o7J09J09P6p9j50OK8K9M4j12p3Q3K9K9r2r1PPJ05n2o9Q7
470A192j1j0K5K6j3j3k7k7N1N1o3o3O6O6o4o4p4Q2M3M3k5k5M9N0k8k8lmp2p2J2J67Q0P9o9
465A327o8j18L8O0N9Q9o7j11M6K6K6mmnmpoL2L2NNp4p3m6m7Q4Q3j28j27KKL9L9M0L9m2m2L5
459A135L6m7m7L1L0p1p2OOL4L4P4P3O2O3o8o7l8l9JJM8M8k9l0L6L6m2m2J4J3o4o5OOM5M5P0
453A232P1pqRRo9o9Q1Q1M2M2m3m3L5L5K4K5K4K5J9K0n9n8R8R9J76J76j7j7j7j7j69j69r1r1
448A379j6j6n5n4J3J3J3J4j9j8N9O0p6p6KKnnJ26J25K6K6n2n2n2n2J7J6J44j1n3n3J69J69
443A708J68J69J33J33K01K01J12m4j48j48r1k46j78k3k9j85r2r3K1n8j06N0L4m3q6O9O8q7
$$ plain form
481 1186 1253 1319 1204 1089 1092 1095 1099 1102 1102 1102 1102 1102 1052 1003 1083 1163 1188 1213 1180 1302 1363 1268 1144 1176 1175 1175 1262 1348 1337 1326 1315 1303 1320 1336 1223 1109 1151
475 1151 1192 1156 1119 1187 1254 1370 1331 1313 1295 1229 1162 1271 1380 1456 1377 1227 1233 1261 1290 1334 1222 1149 1232 1261 1290 1198 1107 1114 1121 1226 1174 1105 1192
470 1192 1181 1171 1196 1222 1209 1196 1169 1142 1193 1244 1181 1118 1184 1250 1186 1122 1048 1130 1173 1216 1191 1166 1215 1265 1237 1209 1206 1202 1130 1058 1070 1237 1317 1396 1327
465 1327 1259 1141 1179 1239 1298 1387 1320 1209 1255 1281 1307 1303 1299 1294 1290 1283 1277 1309 1341 1346 1351 1277 1204 1158 1111 1195 1278 1150 1023 1025 1027 1066 1105 1145 1184 1142 1100 1135
459 1135 1171 1124 1077 1108 1138 1067 995 1001 1007 1041 1075 1149 1222 1284 1347 1279 1212 1174 1135 1136 1137 1185 1233 1204 1174 1210 1246 1204 1162 1176 1189 1125 1060 1066 1072 1117 1162 1232
453 1232 1303 1296 1288 1297 1306 1237 1168 1249 1330 1372 1414 1371 1328 1363 1398 1422 1447 1471 1496 1515 1535 1476 1418 1516 1615 1791 1967 1950 1933 1916 1899 1730 1561 1470 1379
448 1379 1363 1347 1292 1238 1251 1264 1277 1291 1272 1254 1313 1373 1297 1221 1223 1225 1220 1215 1341 1466 1492 1518 1466 1414 1362 1310 1327 1343 1487 1476 1423 1370 1539 1708
443 1708 1876 2045 2178 2311 2512 2713 2825 2781 2633 2485 2394 2148 1970 1947 1918 1733 1641 1548 1569 1511 1405 1455 1489 1446 1360 1429 1497 1410
438A410rJ47N2j03l6j13n9J8L8L8M5j11J6J6k3k4N4N4rrO9O8M9M8Q8Q7O7O7j14j15p9p9jj
433A546j28j29N4N3K7K8j2j2m0m1n6K3M2j14k2k1K1K2l2M6J17l9l9J17%p8n8j37n8n9O6O6
428A153j1j2j1j2L0K9K5K5O4j4J22l4r2j5J0Rl2l3J28k8Kp7P9JQRl6l5m3m3K5K5N3j03j42
423A024J4L3L3L4L3P0q6q6O9L9L9J36j9ooj5j6L3L3j5j6J01n5q8q8mJ51o6o6j6j7J04J03O1
418A445r5L1L2K0K0j8j9J5J4J5J5q3q2M7M7MLl6l5P1P1R1o5J42K97K38Q3P4q1j86j85q0p9
413A731r8N7J20l6o7o8m5m4n4n4R7n9J9J9R7n8K0J9Q1p5J2J3l7l6LLO8O9P8p8L4L5J64J64
408B094J35K90N21O77M76r5o04m48k65k65k55k56p7p8%JL4L4j37j38j70j6K7K7l8l8l8l8L9
403A399L9L9L9J7J7J7J7j0j0m9m8N7N8k1k0K4K3K41Q5J27J27J18J17j22j22j23j22j71j71
$$ plain form
438 1410 1401 1548 1600 1497 1461 1348 1289 1307 1345 1383 1428 1317 1333 1349 1326 1302 1356 1410 1401 1392 1461 1529 1578 1626 1714 1801 1868 1935 1821 1706 1627 1548 1547 1546
433 1546 1418 1289 1343 1396 1423 1451 1439 1427 1387 1346 1290 1313 1355 1241 1219 1198 1219 1241 1209 1255 1372 1333 1294 1411 1411 1333 1275 1138 1080 1021 1087 1153
428 1153 1142 1130 1119 1107 1137 1166 1191 1216 1280 1266 1388 1354 1262 1247 1257 1266 1234 1201 1329 1301 1303 1226 1305 1306 1314 1323 1287 1252 1209 1166 1191 1216 1269 1166 1024
423 1024 1038 1071 1104 1138 1171 1241 1155 1069 1138 1177 1216 1352 1333 1327 1321 1306 1290 1323 1356 1341 1325 1426 1371 1283 1195 1191 1342 1276 1210 1194 1177 1281 1384 1445
418 1445 1350 1381 1413 1433 1453 1435 1416 1431 1445 1460 1475 1392 1310 1357 1404 1408 1411 1375 1340 1411 1482 1573 1508 1650 1947 2185 2268 2342 2261 2075 1890 1810 1731
413 1731 1633 1690 1810 1774 1707 1639 1594 1550 1496 1442 1539 1480 1499 1518 1615 1557 1577 1596 1677 1602 1614 1627 1590 1554 1557 1560 1628 1697 1775 1697 1731 1766 1930 2094
408 2094 2229 2519 3040 3717 4193 4098 3494 3046 2781 2516 2261 2005 1928 1850 1850 1851 1885 1919 1782 1644 1474 1458 1485 1512 1474 1436 1398 1360 1399
403 1399 1438 1477 1516 1533 1550 1567 1584 1574 1564 1515 1467 1524 1582 1561 1541 1565 1588 1829 1914 2041 2168 2286 2403 2281 2159 2036 1914 1743 1572
399A572m1m1o4o3J4J5kkj1j1O8q7q6O8l8l8k8k9K4K5K4K4k1k1k2k1RQR6o0JKn8R9j2j2p9q0
393A122o3o3J19J19J14J14o8o8l5l6M3M2n9o0O0O1M7j08k1k1K6K5K6K6kkkkrj0O9O9l9l8k9
388A347k9j10M5Q8Q7M1M0l7l8q5q5qqk8k9M9M9K1K1K0K1o5o6O5O4MLj16j17k2J34R6o1l6l5
382A220J30k6o4R2onn4n5P6P6m2m1L7L6qrqrl9m0j27K9L3L2M2M2J0J0RJ0n2n2n2n2J9J9o9
377A112Q6k5k5o4R2R2R3J12m4o8o7q7O9K5K5q6q5o0R5QQk7k8k8k7O1O2j6j6K8K8j1j1J8J8
371A257k1k1J0J0o8o7K0K0o7Q9M9N0p0p1K5K4K5K4RRM8M8NMj61nJ1J2K2K1m1m1l1l1l0J26
366A193L8L9O2O3o7o8j02j02K8K7J3J3k6k6M0M1JJl0l1m0J15O5O4L5L5r2r3n4n4J00J00j69
361A119j3N7N6r9N6p7p7J0J0N5N5J03n2o6o6KKO6O6O6O5j33j34r2O5N3N3j5j5o0o0J21J21
$$ plain form
399 1572 1531 1490 1426 1363 1377 1392 1390 1388 1377 1366 1434 1347 1261 1329 1291 1253 1225 1196 1220 1245 1269 1293 1272 1251 1229 1208 1217 1225 1321 1261 1262 1264 1206 1305 1293 1281 1202 1122
393 1122 1059 996 1115 1234 1348 1462 1394 1326 1291 1255 1298 1340 1281 1221 1281 1342 1389 1281 1260 1239 1265 1290 1316 1342 1340 1338 1336 1334 1325 1315 1384 1453 1414 1376 1347
388 1347 1318 1208 1253 1341 1428 1469 1509 1472 1434 1349 1264 1256 1248 1220 1191 1240 1289 1310 1331 1351 1372 1307 1241 1306 1370 1374 1377 1261 1144 1122 1256 1352 1291 1255 1220
382 1220 1350 1324 1260 1352 1346 1341 1287 1232 1308 1384 1342 1301 1338 1374 1366 1357 1349 1340 1301 1261 1134 1163 1196 1228 1270 1312 1322 1332 1341 1351 1299 1247 1195 1143 1162 1181 1112
377 1112 1198 1173 1148 1084 1176 1268 1361 1473 1429 1361 1294 1207 1276 1301 1326 1240 1155 1095 1190 1198 1206 1179 1151 1123 1096 1157 1219 1203 1187 1215 1243 1232 1221 1239 1257
371 1257 1236 1215 1225 1235 1167 1100 1120 1140 1073 1162 1211 1261 1191 1120 1145 1169 1194 1218 1227 1236 1284 1332 1337 1341 1180 1175 1186 1198 1220 1241 1200 1159 1128 1097 1067 1193
366 1193 1231 1270 1332 1395 1328 1260 1158 1056 1084 1111 1124 1137 1111 1085 1125 1166 1167 1168 1138 1107 1067 1182 1247 1311 1346 1381 1289 1196 1142 1088 1188 1288 1119
361 1119 1106 1163 1219 1120 1176 1099 1022 1032 1042 1097 1152 1255 1203 1137 1071 1073 1075 1141 1207 1273 1338 1205 1071 979 1044 1097 1150 1135 1120 1060 1000 1121 1242
356A242o9o9o9Q7p2Q3Q4Q3p9q0l8J18MMn5n4k9J26%%K5K5K5K5j11j11J8J8N1N1N1N1PQp0p0
350A210O6O6Q5p0p5Q1j7j7j2j1j2j2kklkLKLLp4p4NMM7M7M8M7L0L1N9O0L2j23l6l6m0l9o2
344A210R4P5P5ooonj58kj4j4J12J13jj%jl5l6q4P2n0n1jkK9L0p8p8KJ58k0k1M1M0M1M0j07
339A355j06J0J0M7M7j9j8J7J7p3p4Q3Q2qqn3n3m4m3J9J74n6n5p4p3JJM7K03n3n3k3k2k2k2
333A161O7O8l3l2j30J30K4K3k9k9J%R5o0l1J24Q6o9l7l7l2l2l2l2J3J3J4J3Q5Q5M0j16j65
328A146rQ8Q9k9k8k9k8M7M7QQPPn8n8K4K4K5K4K6K7O5O6j34j34RQQRO0j8o7O2K4J53M4l3l9
322A441l8p9N2O9P0m0m0l9m0l7l6l7l6K4K4j5j5k5k5O6O6PPJ2J2m6L2mj33J02J01N5N5k4k4
317A462j33j32j2J17J23pm7L1J8J8j23j24M6M5qqK3K3k7j58m5m5O1O1mmOPKJJ07K8m0R1j2
$$ plain form
356 1242 1173 1104 1035 1122 1050 1133 1217 1300 1221 1141 1103 1221 1225 1229 1174 1120 1091 1217 1217 1217 1242 1267 1292 1317 1206 1095 1113 1131 1182 1233 1284 1335 1342 1350 1280 1210
350 1210 1276 1342 1427 1357 1282 1363 1346 1329 1317 1306 1294 1282 1280 1278 1275 1273 1276 1278 1281 1284 1210 1136 1141 1145 1192 1239 1287 1334 1364 1395 1454 1514 1546 1423 1387 1351 1311 1272 1210
344 1210 1304 1379 1454 1448 1442 1436 1431 1273 1271 1257 1243 1355 1468 1467 1466 1466 1465 1430 1394 1310 1382 1332 1281 1280 1278 1307 1337 1259 1181 1183 1341 1321 1300 1341 1381 1422 1462 1355
339 1355 1249 1259 1269 1316 1363 1344 1326 1343 1360 1287 1213 1296 1378 1370 1362 1309 1256 1212 1169 1188 1362 1306 1251 1177 1104 1105 1106 1153 1356 1303 1250 1227 1205 1183 1161
333 1161 1228 1296 1263 1231 1101 1231 1255 1278 1249 1220 1221 1221 1316 1256 1225 1349 1435 1366 1329 1292 1260 1228 1196 1164 1177 1190 1204 1217 1302 1387 1427 1311 1146
328 1146 1137 1225 1314 1285 1257 1228 1200 1247 1294 1302 1310 1317 1324 1266 1208 1232 1256 1281 1305 1331 1358 1423 1489 1355 1221 1230 1238 1246 1255 1315 1297 1230 1292 1316 1469 1513 1480 1441
322 1441 1403 1324 1376 1445 1515 1475 1435 1396 1356 1319 1283 1246 1210 1234 1258 1243 1228 1203 1178 1244 1310 1317 1324 1336 1348 1302 1334 1330 1197 1299 1400 1455 1510 1486 1462
317 1462 1329 1197 1185 1302 1425 1418 1371 1402 1420 1438 1315 1191 1237 1282 1274 1266 1289 1312 1285 1127 1082 1037 1098 1159 1155 1151 1157 1164 1166 1167 1274 1302 1262 1353 1341
312A341j1K8K8J8j12l8l9QPJ6J6l5R5Jp7P5P5p3p3o7o6M2M2R6l5k6k6L1L1pqrqqrL5L4K5K5
306A342Q3p3J5J4M4M4l4l4j30j30J03J03K1K0L1j26j0j0k0k0N6N6k1k2o2o2J03n3L6L5j3j3
301A273O5O4j4j4j3j3j3j2J3J3R2R1j0j0m9m9n7n6K2K1j0j0O8O8k2k1l1l1O6q9Q5p0KJq6q6
295A178%J%JN5N6J7J6n8n9J9J9J17J17k3k3J00n6m6m6LKl6l6o8o8%%O9q7p7p7L5L6P4P4n8
290A171n7J23J24L4L4N9k00j17L8K04M8l5l5norj0m8m8K0K0n8n8L8L8L8L8K1K1o6o7R1o4O2
285A339O1o8o7k9k9MMMNJ21J21j13j12mmJ9J9J35j24j6j7K1K1R9J00o8o7J1J1L7L8n0n0N8
279A410r7rj0m2m2L6L6L4L5M4j12J20J20p2p1p5p5j3j3K05n5r0r1J21J20o1o1m3m3Q7Q7j4
274A366j4R9R9J25j34k8k7j3j4P4q2NMnol8l7l8l8QQR5o0K8K7J8J7JJ%Jj6j7O2r5N8r9J9J8
$$ plain form
312 1341 1330 1358 1386 1404 1292 1254 1215 1223 1230 1246 1262 1227 1322 1323 1246 1321 1396 1323 1250 1183 1117 1159 1201 1297 1262 1236 1210 1241 1272 1265 1257 1248 1240 1232 1223 1258 1292 1317 1342
306 1342 1425 1352 1367 1381 1425 1469 1435 1401 1271 1141 1244 1347 1368 1388 1419 1293 1283 1273 1253 1233 1289 1345 1324 1302 1240 1178 1281 1228 1264 1299 1286 1273
301 1273 1338 1402 1388 1374 1361 1348 1335 1323 1336 1349 1441 1532 1522 1512 1463 1414 1357 1301 1323 1344 1334 1324 1392 1460 1438 1417 1386 1355 1421 1332 1417 1347 1349 1350 1264 1178
295 1178 1178 1179 1179 1180 1235 1291 1308 1324 1266 1207 1226 1245 1362 1479 1456 1433 1533 1477 1431 1385 1388 1390 1354 1318 1250 1182 1182 1182 1251 1164 1087 1010 1045 1081 1155 1229 1171
290 1171 1114 1237 1361 1395 1429 1488 1288 1171 1209 1413 1461 1426 1391 1386 1380 1371 1361 1313 1265 1285 1305 1247 1189 1227 1265 1303 1341 1362 1383 1317 1250 1341 1277 1339
285 1339 1400 1332 1265 1236 1207 1211 1215 1219 1224 1345 1466 1353 1241 1237 1233 1252 1271 1406 1282 1266 1249 1270 1291 1390 1490 1422 1355 1366 1377 1414 1452 1402 1352 1410
279 1410 1313 1304 1294 1252 1210 1246 1282 1316 1351 1395 1283 1403 1523 1451 1380 1305 1230 1217 1204 1409 1354 1264 1173 1294 1414 1353 1292 1249 1206 1293 1380 1366
274 1366 1352 1451 1550 1675 1541 1513 1486 1473 1459 1533 1451 1456 1460 1455 1449 1411 1374 1336 1298 1306 1314 1409 1349 1377 1404 1422 1439 1440 1441 1441 1442 1426 1409 1471 1376 1434 1335 1354 1372
268A372N7N7l0l0J32k2l6l6qj65J01n4O6O6qrn1n2N6N5O6r0lkpqppRRk9l0O1O0J09m6j08j08
263A330M1M2J35k0m9n0N6N6K7j29k2k2QPJ%L0L0P1q4q5P2r6r6M7M7O1r4P4P5J11m4M4M3j9
257A598j9k8k9N5j00j3j3J1J2n4n3M2M2LKj17j17N2N1J55J54P3q3l1l0P6P6PPn8n8RR%jJ42
252A772j4o9o9N5N5l6l5n6n6j6j7M3M3m7m8l6l7K8K9n1n0J09J08Q8o9K0J9rrj16j16k4J32
247A521Q3Q4n6n5ppp5Q1ppl8l8K6K7o9o8k9k9J19J19n0m9O3O4O3O4N3N3n4k10M6M6llk9k9
241A600Q8Q8j0j1n0m9p3p3o4o3n8R8J01J01ONq2P3L7L6l5l5j32K3K7K7QQQQp9p9M5K00N4j01
236A647n3J03noNNn5n4O2O2jkm0m0J0J0RJ0m1m1l8J17M4M4o4o3QRQQMMMMN9N9j9J37j09M6
230A847l1l2m5m5j6J40QQj29J31n6n6j27K8L8L7m0J16N0N0j8j8l7l7j64qO3O2J1J1j07J53
$$ plain form
268 1372 1429 1486 1456 1426 1558 1536 1500 1464 1456 1291 1392 1338 1404 1470 1462 1453 1402 1350 1406 1461 1527 1437 1434 1432 1425 1417 1410 1403 1412 1421 1392 1362 1423 1483 1592 1546 1438 1330
263 1330 1371 1413 1548 1528 1479 1429 1485 1541 1568 1439 1417 1395 1403 1410 1411 1411 1441 1471 1542 1458 1373 1445 1349 1253 1300 1347 1408 1314 1388 1463 1574 1530 1574 1617 1598
257 1598 1579 1551 1522 1577 1477 1464 1451 1462 1474 1420 1367 1409 1451 1454 1456 1339 1222 1274 1325 1480 1634 1707 1624 1593 1563 1639 1715 1722 1729 1671 1613 1622 1631 1631 1630 1772
252 1772 1758 1689 1620 1675 1730 1694 1659 1603 1547 1531 1514 1557 1600 1553 1505 1469 1432 1460 1489 1438 1388 1497 1605 1693 1624 1644 1663 1654 1645 1529 1413 1389 1521
247 1521 1604 1688 1632 1577 1570 1563 1488 1569 1562 1555 1517 1479 1505 1532 1463 1395 1366 1337 1456 1575 1525 1476 1539 1603 1666 1730 1783 1836 1782 1572 1618 1664 1661 1658 1629 1600
241 1600 1688 1776 1766 1755 1705 1656 1583 1510 1446 1383 1325 1423 1524 1625 1631 1636 1554 1627 1664 1700 1665 1630 1498 1521 1548 1575 1583 1591 1599 1607 1528 1449 1494 1694 1748 1647
236 1647 1594 1697 1692 1686 1691 1696 1641 1587 1649 1711 1710 1708 1668 1628 1638 1648 1657 1667 1626 1585 1547 1664 1708 1752 1688 1625 1633 1642 1650 1658 1662 1666 1670 1674 1733 1792 1773 1910 1801 1847
230 1847 1816 1784 1739 1694 1678 1818 1826 1834 1705 1836 1780 1724 1597 1625 1663 1700 1660 1776 1826 1876 1858 1840 1803 1766 1602 1594 1657 1719 1730 1741 1634 1787
225A787J6J6r2O3k4k4M5M5N5N5k7J30k6k7j66j1L1L1M5M4k4k4q7O9N9N9j4j4mmj42J3J18J17
220B088j01N4N4N4j19L6M3M3j76Q4J5J6n1n2n1n1m1m1N2K09N0N1j7J39j60lp2p1m3J12k4J32
215B159L4L4p6p7n1J04K7K7p9P7j1j0j0j0%%j02N5j41J19Q8Q7j6j6m1J15j1J44r4O3ool9J17
210B454j37K0R7R8j53Lk1J35n5K3q0P5L7J14j07M9l9J17P0J48P5K31L9J95n7j35j95O5q6O9
205C049M9K04j0K50J47L03J80M39M74P33R07J687K348L854N080N754L993N16l505n425n507
202A5520m106k789j491r54n90o03m47m70k10k55Nj23m6p4Q2nJ51%P8j31K5k07n1l03m3j33
198B830K3n4K4m9J06j04N2k6J30o3R3o2R3q6P0j2J43j09l0j28J32q5pj12M3j02N3rqr8J61
193B809k3N4jP7j02J56n5K3q2P3j7J39k2N7l3l2K0J75J1Q9j01N4k8J28j22j22j20L5j0J45
$$ plain form
225 1787 1803 1819 1727 1790 1766 1742 1787 1832 1887 1942 1915 2045 2019 1992 1826 1815 1846 1877 1922 1966 1942 1918 1831 1900 1959 2018 2004 1990 1986 1982 1840 1853 1971 2088
220 2088 1987 2041 2095 2149 2030 2066 2109 2152 1976 2060 2075 2091 2040 1988 1937 1886 1845 1804 1856 2065 2115 2166 2149 2288 2128 2125 2053 1982 1939 2051 2027 2159
215 2159 2193 2227 2151 2074 2023 2127 2154 2181 2102 2179 2168 2158 2148 2138 2138 2138 2036 2091 1950 2069 2157 2244 2228 2212 2171 2286 2275 2419 2325 2388 2382 2376 2337 2454
210 2454 2317 2337 2434 2532 2379 2382 2361 2496 2441 2464 2384 2459 2496 2610 2503 2552 2513 2630 2700 2848 2923 3154 3193 3388 3331 3196 3001 3066 2980 3049
205 3049 3098 3302 3292 3542 3689 3992 4172 4611 5085 5818 6725 8412 10760 14614 19694 25448 29441 29957 26452 21027 15520
202 15520 11414 8625 7134 6180 5590 4987 4540 4070 3860 3605 3610 3487 3441 3367 3449 3444 3595 3595 3673 3542 3567 3360 3309 3006 2963 2830
198 2830 2853 2799 2823 2774 2880 2776 2828 2802 2932 2869 2962 2900 2993 2907 2977 2965 3108 2999 2969 2841 2973 2888 2881 2769 2812 2710 2763 2754 2746 2648 2809
193 2809 2786 2840 2839 2916 2814 2970 2915 2938 2856 2929 2912 3051 3029 3086 3053 3021 3041 3216 3227 3316 3215 3269 3241 3369 3247 3125 3005 3040 3030 3175
189C175L1L1M0M1J6J6J7J6M9M8k9J27m1J15p4Q2j89P1Q7Q7j23K40L6L6MMN6K11O5K20m2K17
184D640K78K78m3m3o6o6k51RK1K1L7J93K0J76k30k29l16j60j08j08j26L0o7Q8J3J3K3K3L6
179D086L5r2O5J02J01L4L3L8L7r2r2m0l9j28K8k5k5K7J82Q6Q6J7J8k8k7k8k8J3J3J2J3K1K1
174D424j45J1J04J05J14J14l0k9l0k9O8O9L0K9N3N2k5k6P0P1K1J78%Jl9l8Q8o8K0K0P9P9O9
169E410O9Q0p6J2J1O9O8K15m5p1p1Q5Q5J55kJ49J48J87p3o6o6J54kJ35k2J58J57K35P9J53
165G320J53J54J53M12N67J005J161J591K680K875Q52n97j479k063j492J093J352r44j826q48
162A2119j004p80n21l13l13j31k87K9K9L11J55M25m3P1j88O2O2L58R8L99J40K83j85K3k38
158A0561Q8o9M78L22O60Q8L14n0L39k4L70PM48J88L86J25O19K55O63K99P60J89M73k01J82
$$ plain form
189 3175 3206 3237 3277 3318 3334 3350 3367 3383 3432 3480 3451 3578 3537 3652 3578 3660 3471 3542 3629 3716 3593 3833 3869 3905 3909 3913 3969 4180 4245 4465 4423 4640
184 4640 4918 5196 5153 5110 5044 4978 4727 4736 4757 4778 4815 5008 5028 5204 4974 4745 4429 4269 4161 4053 3927 3957 3890 3978 3991 4004 4027 4050 4086
179 4086 4121 4029 4094 4196 4297 4331 4364 4402 4439 4347 4255 4215 4176 4048 4076 4051 4026 4053 4235 4321 4407 4424 4442 4414 4387 4359 4331 4344 4357 4369 4382 4403 4424
174 4424 4279 4290 4394 4499 4613 4727 4697 4668 4638 4609 4677 4746 4776 4805 4858 4910 4885 4859 4929 5000 5021 5199 5199 5200 5161 5123 5211 5143 5163 5183 5262 5341 5410
169 5410 5479 5559 5483 5495 5506 5575 5643 5858 5813 5742 5671 5756 5841 5996 5994 6143 6291 6478 6405 6339 6273 6427 6425 6560 6538 6696 6853 7088 7167 7320
165 7320 7473 7627 7780 8192 8759 9764 10925 12516 15196 18071 18923 18326 16847 14784 13292 14385 15737 14793 12967 12119
162 12119 11115 10335 9814 9501 9188 9057 8770 8799 8828 9139 9294 9719 9676 9747 9559 9621 9683 10041 10139 10538 10678 10961 10776 10799 10561
158 10561 10649 10580 11058 11380 12040 12128 12442 12392 12731 12707 13077 13084 13532 13720 14106 14231 14850 15105 15768 16067 16827 17016 17489 17288 17470
154A7470p8O21J54P77K06N58J96P72L06R54L84J019L45R74M04J026L52J098N27J085L06J254
151C0710P87J941J164J808L04O40j37J387J542L657K879L592J465J322p9K426K789M624L328
148F6149M965L668O230P009J1041J4207K5285L8103N5042L2054k9814m7507k1221m772N341
145A65780M874J0212J0990J9190K1524L1864L9180N8042O6086Q2393J07871J62505K36762
143A017273L95606O87700J208952J836159J656333n06120k044118j572169r02040n04398l11558
142I61620j97554j51316j09336q5771o4547o3435m6466l6912k3368k1218j3901j2124k836
140A32836L460J6276K6136M3831L0105l0451o1534l9792k4884j3727j0977o255o833l978n646
137D8567l310l731k122m562l368l543j70m36R65r34l64k419j331k020k05j029K69r15l3j330
$$ plain form
154 17470 17392 18013 18167 18944 19150 19708 19904 20676 20982 21936 22320 23339 23684 24658 25062 26088 26440 27538 28065 29150 29456 30710
151 30710 31497 33438 34602 36410 36714 37354 37217 38604 40146 43803 46682 50274 51739 53061 52982 55408 58197 62821 66149
148 66149 71114 74782 81012 88021 99062 113269 138554 176657 231699 263753 233939 186432 165211 160439 165780
145 165780 170654 180866 191856 211046 232570 264434 303614 361656 427742 510135 618006 780511 1017273
143 1017273 1412879 2100579 3309531 5145690 6802023 6295903 4251785 2679616 1777576 1273178 961620
142 961620 764066 612750 503414 417643 353096 289661 243195 206283 182915 161697 147796 135672 132836
140 132836 136296 152572 178708 222539 252644 222193 160659 120867 95983 82256 71279 65024 58191 54213 48567
137 48567 45257 41526 39404 34842 31474 27931 27761 27325 28290 27356 26992 24573 23242 21222 21017 19988 20257 19342 19309 17979
134A7979j36r48K46r02j23j108j8p97J90o45K37n60K18o51p9o90M01l00L76n98j31j018l43
131A0600p59J24m06K69l28M51k63L07k37K30o19j52m50K24l30J36n06J69j39M32l60Lm51J6
127G961n04J72r8K65k73K98j29K34l76j16n11J62j68M03k0K40j69J95j50M22M5P20O55J745
124A1003K138K137p43j520j79J120J067J067j096k186k283j089j051n83p58k91m14j55m31
121E753o7k03J60j56K06j82P7j94O5j75j9j96O4j89J74j55%k33K7k15M4l32J35M3L02p4Q2
117D742j86k9k15M5K8K8j64R6j89P0k09n3j70Q9m6J08MJ60j35j36j74Q6Q0P9j38J7j68R2j37
112C575J8j99O0N2N2l9l9j16K48MMp1p1j49Pj69j5M8M7o3R3l4J22rJ47n0n1p9P7p9p9k18o3
107B961M2M1q5P1O1O1J8J8O0K16j5j5j31K4O4O4NNq0P5Oj48j19L6J64J63l6j92j43J2K2J77
$$ plain form
134 17979 17843 16895 17141 16239 16116 15008 14990 14193 14383 13738 13975 13415 13633 12982 12903 12213 12614 12314 12690 12092 11961 10943 10600
131 10600 9841 9965 9559 9828 9500 9951 9688 9995 9758 9988 9369 9217 8767 8991 8661 8797 8291 8460 8321 8753 8393 8396 7945 7961
127 7961 7457 7629 7531 7796 7523 7821 7692 7926 7550 7434 6923 7085 6917 7320 7300 7540 7371 7566 7416 7838 7883 8603 9258 11003
124 11003 13141 15278 14535 13015 12836 13956 15023 16090 14994 12808 10525 9436 8385 7802 7044 6753 6339 6184 5753
121 5753 5686 5483 5643 5487 5693 5511 5588 5394 5459 5284 5265 5069 5133 4944 5118 4963 4963 4730 4757 4542 4586 4254 4389 4432 4734 4660 4742
117 4742 4556 4527 4312 4357 4385 4413 4249 4345 4156 4226 4017 3964 3794 3883 3837 3945 3949 4109 3974 3838 3664 3750 3830 3909 3771 3788 3620 3712 3575
112 3575 3593 3394 3454 3506 3558 3519 3480 3364 3612 3616 3620 3549 3478 3329 3336 3167 3152 3200 3247 3184 3277 3243 3365 3356 3503 3453 3402 3323 3400 3321 3242 3024 2961
107 2961 3003 3044 2959 3030 3091 3152 3170 3188 3248 3464 3449 3434 3303 3327 3391 3455 3460 3465 3385 3460 3466 3318 3199 3235 3399 3562 3526 3334 3191 3203 3225 3402
102C402K1K1k1k2j97m1R5o1L6L7ppr5O1K46K45l0k89k80j25r9r8l8l8R2R2J9K0j9k0JJp6p7
97B749n0m9K8K8m4m5o1o1J86p5ooj5j5J50nJ2J1j24L1l0k9k0k0l2l1N6j00j1j0N7N8J2J2J3
92B564J2j4j3j4j3P5P6M0k20o4o3M0L9J20l6M2M2Q3p3p4p3R6o0L7j19pqJ39j8J22l5P3P3o3
86B706k18j1j1J39j8P1P0K24K25J82K6q7q8J10m5J71J5J42j4R2R1J70J3J87J86N43N44J012
82F427J479K221L415N044N718M680J203k787n537n452m363k880j791j020p59m56p16m17k62
79C747j25k81j16j15pj61N5N5N6N5K05M9k5k84k26k27p1p1J14j46j08j09M1M1Q7j73k6k7O
75B213OmmJ18l8N9r6k2k3N5j00J5J5%%M2l7Q5p0O6r0R9K2J14m3N0j05q5q4K7j28L7m0L2j24
70A962J01n5L2j24J2J2P9Q0kkpq5Qj47O0O0n4j32J19l6J04n2R7n8J54j05j3r1P2q3Q7o9po
$$ plain form
102 3402 3423 3444 3423 3401 3204 3163 3258 3197 3233 3270 3263 3256 3161 3222 3468 3713 3683 3394 3114 2989 2890 2792 2754 2716 2808 2900 2919 2939 2920 2900 2901 2902 2826 2749
97 2749 2699 2650 2678 2706 2662 2617 2556 2495 2681 2606 2600 2594 2579 2564 2714 2709 2721 2732 2608 2639 2609 2580 2560 2540 2508 2477 2533 2433 2422 2412 2469 2527 2539 2551 2564
92 2564 2576 2562 2549 2535 2522 2597 2673 2713 2493 2429 2366 2406 2445 2565 2529 2571 2613 2696 2623 2549 2476 2572 2512 2549 2430 2423 2415 2554 2536 2658 2623 2696 2769 2706
86 2706 2488 2477 2466 2605 2587 2658 2728 2952 3177 3359 3385 3298 3210 3320 3275 3446 3461 3603 3589 3681 3772 3942 3955 4142 4328 4871 5415 6427
82 6427 7906 10127 13542 18586 24304 28984 30187 27400 21863 16411 12048 9168 7377 6357 5598 5142 4426 4009 3747
79 3747 3622 3341 3225 3110 3103 2942 2997 3052 3108 3163 3368 3417 3392 3108 2882 2655 2584 2513 2627 2481 2373 2264 2305 2346 2433 2260 2234 2207 2213
75 2213 2219 2215 2211 2329 2291 2350 2254 2232 2209 2264 2164 2179 2194 2194 2194 2236 2199 2284 2214 2280 2190 2289 2311 2425 2382 2432 2327 2242 2158 2185 2057 2094 2054 2086 1962
70 1962 2063 2008 2040 1916 1928 1940 2019 2099 2097 2095 2088 2003 2011 1864 1924 1984 1930 1798 1917 1881 1985 1933 2030 1972 2126 2021 2008 1917 1989 1906 1993 1924 1917 1911
64A911J69r1p0p0J21l4J02n4L4j22M0M1J43j16p1QJ03n3P4q2L4m3K3n4K8n0RRJ68R0Q4p2J5
59B224j40q3j62N0M9J33N4oj61N3j02l0l0O5j4L6j21J07K8P9j80K1K0J65Rj7r5Q5j75PPO9
54A945O9N1N1O1r5j24j25L9L8J19l5k6k6J2J2M1M1M1j14M1M1L6j19p1p1N3N3O3r3PPQ4p1N
49A940MnoO6O6N7K12M62M62R2m79m20m20j54JP8P7R7n8L4L3QQP2j89j20j20J3J3Q2Q1O6r0
44A963kkN2N1O1r4P5P6L18M75N68k10n51l95k42k42j38J8N7N7j1j1RJ0L8L9N9r7j0rM8M8q1
39A927q1q1q1J01J01L3L3ooQPj22j22o0o0J8J8Q7Q7R6n9m7m7j8j8m7m7m8m7L0K9P8p7N9N9
34A697J28J28r1r1q1q1k0J36J35k0n8n8llK5K5R0R0j0j1N5N4j8j8j8j8l6l6N5N4l3l2K2K2
29A980L7j19l1l1k0k0k0k0N0M9J1J0k9k9j20j20M8M8RQN0M9o7o7l7l7K9K8OOP1P2onr2O3J8
$$ plain form
64 1911 2080 1989 1919 1849 1970 1936 2038 1984 2018 1896 1936 1977 2120 2004 1933 1941 2044 1991 2065 1983 2017 1974 1997 1943 1971 1921 1930 1939 2107 2197 2281 2209 2224
59 2224 2084 2001 1839 1889 1938 2071 2125 2119 1958 2011 1909 1879 1849 1914 1900 1936 1815 1922 1950 2029 1849 1870 1890 2055 2064 2047 1952 2037 1862 1869 1876 1945
54 1945 2014 2065 2116 2177 2082 1958 1833 1872 1910 2029 1994 1968 1942 1954 1966 2007 2048 2089 1975 2016 2057 2093 1974 1903 1832 1885 1938 2001 1908 1915 1922 2006 1935 1940
49 1940 1944 1939 1933 1999 2065 2122 2334 2796 3258 3350 2871 2451 2031 1877 1878 1956 2033 2130 2072 2106 2139 2147 2155 2227 2038 1918 1798 1811 1824 1906 1987 2053 1963
44 1963 1961 1959 2011 2062 2123 2029 2104 2180 2498 2973 3541 3331 2780 2385 2143 1901 1763 1781 1838 1895 1884 1873 1882 1892 1930 1969 2028 1931 1921 1912 1960 2008 1927
39 1927 1846 1765 1684 1785 1886 1919 1952 1946 1940 1948 1955 1833 1711 1651 1591 1609 1627 1714 1801 1897 1838 1791 1744 1726 1708 1661 1614 1566 1519 1549 1578 1656 1579 1638 1697
34 1697 1825 1953 1862 1771 1690 1609 1589 1725 1860 1840 1782 1724 1721 1718 1743 1768 1858 1948 1938 1927 1982 2036 2018 2000 1982 1964 1928 1892 1947 2001 1968 1936 1958 1980
29 1980 2017 1898 1867 1836 1816 1796 1776 1756 1806 1855 1866 1876 1847 1818 1698 1578 1626 1674 1683 1691 1741 1790 1723 1656 1619 1582 1611 1639 1645 1651 1722 1794 1788 1783 1691 1754 1772
23A772J8o2o3M0L9J%J6J6J6J6M7M6j12j13p2Q3O0O1LLl6l6k3k3J6J6p6p5J55jL1L1qrq7O8
17A758rj0j15M1m7m7L2L3n9n9KKKKK2K1K2K2M9M9p7P9k3k3o8o7j4J42R8K1k1k1J3J3o0o0L1
12A674L1k9l0l0k9K5K4j4j4O3O3j9j8j35K1j2J44R0R0j7j7j46j45JKj6O2o9Q7n9n9m9m9J10
6A531J09N6J33O4r1q7O8j6j7ppJ5J5k5k4nnq7O8JP8l8L9M8M7k9k9m1J13O6O5L9M0j3J42K34
1B450J57O2K18K78L55J78K3k92m49m48k92k44q8j01j01L6L5o5o6k8K30Q5Q5p0p0r9j00r0O6
-3A655J7J7LKo2o3P0P0NNj2j2j3j2N4N4r9N7n4n4onm8m7O9O9n6n6j36J22l3l4M8M8MMR4R5
-9A760r8r8o9Q7o3o2k3J32K0K0j23L3jjRRM1M1M1M1n4n4K0K1o9Q6jkm5m6J9J9jjm0m0J4J4
-15A536k5k5j5j5P6P6j0j1j0j0l4l5l5l5RQQQL9L8q7O7%%M8M8nnNMj13M3l5l5o2R4PPNOl3
$$ plain form
23 1772 1790 1728 1665 1705 1744 1745 1745 1761 1777 1793 1809 1856 1902 1790 1677 1605 1688 1748 1809 1812 1815 1779 1743 1720 1697 1713 1729 1653 1578 1733 1732 1763 1794 1786 1777 1690 1758
17 1758 1749 1739 1624 1665 1618 1571 1603 1636 1577 1518 1520 1522 1524 1526 1548 1569 1591 1613 1662 1711 1634 1713 1690 1667 1599 1532 1518 1660 1758 1779 1758 1737 1750 1763 1703 1643 1674
12 1674 1705 1676 1646 1616 1587 1612 1636 1622 1608 1671 1734 1715 1697 1562 1583 1571 1715 1805 1895 1878 1861 1715 1570 1571 1573 1557 1619 1550 1637 1578 1519 1470 1421 1531
6 1531 1640 1696 1829 1893 1802 1715 1783 1767 1750 1743 1736 1751 1766 1741 1717 1712 1707 1620 1688 1689 1767 1729 1768 1816 1863 1834 1805 1764 1877 1943 2008 2047 2087 2074 2216 2450
1 2450 2607 2669 2887 3165 3520 3698 3721 3429 2980 2532 2240 1996 1908 1807 1706 1742 1777 1712 1646 1618 1848 1933 2018 1948 1878 1779 1679 1589 1655
-3 1655 1672 1689 1692 1694 1632 1569 1639 1709 1714 1719 1707 1695 1682 1670 1724 1778 1679 1736 1682 1628 1622 1617 1569 1522 1591 1660 1604 1548 1412 1534 1501 1467 1515 1563 1567 1571 1665 1760
-9 1760 1662 1564 1495 1582 1519 1457 1434 1566 1586 1606 1483 1516 1515 1514 1523 1532 1573 1614 1655 1696 1642 1588 1608 1629 1560 1646 1645 1643 1598 1552 1571 1590 1589 1588 1548 1508 1522 1536
-15 1536 1511 1486 1471 1456 1532 1608 1598 1587 1577 1567 1533 1498 1463 1428 1437 1445 1453 1461 1500 1538 1451 1518 1518 1518 1566 1614 1609 1604 1609 1613 1500 1543 1508 1473 1411 1505 1512 1519 1524 1530 1497
-21A497l3LMp5Q2p4Q2J05J05j01N4OOl6l6J3J2j20L6M0L9l0l1L4L5rrp3p4kjl1l1n9R6RQk0
-27A421k1M4M5l1l1l2l1j3j3j4j3P8P8R0o5j30J29J77K2p9p9n9R6jkP3P3q6q6q6q6j5j5N9
-32A397N9k3J32K4j30j01N5J26J27m3m3l2l3r5O1k6k6JJR2R1m1m1m1m1kkL7L7NNq2P3J9J9
-38A559L9L8j61nkkONN5j02M3M3n7n8M6M5J7J6r1O4M1M2nmmmj00j00r7N9K6K7L6L7m3m2OP
-43A380jJ55KLK4K5q3q3q1P5O5O5j1j0O7O7m8m8m8m8n7n8n8n7L1L2J10J10K0K1J1J0K3j32
-49A473m6m5M4M3MMK3K3k0j75k4k3m3J13P7P8J0Rl3l3M4M5J0J0N9r7j09j09J1J0j1j2O7O6
-54A443J2J3J3J3L7L8r2r2j4j4P4q3O6O5O5r1o1o1p1p1MLJ34J33P0O9qrrrm8m8K1K2P0q6j04
-59A394j05J5J5J6J5K6K6p4Q2J60Mj15j16N6N7j3j3j3j2q7q6M3M3L9M0%JLMQ2Q1k5k5o3o4
$$ plain form
-21 1497 1464 1467 1471 1396 1478 1404 1486 1591 1696 1595 1649 1655 1661 1625 1589 1602 1614 1494 1530 1570 1609 1579 1548 1582 1617 1608 1599 1526 1452 1450 1449 1418 1387 1328 1424 1433 1441 1421
-27 1421 1400 1444 1489 1458 1427 1395 1364 1351 1338 1324 1311 1389 1467 1557 1492 1362 1491 1668 1690 1611 1532 1473 1569 1568 1566 1639 1712 1626 1540 1454 1368 1353 1338 1397
-32 1397 1456 1433 1565 1589 1459 1358 1413 1539 1666 1623 1580 1548 1515 1420 1481 1455 1429 1430 1431 1523 1614 1573 1532 1491 1450 1448 1446 1483 1520 1525 1530 1448 1521 1540 1559
-38 1559 1598 1636 1475 1470 1468 1466 1472 1477 1532 1430 1473 1516 1459 1401 1447 1492 1509 1525 1434 1498 1539 1581 1576 1572 1568 1564 1464 1364 1267 1326 1352 1379 1415 1452 1409 1367 1373 1380
-43 1380 1379 1534 1536 1539 1563 1588 1505 1422 1341 1416 1481 1546 1535 1525 1592 1659 1611 1563 1515 1467 1410 1352 1294 1237 1268 1300 1410 1520 1540 1561 1572 1582 1605 1473
-49 1473 1427 1382 1426 1469 1473 1477 1500 1523 1503 1328 1304 1281 1238 1351 1428 1506 1516 1525 1492 1459 1503 1548 1558 1568 1627 1530 1421 1312 1323 1333 1322 1310 1377 1443
-54 1443 1455 1468 1481 1494 1531 1569 1477 1385 1371 1357 1431 1348 1414 1479 1544 1453 1392 1331 1260 1189 1193 1196 1330 1463 1533 1602 1594 1585 1576 1567 1519 1471 1492 1514 1584 1498 1394
-59 1394 1289 1304 1319 1335 1350 1376 1402 1328 1410 1570 1574 1459 1343 1399 1456 1443 1430 1417 1405 1318 1232 1275 1318 1357 1397 1397 1398 1401 1405 1487 1568 1543 1518 1455 1391
-65A391l8l8J79K4K5K6O4r1j2j3M6M6R1o4n4n5j5j6j5j6k0k1l0l1J61Ml7l8M0M1JJo6o6LK
-70A409J39j7opn7n7J1J1P1q4ooN7r9O7O7n6n6K2K2N2N1k6k7j13j14l5l6J28J29Q6p0L9L9
-75A528L0K9k4k4l4l4jj56o9o9OOOOL5L6L5L5MMJ69J4m3m3j3j4m8m7rrj2j2O6O6j15j15J09
-81A293J09J53kM3j13J3J2LKn9o0o9Q7K2K3ppJ0RR7n9j9j9k8k9m4m4m5m4M5M5L6L5K7j28K7
-87A315K7Q6p0o1o0J0J0%%Q3p2J5J4J2J1J1J1l1l0M7M6M8M7p3p3k4J31N4j02nnM7M7J43j16
-92A493m9m8N5N5N5N5j34j35R0Q9lj59PPp5p5N4N5K8K7j1j1n3n3k4k4J70J4J5J4J48pn0m9
-97A471p2p1M9M8M7j08j19L8J54kl5l4NOl4l3K6K6K6K7k1k1o0n9Q6Q6m4m4J2J2q5P1J41j5
-102A474NNk4k5k4k4Q4Q4OPPPp1p0RJ0N9r7j9j9J0J0P5P5llm6m6m6m6Q8Q7R8n9k2k2j09j10
$$ plain form
-65 1391 1353 1315 1494 1518 1543 1569 1633 1542 1530 1517 1563 1609 1700 1636 1582 1527 1512 1496 1481 1465 1445 1424 1394 1363 1524 1528 1491 1453 1493 1534 1535 1536 1470 1404 1407 1409
-70 1409 1548 1531 1525 1518 1461 1404 1415 1426 1497 1413 1407 1401 1458 1359 1426 1493 1437 1381 1403 1425 1477 1528 1502 1475 1362 1248 1213 1177 1305 1434 1520 1450 1489 1528
-75 1528 1558 1587 1563 1539 1505 1471 1470 1314 1245 1176 1182 1188 1194 1200 1235 1271 1306 1341 1345 1349 1518 1532 1489 1446 1433 1419 1371 1324 1315 1306 1294 1282 1348 1414 1299 1184 1293
-81 1293 1402 1555 1553 1596 1483 1496 1508 1511 1513 1454 1394 1325 1412 1434 1457 1450 1443 1453 1462 1559 1500 1481 1462 1434 1405 1361 1317 1272 1228 1273 1318 1354 1389 1416 1288 1315
-87 1315 1342 1428 1358 1297 1237 1247 1257 1257 1257 1340 1268 1283 1297 1309 1320 1331 1342 1311 1281 1328 1374 1422 1469 1396 1323 1299 1430 1484 1382 1377 1372 1419 1466 1609 1493
-92 1493 1444 1396 1451 1506 1561 1616 1482 1347 1437 1526 1523 1364 1371 1378 1303 1228 1282 1337 1365 1392 1381 1370 1317 1264 1240 1216 1386 1400 1415 1429 1577 1570 1520 1471
-97 1471 1399 1328 1377 1425 1472 1364 1245 1283 1437 1435 1400 1366 1371 1377 1343 1310 1336 1362 1388 1415 1394 1373 1313 1254 1340 1426 1382 1338 1350 1362 1277 1348 1489 1474
-102 1474 1479 1484 1460 1435 1411 1387 1471 1555 1561 1568 1575 1582 1511 1441 1450 1460 1519 1422 1403 1384 1394 1404 1479 1554 1551 1548 1502 1456 1410 1364 1452 1539 1637 1578 1556 1534 1425 1315
-108A315J3J2k6k6K6K6J14m1k6k6l5l5KKKKKKQ1Q0j23j23J11J11m4m3L4L4J7J7k2k2l0l0l1
-113A320l0R1R0l9l9L6L6q4q4m3J12K5K5M9N0p0p1j00N5p1p1Q1Q0LKo1o1O8O8J1J1J2J1j3
-119A399j4j3j3M5M5M6M5l6l6N2j04l7l7m6m6L3L3K50R5n8n8j55Jj6j6J24J24j0j1j0j1K2
-124A587K2n5n6m1m0m1m0N9O0j9j9m4m5ooR1R1q0q1p2Q5J22l2k6k5MLJ4J5k5k5m6m6Q4Q4J2
-129A463J3o6o5k5k5N3N3rrrrk4k3k4k3K1K1K1K1j19j18O3O3N5N5k3k3m7m7o2R4O7j1N3N2
-134A407j14M1m6m7n0n0L2L2N4J31N5j01q9O6J8o0j44o6O7O7klm1m2J12J12L4L3p4p5LLk7
-139A236k7J2J2K9K9m9m9M3M3M2M3mlmlM2M1L3L2M7j08j09M7%jk0k0NJ61mnj8j7r6r5j6j5
-145A234K3K3M2M2M2M2m6m7l6l7o3R2MNl2l3POk2k2l1J24k4k3r2r1J0J1J0J1Q2Q3J02n4j12
$$ plain form
-108 1315 1328 1340 1314 1288 1314 1340 1454 1413 1387 1361 1326 1291 1293 1295 1297 1299 1301 1303 1384 1464 1341 1218 1329 1440 1396 1353 1387 1421 1438 1455 1433 1411 1381 1351 1320
-113 1320 1290 1381 1471 1432 1393 1429 1465 1381 1297 1254 1366 1391 1416 1465 1515 1445 1374 1274 1329 1258 1187 1268 1348 1351 1353 1292 1231 1299 1367 1378 1389 1401 1412 1399
-119 1399 1385 1372 1359 1404 1449 1495 1540 1504 1468 1520 1416 1379 1342 1296 1250 1283 1316 1566 1661 1603 1545 1390 1391 1375 1359 1483 1607 1597 1586 1576 1565 1587
-124 1587 1609 1554 1498 1457 1417 1376 1336 1395 1455 1436 1417 1373 1328 1322 1316 1407 1498 1418 1337 1265 1350 1472 1440 1414 1389 1393 1396 1410 1425 1400 1375 1329 1283 1367 1451 1463
-129 1463 1476 1410 1345 1320 1295 1348 1401 1392 1383 1374 1365 1341 1318 1294 1271 1292 1313 1334 1355 1236 1118 1181 1244 1299 1354 1331 1308 1261 1214 1152 1246 1313 1302 1355 1407
-134 1407 1293 1334 1288 1241 1191 1141 1173 1205 1259 1390 1445 1344 1255 1321 1339 1279 1135 1069 1136 1203 1201 1198 1157 1115 1227 1339 1373 1406 1332 1257 1260 1263 1236
-139 1236 1209 1221 1233 1262 1291 1242 1193 1236 1279 1321 1364 1360 1357 1353 1350 1392 1433 1466 1498 1545 1437 1328 1375 1375 1374 1354 1334 1339 1500 1496 1491 1473 1456 1360 1265 1249 1234
-145 1234 1257 1280 1322 1364 1406 1448 1402 1355 1319 1282 1219 1311 1315 1320 1288 1255 1262 1268 1246 1224 1193 1317 1293 1270 1178 1087 1097 1108 1118 1129 1211 1294 1396 1342 1230
-150A230M4L4L4m6J10K3K2j05j06p3Q3M7j09N7N7P1q4LMR6R6l4l4j9j9k9J27j2j2p1p0r5O1
-155A281k7k7k7k7N1N1N7N7J7J8J9K0m9m8q5P1P0P1j57kL1L1Q2p4n4n4k8J27JJQ4Q5q8q7p5
-161A316Q1poj7j7j8j7O6O7p7p6J3J4J3J3l1l2j19L6J5J6R0R0p3p2p0Q7j6j6MMj08M7M8j08
-166A140m6m6Q8Q7L9M0L9M0j9j9K0K0m0m1j27K8O5O4M5M5j00N6PQlkL6L6L3L2n8n9j8j8n7
-171A315n7O4O4K4K5o4o4J57Jj44J15m1m0j1j1N5N4j04j04O4O5n9n9q1P4K9K8M5j11l6J19
-176A312K2K2OOOPK4K5o6o6k5k6k5k6M3M3M2M3j4j4K5K5k9k9q7O9O2r4MMK9K9j24L2n7n7M3
-182A184M3K1K0J1J1J11m5M2M3OPq4q4l3l4P3P4R8n8O8O9m2m1q1q0J1J2p5Q0kkQQrrrrj4j5
-188A274K5K5J15J15Pj48k9k9j0j0P6q0QQqpqqn3n4R0Q9m2m3OOq1P5j3j3JJO6O5POq1P5m2
$$ plain form
-150 1230 1274 1308 1342 1296 1406 1429 1451 1346 1240 1167 1250 1297 1188 1245 1302 1373 1289 1292 1296 1392 1488 1454 1420 1401 1382 1353 1480 1468 1456 1385 1315 1220 1281
-155 1281 1254 1227 1200 1173 1224 1275 1332 1389 1406 1424 1443 1463 1414 1366 1281 1352 1422 1493 1336 1334 1365 1396 1478 1404 1350 1296 1268 1395 1396 1397 1481 1566 1478 1391 1316
-161 1316 1397 1390 1384 1367 1350 1332 1315 1381 1448 1371 1295 1308 1322 1335 1348 1317 1285 1166 1202 1217 1233 1323 1413 1340 1268 1198 1285 1269 1253 1257 1261 1153 1200 1248 1140
-166 1140 1094 1048 1136 1223 1262 1302 1341 1381 1362 1343 1363 1383 1343 1302 1175 1203 1268 1332 1377 1422 1322 1378 1385 1393 1390 1388 1424 1460 1493 1525 1467 1408 1390 1372 1315
-171 1315 1258 1322 1386 1410 1435 1371 1307 1464 1465 1321 1436 1395 1355 1344 1333 1388 1442 1338 1234 1298 1363 1304 1245 1164 1238 1267 1295 1340 1229 1193 1312
-176 1312 1334 1356 1362 1368 1374 1381 1405 1430 1364 1298 1273 1247 1222 1196 1239 1282 1324 1367 1353 1339 1364 1389 1360 1331 1244 1313 1375 1281 1285 1289 1318 1347 1223 1255 1198 1141 1184
-182 1184 1227 1248 1268 1279 1290 1401 1356 1398 1441 1447 1454 1370 1286 1253 1219 1292 1366 1464 1406 1474 1543 1501 1460 1379 1299 1310 1322 1247 1327 1325 1323 1331 1339 1330 1321 1312 1303 1289 1274
-188 1274 1299 1324 1439 1554 1561 1413 1384 1355 1345 1335 1411 1331 1339 1347 1339 1332 1324 1316 1263 1209 1299 1388 1346 1303 1309 1315 1234 1309 1296 1283 1284 1285 1351 1416 1423 1429 1348 1423 1381
-194A381m3l2l3o1o2N5N5m0m0K5K5J03J03j4j4M4M5j17L8Q8o8q8q7J0J1J0J1N0N0K1j34o2
-199A230o2R7R7q3q3L4L4N6N7J8J8QQm1m0P5p9j19L7N3N3j5j5N7N8p1p2M9M9R7n8j14j15q2
-204A136P4L6L6M6M6k9l0J0Rl5l5M3M2R0R0r2r2k5k6k5k6O1O0o9p0J9J8J8J8n8n8J0J0J22
-209A324l3k4k4j7j6O1O1l7l8N0j05j1j1N7N7M6M5M6M6q0q0Qj48kkN6N6N7r8N7N7N6j01j00
-214A213N6N2N3j5j5n3n2J5J6J41j4mnj9j9N9N8j9j9j8j9o5o4o4o5Q8Q7J0Rm4m4Q6Q5KKp6
-220A339p5k0j9j9j9N1N0k7k8j3j4j3j4K8K8O7O7j26j25NML4L4L4L4J13J13L6L5j31j32kk
-225A293O3O2o8o7O6O6K8K7L5L5m3m4l5l5j12j13LLM2M2r7r7J36J37n1n1P9P9L8L8l9m0p5
-230A305p6J06J07l2l2M6M6NMj22L4Q0Q0l9m0n0m9q9q8Q2Q1MM%jj0j0M6j11k3k3RRM7M8o7
$$ plain form
-194 1381 1338 1306 1273 1212 1150 1205 1260 1220 1180 1205 1230 1333 1436 1422 1408 1452 1497 1380 1418 1506 1438 1350 1263 1273 1284 1294 1305 1355 1405 1426 1292 1230
-199 1230 1168 1265 1362 1279 1196 1230 1264 1320 1377 1395 1413 1421 1429 1388 1348 1423 1344 1225 1262 1315 1368 1353 1338 1395 1453 1382 1310 1359 1408 1505 1447 1333 1218 1136
-204 1136 1210 1246 1282 1328 1374 1345 1315 1325 1334 1299 1264 1307 1349 1439 1529 1437 1345 1320 1294 1269 1243 1304 1364 1295 1225 1244 1262 1280 1298 1240 1182 1192 1202 1324
-209 1324 1291 1267 1243 1226 1210 1271 1332 1295 1257 1307 1202 1191 1180 1237 1294 1340 1385 1431 1477 1397 1317 1325 1177 1175 1173 1229 1285 1342 1244 1301 1358 1414 1313 1213
-214 1213 1269 1321 1374 1359 1344 1291 1239 1254 1270 1411 1397 1393 1388 1369 1350 1409 1467 1448 1429 1411 1392 1327 1263 1199 1134 1222 1309 1319 1328 1284 1240 1326 1411 1413 1415 1339
-220 1339 1264 1244 1225 1206 1187 1238 1288 1261 1233 1220 1206 1193 1179 1207 1235 1302 1369 1243 1118 1123 1127 1161 1195 1229 1263 1376 1489 1525 1560 1429 1297 1295 1293
-225 1293 1356 1418 1350 1283 1349 1415 1443 1470 1505 1540 1497 1453 1418 1383 1271 1158 1161 1164 1206 1248 1151 1054 1190 1327 1276 1225 1304 1383 1421 1459 1420 1380 1305
-230 1305 1229 1335 1442 1410 1378 1424 1470 1475 1479 1357 1391 1471 1551 1512 1472 1422 1373 1284 1196 1278 1359 1363 1367 1367 1366 1356 1346 1392 1281 1258 1235 1244 1253 1300 1348 1281
-235A281o6J1J1L0L0L0L0J7J7o7k23r6N9l8l8J20J21rrj4j4J51mr3r3K7K7R0R0l9m0OOOOl0
-241A293l0R7n9lkN2N3j6j6P1q4p2p2L6L5k1k1k0k1ppppJ9K0K0J9M0L9n1n1n1n0kkp5Q0J45
-246A272j1m2m3n2n2N3N4R2R2L6L5L6L5j6j5n5n4%j%%L8L9L9L8n6n6m7m7r7N8j%N7r8N4N4
-252A339O3O3p0k26m2m1L9L9nmnnL5L6L5L6k9k8J0J0MMMMj3j2j0J47J1J2m3m4q3q4q3q4O9
-258A049O9O9O9m8m8P8P9p7P9l4j89QQ5J25l2j03k4O4O4j2j3j3j3NMM3M3J%l9l8rrJ08J08
-263A449l6l6O1r5p4Q1P2om3L6j2j67p0PK0J9R7R7l1j87K1J00J7j39K4K5p8P8L3m4l0l0nm
-268A150O0O0n9n9n9n9P6P7J41J42j28j27j0j0K4K3m1m1J7J8N6N6N0N0r2r3k5k4M0M1lkL6
-273A285L7n2n2J1Q9J03n3L9L9rqm8m8o9p0R9n7j72Q7K1K2KKJKl3l3J04J05M8l0j65qR0R0
$$ plain form
-235 1281 1215 1226 1237 1267 1297 1327 1357 1374 1391 1324 1101 1005 1064 1026 988 1108 1229 1220 1211 1197 1183 1334 1330 1237 1144 1171 1198 1288 1378 1339 1299 1305 1311 1317 1323 1293
-241 1293 1263 1360 1301 1298 1296 1348 1401 1385 1369 1440 1356 1284 1212 1248 1283 1262 1241 1221 1200 1193 1186 1179 1172 1191 1211 1231 1250 1290 1329 1278 1227 1176 1126 1124 1122 1047 1127 1272
-246 1272 1261 1219 1176 1124 1072 1125 1179 1271 1363 1399 1434 1470 1505 1489 1474 1419 1365 1365 1364 1364 1364 1402 1441 1480 1518 1462 1406 1359 1312 1215 1273 1272 1272 1329 1231 1285 1339
-252 1339 1402 1465 1395 1169 1127 1086 1125 1164 1159 1155 1150 1145 1180 1216 1251 1287 1258 1230 1240 1250 1254 1258 1262 1266 1253 1241 1231 1378 1389 1401 1358 1314 1231 1147 1064 980 1049
-258 1049 1118 1187 1256 1208 1160 1238 1317 1240 1319 1285 1096 1104 1189 1314 1282 1179 1155 1219 1283 1271 1258 1245 1232 1237 1241 1284 1327 1328 1328 1289 1251 1242 1233 1341 1449
-263 1449 1413 1377 1438 1343 1269 1350 1422 1416 1373 1409 1397 1230 1160 1167 1187 1206 1303 1400 1369 1182 1203 1303 1320 1181 1205 1230 1152 1230 1263 1219 1189 1159 1154 1150
-268 1150 1210 1270 1211 1152 1093 1034 1110 1187 1328 1470 1342 1215 1205 1195 1219 1242 1201 1160 1177 1195 1251 1307 1357 1407 1315 1222 1197 1173 1213 1254 1251 1249 1285
-273 1285 1322 1270 1218 1229 1318 1421 1368 1407 1446 1437 1429 1381 1333 1264 1194 1293 1236 1064 1151 1172 1194 1196 1198 1199 1201 1168 1135 1239 1344 1392 1362 1197 1189 1279 1369
-279A369m3m3K8K8q9q9L1L0O9P0J2J3J3J3k2k1o0o0OPPPLLMLN7N6j02j02m8J09Q6Q5j3j4j3
-284A390j4j28j29O6O6MMLMo4o5k5k5N4N4N4N4klq3q4p6P9qqj4j4P7P7M8M8j6j7j9k0k0k0
-290A228L0K9L0L0q3q2m3m3R2R2KKQ4Q5n9n8o1o0N6N6kkm1m1j4j3l6J19o3o3J2J1M8M7M7M7
-295A383l7l7k8k7k7J30k3k3O2O2k9k8q9q9K8K8K1K1m3m4N5N5%jj33K2N2N1ooj32K3N1N1l0
-301A263l0KKn7J00J18l8n7n7KKKKo1o1MMJ9J9o8Q7l0l1M5M4J9J9q2q2r4J65Q3Q4j2j3K7K6
-306A365m6m6opm0l9j18L9K7J82J5J4nnnnJ4J4n1n1l9l9j65j0K6K5L5L5O5O4k6k6M8M7pqj35
-312A136K0K3K4Q0Q0j1j1n9o0L1L2n3n2n2n2j6j5P5P6K0K0K1K0L2L3k3k3j86l0l7J19jjR9
-317A259R9q6q5L1L1N9O0n7n7j3j2llj12M4J08m8K2K2N0N1j2j2j29K6o2R3O4r2m5m5p8P8K2
$$ plain form
-279 1369 1326 1283 1311 1339 1250 1161 1192 1222 1291 1361 1373 1386 1399 1412 1390 1369 1309 1249 1255 1262 1269 1276 1279 1282 1286 1289 1346 1402 1300 1198 1150 1259 1345 1430 1417 1403 1390
-284 1390 1376 1248 1119 1185 1251 1255 1259 1262 1266 1202 1137 1112 1087 1141 1195 1249 1303 1301 1298 1215 1131 1055 1134 1126 1118 1104 1090 1167 1244 1292 1340 1324 1307 1288 1268 1248 1228
-290 1228 1258 1287 1317 1347 1264 1182 1139 1096 1188 1280 1282 1284 1368 1453 1394 1336 1275 1215 1271 1327 1325 1323 1282 1241 1227 1214 1178 1297 1234 1171 1183 1194 1242 1289 1336 1383
-295 1383 1346 1309 1281 1254 1227 1357 1334 1311 1373 1435 1406 1378 1289 1200 1228 1256 1277 1298 1255 1211 1266 1321 1321 1320 1187 1209 1261 1312 1306 1300 1168 1191 1242 1293 1263
-301 1263 1233 1235 1237 1180 1280 1398 1360 1303 1246 1248 1250 1252 1254 1193 1132 1136 1140 1159 1178 1110 1197 1167 1136 1181 1225 1244 1263 1181 1099 1005 1170 1253 1337 1325 1312 1339 1365
-306 1365 1319 1273 1267 1260 1220 1181 1063 1102 1129 1311 1326 1340 1335 1330 1325 1320 1334 1348 1297 1246 1207 1168 1003 993 1019 1044 1079 1114 1179 1243 1217 1191 1239 1286 1279 1271 1136
-312 1136 1156 1179 1203 1283 1363 1352 1341 1282 1222 1253 1285 1232 1180 1128 1076 1060 1045 1120 1196 1216 1236 1257 1277 1309 1342 1319 1296 1110 1080 1043 1162 1161 1160 1259
-317 1259 1358 1272 1187 1218 1249 1308 1368 1311 1254 1241 1229 1226 1223 1111 1155 1263 1215 1237 1259 1309 1360 1348 1336 1207 1233 1171 1264 1328 1236 1191 1146 1068 1146 1168
-322A168K3n9n8R2R2j03j02N9O0N9O0J4J5J5J5n9n9n9n8L8L9j%k4k4J5J5MNo1o0L4L3R9R8
-328A325J0Rq2q1L6L6L6L6l4l4L2L1j5j4o3o3j00J60J3J4kkp6p7O7q9J15J15L6L6L6L6o7o7
-333A313o6o7n0n0J4J4Q0Q0J35j25J%r7r7l6J19N5j01j4j5J5J5K9K8K9K9K1K2o7R0KKp6Q0
-338A312m4m4l4l5N1N1j5j4M5M5p1p2J2J2N1N1J2J2p5Q0m9m9l9l9O1O1O0O1q1q2m2m3J7J8
-343A184J7J8LKl6l6l8l9L6L6jJ54L8j19P0P0j25j24j0J46Q1p5mmJ55jJ1j45j54JMMK17O2
-349A398o1o1M5M6n8n8OPL4L4j09j09M7M7j8j8j7j8K1K2M9M8P2q4P5P6k5k5r5r5M8M7j0j1
-354A250p6p5n8n8N9N9k3k3J55%l3l3J72J5j78k3K2K3L3L3Q8Q8M8j08k0k0m6m5o5R1J22l4
-359A340j5j5j9k0j9j9Q0Q0j4j69m8m8K0K1O6O6j2j2M0L9L9M0m0l9jjooq4q4j3j3N5N6J33
$$ plain form
-322 1168 1191 1132 1074 1166 1258 1155 1053 1112 1172 1231 1291 1305 1320 1335 1350 1291 1232 1173 1115 1153 1192 1191 1191 1167 1143 1158 1173 1177 1182 1121 1061 1095 1128 1227 1325
-328 1325 1335 1344 1262 1181 1217 1253 1289 1325 1291 1257 1289 1320 1305 1291 1228 1165 1065 1225 1238 1252 1250 1248 1172 1095 1162 1073 1188 1303 1339 1375 1411 1447 1380 1313
-333 1313 1247 1180 1130 1080 1094 1108 1188 1268 1403 1278 1279 1279 1182 1085 1049 1168 1223 1122 1108 1093 1108 1123 1152 1180 1209 1238 1259 1281 1214 1304 1306 1308 1232 1312
-338 1312 1268 1224 1190 1155 1206 1257 1242 1228 1273 1318 1247 1175 1187 1199 1250 1301 1313 1325 1250 1330 1281 1232 1193 1154 1215 1276 1336 1397 1316 1234 1192 1149 1166 1184
-343 1184 1201 1219 1222 1224 1188 1152 1114 1075 1111 1147 1146 1300 1338 1219 1289 1359 1234 1110 1100 1246 1327 1252 1248 1244 1399 1398 1409 1264 1110 1111 1115 1119 1336 1398
-349 1398 1337 1276 1321 1367 1309 1251 1257 1264 1298 1332 1223 1114 1161 1208 1190 1172 1155 1137 1158 1180 1229 1277 1349 1265 1340 1416 1391 1366 1271 1176 1224 1271 1261 1250
-354 1250 1174 1099 1041 983 1042 1101 1078 1055 1210 1210 1177 1144 1316 1331 1153 1130 1152 1175 1208 1241 1329 1417 1465 1357 1337 1317 1271 1226 1161 1252 1374 1340
-359 1340 1325 1310 1291 1271 1252 1233 1313 1393 1379 1210 1162 1114 1134 1155 1221 1287 1275 1263 1303 1342 1381 1421 1381 1342 1341 1340 1334 1328 1244 1160 1147 1134 1189 1245 1378
-364A378k3j2j3N4N4k3k4q2q3m4m4N4N3k5k5L3L3l5l6q1P3j3j4J6J7J04n2l8l7rqM6M6l2l2
-369A176%%J%L1L1m6m7Q7Q8m3m2n8n9J0RJ78K3k0k0j9j9K0K0l3l3l3l3r2r2R0Q9P6P6Q5p0
-375A331o3o2l0J26m4m5O3r3q0P6J43j2L8L7K7K8j07j08P5P4J5J5o3o3kkL7L7q8q8L2L2J18
-380A354l9j68j2J56J57o7o7ppqpK1K1n6n7J1J2J1J1M5M4q5q5K5K5K6K5n8n9K0K0J6J6J7J6
-385A267K9K8L8j17QQm0m0j1j0O8O7l9l9L8L8m6m5ppK5K5j3j4opJ3j43kJ53N7N6kkL7L7r8
-391A304r8Q3Q3r1r0L9L9K8K8K8K8N8N8p2p2J5J5o3o2k8k8R9n7m5m4J3J4K04M8r8r7M0M0l7
-396A282l8k8k8P0q6j04N1M6M5k1k2j8J38l4l3k4k3K1K2p0o9Q9Q8j1j2R7n9r8N7L8L7m3m4
-401A216K6K5K6K5nnnol4l4P3P2J2j45n7n7J06J05q9q9Q7Q7J10m6p8p9K9K8L3L2K3K3lj59
$$ plain form
-364 1378 1355 1343 1330 1384 1438 1415 1391 1309 1226 1182 1138 1192 1245 1220 1195 1228 1261 1226 1190 1109 1182 1169 1155 1171 1188 1292 1240 1202 1165 1156 1148 1194 1240 1208 1176
-369 1176 1176 1176 1177 1177 1208 1239 1193 1146 1233 1321 1278 1236 1178 1119 1129 1138 1316 1339 1319 1299 1280 1261 1281 1301 1268 1235 1202 1169 1077 985 1075 1164 1240 1316 1401 1331
-375 1331 1268 1206 1176 1302 1258 1213 1276 1183 1103 1179 1322 1310 1348 1385 1412 1440 1333 1225 1300 1374 1389 1404 1341 1278 1276 1274 1311 1348 1260 1172 1204 1236 1354
-380 1354 1315 1147 1135 1291 1448 1381 1314 1307 1300 1292 1285 1306 1327 1271 1214 1225 1237 1248 1259 1304 1348 1263 1178 1203 1228 1254 1279 1221 1162 1182 1202 1218 1234 1251 1267
-385 1267 1296 1324 1362 1245 1253 1261 1221 1181 1170 1160 1228 1295 1256 1217 1255 1293 1247 1202 1195 1188 1213 1238 1225 1211 1205 1198 1211 1068 1066 1219 1276 1332 1330 1328 1365 1402 1304
-391 1304 1206 1289 1372 1281 1191 1230 1269 1297 1325 1353 1381 1439 1497 1425 1353 1368 1383 1320 1258 1230 1202 1301 1244 1199 1155 1168 1182 1386 1434 1336 1239 1279 1319 1282
-396 1282 1244 1216 1188 1258 1172 1068 1119 1165 1210 1189 1167 1149 1287 1253 1220 1196 1173 1194 1216 1146 1077 1166 1254 1243 1231 1328 1269 1171 1228 1266 1303 1260 1216
-401 1216 1242 1267 1293 1318 1313 1308 1303 1297 1263 1229 1302 1374 1386 1241 1184 1127 1233 1338 1249 1160 1247 1334 1444 1398 1320 1241 1270 1298 1331 1363 1386 1409 1406 1247
-406A247j20L5llOON4N3j2j1j9j9P2P1K3K3j7j6j3j2n1n1l9l9j26K9R3R3l9m0l7l6KKO4O4
-412A234j%j6j5n5n4O4O4K5K5j06j06J1J1J27J28r3r3k9k8J0J0K2K2K2K3J2J2N1N1l4l4nn
-417A250N9r7N5N6n2n1J3J3L6L6p1p1m7J09m4m4J1J0J01J01m9m9m9m9k3k3J5J6Q8Q7L3j23
-422A247l7l7J8J8nnm5m4J8J9J8J8q5q5Q4Q4j8j9M6M7poopN1N1o6o6L4L3q4q4K3K2K3K2J0
-427A180J1M9M9l3l3J6j40L0L0j8j9j8j9M7M6L2L2q5q5qqN7N7P3P3QQl6l6K0J9J8j38j38J7
-433A058J8J8L8L8l4J22nnn8n7OPM8M7M8M7m9m9Q0Q0j03j03K7K7K1K1m7m7j07M9l9l9P0P0
-438A198pqj4j5j4j4p8p9N2N1P6P6n4n4m9n0K9K9j2j2j2j2J05J05k5k4l0l0N5K10N3j02p3
-443A271p3m4J12K4K4j4j4j01N4m0m0n0J06R0o5m6m5N9N8p0p1k1k2p9P6J60Lq0q0P5P6n5n4
$$ plain form
-406 1247 1127 1162 1159 1156 1162 1168 1222 1275 1263 1252 1233 1214 1286 1357 1380 1403 1386 1370 1357 1345 1294 1243 1204 1165 1039 1068 1161 1254 1215 1175 1138 1102 1104 1106 1170 1234
-412 1234 1233 1233 1217 1202 1147 1093 1157 1221 1246 1271 1165 1059 1070 1081 1208 1336 1243 1150 1121 1093 1103 1113 1135 1157 1179 1202 1214 1226 1277 1328 1294 1260 1255 1250
-417 1250 1309 1212 1267 1323 1271 1220 1233 1246 1282 1318 1247 1176 1129 1238 1194 1150 1161 1171 1272 1373 1324 1275 1226 1177 1154 1131 1146 1162 1250 1337 1370 1247
-422 1247 1210 1173 1191 1209 1204 1199 1154 1110 1128 1147 1165 1183 1098 1013 1097 1181 1163 1144 1190 1237 1230 1224 1218 1211 1262 1313 1247 1181 1215 1248 1164 1080 1103 1125 1148 1170 1180
-427 1180 1191 1240 1289 1256 1223 1239 1099 1129 1159 1141 1122 1104 1085 1132 1178 1210 1242 1157 1072 1064 1056 1113 1170 1243 1316 1324 1332 1296 1260 1280 1299 1317 1179 1041 1058
-433 1058 1076 1094 1132 1170 1136 1258 1253 1248 1190 1133 1139 1146 1194 1241 1289 1336 1287 1238 1318 1398 1295 1192 1219 1246 1267 1288 1241 1194 1087 1136 1097 1058 1128 1198
-438 1198 1191 1183 1169 1154 1140 1126 1048 969 1021 1072 1148 1224 1170 1116 1067 1017 1046 1075 1063 1051 1039 1027 1132 1237 1212 1188 1158 1128 1183 1393 1446 1344 1271
-443 1271 1198 1154 1266 1290 1314 1300 1286 1185 1239 1199 1159 1109 1215 1305 1240 1194 1149 1208 1266 1196 1125 1104 1082 1003 1079 1239 1242 1162 1082 1157 1233 1178 1124
-448A124K4K5J02J02r0r0n1n1P6P6m4m3o8Q7%JM5M6M5M6j14j15O8O7p7p8N2N2l5l5p3p4N4
-453A054N4k5k4J04J04L6L6q1P6n1n1M5M4l3l3lkm1m2O8O8O8O8p1p1QPL5L5r5r5k6k7k6k7
-458A086M0L9L9L9PPPPO1O1O1O1j31j30jjn5n5K3K2j2j3j3j3J7J7J7J7K2K2K2K2n7n7K1K0
-464A219KJl8l7qpL2L1l8l9%%rrJ7J73J26j34j05N1p1p1J6J6N2N1p9p9o6o6O4O4Q0Q0KKJ6
-470A239J7o1o1K3K3K3K3L8L7L8L8j56j56k7k6RQM8M8M2M3l5l5M8M7RRM0M0q9q9L1L2L1L2
-475A281l0l0l0l0O2O3o8o7j9j9j8j9P1P1ppj2j3K7K6p7p7r7N9J44j3PQK1K1j8j7MMMML9L8
-481A286l9l9KKKKL8L8%%m2m2o6j44p7P8J16J16K0K1n8n8K1K0K5K5m6L1j00N6KJm2L6O5r1
-486A159m7L1O1j6L3L2JJR8n8j35K0N8r6j35K0J05J05n5n5K2K3m3m4mmQ0P9m8j27J4J70R2
$$ plain form
-448 1124 1148 1173 1275 1377 1287 1197 1146 1095 1171 1247 1203 1160 1092 1179 1179 1180 1225 1271 1316 1362 1248 1133 1201 1268 1191 1113 1165 1217 1182 1147 1074 1000 1054
-453 1054 1108 1083 1059 1163 1267 1303 1339 1258 1334 1283 1232 1277 1321 1288 1255 1252 1250 1209 1167 1235 1303 1371 1439 1368 1297 1305 1312 1347 1382 1287 1192 1166 1139 1113 1086
-458 1086 1126 1165 1204 1243 1250 1257 1264 1271 1332 1393 1454 1515 1384 1254 1253 1252 1197 1142 1165 1187 1175 1162 1149 1136 1153 1170 1187 1204 1226 1248 1270 1292 1235 1178 1199 1219
-464 1219 1221 1222 1184 1147 1139 1132 1164 1195 1157 1118 1118 1118 1109 1100 1117 1290 1416 1282 1177 1228 1157 1086 1102 1118 1170 1221 1142 1063 997 931 995 1059 1139 1219 1221 1223 1239
-470 1239 1256 1195 1134 1157 1180 1203 1226 1264 1301 1339 1377 1221 1065 1038 1012 1021 1029 1077 1125 1167 1210 1175 1140 1188 1235 1244 1253 1293 1333 1244 1155 1186 1218 1249 1281
-475 1281 1251 1221 1191 1161 1223 1286 1218 1151 1132 1113 1095 1076 1147 1218 1211 1204 1192 1179 1206 1232 1155 1078 981 1040 1184 1171 1178 1186 1207 1228 1210 1193 1197 1201 1205 1209 1248 1286
-481 1286 1247 1208 1210 1212 1214 1216 1254 1292 1292 1292 1250 1208 1142 998 921 999 1115 1231 1251 1272 1214 1156 1177 1197 1222 1247 1201 1232 1132 1188 1190 1191 1149 1185 1250 1159
-486 1159 1112 1143 1204 1188 1221 1253 1254 1255 1353 1295 1160 1180 1238 1142 1007 1027 1132 1237 1182 1127 1149 1172 1129 1085 1081 1077 1157 1236 1188 1061 1075 1245 1337
-491A337o4p5Ln0n1j4j5O3O3Q6Q5QQj00j00k2k2N1N2J2J3n9n9k0k0L4L5m3m3P8P9n1n2J9J8
-497A184N7N7l6l6M2M2k3k3r6L4l2l3O2O1r2L8O6j14JKj19O2R4l6NQ3l6l5o7J2l6R4P5l%P8
-502A332P3nk0k0k4k5k5k5k5k5KJJJJ9J9J8J9q7q8M3M2rrq7q6M8M9J0J0m6m6Q4Q4k9l0k9k9
-508A086J0J0N0M9L9L9O8j13j04k6M9M9M5M6OPk2k2N6N6n1n1P9%j64l5l5l5l5l5M3M3JKl8
-513A067l7L7L7m1m1R8R8K0K0M0M1N0j06j40j39K2K2J29k6O0O1l0l0l0l0n0n1J8J8N9r7L0
-518A079L0J2J2R9n6N8N8k9l0m5m6m6m5k1k1N8N7K3K3O2O3ooq4q4n7n8rrr4O1J38j7M0M0q
-524A142rl4l4M4M4P4P4L1j24l3l2L5L6n4n3j5j5OPO8O8J36j22j04N3J6J7j00N5K5K4L4L3
-529A293MMMMo8o8p7P8j2j3llL7L6m1m1O0O1J9j37J0J0p7p8J5J5J03n3m1m0P9P9P8P8N3k4
$$ plain form
-491 1337 1273 1198 1201 1151 1100 1086 1071 1134 1197 1283 1368 1376 1384 1284 1184 1162 1140 1191 1243 1255 1268 1209 1150 1130 1110 1144 1179 1136 1093 1171 1250 1199 1147 1166 1184
-497 1184 1241 1298 1262 1226 1268 1310 1287 1264 1168 1202 1170 1137 1199 1260 1168 1206 1272 1158 1159 1161 1042 1104 1198 1162 1167 1250 1214 1179 1112 1124 1088 1182 1257 1254 1254 1332
-502 1332 1405 1400 1380 1360 1336 1311 1286 1261 1236 1211 1213 1214 1215 1216 1235 1254 1272 1291 1204 1116 1159 1201 1192 1183 1096 1010 1058 1107 1117 1127 1081 1035 1119 1203 1174 1144 1115 1086
-508 1086 1096 1106 1156 1205 1244 1283 1351 1238 1134 1108 1157 1206 1251 1297 1303 1310 1288 1266 1322 1378 1327 1276 1355 1355 1191 1156 1121 1086 1051 1016 1059 1102 1103 1105 1067
-513 1067 1030 1067 1104 1063 1022 1120 1218 1238 1258 1298 1339 1389 1283 1143 1004 1026 1048 1177 1151 1211 1272 1242 1212 1182 1152 1102 1051 1069 1087 1146 1049 1079
-518 1079 1109 1121 1133 1232 1176 1234 1292 1263 1233 1188 1142 1096 1051 1030 1009 1067 1124 1147 1170 1232 1295 1289 1283 1199 1115 1058 1000 991 982 888 949 1087 1070 1110 1150 1142
-524 1142 1133 1099 1065 1109 1153 1227 1301 1332 1208 1175 1143 1178 1214 1160 1107 1092 1077 1083 1090 1158 1226 1362 1240 1136 1189 1205 1222 1122 1177 1202 1226 1260 1293
-529 1293 1297 1301 1305 1309 1241 1173 1096 1174 1162 1149 1146 1143 1180 1216 1175 1134 1194 1255 1274 1137 1147 1157 1080 1002 1017 1032 1135 1082 1041 1001 1080 1159 1237 1315 1368 1344
-534A344q8O8J0o8K0j35n3n3L6L5lmQ5Q5R4o1k5k5l4l5RRo9o8J6J7R4R5k7k6J2J3q3q3M7M6
-540A195noool2l2R8R9lkqpq1j58j25L1O4O3L5L4J0J0K4n3o6Q9Q0p6mq1Q1J59O3r2%%k9k9
-545A234k9k9o1o1J6J7O1O2K9j27q1P4N5N5L9M0r0r0n4n4K3K4M9N0p0p1j02N4J35N7O5j3j01
-550A106N5j7j7n6J00ooM2M3p2p2OPj%J16J17j21j21M7M8NNM5M4p1p1l2l2ONM5M4j5j5j5j5
-556A131J03J03j5j4l4l4MNn7n7N9O0RJ0n6n5J4J4n1n0R2R2K7K7n1n2j3j2O3O4k8k7k3k4O7
-561A291O8n1n1R1R2j14j13K9K9k3k3k3k3nonnm7m8J8J7Q5Q6onk2k2o0o1KLO7O7q9q8N4N4
-567A163O2O2lkLMl5l5OPl3l3MLl6l6k8k8L7L7J5J6N5N4j13j14MLJ8J8Q3Q3j1j2N4N4j9j8
-573A289j9j8m6m6M5M5p7p7J4J4j3j4j3j4K0K0J72J7o7o8k8k8n8R8J02J01l8l8J6J7Q1p4p5
$$ plain form
-534 1344 1256 1324 1334 1266 1286 1151 1098 1045 1081 1116 1113 1109 1194 1279 1373 1312 1287 1262 1228 1193 1202 1211 1142 1074 1090 1107 1201 1296 1269 1243 1255 1268 1185 1102 1149 1195
-540 1195 1190 1184 1178 1172 1140 1108 1206 1305 1302 1300 1292 1285 1204 1046 921 952 1016 1079 1114 1148 1158 1168 1192 1139 1073 1162 1242 1166 1162 1081 1162 1321 1384 1292 1292 1292 1263 1234
-545 1234 1205 1176 1115 1054 1070 1087 1148 1210 1239 1112 1031 1105 1160 1215 1254 1294 1204 1114 1060 1006 1029 1053 1102 1152 1082 1011 909 963 1098 1155 1220 1207 1106
-550 1106 1161 1144 1127 1071 1171 1165 1159 1201 1244 1172 1100 1106 1113 1112 1112 1228 1345 1224 1103 1150 1198 1203 1208 1253 1297 1226 1155 1123 1091 1097 1102 1147 1191 1176 1161 1146 1131
-556 1131 1234 1337 1322 1308 1274 1240 1244 1249 1192 1135 1194 1254 1263 1273 1217 1162 1176 1190 1139 1089 1181 1273 1300 1327 1276 1224 1211 1199 1262 1326 1298 1271 1248 1224 1291
-561 1291 1359 1308 1257 1348 1440 1326 1213 1242 1271 1248 1225 1202 1179 1174 1168 1163 1158 1111 1063 1081 1098 1183 1269 1263 1258 1236 1214 1154 1093 1095 1098 1165 1232 1143 1055 1109 1163
-567 1163 1225 1287 1284 1282 1285 1289 1254 1219 1225 1232 1199 1166 1170 1173 1137 1101 1073 1045 1082 1119 1134 1150 1205 1259 1146 1032 1036 1039 1057 1075 1158 1241 1230 1218 1272 1326 1307 1289
-573 1289 1270 1252 1206 1160 1205 1250 1173 1096 1110 1124 1111 1097 1084 1070 1090 1110 1282 1299 1232 1164 1136 1108 1050 1148 1250 1351 1313 1275 1291 1308 1389 1315 1240
-578A240Q1j1j1m0m1k6k7J3J2N9N9l1l2r2r2k7k7k6k6pJ49P2q4J4J4j9j8M6M6K8K8r9N7l0
-583A152l1P0P0j0j1j0j0p0p0K1K0j7j7r8r9l8J17J47J47j1j1L8j18L3L2O2O1o1o0j49QJ13
-588A200J14n6n5Q5p0j00j00M7M6Q5Q5k6k7n6n6j3J43n1n2j18L8J4J5R0R1jjl0k9l0l0k9k8
-593A095k8k9M3M3M3M3k7k7k6k7K8K9o0R7%%J0Rk2k3k3k2j2j2j3j2M4M3p4p4m2m3R0R0J53
-598A264lq5q4L3L3L3L3K7K7k9k9j10M5m3m2MMNMN0N0noj07M9K7K6k4k4q8q9M4M5J09J09j7
-604A236j7P4P4l2l2L4L3m6m6p4p5o8Q8o4o5POR4o1q5q5P3P4J09J08q6q7M0L9L9M0o1o1n8
-609A065R8o3o2j4j4J9K0K0J9J5J4K5K4p5Q0L1L2o3o2KLj5j5k5k4J15m1J12J11m4m3m4m4o6
-614A091o6%jJ15J15k8k7QQq0P6l2l3k3k3Q3Q2J8J7pqm6m7M9N0j6j6l6l6j02j01L5L5l0k9
$$ plain form
-578 1240 1321 1310 1299 1259 1218 1192 1165 1178 1190 1249 1308 1277 1245 1153 1061 1034 1007 981 955 948 1097 1169 1085 1099 1113 1094 1076 1122 1168 1196 1224 1125 1182 1152
-583 1152 1121 1191 1261 1251 1240 1230 1220 1150 1080 1101 1121 1104 1087 989 890 852 969 1116 1263 1252 1241 1279 1161 1194 1226 1288 1349 1288 1228 1079 1087 1200
-588 1200 1314 1258 1203 1288 1218 1118 1018 1065 1111 1196 1281 1255 1228 1172 1116 1103 1246 1195 1143 1025 1063 1077 1092 1182 1273 1272 1271 1241 1212 1182 1152 1123 1095
-593 1095 1067 1038 1081 1124 1167 1210 1183 1156 1130 1103 1131 1160 1100 1197 1197 1197 1207 1216 1194 1171 1148 1126 1114 1102 1089 1077 1121 1164 1090 1016 974 931 1021 1111 1264
-598 1264 1261 1176 1092 1125 1158 1191 1224 1251 1278 1249 1220 1110 1155 1112 1070 1074 1078 1083 1087 1137 1187 1182 1176 1069 1118 1145 1171 1147 1123 1035 946 990 1035 1144 1253 1236
-604 1236 1219 1293 1367 1335 1303 1337 1370 1324 1278 1204 1129 1061 1149 1085 1020 1027 1033 1127 1066 981 896 969 1043 1152 1260 1174 1087 1127 1166 1205 1245 1184 1123 1065
-609 1065 1163 1100 1038 1024 1010 1029 1049 1069 1088 1103 1117 1142 1166 1091 1171 1202 1234 1171 1109 1111 1114 1099 1084 1059 1035 1150 1109 1221 1332 1288 1245 1201 1157 1091
-614 1091 1025 1025 1024 1139 1254 1226 1199 1207 1215 1135 1211 1179 1146 1123 1100 1183 1265 1283 1300 1293 1285 1239 1192 1241 1291 1275 1259 1223 1187 1085 984 1019 1054 1024 995
-620I95Q5Q5K1K0l6l5l6l5O2O2llm8m7M3M3J02J02n8n7j69j3O7O8l7l6q6P1P3P4k4k3j08M8
-625A167K5K5J7J8J8J8J2J3p8p8L0L0rrRRM8M8n6n7j8j7llmlL6L6k9l0J6J6J6J6j0j0k0k0
-631A169L5j21p2p2M9N0m2m1N2N3O3O2o5R1l6l6j6j5K3K3jkm0m0N7N8p0Q7k4k4n3n4N8N8O5
-636A229r2o7Q7rrO6O6k5k5K2K1j8j7j1j1P9Q0l9l9J%n7n6j8j8K6K5J5J6Jj56klL5L6L5L5
-642A203n2n2n2n2K6K6K7K6K3K2o9o8P6P7m0m0KLo2o2O8O7k3k3J8J8Q3Q2K2K1J1J2J8j36n0
-647A150m9K0K1J11J11r9j00J8J7k3k3J6J6J2J3n3n2L4L3J1J67l7l7J2J2n6n7j7j8kkN3N3
-652A255O4r1r5r4k1k0M5M4P3P3p0p0J4J3LMK5j31o5R0Q3Q2J2j45N1N0JKk6k6O5O5j09j09
-657A042L4L4N4N3L0j27o8Rm0l9L7J15J16m1J46O9nj61l2l2l7l7j9O0J03n3k2k3j29K6Q1p4
$$ plain form
-620 995 1080 1165 1186 1206 1170 1135 1099 1064 1126 1188 1185 1182 1134 1087 1130 1173 1275 1377 1319 1262 1093 1080 1147 1215 1178 1142 1056 1127 1200 1274 1250 1227 1119 1167
-625 1167 1192 1217 1234 1252 1270 1288 1300 1313 1235 1157 1187 1217 1208 1199 1208 1217 1265 1313 1257 1200 1182 1165 1162 1159 1155 1152 1188 1224 1195 1165 1181 1197 1213 1229 1219 1209 1189 1169
-631 1169 1204 1083 1011 939 988 1038 996 955 1007 1060 1123 1185 1120 1211 1175 1139 1123 1108 1131 1154 1153 1151 1111 1071 1128 1186 1116 1203 1179 1155 1102 1048 1106 1164 1229
-636 1229 1137 1070 1157 1148 1139 1205 1271 1246 1221 1243 1264 1246 1229 1218 1207 1286 1366 1327 1288 1289 1289 1232 1176 1158 1140 1166 1191 1206 1222 1223 1067 1065 1062 1097 1133 1168 1203
-642 1203 1151 1099 1047 995 1021 1047 1074 1100 1123 1145 1076 1008 1084 1161 1121 1081 1083 1086 1024 962 1030 1097 1074 1051 1069 1087 1170 1252 1274 1295 1306 1318 1336 1200 1150
-647 1150 1101 1121 1142 1253 1364 1265 1165 1183 1200 1177 1154 1170 1186 1198 1211 1158 1106 1140 1173 1184 1351 1314 1277 1289 1301 1245 1188 1171 1153 1151 1149 1202 1255
-652 1255 1319 1228 1133 1039 1018 998 1043 1087 1160 1233 1163 1093 1107 1120 1123 1127 1152 1021 956 1046 1129 1211 1223 1078 1129 1179 1180 1182 1156 1130 1195 1260 1151 1042
-657 1042 1076 1110 1164 1217 1247 1120 1052 1061 1021 982 1019 1134 1250 1209 1355 1424 1419 1258 1226 1194 1157 1120 1101 1161 1264 1211 1189 1166 1037 1063 1144 1070
-662A070o5R1L4L4M4M4p6p5l7l7MLLMpoopL8L7jjk4k3OOJ01n4onJ9J8m6m6Q7Q8l0k9nmmnK2
-669A154K2m4m3jjK8K8J03n3m4m3K9K9O9O8j1j2j2j1k4k4k4k4N8N8k0k0J2J2o6o6PQM6M7k3
-674A212k2O5r1j7j7k7k7L1L2L1L1k0k1k0k1Q8Q7m3m2l3l3OOj2j2P5q0L1L0M9N0R6o0n0n0
-679A222j5j5r4r3j6j6O2O2K5K6j4j4k1k0j09M7J45J44k8k7j01j00k3k3Q5Q5m5m5mmnmN6N6
-685A179O5r0K6K7J7J7J7J7o1o1k3k4N4N5o4o4J4J4J3J2J2J3o8o8J0J0L3L2L3L3j09j09K0
-690I82K1L0L0J28k8j33K2N5N5n6n7J08m7j1j1N8N7p7p6N3N3k5k5o4o4Q1Q1Q1Q1q6q7qrN8
-695A170N8k0k0M9N0O0r7m1m1n1n0kjjjl4l3l4l3j%%%R7R7K0J9K1K0n7n7Q9Q8nj61l8l8n7
-701I65R8O2O3nor3r2j5j5Q2Q3m7m8j03j03M3J98L4L4MNkkp9q0L3L3L3L3j7j7j7j8R0Q9M6
$$ plain form
-662 1070 1005 1096 1130 1164 1208 1252 1176 1101 1064 1027 1031 1034 1037 1041 1034 1028 1022 1015 1053 1090 1089 1088 1064 1041 1047 1053 1154 1100 1094 1089 1108 1126 1080 1034 1121 1209 1179 1150 1145 1141 1137 1132 1154
-669 1154 1176 1132 1089 1088 1087 1115 1143 1246 1193 1149 1106 1135 1164 1233 1301 1290 1278 1266 1255 1231 1207 1183 1159 1217 1275 1255 1235 1247 1259 1193 1127 1134 1142 1188 1235 1212
-674 1212 1190 1255 1164 1147 1130 1103 1076 1107 1139 1170 1201 1181 1160 1140 1119 1207 1294 1251 1209 1176 1143 1149 1155 1143 1131 1206 1126 1157 1187 1236 1286 1382 1322 1272 1222
-679 1222 1207 1192 1098 1005 989 973 1035 1097 1122 1148 1134 1120 1099 1079 970 1017 1162 1306 1278 1251 1150 1050 1027 1004 1089 1174 1129 1084 1080 1076 1071 1067 1123 1179
-685 1179 1244 1154 1180 1207 1224 1241 1258 1275 1214 1153 1130 1106 1160 1215 1151 1087 1101 1115 1128 1140 1152 1165 1097 1029 1039 1049 1082 1114 1147 1180 1071 962 982
-690 982 1003 1033 1063 1191 1163 1030 1052 1107 1162 1106 1049 1157 1110 1099 1088 1146 1203 1126 1050 1103 1156 1131 1106 1042 978 1059 1140 1221 1302 1216 1129 1121 1112 1170
-695 1170 1228 1208 1188 1237 1287 1347 1250 1209 1168 1117 1067 1065 1064 1063 1062 1028 995 961 928 927 927 927 927 1024 1121 1141 1160 1181 1201 1144 1087 1176 1264 1259 1098 1060 1022 965
-701 965 1063 1125 1188 1183 1177 1084 992 977 962 1044 1127 1080 1032 929 826 869 1067 1101 1135 1139 1144 1142 1140 1061 981 1014 1047 1080 1113 1096 1079 1062 1044 1134 1223 1269
-706A269j08JKn7n7L9j18m0J16j3j2J26J27pol9j95K4J80NNL4L4q6q6j21L5P7P7m6m7LKj62
-711I56on4n5N8N9N9N9L9L9L9M0p1p1p1p1L1L2L1L2K0K0K1K0j19j18J1J1Q8Q7J0J0J7J7o1
-716A109o1N4N4j4j3p9P7j1j0ooonNOOONOOOnmmnp0p0l7J18J37j9M0M0n0n0n1n0J5J5J03n4
-723A128n6n7p5P9R2R2q1q0J14J15o7o8L9M0l9l9r3r3j5j5N1N1R0R0o7o7k9k8k9k8N0M9ll
-728A048JKm6L1K0J76k0j77l9L7p6KR2R2L9L9r1r1L8L7l0l0n5J01O2j6k8N1M5l3o6o5q6P1
-733A035M5l3j8j8K8K8Q2p5j2O6KQ0L3m4o9o9j2O5p5Q0M2j14k7J29K4K3Ro9j51MM2M1l5l6
-738A001M2M3N5N5k2k3k3k4m3J12J08m8k7j05q5P1J09J08M7M6p8p8k3N5K2j35j6j6J04J04
-743A336q8q8j0j0r5r5j04N1Q7Q8J9J9J9J9n9n8J6J5R4R4n5n5K4K3l3l2OOm2m2OOo3R3NNL
$$ plain form
-706 1269 1161 1162 1164 1107 1050 1089 971 931 1047 1034 1022 1148 1275 1268 1262 1223 1028 1052 1232 1237 1242 1276 1310 1224 1138 1017 1052 1129 1206 1160 1113 1116 1118 956
-711 956 950 896 841 899 958 1017 1076 1115 1154 1193 1233 1162 1091 1020 949 980 1012 1043 1075 1095 1115 1136 1156 1037 919 930 941 1029 1116 1126 1136 1153 1170 1109
-716 1109 1048 1102 1156 1142 1129 1050 1127 1116 1106 1100 1094 1088 1083 1088 1094 1100 1106 1111 1117 1123 1129 1124 1120 1116 1111 1041 971 934 1052 1189 1170 1210 1250 1200 1150 1099 1049 1064 1079 1182 1128
-723 1128 1072 1015 940 1019 1111 1203 1122 1042 1156 1271 1204 1136 1175 1215 1176 1137 1044 951 936 921 972 1023 1113 1203 1136 1069 1040 1012 983 955 1005 1054 1051 1048
-728 1048 1049 1051 1005 1036 1056 1232 1212 1035 996 1033 957 959 1051 1143 1182 1221 1130 1039 1077 1114 1084 1054 999 1100 1162 1146 1118 1169 1214 1181 1115 1050 964 1035
-733 1035 1080 1047 1029 1011 1039 1067 1149 1074 1062 1128 1130 1210 1243 1199 1130 1061 1049 1114 1039 1119 1161 1047 1020 1149 1173 1196 1205 1136 985 989 1031 1072 1037 1001
-738 1001 1043 1086 1141 1196 1174 1151 1128 1104 1061 1173 1281 1233 1206 1101 1016 1087 1196 1304 1351 1397 1319 1241 1218 1273 1295 1160 1144 1128 1232 1336
-743 1336 1248 1160 1150 1140 1045 950 846 897 984 1072 1091 1110 1129 1148 1089 1031 1047 1062 1156 1250 1195 1140 1164 1187 1154 1122 1128 1134 1092 1050 1056 1062 999 1092 1097 1102 1105
-749A105LO7O8m6m6KLp9P6j1j2P7P7o6o5J9J9N2j04j4J41ONp3p3j11M4J01j58JJ56J0J0J9
-754A203K0KKO7O7nmp0o9J8J8J8J8n5n6j7j7k2k1o1o0Q8Q9lkl3l3OOl6l6m3J13J21l4k8k8
-759A123N1N2j3j4j17j17k7k6O2O3kkJ3J2k6k6PPQPj4j3O8O7N7r8K8K8o8o7M9N0mnm3m3M7
-765A074M6QPL5L5P4P4k4k5n3n4j22L4j4j5M7M6QP%jj%m8m9j36K0M1M2l9m0O3O3O3O4n5n4
-771A121J0J0p4p5O8O8J5J5N4N5rqqrj04j04j36J9J16m0M8M7J40j5r7r7M4M4M4M4R5R4j88
-776A187l2k0k0j1j0M2M3LMp1p1R8R8J2J2n3n3p4p5M3M2O0O0l0l1N8N9q5q4M2M2K3j34p3Q2
-781A083q0q0l8l9rJ46K9L0L9L9n6n7n6n7R1R0Q7o9m0m0J5J5MMl5l5%%O4O5ooopP4P3o0n9
-787A113p2Q4K2j33o6J93J54jK9j26n4K5M3M4M4M4r1j69q3P2J3J3K2K3RRo8o8N8N9R3R3p2
$$ plain form
-749 1105 1108 1175 1243 1197 1151 1153 1156 1077 1153 1142 1130 1207 1284 1218 1153 1172 1191 1243 1139 1125 1266 1272 1277 1204 1131 1020 1064 1165 1007 1008 1164 1174 1184 1203
-754 1203 1223 1225 1227 1294 1361 1356 1352 1282 1213 1231 1249 1267 1285 1230 1174 1157 1140 1118 1097 1036 976 1064 1153 1150 1148 1115 1082 1088 1094 1058 1022 979 1092 1213 1179 1151 1123
-759 1123 1174 1226 1213 1199 1082 965 938 912 974 1037 1035 1033 1046 1058 1032 1006 1013 1020 1028 1035 1021 1008 1076 1143 1200 1102 1130 1158 1090 1023 1072 1122 1118 1113 1070 1027 1074
-765 1074 1120 1128 1135 1170 1205 1279 1353 1329 1304 1251 1197 1075 1109 1095 1080 1127 1173 1181 1188 1188 1187 1186 1186 1138 1089 953 973 1014 1056 1017 977 1040 1103 1166 1230 1175 1121
-771 1121 1131 1141 1067 992 1060 1128 1143 1158 1212 1267 1258 1250 1242 1233 1129 1025 889 908 1024 984 1032 1079 1219 1204 1107 1010 1054 1098 1142 1186 1281 1375 1187
-776 1187 1155 1135 1115 1104 1094 1136 1179 1182 1186 1115 1044 1142 1240 1252 1264 1211 1158 1084 1009 1052 1094 1154 1214 1184 1153 1211 1270 1185 1101 1143 1185 1208 1074 1001 1083
-781 1083 1003 923 885 846 837 983 1012 1042 1081 1120 1064 1007 951 894 985 1075 1162 1093 1053 1013 1028 1043 1047 1051 1016 981 981 981 1045 1110 1104 1098 1092 1085 1159 1232 1172 1113
-787 1113 1041 1125 1147 1014 948 1141 1295 1294 1323 1197 1143 1168 1211 1255 1299 1343 1252 1083 1000 1072 1085 1098 1120 1143 1152 1161 1093 1025 1083 1142 1235 1328 1256
-792A256j50p3Q2O2r4m0L7M0M0q5q5mmJ25K02l3j88n3J02K1K1Q4Pj68j2O8O7L1j24m2L6n2
-797A074n2j25j25J05J05J04J05r7r6o5R2Q3p2j9N9J12J13J8j37o0j37o6Q9R2J3o2o3M8M8
-801A084K3n4j03N3J26l0J9J8M9M8j1j1o0R6K8K8M8j09p1p2mmn3n4O6O6J04n2j3O5L1m6q6
-806A119q6J24l1j10M6O3O2n7n8Q4Q5m6m5m2m2j20j20JKP9Q0J8J9M8M8P8p8p8P8M9M9J7j40
-811A096J2J3M1M1m0m1jkl2l2R5o1p3p3M7M6o3o2k4k4J9J9o9Q8J25J25m7m7O7O6j1j1q0q0
-816A027q0q0L1L0K1K0R4o2J03J04N6N6p3p4m2m3L5L6o3o2O8O8n2n1P8P9m5m5L3L3J3J3o4
-821A162o5k3k2N5N5J08J08l2l1M1j14k7k7r0q9j2j2L3L3poQ0Q0LKK6K7K6K7m3m2mmJ2J2k7
-827A213k7m2m2J37j9l5l6M5M5k8k8l8l7Q8o8K0K0lkPPn7R8R8n8m8m8n8n8K6K7l9l8k2k2J8
$$ plain form
-792 1256 1106 1033 1115 1177 1083 1043 1080 1120 1160 1075 990 986 982 1107 1309 1276 1088 1035 1137 1158 1179 1263 1270 1102 1090 1158 1225 1256 1132 1090 1126 1074
-797 1074 1022 897 772 877 982 1086 1191 1094 998 933 1025 1108 1036 1017 1076 1188 1301 1319 1182 1122 985 919 1008 1100 1113 1051 988 1036 1084
-801 1084 1107 1053 950 1003 1129 1099 1118 1136 1185 1233 1222 1211 1151 1247 1275 1303 1351 1242 1171 1099 1095 1091 1038 984 1050 1116 1220 1168 1155 1220 1251 1205 1119
-806 1119 1033 1157 1126 1016 1062 1125 1187 1130 1072 1156 1241 1195 1150 1108 1066 946 826 827 829 908 988 1006 1025 1073 1121 1199 1121 1043 1121 1170 1219 1236 1096
-811 1096 1108 1121 1162 1203 1163 1122 1121 1119 1087 1055 1150 1089 1016 943 990 1036 973 911 887 863 882 901 832 920 1045 1170 1123 1076 1143 1209 1198 1187 1107 1027
-816 1027 947 867 898 928 949 969 1063 1001 1104 1208 1264 1320 1247 1173 1131 1088 1123 1159 1096 1034 1102 1170 1118 1067 1145 1224 1179 1134 1167 1200 1213 1226 1162
-821 1162 1097 1074 1052 1107 1162 1270 1378 1346 1315 1356 1242 1215 1188 1098 1009 997 985 1018 1051 1044 1038 1118 1198 1201 1203 1229 1256 1282 1309 1266 1224 1220 1216 1228 1240 1213
-827 1213 1186 1144 1102 1239 1220 1185 1149 1194 1239 1211 1183 1145 1108 1196 1128 1148 1168 1165 1163 1170 1177 1120 1218 1316 1258 1210 1162 1104 1046 1072 1099 1060 1022 1000 978 996
-832I96J7O7O6n0n0ONOOO1O2llq2q2L5L5K2K1K1K1l1l1J8j39j8j8J1J1P4P4P5P4o0n9k1k0
-838A117M5M5k0k0K6K5K3j34q9r0P0O9M8M9l3j89q8q7J23J23K9L0L0L0K6K7M9j07n5n5K5K6
-843A068O2O2K3K3p6p6j1j1n4n4O3O3K1K0K1K0k1k1k2k1l9l8K6K7K0K0K0K0J4J5J4J5pppp
-848A165k1k1o1o0n3n3R0R0K5K5R0R0j2j1J6j39m5L2L3j23j1O7J8n9llN7N8L9M0p8p7O4O3
-854A232jjk9k9J0J0j0j0j0j1M7M6j9j8n9n8L2L3r0q9o5R0J32N3j0j0p0p0M7M7O9O9j00j00
-859A058k9k9k8k9N8N7N8N8j1j1j1j0K2K2q4q5o5R0m1L7L1L2q1q1kkL6L6N6N6J2J2m7j26n3
-864I06J03ONONK1j35L1L1K8K8l7J19J88p1m6m5k1k2k1k1KKl8l7M6M7l2l2m6m7Q3Q3M6M7J7
-870A199J7r2O3k4k4j9k0j9j9L4L5mnK4K4j05j06K0K0J07J08j32K3O5O6K9L0j00j00L7L7L7
$$ plain form
-832 996 1013 1080 1146 1096 1046 1052 1057 1063 1069 1130 1192 1189 1186 1104 1022 1057 1092 1114 1135 1156 1177 1146 1115 1133 994 976 958 969 980 1054 1128 1203 1277 1217 1158 1137 1117
-838 1117 1162 1207 1187 1167 1193 1218 1241 1107 1018 928 998 1067 1115 1164 1131 942 854 767 890 1013 1042 1072 1102 1132 1158 1185 1234 1127 1072 1017 1042 1068
-843 1068 1130 1192 1215 1238 1162 1086 1075 1064 1010 956 1019 1082 1103 1123 1144 1164 1143 1122 1100 1079 1040 1002 1028 1055 1075 1095 1115 1135 1149 1164 1178 1193 1186 1179 1172 1165
-848 1165 1144 1123 1062 1002 949 896 986 1076 1101 1126 1216 1306 1294 1283 1299 1160 1115 1147 1180 1057 1046 1113 1131 1072 1069 1066 1123 1181 1220 1260 1182 1105 1169 1232
-854 1232 1231 1230 1201 1172 1182 1192 1182 1172 1162 1151 1198 1244 1225 1207 1148 1090 1122 1155 1065 976 911 1001 1133 1186 1176 1166 1096 1026 1073 1120 1189 1258 1158 1058
-859 1058 1029 1000 972 943 1001 1058 1116 1174 1163 1152 1141 1131 1153 1175 1091 1006 941 1031 990 1027 1058 1090 1009 928 926 924 960 996 1052 1108 1120 1132 1085 959 906
-864 906 1009 1015 1020 1026 1031 1052 917 948 979 1007 1035 998 1117 1305 1234 1188 1143 1122 1100 1079 1058 1060 1062 1024 987 1033 1080 1048 1016 970 923 1006 1089 1135 1182 1199
-870 1199 1216 1124 1187 1163 1139 1120 1100 1081 1062 1096 1131 1127 1122 1146 1170 1065 959 979 999 1106 1214 1082 1105 1170 1236 1265 1295 1195 1095 1132 1169 1206
-875A206L7j6j7m6m5j02N4J32k4opO1O2j8j7j44J2k4k4j4j5M7M6l1l2j0j0j1j0MMnoR0o7o7
-880I87R0LLJ3J3L0L1q3q3j97O1J85K9o3o3K1J77Q0P9m7k02o2R3P4P4o1o0j19L6J13m3k8N0
-885A131Q2Q2r4r5l3l3M6M5PQQ6j74n7R9nno0o1J7J7LLM2M2klJ48j11j41o3l7M1R4R5l1l0
-891A053R9R9K1K2j8j7j10M5qq7l2l3j0j0j0j0O4O5k3k3P2q3m4L4J5o4O4O3P8P8%Jrrrrj5
-896A240j5r3r3J8J8J8J8jjP7P7j5j6n4n5%%%%M8M8l5l5K3n5o5R1N9j9p9p9j06J53N2k7N3
-902A150N2l0l0m6m6poM5M6k2k2l3J24M1l7L1L0j40J6J2J2n6n7l6l7R3R4L4L5m3m3LKp5p5
-907I79%JL9L9K0J9J9K0m7m6L2L1o3o2O7O7n0n0K8K9K2K3n5n5J1J1J1J2p0p0O0N9K8K7K7K8
-913A141j12j11K9K8r0O5N6N6N1N1j30j31N0M9M9N0R3R4r8r8O9q7r6N9P7p9J9J9rqK1K1R6
$$ plain form
-875 1206 1243 1227 1210 1164 1119 1017 1071 1203 1179 1173 1166 1227 1289 1271 1254 1110 1122 1098 1074 1060 1045 1092 1138 1107 1075 1065 1055 1044 1034 1038 1042 1037 1031 1121 1054 987
-880 987 1077 1080 1083 1096 1109 1139 1170 1087 1004 807 868 1053 1082 1019 956 977 1154 1234 1313 1266 1064 1002 1095 1169 1243 1182 1122 1003 1039 1152 1109 1081 1131
-885 1131 1213 1295 1201 1106 1073 1040 1086 1131 1138 1146 1232 1058 1001 1100 1095 1090 1030 969 986 1003 1006 1009 1051 1093 1091 1088 1236 1125 984 921 884 925 1019 1114 1083 1053
-891 1053 1152 1251 1272 1294 1276 1259 1149 1194 1186 1099 1067 1034 1024 1014 1004 994 1058 1123 1100 1077 1149 1066 1022 1056 1071 1007 1071 1134 1212 1290 1290 1291 1282 1273 1264 1255 1240
-896 1240 1225 1132 1039 1057 1075 1093 1111 1110 1109 1186 1263 1248 1232 1178 1123 1123 1123 1123 1123 1171 1219 1184 1149 1172 1117 1052 1143 1202 1183 1104 1025 919 1072 1124 1097 1150
-902 1150 1202 1172 1142 1096 1050 1043 1037 1082 1128 1106 1084 1051 1175 1216 1179 1210 1240 1100 1116 1128 1140 1084 1027 991 954 1047 1141 1175 1210 1167 1124 1127 1129 1054 979
-907 979 979 980 1019 1058 1078 1097 1116 1136 1089 1043 1075 1106 1043 981 1048 1115 1065 1015 1043 1072 1094 1117 1062 1007 1018 1029 1040 1052 982 912 972 1031 1059 1086 1113 1141
-913 1141 1029 918 947 975 885 950 1006 1062 1113 1164 1034 903 953 1002 1051 1101 1194 1288 1190 1092 1161 1074 978 1037 1114 1035 1054 1073 1064 1056 1077 1098 1194
-918A194o0j39J8k9l0N8N8m2m3OOp4Q1ooj9k0M9M9J55kj92l7J37j9q6O9k8k8j9j8J1J1J1J1
-923A027j2j2r9N6KLJ2J2J9J9J0RJ21l5q4P2J36k0j04j05o9p0k8J28Q0P9J09m7j00N6L6L7
-928A238M6M6l2l1n6n5K2K3k7k6k6k6j8j8j8j7j0j0rj0nmJ25J24j4j5j02N4O4O4Q3p3j35j35
-933A017nnn1J04N6N6J1J1n7n6n0J06J8J9l1l1p0p0P6P5kkl7l7l7l7K3K4n5n4nnL4L4M0M0
-938A047l8l8opooM1M2l6l6Q6Q6j32K4K7K7J06J05M9j07j48j49P4P5L5L6k2k2k2k2QQQQQQ
-944A111QRj1j0j0j0M2M1j40j40R7R7J07m9J2J3LLj6j6j6j6m2m3L5L6M4M4R2o3mnj4j5j2j1
-949A151K7K7l4l3m4J13q7q6KJM4M3N4j03Q7Q8j05j04q8q8j0j0J19J18M1M1O6O5j15j16k5
-954A039k5o4o4j3j4J16J16K7K6O5O5o9o9%jQ1p5j54LL0L1k9k8LJ59J59Lq9r0k1k1M8M8l0
$$ plain form
-918 1194 1134 995 1013 984 954 1012 1070 1028 985 991 997 923 1004 998 992 973 953 1002 1051 1206 1204 1012 975 1112 1093 1007 1076 1048 1020 1001 983 994 1005 1016 1027
-923 1027 1015 1003 904 960 962 965 977 989 1008 1027 1037 1046 1167 1132 1048 1120 1256 1236 1132 1027 958 888 860 988 1068 1147 1256 1209 1109 1165 1201 1238
-928 1238 1284 1330 1298 1267 1211 1156 1178 1201 1174 1148 1122 1096 1078 1060 1042 1025 1015 1005 996 986 981 977 1102 1226 1212 1197 1095 1149 1213 1277 1360 1287 1152 1017
-933 1017 1012 1007 956 1060 1116 1172 1183 1194 1137 1081 1031 1137 1155 1174 1143 1112 1042 972 1048 1123 1121 1119 1082 1045 1008 971 994 1018 963 909 904 899 933 967 1007 1047
-938 1047 1009 971 965 958 952 946 987 1029 993 957 1043 1129 997 1021 1048 1075 1181 1286 1335 1228 1080 931 1005 1080 1115 1151 1129 1107 1085 1063 1071 1079 1087 1095 1103 1111
-944 1111 1119 1128 1117 1107 1097 1087 1129 1170 1030 890 987 1084 1191 1142 1154 1167 1170 1173 1157 1141 1125 1109 1067 1024 1059 1095 1139 1183 1275 1212 1208 1203 1189 1174 1162 1151
-949 1151 1178 1205 1171 1138 1094 1207 1120 1034 1036 1037 1081 1124 1178 1075 1162 1250 1145 1041 953 865 855 845 964 1082 1123 1164 1230 1295 1180 1064 1039
-954 1039 1014 950 886 873 859 975 1091 1118 1144 1209 1274 1205 1136 1136 1135 1216 1141 987 990 1020 1051 1022 994 997 1156 1315 1318 1229 1139 1118 1097 1145 1193 1163
-959A163l0l3l3M5M5K0K0j09j10K8K7J93L7m8m9j9j9k6k6J4J3M3M3n4J01M6j10j3j3k4k5k4
-964A073k4M8M8q8O7P5q0o1o1N7N8k0k1J3J2k6k7J3J2k6k7mlmmK6K6K6K6LMLLn7n6j7j7L8
-970A008L8m0l9nnP3P3n5n4n4n4M7M8M8M8J3J3J4J3j6j6O2O1J4J3o5o4j6j6j6j6J6J7J7J6
-975A121J2J2J2J2L2L3m5m5p9p9m0m0QPM6M6j5j5J7J73R0o5j50j49M8M8M9M8j6j5j6j5j6j5
-981I99k6k5J47qP9Q0l2l2l2l1J1J2L5j21r0q9j9J38M7M7j47QL8L8L8L8R4o3l9m0J1J2q0p9
-986I19O7O8n0m9N8N9M9M8O3r3j12J47K0K1n1J05q6q7N6N7M2j13L9L9k1k1q6q6J9K0m6m5L
-991I53MJ47J46j6j5j07j06P5P5nok1J34j8j8l8l8l8l8m1m0J4J5M9j06P2P2l1l1L4L4j%QR
-996A127j23L2J24l3m8m8j9j9rrK9L0k4k4J5J5J9J9RRJ45j0o6o5N3N4l7l8ONl3l4j2j1l9J16
$$ plain form
-959 1163 1133 1100 1067 1112 1157 1177 1197 1088 978 1006 1033 1226 1263 1215 1166 1147 1128 1102 1076 1090 1103 1146 1189 1135 1236 1282 1172 1159 1146 1122 1097 1073
-964 1073 1049 1097 1145 1057 1124 1199 1119 1058 997 1054 1112 1092 1071 1084 1096 1070 1043 1056 1068 1042 1015 1011 1008 1004 1000 1026 1052 1078 1104 1107 1111 1114 1117 1060 1004 987 970 1008
-970 1008 1046 1006 967 962 957 1030 1103 1048 994 940 886 933 981 1029 1077 1090 1103 1117 1130 1114 1098 1160 1221 1235 1248 1183 1119 1103 1087 1071 1055 1071 1088 1105 1121
-975 1121 1133 1145 1157 1169 1201 1234 1189 1144 1065 986 946 906 914 921 967 1013 998 983 1000 1173 1263 1198 1048 899 947 995 1044 1092 1076 1061 1045 1030 1014 999
-981 999 973 948 1095 1087 1166 1246 1214 1182 1150 1119 1130 1142 1177 1056 966 877 858 996 1043 1090 943 951 989 1027 1065 1103 1197 1134 1095 1055 1066 1078 998 919
-986 919 986 1054 1004 955 1013 1072 1121 1169 1232 1139 1027 1174 1194 1215 1164 1269 1183 1096 1152 1209 1251 1138 1177 1216 1195 1174 1088 1002 1021 1041 995 950 953
-991 953 957 1104 1250 1234 1219 1112 1006 1081 1156 1151 1145 1124 1258 1240 1222 1184 1146 1108 1070 1029 989 1003 1018 1067 961 1033 1105 1074 1043 1077 1111 1110 1110 1118 1127
-996 1127 1004 1036 1160 1127 1079 1031 1012 993 984 975 1004 1034 1010 986 1001 1016 1035 1054 1063 1072 1217 1207 1141 1076 1129 1183 1146 1108 1114 1119 1086 1052 1040 1029 990 1106
-1002A106O9rn9R7J67r3k6j03j73j7L4L3j9j9k4k4Ro9nJ50Q1p5K2K2P0P1p3p2j04j04j3j3
-1007H37N1N0J2J2K7K7K7K8N2N3J3J4q4q4m4m5K5K5K5K5m7m8J8J8k2k2R5R6J1J2n4n3J7J7
-1012A084J8J7K3K4K3K4r1r2K4J02L8j17J9J9l4M5R3o3o6J2Pp1j19m0J07K9jJ55N4j02R8J9
-1017A238j15j15J2J1N0N1m8m7R6J9r5O0PPlklln8n9L2L3l4l5NNLLLLK9K9m9m8P5P5n4n5m
-1023A019lm3m3k1k0J1J68J04n1m1J15n8n7Q2Q2m2m2m2m2j7j8O1O0j66j66O7O7J9J8k0k0O2
-1027A023O1K3K3rqj7j8R0o4m6m5q0P7O6O7m3m2L6L6n7n7O3O4M8j07k0k0M2M2M2M2RQl3j89
-1033A007m3m4P7P7M2M2M2M2j19j18J1J1N2N3l2j88j30K5N7N7O2O2O2O2l1l0j08j09J19J18
-1037A128P6p9K7K7k2k2OPOOj1j1jjjJ55j1j0m2m1m2m1l9l9l8l9K0J9K0K0L5L5M5M5j6J39
$$ plain form
-1002 1106 1175 1166 1107 1204 1371 1278 1252 1149 976 959 993 1026 1007 988 964 940 949 880 875 1025 1106 1031 1053 1075 1145 1216 1143 1071 967 863 850 837
-1007 837 888 938 950 962 989 1016 1043 1071 1123 1176 1189 1203 1119 1035 991 946 971 996 1021 1046 999 951 969 987 965 943 1038 1134 1145 1157 1103 1050 1067 1084
-1012 1084 1102 1119 1142 1166 1189 1213 1122 1030 1054 1156 1194 1077 1096 1115 1081 1126 1219 1156 1090 1102 1109 1038 919 879 986 1015 1014 1169 1223 1121 1219 1238
-1017 1238 1123 1008 1020 1031 1081 1132 1084 1037 1133 1152 1057 1117 1124 1131 1128 1126 1123 1120 1062 1003 1035 1068 1034 999 1004 1009 1012 1015 1018 1021 1050 1079 1030 982 1057 1132 1078 1023 1019
-1023 1019 1016 973 930 909 889 900 1068 1172 1121 1080 1195 1137 1080 1162 1244 1202 1160 1118 1076 1059 1041 1102 1162 996 830 897 964 983 1001 981 961 1023
-1027 1023 1084 1107 1130 1121 1113 1096 1078 1168 1104 1058 1013 933 1010 1076 1143 1100 1058 1094 1130 1073 1016 1079 1143 1191 1084 1064 1044 1086 1128 1170 1212 1221 1229 1196 1007
-1033 1007 964 920 997 1074 1116 1158 1200 1242 1123 1005 1016 1027 1079 1132 1100 912 782 807 864 921 983 1045 1107 1169 1138 1108 1000 891 1010 1128
-1037 1128 1204 1125 1152 1179 1157 1135 1141 1148 1154 1160 1149 1138 1137 1136 1135 1290 1279 1269 1227 1186 1144 1103 1064 1025 987 948 968 987 1007 1027 1062 1097 1142 1187 1171 1310
-1043A310l3j89j16M0K1K0j5j5j5j5K7K6K7K7K7K7o0R5k9k9j9j9mmnmQ7Q6RRj01j02k4k3L
-1048A020Mq5P2L2L3l6l5J4J5J02n4K0J9RJ0m7m7m7m7OOPOk9k8J01J01J3J4J3J4r3r3j5j4
-1054I61n6n5o6R1R9J00l0l1Q2p4J3J4p2p2NOJ9J9J9J9n6n6J26J26L5L5m3m3L2L1L2L1o2o3
-1059A116o2o3N2N2l6l6J39j7r4O2k3k3mmq7O7j9k0l5l5R5R4r1r2L8L8K7K7J04J05jkm0m1
-1064A191l3l3m3J13kjQQn5n4n5n5J7J7J6J7%%nnM6l1q1P6O2j6m6L3j6j6O7O6q1q2m2m3J7
-1070I59J7J6J7P2P2mq2k1J35J7o0j10M4j3j4N0k8j55JP3mQ8Q8m3m4L0K9Op1q2P4P2ol0l1
-1075A062K9K9K8K9j7j6j7j7N3N4o7o7r4O3O2j6j59q1J04J04K2K2n6n6m3m3Q7Q6p6p6l4J21
-1080A020M9M8J07m9j15j15N6N7J2J2N1N1l0l1o9o9O0O0o9p0K5K6K5K5O9O9K7j29n8n8O1O2
$$ plain form
-1043 1310 1277 1088 972 1012 1033 1053 1038 1023 1008 993 1020 1046 1073 1100 1127 1154 1094 1189 1160 1131 1112 1093 1089 1085 1080 1076 1163 1249 1258 1267 1166 1064 1040 1017 1020
-1048 1020 1024 939 1011 1043 1076 1040 1005 1019 1034 1136 1082 1102 1121 1130 1140 1093 1046 999 952 958 964 971 977 948 920 1021 1122 1135 1149 1162 1176 1083 990 975 961
-1054 961 905 850 784 875 974 1074 1044 1013 1095 1021 1034 1048 976 904 909 915 934 953 972 991 935 879 1005 1131 1166 1201 1158 1115 1147 1178 1210 1241 1179 1116
-1059 1116 1054 991 1043 1095 1059 1023 1162 1145 1051 1113 1090 1067 1063 1059 972 1039 1020 1000 965 930 1025 1119 1028 936 974 1012 1039 1066 1170 1275 1274 1272 1232 1191
-1064 1191 1158 1125 1082 1195 1193 1192 1200 1208 1153 1099 1044 989 1006 1023 1039 1056 1056 1056 1051 1046 1092 1061 980 1056 1118 1102 1056 1089 1073 1057 1124 1190 1109 1027 985 942 959
-1070 959 976 992 1009 1081 1153 1149 1067 1046 1181 1198 1138 1028 1072 1059 1045 1095 1067 912 913 986 982 1070 1158 1115 1071 1101 1130 1136 1065 983 1057 1129 1123 1093 1062
-1075 1062 1091 1120 1148 1177 1160 1144 1127 1110 1163 1217 1150 1083 989 1052 1114 1098 939 858 962 1066 1088 1110 1054 998 955 912 999 1085 1009 933 899 1020
-1080 1020 1069 1117 1224 1175 1060 945 1001 1058 1070 1082 1133 1184 1154 1123 1054 985 1045 1105 1036 966 991 1017 1042 1067 1136 1205 1232 1103 1045 987 1048 1110
-1085A110p9p9l1l0m8J08R9R8n5n4o5R1L3L3l6l5J%P9P8m2m2j3j3K4j32Q6Q6o6o6J2J2o1o0
-1090I43J7J6J47J47l5l5r6r6L3L4K3K3n5n5K7K6k3k2J21l5k5k5M5M5l3l3mlQ3p2j8j9j8j9
-1095A009r2O4N5N4J1J1R9n7l2l1m1m1j4j5J51mj04j04l5l6p7p8J14J13p6Q0L1L1N1N2J2J3
-1100A114j25j26M4M3R1R2L6j20kko7o7m7J09K2K1n9n9L2L2R1R2N3N3k4k4k4k4k3k3n3k08
-1105H48J5J4MNR4R5N6N5m3m4K2K2o8o7o7o7M9N0M9N0m2m3lmj0j0P7p8l2l2M9M9PQl2l1J07
-1110A052J07J0j46q1P5M3M2K7K6n4n4l6J20L2L3L3L3q3q3J0Rk9k9k7k8j80k5MMJ01n4O5O5
-1115I82l6l6O1O1l0l0j13j13J08J07k5k6O5O6K9L0O9O8m2m3K3K2l6l6N7r9j8O0N0k7m2m3
-1120A063rO8Q1p5O2j7p9q0OONMM3M4k0k1k5k5Q0Jj32K2K8K8R2o5n7K1J6o2OQ4R4o2j58lM4
$$ plain form
-1085 1110 1031 952 921 891 843 951 1050 1148 1093 1039 974 1065 1098 1131 1095 1060 1061 1061 1140 1218 1176 1134 1121 1108 1132 1000 1086 1172 1106 1040 1052 1064 1003 943
-1090 943 960 976 1123 1270 1235 1200 1104 1008 1041 1075 1098 1121 1066 1011 1038 1064 1041 1019 1140 1105 1080 1055 1100 1145 1112 1079 1075 1072 1155 1083 1065 1046 1028 1009
-1095 1009 917 981 1036 1090 1101 1112 1211 1154 1122 1091 1050 1009 995 980 1131 1127 1023 919 884 848 771 693 807 920 844 924 955 986 1037 1089 1101 1114
-1100 1114 989 863 907 950 1041 1133 1169 1049 1047 1045 978 911 864 973 995 1016 957 898 930 962 1053 1145 1198 1251 1227 1203 1179 1155 1132 1109 1056 848
-1105 848 863 877 881 886 980 1075 1131 1186 1143 1099 1121 1143 1075 1008 941 874 923 973 1022 1072 1030 987 984 980 970 960 1037 959 927 895 944 993 1000 1008 976 945 1052
-1110 1052 1159 1169 1023 942 1017 1060 1102 1129 1155 1101 1047 1011 1131 1163 1196 1229 1262 1179 1096 1106 1115 1086 1057 1030 1002 822 797 801 805 906 852 917 982
-1115 982 946 910 971 1032 1002 972 859 746 854 961 936 910 975 1041 1070 1100 1169 1237 1195 1152 1175 1197 1161 1125 1182 1083 1065 1125 1175 1148 1106 1063
-1120 1063 1054 1122 1203 1128 1190 1173 1094 1014 1020 1026 1031 1035 1078 1122 1102 1081 1056 1031 1111 1112 980 1002 1030 1058 1150 1085 1028 1049 1065 1003 1009 1093 1187 1125 967 964 1008
-1126A008l3p7P9N1N1R2R2k5k5LLo2o1l2l2PJ63M8k12j43J2JKP2P1Lp4j62pJ36N9nnrrL1L0
-1132A041qpN8N7K6K5m0m0J2J1N0N1k5k6K9n0q6P0J32N6p8j55r5j7J6J5J5J6N3k5p8P8J13
-1137A194m3j39j40NMM4M4j8j8L0L1r6O0L7L7POm9m9l8J17J56%J0Rl9m0k6k6k6k6Q0Q0q9q8
-1142A001P1P1j9k0L4L3onm6m7m6m6L4L3l1l2J7J7J6J7n0n1Q3Q2O4r3j31K5M7M8m9k05L5L5
-1147H86K6K5MMo0o1L4L5L4L5J6J7J6J7O8O9MMj2j1j64rP3P2j28j29j1J45Q0p6JJrqJ6J5J13
-1153A132m2j74j9k4k5J02J03L7L8j6j6q1q0K0K1m5m4P3P3P2P3l3l2p2p2N0N0N0N1j1j1j1
-1158A137j1j0j1j0j1k5k5o4o4L6L7k9k8n4n5j5j5Q3Q4ppO7O7LLm6m6K0J9j9j9j07N0J06J07
-1163A141Q7o9M4M4nmj23j22K0K0j7j7j8j7l7l7l7l7N7N8O7O8q7O8L9j16j31K5M4M4NNNML3
$$ plain form
-1126 1008 975 898 977 1028 1079 1171 1263 1238 1213 1216 1219 1157 1096 1064 1032 1039 1202 1250 1038 895 907 908 910 982 1053 1056 982 820 813 949 1008 1003 998 989 980 1011 1041
-1132 1041 1033 1026 1084 1141 1167 1192 1152 1112 1124 1135 1185 1236 1211 1185 1214 1164 1078 1148 1280 1336 1258 1103 1008 991 1007 1022 1037 1053 1106 1081 1003 1081 1194
-1137 1194 1151 1012 872 877 881 925 969 951 933 963 994 898 958 995 1032 1039 1045 996 947 909 1026 1182 1182 1192 1201 1162 1122 1096 1070 1044 1018 1098 1178 1089 1001
-1142 1001 1072 1143 1124 1104 1138 1171 1165 1160 1114 1067 1021 975 1009 1042 1011 979 996 1013 1029 1046 996 945 1028 1110 1174 1081 950 975 1022 1070 1021 816 851 886
-1147 886 912 937 941 945 885 824 858 893 927 962 978 995 1011 1028 1096 1165 1169 1173 1161 1150 986 977 1050 1122 994 865 854 999 1079 1003 1004 1005 996 988 1004 1019 1132
-1153 1132 1090 916 897 873 848 950 1053 1090 1128 1112 1096 1015 935 955 976 931 887 960 1033 1105 1178 1145 1113 1041 969 1019 1069 1119 1170 1159 1148 1137
-1158 1137 1126 1116 1105 1095 1084 1059 1034 970 906 942 979 950 922 868 813 798 783 866 950 943 936 1003 1070 1073 1076 1030 984 1004 1023 1004 985 878 928 1034 1141
-1163 1141 1228 1159 1203 1247 1242 1238 1115 993 1013 1033 1016 999 981 964 927 890 853 816 873 931 998 1066 979 1047 1086 970 839 864 908 952 957 962 967 971 1004
-1168A004L2L3L2j18j17N1N0M4M4K0J77j00r9k6k5J00J00R6n9p6p7NNL7L8j04j05J4J5K5K4
-1173A040q7O9M7M6l6l6KLL0L1L0L0k8k8k8k8KKKLN6N6J8J7o9p0M8M7p7p8l9l9p5p4J59J59
-1179A105m4m4m3m4O6O5o4o4l4l4NNnoJ14J15mj58l9J17O6q9p9P6O5O6klK6K6j3j3n1n1P9
-1184A112P8l8l8JJj0j0rj0l2l1l2l2O9O9rrJ7J6k3k3k0k1m0J15M4j12r3r3J36J36m5m6OO
-1189A030M4M5n0m9Q0Q0J7J8J8J7j19j20J0J0jjL9L8rrJ%r8N8M8M7M9M8R8n9q8q7j0j0o7Q8
-1195A106N9r6j06N0m7m7K1K2K1K2r2r3K8K8N5j01l3J23Q3p3k0N8k5k5j1j0l9J17Q8o8j27
-1200H68K9J61J61qq5j29K7KKJ2J2O0O1j8j7n8n7K0K0K1K0j05j05j0O8L8j17K2J00kP6m0j17
-1205I12RRJ8J9J9J8KKKKj5j5L4L4j03N3L8L8L2m5r4O2J5o2O9O9l4l4p3p3M0M1l7l7l5l5M3
$$ plain form
-1168 1004 1036 1069 1101 983 866 917 967 1011 1055 1075 1252 1152 1053 1027 1002 1102 1202 1298 1239 1163 1086 1091 1096 1133 1171 1067 962 976 991 1016 1040
-1173 1040 953 1022 1069 1115 1079 1043 1045 1048 1078 1109 1139 1169 1141 1113 1085 1057 1059 1061 1063 1066 1122 1178 1196 1213 1144 1074 1122 1169 1092 1014 975 936 861 787 946 1105
-1179 1105 1061 1017 974 930 996 1061 997 933 899 865 870 875 870 864 978 1093 1089 931 892 1009 1075 986 907 983 1048 1114 1112 1109 1135 1161 1148 1135 1084 1033 1112
-1184 1112 1190 1152 1114 1115 1116 1106 1096 1087 1077 1045 1014 982 950 1019 1088 1079 1070 1087 1103 1080 1057 1037 1016 976 1091 1135 1023 930 837 973 1109 1064 1018 1024 1030
-1189 1030 1074 1119 1069 1020 1100 1180 1197 1215 1233 1250 1131 1011 1021 1031 1030 1029 1068 1106 1097 1088 1089 1089 991 1049 1097 1144 1193 1241 1339 1280 1192 1105 1095 1085 1018 1106
-1195 1106 1165 1069 963 1013 966 919 940 962 983 1005 913 820 848 876 931 830 797 920 1003 930 910 968 943 918 907 897 858 975 1063 995 868
-1200 868 897 1058 1219 1211 1126 997 1024 1026 1028 1040 1052 1112 1173 1155 1138 1080 1023 1043 1063 1084 1104 999 894 884 952 990 873 895 995 993 1069 1029 912
-1205 912 921 930 948 967 986 1004 1006 1008 1010 1012 997 982 1016 1050 947 1000 1038 1076 1108 1063 969 1031 1046 984 1053 1122 1088 1054 981 908 948 989 952 915 880 845 888
-1210H88M3n7n7K0K1J0J1M9M9l8l7M1M0L2L2L1L2n4n5n4n4N6N6k2k2j4j5J16J15K6K5n3n2
-1215A109l4l4MNj5j5n3n4poP1P1n1n0P9P9m6m6l0j07p2J09M2l7P4lM0l8P8P8mnj9j9j44j44
-1221H06J3R0Q1m9o3o3N9N9l3l3M5M5Q2Q2NMo6o6k7k7l5l5l5l5K9K8O7O7j20j20O2O1opL3
-1226H98L2K7K8n1n0K8K8K8K8j6j7j6j7K9K9K9K9l4l3l4l4J5J4J4J4m3m4mml3l3R7R7n4n3
-1231H94P6P6L5L6j6j46m2L6J06K8m6m6O1o8k8k7M3M2J8J9k1k1P8P7J10p2j46j6pJ22J33j26
-1236A162n0n0J4J3k5k6l3l4q2P3N2N1Q1p5n1J04l2l2%%q8O8O5O5llr6r5L4L4m7m7Q3Q3QQ
-1242A129p0p0m8m7L0L0M4M5l3l4OOOOj0rK9L0O6O7o3o3j0j1r8N8M4M4J42j5n0n0n9o0k4k4
-1247I34k4k4OOP4P4K3j32ooj6j6O3O2J1J1J37j8l7l6m7m6K7K7n0n1klP5P5l6l7q5P0KJR9
$$ plain form
-1210 888 931 874 817 837 858 868 879 928 977 939 902 943 983 1015 1047 1078 1110 1056 1001 947 893 949 1005 983 961 947 932 1048 1163 1189 1214 1161 1109
-1215 1109 1075 1041 1045 1050 1035 1020 967 913 906 900 971 1042 991 941 1020 1099 1053 1007 977 870 798 907 949 912 986 983 1023 985 1063 1141 1137 1132 1113 1094 950 806
-1221 806 819 909 990 941 878 815 874 933 900 867 912 957 1039 1121 1126 1130 1064 998 971 944 909 874 839 804 833 861 928 995 875 755 817 878 872 865 898
-1226 898 930 957 985 934 884 912 940 968 996 980 963 947 930 959 988 1017 1046 1012 979 945 911 926 940 954 968 925 881 877 873 840 807 904 1001 947 894
-1231 894 970 1046 1081 1117 1101 955 913 949 1055 1083 1037 991 1052 984 956 929 972 1014 1032 1051 1030 1009 1087 1164 1274 1202 1056 1040 1033 1155 1288 1162
-1236 1162 1112 1062 1076 1089 1064 1038 1005 971 889 962 1014 1065 1146 1071 1020 1124 1092 1060 1060 1060 972 1040 1105 1170 1167 1164 1068 973 1007 1041 994 947 1030 1113 1121 1129
-1242 1129 1059 989 941 894 924 954 998 1043 1010 976 982 988 994 1000 990 981 1010 1040 1106 1173 1110 1047 1037 1026 928 986 1030 1074 1216 1201 1151 1101 1042 982 958 934
-1247 934 910 886 892 898 972 1046 1069 937 931 925 909 893 956 1018 1029 1040 1177 1159 1122 1086 1039 993 1020 1047 997 946 944 941 1016 1091 1055 1018 933 1003 1005 1006 1105
-1253A105n7M9M9L9L9j12j11N4j02N6N7M6M7K4K4n4n3ppppj0rj0rN1N2L2j23j17M0n8n8K0
-1258H73J9K0J9K4K4K3K4m6m6J8J9J5J4J5J5QQRQj3j4K5K6j8j8k8k7M6j09n2n1q3P2J01J01
-1263A021P7P7K8K9Qj48k0k1q6q6L1L1k3k3J6J6K9K9j0j0l7l7l4J22M7M7l4l3OPn9n8M4M4
-1269I90M4M4k3k3O4r1NOmnj13j13L0L0J08J09J7J8k0k0n8n9K0K0K0K0m4m3K1K1M8M8o9o9
-1274I29N2N2J3J4l3l2Q5Q4n9n9L2L2k2k2J8J7m8m7rqL3L4n7n8R6R6m6m7q8q7k2k3P0O9m7
-1279I12m7P6P6j5j4J6J6N5N5r3r2kkl0l1RQP2P1PPj24j24M5M4K2K1O0O0j3j3j3j3L5L6k9
-1285A048l0l0l1l0l1N5N4j0j1noJ11J11j25j24M3M4opooj6j5K4K4m1m1kkM8M7M8M8j15j14
-1290I01N4N4p1p2M5M6K5K5O4O4k7k6o5o5RRRRRQn7n7J0J0k9k9P5P6P5P6p6p5l7l6J07J07
$$ plain form
-1253 1105 1048 1097 1146 1185 1224 1112 1001 1055 953 1009 1066 1112 1159 1183 1207 1153 1100 1093 1086 1079 1072 1062 1053 1043 1034 1085 1137 1169 1046 929 969 911 853 873
-1258 873 892 912 931 955 979 1002 1026 980 934 952 971 986 1000 1015 1030 1038 1046 1055 1063 1050 1036 1061 1087 1069 1051 1023 996 1042 933 881 830 747 819 920 1021
-1263 1021 1098 1175 1203 1232 1240 1092 1072 1051 965 879 910 941 918 895 911 927 956 985 975 965 928 891 857 979 1026 1073 1039 1006 1012 1019 960 902 946 990
-1269 990 1034 1078 1055 1032 1096 1005 1010 1016 1012 1007 894 781 811 841 949 1058 1075 1093 1073 1053 995 936 956 976 996 1016 972 929 950 971 1019 1067 998 929
-1274 929 981 1033 1046 1060 1027 995 1080 1164 1105 1046 1078 1110 1088 1066 1084 1101 1053 1006 997 989 1022 1056 999 941 1037 1133 1087 1040 952 865 843 820 890 959 912
-1279 912 865 941 1017 1002 988 1004 1020 1075 1130 1037 945 943 941 911 880 889 897 969 1040 1047 1054 930 806 851 895 917 938 998 1058 1045 1032 1019 1006 1041 1077 1048
-1285 1048 1018 988 957 927 896 951 1005 995 984 979 973 1084 1195 1070 946 989 1033 1027 1020 1014 1008 992 977 1001 1025 984 943 941 939 987 1034 1082 1130 1015 901
-1290 901 955 1009 938 866 911 957 982 1007 1071 1135 1108 1082 1017 952 961 970 979 988 997 1005 948 891 901 911 882 853 928 1004 1079 1155 1079 1004 967 931 1038 1145
-1296A145j0rl6l5MLj1j2j2j2M1M1j02k4N6p4MNNMNNl7l7J9K0Q6m3M3J20M1q9r0M1N9j9n7
-1301A038n8o2o3K9K8N9N8N8N8kjkkN2N2o4o5K6K5r1r2J4J4P9P8n1n1J4J4j5j6p5p6n2K5o1
-1307H22O9Q7m2j20Rl1M6k7k8J13J13n5n5RJ0M8M9m7m6J8J9O9O9l9l9n6P4P9n0j5O4n3n4k4
-1312I86k5o7O3J00l0QQ6k5k5k0k0%%O4O5l0k9o9o8K9K9l6l6R9R9o0o1j34K0N1N0n2n1O5O6
-1317A042QRm7m6j9J37J0J0p3p4r5N9K8K7L7L7o9o9mnN4N3q3P3J37j8n3n4r2O3M0M1m6m7j33
-1323H38K2R0R0k7J29k1k1J7J8R1o5m3m2k6k6o5o5K8K9j0j0J2J1J2J2K5K5r1r2k4k5J5J5l2
-1328G94l1K4K4R7n9K9K9J0RJ0J0l1l2O0N9M3M3m4J11k3k3j03j04N6N6l4l4M9N0J1J1j7j8
-1333A032n6n6m3m3L9L8J22l5l5J21M3M2j3j2p0o9P3P3k9k9r3r4n1n0J4J4O7O6J1J1o4R1O2
$$ plain form
-1296 1145 1135 1126 1090 1055 1059 1062 1051 1039 1027 1015 1056 1097 995 971 1027 953 957 962 967 971 976 981 944 907 926 946 1032 989 1032 1152 1193 1104 1014 1055 1114 1095 1038
-1301 1038 980 918 855 884 912 971 1029 1087 1145 1143 1142 1140 1138 1190 1242 1178 1113 1139 1164 1073 981 995 1009 1088 1166 1115 1064 1078 1092 1077 1061 986 910 858 883 822
-1307 822 891 978 936 816 825 794 840 813 785 898 1011 956 901 910 920 968 1017 970 924 942 961 1030 1099 1060 1021 965 1039 1118 1068 1053 1117 1064 1010 986
-1312 986 961 894 957 1057 1027 1035 1121 1096 1071 1051 1031 1031 1031 1095 1160 1130 1101 1032 964 993 1022 986 950 1049 1148 1088 1027 893 913 964 1014 962 911 976 1042
-1317 1042 1050 1059 1012 966 947 1084 1094 1104 1031 957 862 921 949 976 1013 1050 981 912 908 903 957 1010 927 1000 1137 1119 1066 1012 920 983 1023 1064 1018 971 838
-1323 838 860 950 1040 1013 1142 1121 1100 1117 1135 1226 1161 1118 1076 1050 1024 959 894 922 951 941 931 943 954 966 978 1003 1028 937 845 821 796 811 826 794
-1328 794 763 787 811 908 849 878 907 917 926 936 946 915 883 943 1002 1045 1088 1044 1155 1132 1109 1006 902 958 1014 980 946 995 1045 1056 1067 1050 1032
-1333 1032 976 920 877 834 873 911 1033 998 963 1084 1127 1169 1156 1144 1074 1005 1078 1151 1122 1093 1000 906 855 805 819 833 900 966 977 988 924 1015 1077
-1338A077r3j05N1M4M4K6K6r0r1PPQPk5k5R1R2j03j03R2R1j4j4j4j5O6O5K6K7m1m1m1m1k9
-1343I62k9K7K6J00n6p6p6jJ55KLo8o8N0M9K5K6l9m0L9L9L8L9l4l5l4l4j8j8J09m8l3l3mm
-1348I41j2j2K7K8K3K3K3K3j6j6q1q1Q2Q2L6j19j33K3OJ62OPk3k3j5j4N0N0k1k1k1k1J%%%
-1354I64K5K4m0m0PQl1l1R3R4m9m9L4L4n7n6mmL5L5j1j1j0j1klklM1M2k4k4opopJ3J4J3J3
-1360A001RJ0RRp6p6J5J5N6N6R5R5r1r1k6k6k6k5J3J2N3N2J4J4J8J9k1k0l8l7K7K7n3n2j4
-1365I47j4K8K8K9K8n8n9L3L2N3N3l8l8j7j8n7n6PQQQl9l8N2N2M3M2j52J07R9n7j57jN1N1
-1371I60n6n7N9N9K0K1k4k4J5J5o5o5%%K3K2K3K3L3L4m5m5l5l6R4R4PPp2p1ppO1O1J30k6o8
-1376A058o7m8m8qrJ24J25n8n7m9n0j0j0k4k4N3N4O0O0p0o9M9M9O0r7lmn2n2l0l0J35k1J6
$$ plain form
-1338 1077 984 879 930 974 1018 1044 1070 980 889 896 903 911 918 893 868 959 1051 948 845 937 1028 1014 1000 986 971 1037 1102 1128 1155 1114 1073 1032 991 962
-1343 962 933 960 986 1086 1030 954 878 877 1032 1034 1037 969 901 951 1000 1025 1051 1012 972 1011 1050 1088 1127 1093 1058 1024 990 972 954 1063 1015 982 949 945 941
-1348 941 929 917 944 972 995 1018 1041 1064 1048 1032 951 870 952 1034 1070 951 818 841 847 1009 1015 1022 999 976 961 947 997 1047 1026 1005 984 963 964 964 964 964
-1354 964 989 1013 973 933 940 948 917 886 979 1073 1024 975 1009 1043 986 930 926 922 957 992 981 970 960 949 947 944 942 939 980 1022 998 974 968 961 955 948 961 975 988 1001
-1360 1001 1010 1020 1029 1038 962 886 901 916 972 1028 1123 1218 1127 1036 1010 984 958 933 946 958 1011 1063 1077 1091 1109 1128 1107 1087 1049 1012 1039 1066 1013 961 947
-1365 947 933 961 989 1018 1046 988 929 962 994 1047 1100 1062 1024 1007 989 932 876 883 891 899 907 868 830 882 934 977 1019 867 974 1073 1016 859 858 909 960
-1371 960 904 847 906 965 985 1006 982 958 973 988 923 858 858 858 881 903 926 949 982 1016 971 926 891 855 949 1043 1050 1057 985 914 907 900 961 1022 1152 1126 1058
-1376 1058 991 943 895 887 878 1002 1127 1069 1012 963 913 903 893 869 845 898 952 1012 1072 1002 933 982 1031 1091 994 991 987 935 883 853 823 958 937 953
-1381I53J5OOK3K4j42J3O6O6n4n4m1m1L7L6j6j7J13J13l2l1l1l2K9K9m9m9k5k4O3O2j01N4
-1386I69M4M4J9J8o0n9j9j9O0N9M3M3l5l5j17j16J3J3m0m0q8O7J13J14KLp6P9m8m7K6K6n3
-1392I03n2l8l8R1R2JKJJJ0RR8n9n1n0o1o0K1K2R9R9pqK1K2P1q5q5P1P6P6r5r6mlj3j4J11
-1397A078m5M3M3J3J4j07j06rJ48J7j38nnO3O3J9J9n9n9nonnK6K7n1n1M7M6L7L6m4k00J8J7
-1403H74L3L3poO4O3K2j34rqJ11J11j13j14J6J7l2l2M6M7m7m8qqJ01J02N9r7p9q0j1j1N6N5
-1408I66R5R5j03j04k5k6L9M0%JRJ0RJ0J1J2J2J2n3n3o3R2m3m2n3J03Q7o8j1j0K3K3n5n5n6
-1413H29n6K1K2P0P0qpM1M2l6l6n6n5j4J42J5J4n4n3k2k1J8J7L7L7O7O6R7n8j01j01J6J6J6
-1418I75J5L5L6K5K5R1o5n5n5m1m1m0m1j5j5j4j5J3J3J2J3K6K6j40J6J0J0Q8Q8O5r0j29K6
$$ plain form
-1381 953 968 974 980 1003 1027 885 898 964 1030 976 922 881 840 877 913 897 880 993 1106 1074 1043 1012 980 1009 1038 989 940 915 891 954 1016 915 969
-1386 969 1013 1057 1076 1094 1034 975 956 937 997 1056 1099 1142 1107 1072 955 839 852 865 825 785 697 764 877 991 993 996 920 999 951 904 930 956 903
-1392 903 851 813 775 866 958 959 961 962 963 973 982 1080 1021 970 920 859 799 820 842 941 1040 1033 1025 1046 1068 1139 1054 969 1040 1116 1192 1097 1001 997 994 981 967 1078
-1397 1078 1033 1076 1119 1132 1146 1039 933 924 1072 1089 951 946 941 1004 1067 1086 1105 1046 987 982 976 971 966 992 1019 968 917 964 1010 1047 1083 1039 839 857 874
-1403 874 907 940 933 927 991 1054 1076 942 933 925 1036 1147 1034 920 936 953 921 889 935 982 935 887 879 871 972 1074 1133 1036 957 877 866 855 911 966
-1408 966 1061 1156 1053 949 924 898 937 977 977 978 987 997 1006 1016 1027 1039 1051 1063 1010 957 894 986 943 901 848 951 1038 970 959 949 972 995 940 885 829
-1413 829 773 794 816 886 956 948 941 982 1024 988 952 896 841 827 969 984 998 944 891 869 848 866 883 920 957 1024 1090 1187 1129 1028 927 943 959 975
-1418 975 990 1025 1061 1086 1111 1202 1137 1082 1027 986 945 905 864 849 834 820 805 818 831 843 856 882 908 768 784 794 804 892 980 1045 955 826 852
-1423H52P9P9J1J1n5n4P5P5j46j46L6L6k9l0M8M9k4k3N5N5n3n2K6K6rqrql3l2M5M5L8L8l9
$$ plain form
-1423 852 931 1010 1021 1032 977 923 998 1073 927 781 817 853 824 794 842 891 867 844 899 954 901 849 875 901 892 884 875 867 834 802 847 892 930 968 929
$$ [...]
##END=	
##END=	
