##TITLE=	kmi-4-PhPy-1.10.fid


##JCAMP-DX=	6.0	$$ MestReNova 14.1.1-24571
##DATA TYPE=	LINK
##BLOCK_ID=	1
##BLOCKS=	1    
##ORIGIN=	Mestrelab Research S.L.
##OWNER=	hrzepa
##$MNOVA/LINK_BLOCK_TYPE=	ITEM	$$ NMR Spectrum
##$MNOVA/ITEM/POLYGON=	(XY..XY)
5321,5835
8722,5835
8722,8208
5321,8208
5321,5835
##$MNOVA/ITEM/Z=	0
##$MNOVA/ITEM/ANGLE=	0
##TITLE=	kmi-4-PhPy-1.10.fid
##JCAMP-DX=	6.0	$$ MestReNova 14.1.1-24571
##BLOCK_ID=	2
##DATA TYPE=	NMR SPECTRUM
##DATA CLASS=	XYDATA
##NUMDIM=	1
##ORIGIN=	Bruker BioSpin GmbH
##OWNER=	root
##.OBSERVE FREQUENCY=	500.13308850747802126
##.OBSERVE NUCLEUS=	^1H
##.SOLVENT NAME=	CDCl3
##.PULSE SEQUENCE=	zg30
##LONGDATE=	2022/03/10 11:15:00.000
##.ACQUISITIONMODE=	SIMULTANEOUS (DQD)
##$ORIGINAL FORMAT=	Bruker XWIN-NMR
##$MNOVA/SCALES_VERSION=	9
##$PARAMETER FILE=	(acqus, ASCII, /Users/hrzepa/Library/Mobile%20Documents/com~apple~CloudDocs/C2/Pure%20samples/kmi-4-PhPy-1/4-phenylpyridine/acqus, 0)
$$ ##TITLE= Parameter file, TOPSPIN		Version 3.2
$$ ##JCAMPDX= 5.0
$$ ##DATATYPE= Parameter Values
$$ ##NPOINTS= 11	$$ modification sequence number
$$ ##ORIGIN= Bruker BioSpin GmbH
$$ ##OWNER= root
$$ $$ 2022-03-10 11:15:38.959 +0900  root@CZC31189P3
$$ $$ C:/Users/root/Desktop/NMR/miyamoto/kmi-ANthra-1/10/acqus
$$ $$ process C:\Bruker\TopSpin3.2\prog\mod\shimcntl.exe
$$ ##$ACQT0= -2.52100840336134
$$ ##$AMP= (0..31)
$$ 100 100 100 100 100 100 100 100 100 100 100 100 100 100 100 100 100 100
$$ 100 100 100 100 100 100 100 100 100 100 100 100 100 100
$$ ##$AMPCOIL= (0..19)
$$ 0 0 0 0 0 0 0 0 0 0 0 0 0 0 0 0 0 0 0 0
$$ ##$ANAVPT= -1
$$ ##$AQSEQ= 0
$$ ##$AQ_mod= 3
$$ ##$AUNM= <au_zg>
$$ ##$AUTOPOS= <19 >
$$ ##$BF1= 500.13
$$ ##$BF2= 500.13
$$ ##$BF3= 500.13
$$ ##$BF4= 500.13
$$ ##$BF5= 500.13
$$ ##$BF6= 500.13
$$ ##$BF7= 500.13
$$ ##$BF8= 500.13
$$ ##$BYTORDA= 0
$$ ##$CAGPARS= (0..11)
$$ 0 0 0 0 0 0 0 0 0 0 0 0
$$ ##$CFDGTYP= 0
$$ ##$CFRGTYP= 9
$$ ##$CHEMSTR= <none>
$$ ##$CNST= (0..63)
$$ 1 1 1 1 1 1 1 1 1 1 1 1 1 1 1 1 1 1 1 1 1 1 1 1 1 1 1 1 1 1 1 1 1 1 1 1
$$ 1 1 1 1 1 1 1 1 1 1 1 1 1 1 1 1 1 1 1 1 1 1 1 1 1 1 1 1
$$ ##$CPDPRG= (0..8)
$$ <> <> <> <> <> <> <> <> <>
$$ ##$D= (0..63)
$$ 0 1 0 0 0 0 0 0 0 0 0 0 0 0 0 0 0.0002 0 0 0 0 0 0 0 0 0 0 0 0 0 0 0 0
$$ 0 0 0 0 0 0 0 0 0 0 0 0 0 0 0 0 0 0 0 0 0 0 0 0 0 0 0 0 0 0 0
$$ ##$DATE= 1646878537
$$ ##$DE= 6.5
$$ ##$DECBNUC= <off>
$$ ##$DECIM= 2000
$$ ##$DECNUC= <off>
$$ ##$DECSTAT= 4
$$ ##$DIGMOD= 1
$$ ##$DIGTYP= 12
$$ ##$DQDMODE= 0
$$ ##$DR= 22
$$ ##$DS= 2
$$ ##$DSPFIRM= 0
$$ ##$DSPFVS= 20
$$ ##$DTYPA= 0
$$ ##$EXP= <A.Proton>
$$ ##$F1LIST= <>
$$ ##$F2LIST= <>
$$ ##$F3LIST= <>
$$ ##$FCUCHAN= (0..9)
$$ 0 2 0 0 0 0 0 0 0 0
$$ ##$FL1= 90
$$ ##$FL2= 90
$$ ##$FL3= 90
$$ ##$FL4= 90
$$ ##$FOV= 20
$$ ##$FQ1LIST= <>
$$ ##$FQ2LIST= <>
$$ ##$FQ3LIST= <>
$$ ##$FQ4LIST= <>
$$ ##$FQ5LIST= <>
$$ ##$FQ6LIST= <>
$$ ##$FQ7LIST= <>
$$ ##$FQ8LIST= <>
$$ ##$FRQLO3= 23161.4925220013
$$ ##$FRQLO3N= 2
$$ ##$FS= (0..7)
$$ 83 83 83 83 83 83 83 83
$$ ##$FTLPGN= 0
$$ ##$FW= 125000
$$ ##$FnMODE= 0
$$ [...]
$$ 130000 130000 130000 130000 130000 130000 130000 130000 130000 130000 130000
$$ 130000 130000 130000 130000 130000 130000 130000 130000 130000 130000 130000
$$ 130000 130000 130000 130000 130000 130000 130000 0 0 0 0 0 0 0 0 0 0 0
$$ 0 0 0 0 0 0 0 0 0 0 0 0 0
$$ ##$ShimPowMaxUC= (0..63)
$$ 130000 130000 130000 130000 130000 130000 130000 130000 130000 130000 130000
$$ 130000 130000 130000 130000 130000 130000 130000 130000 130000 130000 130000
$$ 130000 130000 130000 130000 130000 130000 130000 130000 130000 130000 130000
$$ 130000 130000 130000 130000 130000 130000 130000 0 0 0 0 0 0 0 0 0 0 0
$$ 0 0 0 0 0 0 0 0 0 0 0 0 0
$$ ##$ShimPowMaxUG= (0..63)
$$ 524287 524287 524287 524287 524287 524287 524287 524287 524287 524287 524287
$$ 524287 524287 524287 524287 524287 524287 524287 524287 524287 524287 524287
$$ 524287 524287 524287 524287 524287 524287 524287 524287 524287 524287 524287
$$ 524287 524287 524287 524287 524287 524287 0 0 0 0 0 0 0 0 0 0 0 0 0 0 0
$$ 0 0 0 0 0 0 0 0 0 0
$$ ##$ShimPowRcbType= 3
$$ ##$ShimPowRes= (0..63)
$$ 1e-020 1e-020 1e-020 1e-020 1e-020 1e-020 1e-020 1e-020 1e-020 1e-020 1e-020
$$ 1e-020 1e-020 1e-020 1e-020 1e-020 1e-020 1e-020 1e-020 1e-020 1e-020 1e-020
$$ 1e-020 1e-020 1e-020 1e-020 1e-020 1e-020 1e-020 1e-020 1e-020 1e-020 1e-020
$$ 1e-020 1e-020 1e-020 1e-020 1e-020 1e-020 1e-020 0 0 0 0 0 0 0 0 0 0 0
$$ 0 0 0 0 0 0 0 0 0 0 0 0 0
$$ ##$ShimPowRng0= (0..63)
$$ 1 1 1 1 1 1 1 1 1 1 1 1 1 1 1 1 1 1 1 1 1 1 1 1 1 1 1 1 1 1 1 1 1 1 1 1
$$ 1 1 1 1 0 0 0 0 0 0 0 0 0 0 0 0 0 0 0 0 0 0 0 0 0 0 0 0
$$ ##$ShimPowRng1= (0..63)
$$ 1 1 1 1 1 1 1 1 1 1 1 1 1 1 1 1 1 1 1 1 1 1 1 1 1 1 1 1 1 1 1 1 1 1 1 1
$$ 1 1 1 1 0 0 0 0 0 0 0 0 0 0 0 0 0 0 0 0 0 0 0 0 0 0 0 0
$$ ##$ShimPowRng2= (0..63)
$$ 1 1 1 1 1 1 1 1 1 1 1 1 1 1 1 1 1 1 1 1 1 1 1 1 1 1 1 1 1 1 1 1 1 1 1 1
$$ 1 1 1 1 0 0 0 0 0 0 0 0 0 0 0 0 0 0 0 0 0 0 0 0 0 0 0 0
$$ ##$ShimPowRng3= (0..63)
$$ 1 1 1 1 1 1 1 1 1 1 1 1 1 1 1 1 1 1 1 1 1 1 1 1 1 1 1 1 1 1 1 1 1 1 1 1
$$ 1 1 1 1 0 0 0 0 0 0 0 0 0 0 0 0 0 0 0 0 0 0 0 0 0 0 0 0
$$ ##$ShimSysFunc= (0..63)
$$ 1 2 3 4 5 6 7 8 9 10 0 37 38 35 16 15 14 13 12 11 28 27 26 25 24 23 36
$$ 22 30 29 20 21 34 33 32 31 17 18 19 0 0 0 0 0 0 0 0 0 0 0 0 0 0 0 0 0 0
$$ 0 0 0 0 0 0 0
$$ ##$ShimSysMatrix= 0
$$ ##$ShimSysType= 4
$$ ##$TFXNUM= 0
$$ ##$TRIPLO2= 0
$$ ##$VTU= 2
$$ ##$VTUETH= <149.236.99.20>
$$ ##$VTUTY= <no>
$$ ##$WBREFAM= (0..15)
$$ 100 100 100 100 100 100 100 100 100 100 100 100 100 100 100 100
$$ ##$WBREFLM= (0..15)
$$ 1 0 0 0 0 0 0 0 0 0 0 0 0 0 0 0
$$ ##$WBREFPH= (0..15)
$$ 0.03 0 0 0 0 0 0 0 0 0 0 0 0 0 0 0
$$ ##$WBSGU= (0..15)
$$ 0 0 0 0 0 0 0 0 0 0 0 0 0 0 0 0
$$ ##$XFAC= 2
$$ ##END=
$$ 
##$DECIM=	2000
##$DSPFVS=	20
##XUNITS=	HZ
##YUNITS=	ARBITRARY UNITS
##FIRSTX=	8076.719258046970026
##LASTX=	-1923.128154062404974
##DELTAX=	-0.152587890625
##XFACTOR=	1
##YFACTOR=	0.0098300388095386541376
##FIRSTY=	13.938511848449707031
##MINY=	7.23114013671875
##MAXY=	7392.98046875
##NPOINTS=	65536
##XYDATA=	(X++(Y..Y))
$$ [...]
$$ plain form
1558 1655 1721 1726 1731 1736 1741 1656 1571 1530 1488 1473 1595 1603 1473 1470 1466 1523 1580 1636 1693 1589 1486 1559 1633 1730 1689 1578 1697 1677 1658 1660 1661 1731 1801 1724 1647 1569
1552 1569 1492 1486 1481 1475 1469 1590 1711 1671 1631 1681 1731 1635 1677 1640 1603 1643 1683 1680 1676 1664 1652 1764 1739 1599 1597 1676 1755 1636 1517 1550 1583 1693 1666 1648
1547 1648 1630 1680 1593 1576 1559 1534 1508 1578 1648 1603 1559 1554 1549 1545 1540 1604 1669 1619 1569 1543 1517 1491 1465 1463 1460 1458 1455 1470 1484 1499 1513 1523 1533 1620 1569 1496 1423 1501
1541 1501 1580 1513 1447 1503 1560 1536 1650 1618 1586 1572 1559 1605 1651 1704 1618 1542 1465 1552 1638 1656 1675 1668 1662 1656 1649 1592 1535 1460 1524 1604 1547 1507 1467 1501 1535 1569
1536 1569 1604 1612 1620 1637 1654 1621 1725 1770 1676 1528 1518 1491 1463 1524 1585 1646 1706 1713 1719 1725 1731 1756 1780 1698 1616 1620 1762 1743 1587 1601 1615 1621 1627 1683 1738 1717 1695
1530 1695 1683 1533 1452 1508 1513 1518 1600 1682 1702 1721 1672 1623 1699 1774 1698 1622 1560 1635 1633 1631 1656 1681 1638 1594 1696 1797 1815 1696 1700 1704 1699 1694 1739 1784 1829 1874
1525 1874 1883 1893 1833 1774 1681 1588 1495 1402 1455 1509 1553 1598 1718 1701 1692 1682 1671 1659 1647 1635 1563 1491 1534 1577 1568 1559 1550 1541 1588 1635 1536 1575 1658 1740 1717 1694 1720
1519 1720 1747 1613 1479 1456 1434 1481 1527 1546 1566 1654 1742 1807 1872 1951 1802 1681 1560 1503 1674 1729 1783 1737 1690 1691 1692 1701 1573 1598 1624 1640 1657 1614
$$ packed form
1558A655O6NNNNq5q5m1m2j5J22Qj30lmN7N7N6N7j04j03P3P4R7m1j11J19k0j9KJP0P0p7p7p8
1552A569p7onooJ21J21m0m0N0N0r6M2l7l7M0M0lmj2j2J12k5j40kP9P9j19j19L3L3J10k7j8
1547A648j8N0q7j7j7k5k6P0P0m5m4nnmnO4O5n0n0k6k6k6k6klklJ5J4J5J4J0J0Q7n1p3p3P8
1541A501P9o7o6N6N7k4J14l2l2j4j3M6M6N3q6p6p7Q7Q6J8J9poopn7n7p5O4Q0n7m0m0L4L4L4
1536A569L5QQJ7J7l3J04M5r4j48j0k7k8O1O1O1O0POOOK5K4q2q2MJ42j9j56J4J4OON6N5k1k2
1530A695j2j50q1N6NNQ2Q2K0J9m9m9P6P5p6p6o2P5kkK5K5m3m4J02J01J8j19MMnnM5M5M5M5
1525A874RJ0o0n9r3r3r3r3N3N4M4M5J20j7rj0j1j2j2j2p2p2M3M3rrrrM7M7r9L9Q3Q2k3k3K6
1519A720K7j34j34k3k2M7M6J9K0Q8Q8O5O5P9j49j21j21n7J71N5N4m6m7JJRj28K5K6J6J7m3
$$ plain form
1514 1614 1570 1596 1621 1673 1724 1708 1623 1513 1540 1593 1577 1572 1566 1556 1546 1530 1515 1500 1485 1578 1672 1651 1630 1573 1516 1528 1540 1574 1607 1572 1536 1560 1584 1607 1631
1509 1631 1641 1652 1663 1673 1599 1524 1450 1376 1437 1499 1561 1622 1615 1607 1668 1730 1719 1709 1698 1688 1706 1725 1671 1617 1624 1563 1569 1713 1745 1639 1620 1601 1574 1548 1590
1503 1590 1632 1616 1599 1643 1686 1760 1696 1628 1698 1755 1744 1630 1653 1759 1797 1684 1571 1537 1641 1705 1701 1626 1550 1539 1528 1527 1526 1538 1412 1357 1371 1405 1440
1498 1440 1561 1681 1642 1534 1396 1396 1552 1571 1561 1551 1601 1652 1576 1500 1539 1578 1528 1478 1465 1590 1609 1628 1655 1683 1648 1614 1580 1545 1597 1648 1631 1614
1493 1614 1694 1775 1786 1798 1769 1741 1597 1454 1572 1690 1685 1680 1704 1592 1479 1504 1551 1598 1585 1572 1569 1566 1571 1439 1472 1506 1591 1676 1772 1731 1616 1500
1489 1500 1443 1523 1641 1759 1689 1619 1703 1650 1594 1675 1662 1649 1692 1597 1562 1665 1698 1593 1437 1419 1437 1594 1690 1648 1640 1632 1546 1460 1461 1461 1461 1462 1506 1550
1483 1550 1517 1622 1709 1797 1778 1759 1734 1708 1605 1503 1635 1629 1595 1561 1452 1481 1593 1704 1747 1790 1718 1647 1585 1523 1498 1611 1669 1727 1726 1724 1723 1722 1614
1478 1614 1507 1496 1622 1603 1583 1596 1609 1613 1617 1656 1557 1458 1497 1518 1540 1638 1737 1691 1645 1668 1691 1659 1627 1710 1793 1749 1705 1695 1685 1744 1803 1825 1709 1705
$$ packed form
1514A614m4K6K5N2N1j6q5j10K7N3j6noj0j0j6j5j5j5R3R4k1k1n7n7J2J2L4L3l5l6K4K4K3K4
1509A631J0J1J1J0p4p5p4p4O1O2O2O1pqO1O2j1j0j1j0J8J9n4n4Po1OJ44L2j06j9j9k7k6M2
1503A590M2j6j7M4M3P4o4o8P0N7j1j14K3J06L8j13j13l4J04O4mp5p6j1j1jjJ2j26n5J4L4L5
1498A440J21J20l9j08j38%J56J9j0j0N0N1p6p6L9L9n0n0j3J25J9J9K7K8l5l4l4l5N2N1j7j7
1493A614Q0Q1J1J2k9k8j44j43J18J18nnK4j12j13K5M7M7j3j3llNj32L3L4Q5Q5R6m1j15j16
1489A500n7Q0J18J18p0p0Q4n3n6Q1j3j3M3r5l5J03L3j05j56j8J8J57R6m2qqq6q6J%%JM4M4
1483A550l3J05Q7Q8j9j9k5k6j03j02J32ol4l4j09K9J12J11M3M3p2p1o2o2k5J13N8N8jkjjj08
1478A614j07j1J26j9k0J3J3MML9r9r9L9K1K2R8R9m6m6K3K3l2l2Q3Q3m4m4j0j0N9N9K2j16m
$$ plain form
1473 1705 1700 1687 1673 1670 1666 1594 1521 1514 1507 1568 1630 1608 1585 1606 1627 1518 1547 1690 1695 1680 1665 1572 1479 1593 1706 1668 1630 1431 1370 1424 1340 1323 1305 1440
1468 1440 1574 1553 1531 1543 1556 1606 1657 1639 1621 1619 1618 1617 1616 1634 1652 1601 1551 1569 1588 1718 1711 1706 1700 1618 1535 1495 1455 1529 1604 1573 1542 1554 1566 1548 1669 1703
1462 1703 1737 1782 1688 1707 1725 1669 1612 1625 1637 1668 1698 1582 1604 1544 1483 1546 1609 1542 1475 1450 1426 1437 1586 1700 1677 1692 1708 1686 1526 1490 1591 1538
1458 1538 1484 1471 1457 1478 1499 1529 1558 1622 1686 1701 1717 1672 1627 1539 1589 1768 1717 1607 1635 1571 1507 1565 1623 1723 1687 1577 1468 1465 1462 1449 1436 1500 1564
1453 1564 1511 1595 1671 1746 1768 1789 1650 1510 1526 1541 1479 1555 1606 1658 1717 1777 1788 1798 1608 1555 1650 1607 1693 1642 1615 1589 1622 1656 1642 1627 1604 1581 1678
1448 1678 1637 1510 1612 1612 1612 1696 1779 1701 1623 1545 1468 1502 1536 1657 1640 1521 1540 1664 1651 1636 1621 1598 1574 1567 1560 1518 1477 1428 1380 1437 1494 1656 1679
1443 1679 1666 1652 1675 1698 1721 1744 1703 1662 1596 1529 1460 1529 1681 1833 1806 1778 1682 1586 1597 1608 1584 1560 1527 1494 1470 1445 1445 1582 1613 1507 1373 1377 1455
1437 1455 1534 1477 1420 1469 1519 1553 1449 1458 1466 1577 1688 1639 1590 1438 1286 1340 1395 1475 1555 1566 1578 1695 1813 1769 1726 1780 1833 1780 1727 1641 1692 1778
$$ packed form
1473A705nj3j4lmp2p3ppO1O2k2k3K1K1j09K9J43Nj5j5r3r3J14J13l8l8j99o1N4q4j7j8J35
1468A440J34k1k2J2J3N0N1j8j8kjjjJ8J8n1n0J8J9J30pnoq2q3m0m0P4P5l1l1J2J2j8J21L4
1462A703L4M5r4J9J8n6n7J3J2L1L0j16K2o0o1O3O3o7o7k5k4J1J49J14k3J5J6k2j60l6J01n3
1458A538n4j3j4K1K1L0K9O4O4J5J6m5m5q8N0J79n1j10K8o4o4N8N8J00l6j10j09llj3j3O4O4
1453A564n3Q4P6P5K2K1j39j40J6J5o2P6N1N2N9O0J1J0j90n3R5m3Q6n1k7k6L3L4j4j5k3k3R7
1448A678m1j27J02%%Q4Q3p8p8p8p7L4L4J21j7j19J9J24j3j5j5k3k4ppm2m1m9m8N7N7J62K3
1443A679j3j4K3K3K3K3m1m1o6o7o9O9J52J52k7k8r6r6J1J1k4k4l3l3k4k5%J37L1j06j34MP8
1437A455P9n7n7M9N0L4j04RQJ11J11m9m9j52j52N4N5Q0Q0J1J2J17J18m4m3N4N3n3n3q6N1Q6
$$ plain form
1433 1778 1726 1699 1673 1638 1603 1629 1656 1750 1845 1796 1747 1699 1650 1571 1492 1573 1655 1694 1732 1657 1581 1542 1504 1448 1530 1625 1583 1520 1458 1485 1649 1778 1770 1756
1427 1756 1741 1683 1625 1542 1458 1490 1521 1585 1649 1608 1566 1550 1672 1745 1588 1431 1504 1593 1682 1646 1609 1504 1398 1457 1516 1460 1405 1398 1391 1453 1515 1437 1360
1422 1360 1444 1527 1590 1653 1700 1516 1408 1530 1622 1715 1666 1617 1526 1572 1611 1651 1584 1518 1522 1527 1531 1536 1509 1482 1524 1566 1530 1495 1528 1561 1543 1525 1507 1488 1623
1417 1623 1759 1733 1708 1705 1702 1631 1560 1646 1733 1706 1678 1598 1518 1472 1427 1498 1569 1571 1574 1600 1626 1584 1541 1557 1573 1590 1606 1616 1627 1569 1510 1549 1589 1696 1804
1412 1804 1774 1744 1715 1685 1678 1672 1666 1659 1634 1609 1619 1628 1580 1531 1551 1572 1571 1571 1570 1570 1535 1500 1534 1568 1557 1546 1535 1524 1500 1476 1438 1400 1548 1466 1513 1561 1553 1545 1606
1406 1606 1666 1649 1632 1580 1529 1532 1536 1471 1405 1543 1680 1703 1726 1726 1726 1795 1864 1767 1671 1690 1709 1628 1548 1628 1708 1685 1661 1637 1613 1604 1594 1585 1575 1562 1548 1604
1400 1604 1659 1601 1543 1554 1565 1561 1556 1529 1640 1743 1618 1516 1413 1466 1519 1538 1556 1600 1644 1688 1731 1785 1838 1900 1825 1791 1757 1715 1672 1642 1611 1580 1549
1395 1549 1555 1560 1551 1541 1670 1569 1528 1488 1562 1636 1558 1480 1428 1514 1522 1531 1551 1570 1668 1627 1582 1536 1473 1547 1489 1430 1486 1542 1636 1593 1482 1508 1486 1465 1452
$$ packed form
1433A778n2k7k6l5l5K6K7R4R5m9m9m8m9p9p9Q1Q2L9L8p5p6l9l8n6Q2R5m2o3o2K7J64J29qj4
1427A756j5n8n8q3q4L2L1O4O4m1m2j6J22P3j57j57P3Q9Q9l6l7j05j06N9N9n6n5ppO2O2p8p7
1422A360Q4Q3O3O3M7j84j08J22R2R3m9m9r1M6L9M0o7o6MNMNk7k7M2M2l6l5L3L3j8j8j8j9J35
1417A623J36k6k5llp1p1Q6Q7k7k8q0q0m6m5P1P1KLK6K6m2m3J6J6J7J6J0J1n8n9L9M0J07J08
1412A804l0l0k9l0poopk5k5J0Rm8m9K0K1j%j%l5l5L4L4j1j1j1j1k4k4l8l8J48q2M7M8qqO1
1406A606O0j7j7n2n1LMo5o6J38J37K3K3%%O9O9r7r6J9J9q1q0Q0Q0k3k4k4k4rj0rj0j3j4N6
1400A604N5n8n8J1J1mnk7J11J03j25j02j03N3N3J9J8M4M4M4M3N4N3O2p5l4l4m2m3l0l1l1l1
1395A549ONrj0J29j01m1m0P4P4p8p8n2Q6QRK0J9R8m1m5m6o3P4n8n9N6N6R4m3j11K6k2k1j3
$$ plain form
1390 1452 1439 1520 1601 1568 1535 1523 1511 1568 1625 1637 1649 1593 1537 1632 1728 1709 1690 1761 1832 1789 1745 1738 1730 1723 1715 1695 1674 1585 1496 1481 1466 1452 1437 1548 1659
1385 1659 1701 1743 1699 1655 1525 1533 1687 1704 1600 1497 1511 1524 1470 1415 1449 1482 1516 1550 1580 1610 1639 1669 1633 1597 1561 1525 1509 1494 1624 1617 1599 1582 1533
1379 1533 1621 1734 1618 1493 1506 1516 1527 1546 1565 1612 1660 1631 1738 1820 1902 1818 1596 1539 1482 1531 1580 1589 1599 1485 1371 1394 1280 1404 1528 1578
1375 1578 1629 1565 1501 1576 1651 1611 1572 1580 1588 1596 1605 1602 1599 1595 1592 1614 1635 1587 1540 1545 1551 1625 1699 1692 1685 1440 1333 1370 1407 1453 1499 1558 1616 1683 1612 1606 1600 1585 1571 1572 1573
1369 1573 1574 1575 1513 1451 1389 1327 1366 1405 1444 1483 1486 1490 1493 1496 1501 1505 1493 1618 1738 1721 1630 1539 1623 1708 1724 1739 1676 1613 1550 1487 1572 1657 1582 1506 1472 1438 1473
1363 1473 1508 1597 1687 1616 1546 1607 1668 1660 1652 1559 1467 1549 1769 1768 1767 1700 1496 1458 1557 1594 1493 1338 1414 1635 1719 1719 1719 1633 1684 1703 1721 1826 1793 1779
1358 1779 1764 1741 1718 1630 1542 1454 1366 1434 1503 1537 1572 1574 1576 1647 1718 1640 1563 1555 1546 1584 1621 1624 1627 1612 1597 1548 1499 1530 1560 1591 1622 1560 1497 1435 1372 1408 1445
1352 1445 1481 1517 1617 1718 1658 1598 1556 1515 1588 1661 1697 1733 1654 1575 1608 1640 1673 1706 1670 1634 1597 1561 1565 1569 1573 1577 1613 1650 1686 1723 1720 1717 1680 1642 1616 1589
$$ packed form
1390A452j3Q1Q1l3l3j2j2N7N7J2J2n6n6R5R6j9j9P1P1m3m4pqpqk0k1q9q9j5j5j4j5J11J11
1385A659M2M2m4m4j30QJ54J7j04j03J4J3n4n5L4L3L4L4L0L0K9L0l6l6l6l6j6j5J30pj8j7m9
1379A533Q8J13j16j25J3J0J1J9J9M7M8k9J07Q2Q2q4k22n7n7M9M9RJ0j14j14K3j14J24J24N0
1375A578N1o4o4P5P5m0l9QQQRllmlK2K1m8m7NOP4P4ppk45j07L7L7M6M6N9N8O7p1ooj5j4JJ
1369A573JJo2o2o2o2L9L9L9L9LMLLNMj2J25J20j7r1r1Q4Q5J6J5o3o3o3o3Q5Q5p5p6l4l4L5
1363A473L5Q9R0p1p0O1O1qqr3r2Q2K20jjo7k04l8R9L7j01j55P6K21Q4%%q6N1J9J8J05l3j4
1358A779j5k3k3q8q8q8q8O8O9L4L5KKP1P1p8p7qrL8L7LLj5j5m9m9L1L0L1L1o2o3o2o3L6L7
1352A445L6L6J00J01o0o0m2m1P3P3L6L6p9p9L3L2L3L3l6l6l7l6MMMML6L7L6L7lll7l8k6k7
$$ plain form
1347 1589 1632 1674 1759 1843 1736 1628 1546 1694 1721 1611 1640 1668 1620 1571 1544 1516 1489 1462 1480 1498 1516 1534 1563 1593 1588 1583 1612 1641 1601 1561 1537 1512 1556
1342 1556 1600 1562 1524 1616 1478 1490 1501 1568 1634 1634 1634 1599 1564 1600 1635 1555 1476 1480 1483 1521 1559 1547 1534 1530 1526 1432 1476 1485 1494 1415 1474 1524 1574 1611 1648 1571 1494 1536
1336 1536 1578 1655 1732 1630 1528 1495 1462 1569 1676 1714 1752 1697 1642 1655 1669 1661 1653 1568 1620 1580 1540 1508 1477 1540 1604 1633 1663 1678 1694 1604 1513 1492 1608
1331 1608 1646 1685 1684 1684 1692 1701 1585 1606 1550 1494 1507 1520 1534 1547 1584 1620 1614 1607 1574 1403 1347 1429 1455 1481 1538 1457 1397 1566 1821 1755 1667 1716 1711 1706 1631 1694
1325 1694 1713 1733 1666 1599 1646 1694 1659 1625 1556 1488 1566 1645 1563 1481 1526 1571 1547 1524 1514 1504 1494 1484 1576 1668 1691 1714 1782 1850 1803 1756 1767 1779 1722 1665
1320 1665 1656 1646 1636 1627 1641 1655 1677 1562 1610 1657 1661 1666 1768 1871 1813 1755 1799 1844 1774 1703 1687 1671 1723 1775 1717 1659 1567 1474 1524 1574 1624 1674 1542 1410
1315 1410 1439 1467 1552 1636 1560 1484 1470 1456 1511 1566 1567 1568 1535 1502 1482 1462 1511 1560 1563 1567 1571 1574 1634 1693 1683 1674 1572 1470 1574 1678 1655 1633 1644 1656 1644 1633
1309 1633 1587 1541 1621 1700 1848 1996 2189 2382 2231 2080 1836 1592 1554 1517 1562 1606 1685 1765 1831 1898 1850 1803 1850 1897 1830 1763 1793 1824 1739 1655
$$ packed form
1347A589M3M2Q5Q4j07j08q2J48K7j10K9K8m8m9k7k8k7k7J8J8J8J8K9L0nnK9K9m0m0k4k5M4
1342A556M4l8l8R2j38J2J1O7O6%%l5l5L6L5q0p9MLL8L8j2j3mmr4M4RRp9N9N0N0L7L7p7p7M2
1336A536M2P7P7j02j02l3l3J07J07L8L8n5n5J3J4qqq5N2m0m0l2l1O3O4K9L0J5J6r0r1k1J16
1331A608L8L9j%QRj16K1n6n6J3J3J4J3L7L6opl3j71n6Q2K6K6N7q1o0J69K55o6q8M9nnp5O3
1325A694J9K0o7o7M7M8l5l4o9o8P8P9q2q2M5M5k4k3j0j0j0j0R2R2K3K3O8O8m7m7J1J2n7n7
1320A665rj0j0rJ4J4K2j15M8M7MNJ02J03n8n8M4M5p0p1j6j6N2N2n8n8r2r3N0N0N0N0j32j32
1315A410K9K8Q5Q4p6p6j4j4N5N5JJl3l3k0k0M9M9LMMLO0N9j0rj02j02J04J04k3k2J1J2j2j1
1309A633m6m6Q0P9J48J48J93J93j51j51k44k44l8l7M5M4P9Q0O6O7m8m7M7M7o7o7L0L1q5q4
$$ plain form
1305 1655 1595 1535 1475 1415 1463 1511 1490 1469 1440 1410 1496 1581 1596 1611 1626 1641 1663 1685 1708 1730 1711 1692 1672 1653 1627 1601 1574 1548 1618 1689 1644 1600 1633 1666
1300 1666 1585 1503 1551 1599 1646 1694 1709 1725 1792 1721 1608 1633 1641 1649 1629 1609 1589 1569 1522 1476 1507 1538 1517 1634 1638 1643 1568 1494 1496 1499 1500 1638 1699 1760 1644 1527
1294 1527 1526 1524 1564 1605 1646 1686 1718 1750 1748 1745 1738 1730 1654 1578 1595 1612 1629 1646 1633 1620 1676 1732 1713 1693 1605 1517 1512 1506 1501 1496 1523 1551 1569 1588 1697 1668 1602 1536 1538
1288 1538 1540 1550 1560 1538 1653 1653 1516 1558 1600 1565 1530 1525 1520 1446 1372 1432 1492 1543 1594 1644 1556 1545 1535 1550 1564 1579 1594 1634 1674 1646 1618 1594 1570 1614 1659
1283 1659 1724 1789 1785 1781 1680 1579 1593 1607 1604 1601 1597 1594 1599 1605 1687 1633 1615 1597 1571 1545 1535 1525 1514 1504 1568 1633 1628 1624 1645 1666 1619 1572 1587 1603 1618 1634 1666 1698
1277 1698 1731 1763 1698 1632 1636 1640 1668 1697 1611 1525 1532 1539 1546 1554 1520 1487 1568 1649 1658 1666 1605 1545 1543 1541 1607 1674 1633 1593 1552 1511 1603 1695 1581 1466 1498 1529 1492 1455
1271 1455 1517 1579 1641 1703 1630 1557 1645 1733 1691 1649 1607 1565 1584 1604 1623 1643 1597 1552 1506 1460 1448 1435 1422 1410 1412 1414 1485 1557 1671 1785 1784 1784 1768 1751 1735
1266 1735 1719 1747 1775 1735 1694 1753 1811 1801 1790 1737 1684 1562 1440 1511 1582 1539 1496 1560 1624 1574 1524 1572 1620 1668 1716 1701 1686 1671 1656 1706 1755 1736 1717
$$ packed form
1305A655o0o0o0o0M8M8k1k1k9l0Q6Q5J5J5J5J5K2K2K3K2j9j9k0j9k6k6k7k6P0P1m5m4L3L3
1300A666q1q2M8M8M7M8J5J6O7p1j13K5QQk0k0k0k0m7m6L1L1k1J17MNp5p4KLJJ38O1O1j16j17
1294A527jkM0M1M1M0L2L2klpqp6p6J7J7J7J7j3j3N6N6j9k0q8q8nonnK7K8J8J9J09k9o6o6K
1288A538KJ0J0k2J15%j37M2M2l5l5nnp4p4O0O0N1N1N0q8j1j0J5J4J5J5M0M0k8k8k4k4M4M5
1283A659O5O5mmj01j01J4J4llmlNOQ2n4j8j8k6k6j0j0j1j0O4O5nmK1K1m7m7J5J6J5J6L2L2
1277A698L3L2o5o6MMK8K9q6q6PPPQl4l3Q1Q1RQo1o0kkO6O7m1m0m1m1R2R2j14j15L2L1l7l7
1271A455O2O2O2O2p3p3Q8Q8m2m2m2m2J9K0J9K0m6m5m6m6j2j3j3j2KKP1P2J14J14j%j6j7j6
1266A735j6K8K8m0m1N9N8j0j1n3n3j22j22P1P1m3m3O4O4n0n0M8M8M8M8j5j5j5j5N0M9j9j9
$$ plain form
1261 1717 1616 1515 1414 1313 1368 1422 1468 1515 1710 1767 1696 1625 1667 1710 1683 1657 1601 1544 1566 1587 1527 1605 1605 1606 1579 1552 1525 1498 1550 1601 1652 1704 1692
1256 1692 1680 1669 1657 1582 1507 1432 1357 1414 1471 1528 1585 1559 1533 1507 1481 1560 1638 1708 1778 1840 1764 1697 1630 1576 1522 1583 1644 1632 1620 1548 1476 1470 1602 1587
1251 1587 1572 1563 1554 1659 1765 1741 1718 1580 1442 1410 1378 1375 1510 1667 1687 1546 1543 1637 1594 1576 1558 1480 1540 1591 1642 1556 1470 1498 1526 1601 1675 1681 1686 1657
1246 1657 1629 1577 1663 1745 1597 1510 1560 1593 1626 1677 1590 1619 1648 1668 1688 1641 1595 1625 1518 1528 1539 1541 1542 1606 1670 1657 1781 1796 1812 1722 1632 1578 1524 1582
1240 1582 1502 1510 1517 1707 1760 1735 1710 1676 1642 1684 1725 1784 1705 1639 1711 1663 1614 1611 1607 1604 1601 1554 1507 1528 1550 1558 1566 1609 1651 1720 1789 1743 1697 1612 1527 1525 1523 1380
1235 1380 1466 1615 1627 1544 1461 1398 1473 1648 1686 1695 1705 1648 1591 1603 1616 1658 1700 1682 1664 1575 1622 1670 1581 1559 1538 1517 1495 1459 1561 1586 1610 1595 1579
1229 1579 1563 1548 1587 1627 1632 1637 1634 1631 1568 1505 1456 1546 1558 1570 1525 1479 1494 1509 1590 1534 1521 1508 1559 1610 1661 1712 1721 1730 1669 1609 1598 1587 1691 1794 1702 1609
1224 1609 1622 1635 1700 1627 1554 1618 1713 1807 1713 1618 1453 1426 1559 1555 1536 1518 1559 1601 1478 1354 1360 1503 1583 1663 1787 1910 1842 1774 1741 1708 1670 1633
$$ packed form
1261A717j01j01j01j01N5N4M6M7J95N7p1p1M2M3k7k6n6n7K2K1o0P8%Jk7k7k7k7N2N1N1N2j2
1256A692j2j1j2p5p5p5p5N7N7N7N7k6k6k6k6P9P8P0P0O2p6o7o7n4n4O1O1j2j2p2p2oJ32j5
1251A587j5rrJ05J06k4k3j38j38l2l2lJ35J57K0j41lR4m3j8j8p8O0N1N1q6q6K8K8P5P4ONk9
1246A657k8n2Q6Q2j48q7N0L3L3N1q7K9K9K0K0m7m6L0j07J0J1KJO4O4j3J24J5J6r0r0n4n4N8
1240A582q0QPJ90N3k5k5l4l4M2M1N9p9o6P2m8m9lmllm7m7K1K2QQM3M2O9O9m6m6q5q5kkj43
1235A380Q6J49J2q3q3o3P5J75L8RJ0n7n7J2J3M2M2j8j8q9M7M8q9k2k1k1k2l6J02K5K4j5j6
1229A579j6j5L9M0NNllo3o3m9R0J2J2m5m6J5J5Q1n6j3j3N1N1N1N1RRo1o0j1j1J04J03r2r3
1224A609J3J3O5p3p3O4R5R4r4r5j65k7J33mj9j8M1M2j23j24OJ43Q0Q0J24J23o8o8l3l3l8l7
$$ plain form
1219 1633 1604 1575 1501 1564 1618 1673 1657 1642 1626 1610 1585 1559 1525 1491 1637 1645 1624 1604 1551 1636 1609 1582 1638 1693 1714 1736 1714 1692 1704 1717 1656 1596 1604 1612 1538
1214 1538 1464 1382 1437 1447 1458 1477 1496 1471 1446 1489 1533 1550 1567 1515 1463 1457 1451 1480 1508 1563 1618 1639 1659 1632 1605 1690 1637 1601 1566 1590 1615 1593 1571 1550 1528
1208 1528 1463 1398 1493 1588 1600 1611 1666 1720 1632 1681 1653 1625 1574 1522 1586 1649 1645 1642 1638 1635 1698 1761 1781 1801 1820 1702 1601 1500 1398 1434 1507 1580 1638 1696
1203 1696 1685 1675 1686 1698 1819 1710 1502 1524 1609 1693 1637 1581 1560 1538 1591 1644 1628 1612 1578 1544 1544 1545 1561 1578 1595 1612 1583 1555 1526 1498 1517 1536 1555 1574
1198 1574 1600 1627 1585 1543 1576 1610 1609 1607 1591 1574 1557 1540 1478 1416 1515 1613 1646 1678 1642 1605 1534 1463 1553 1642 1556 1469 1497 1525 1611 1696 1621 1546 1507 1468 1498
1193 1498 1527 1557 1586 1580 1575 1583 1591 1599 1607 1591 1576 1560 1544 1537 1530 1638 1745 1722 1700 1608 1516 1498 1479 1530 1580 1494 1408 1437 1466 1489 1512 1534 1557 1541 1525 1578 1631
1187 1631 1690 1750 1695 1640 1586 1532 1478 1425 1475 1526 1508 1491 1473 1455 1506 1556 1607 1658 1709 1760 1731 1703 1674 1645 1639 1632 1660 1688 1717 1746 1706 1665 1557 1449
1182 1449 1579 1571 1521 1470 1393 1454 1500 1407 1484 1561 1457 1583 1657 1593 1647 1700 1659 1755 1884 1874 1836 1798 1732 1666 1637 1747 1689 1632 1661 1690 1578 1604
$$ packed form
1219A633k9k9p4O3N4N5j6j5j6j6k5k6l4l4J46Qk1k0n3Q5k7k7N6N5K1K2k2k2J2J3o1o0QQp4
1214A538p4q2N5J0J1J9J9k5k5M3M4J7J7n2n2ooK9K8N5N5K1K0k7k7Q5n3l6l5K4K5k2k2k1k2
1208A528o5o5R5R5J2J1N5N4q8M9k8k8n1n2O4O3mlmlO3O3K0K0J9j18j01j01j02L6P3P3N8N8
1203A696j1j0J1J2J21j09k08K2Q5Q4n6n6k1k2N3N3j6j6l4l4%JJ6J7J7J7k9k8k9k8J9J9J9J9
1198A574K6K7m2m2L3L4jkj6j7j7j7o2o2R9R8L3L2l6l7p1p1R0Q9q6q7K8K8Q6Q5p5p5l9l9L0
1193A498K9L0K9onQQQQj6j5j6j6ppJ08J07k3k2r2r2j8j9N1N0q6q6K9K9K3K3K2K3j6j6N3N3
1187A631N9O0n5n5n4n4n4n3N0N1j8j7j8j8N1N0N1N1N1N1k9k8k9k9opK8K8K9K9m0m1j08j08
1182A449J30qn0n1p7O1M6r3P7P7j04J26P4o4N4N3m1R6J29j0l8l8o6o6k9J10n8n7K9K9j12K6
$$ plain form
1177 1604 1621 1639 1579 1519 1459 1398 1444 1489 1534 1580 1592 1604 1510 1417 1370 1460 1482 1503 1478 1590 1624 1659 1633 1607 1589 1572 1436 1438 1431 1425 1497 1569 1606 1644 1556
1172 1556 1467 1448 1428 1433 1438 1409 1379 1387 1395 1437 1480 1589 1698 1692 1686 1621 1556 1651 1747 1776 1806 1729 1652 1556 1596 1637 1541 1559 1577 1586 1595 1586 1577 1567 1558 1665 1771 1718
1166 1718 1664 1603 1542 1481 1420 1442 1464 1563 1525 1511 1497 1397 1435 1565 1696 1761 1688 1639 1726 1728 1730 1711 1692 1605 1517 1519 1520 1444 1506 1574 1642 1688 1504 1543
1161 1543 1583 1609 1634 1559 1484 1555 1489 1459 1429 1434 1438 1453 1606 1681 1756 1710 1664 1618 1572 1616 1660 1704 1747 1657 1566 1397 1367 1470 1573 1762 1814 1731 1648
1156 1648 1556 1465 1495 1525 1563 1602 1534 1604 1597 1590 1572 1554 1536 1518 1574 1631 1618 1606 1590 1574 1490 1405 1423 1441 1519 1597 1666 1598 1581 1564 1474 1521 1569 1479 1549
1150 1549 1619 1646 1672 1630 1587 1536 1622 1573 1524 1553 1581 1549 1516 1598 1680 1681 1682 1649 1615 1619 1623 1601 1579 1504 1566 1543 1519 1640 1623 1537 1589 1539 1489 1516 1544 1477
1145 1477 1409 1411 1413 1432 1451 1539 1627 1620 1613 1675 1737 1605 1474 1457 1440 1491 1542 1558 1575 1608 1641 1675 1708 1678 1648 1652 1657 1526 1396 1426 1455 1480 1504 1562 1621
1139 1621 1573 1526 1547 1569 1717 1865 1807 1748 1663 1577 1606 1635 1637 1638 1640 1642 1544 1446 1508 1571 1578 1584 1522 1460 1351 1241 1338 1435 1452 1468 1485 1502 1522 1542 1562
$$ packed form
1177A604J7J8o0o0o0o1M6M5M5M6J2J2r4r3m7R0K2K1k5J12L4L5k6k6j8j7j36KpoP2P2L7L8q8
1172A556q9j9k0NNk9l0QQM2M3J09J09ooo5o5R5R6K9L0p7p7r6M0M1r6J8J8RRrrj0rJ07J06n3
1166A718n4o1o1o1o1K2K2R9l8j4j4j00L8J30J31O5p3m9Q7KKj9j9q7q8KJp6O2O8O8M6j84L9
1161A543M0K6K5p5p5P1o6l0l0NMJ5J53P5P5m6m6m6m6M4M4M4M3r0r1j69l0J03J03J89N2q3q3
1156A648r2r1L0L0L8L9o8P0ppj8j8j8j8N6N7j3j2j6j6q4q5J8J8P8P8O9o8j7j7r0M7M8r0P0
1150A549P0K7K6m2m3n1Q6m9m9K9K8l2l3Q2Q2JJl3l4MMk2k2p5O2k3k4J21j7q6N2n0n0K7K8o7
1145A477o8KKJ9J9Q8Q8ppO2O2j32j31j7j7N1N1J6J7L3L3L4L3l0l0MNj31j30L0K9K5K4N8N9
1139A621m8m7K1K2J48J48n8n9q5q6K9K9KJKKr8r8O2O3POo2o2j09j10R7R7J7J6J7J7K0K0K0
$$ plain form
1134 1562 1581 1604 1627 1581 1535 1511 1486 1545 1604 1486 1598 1667 1598 1496 1531 1549 1567 1671 1775 1672 1570 1532 1495 1457 1419 1466 1513 1491 1469 1484 1499
1129 1499 1445 1391 1488 1585 1567 1549 1568 1588 1607 1627 1726 1826 1719 1613 1634 1655 1676 1697 1757 1817 1717 1617 1553 1488 1458 1428 1527 1625 1563 1501 1451 1401
1125 1401 1420 1438 1499 1560 1647 1734 1833 1794 1672 1550 1517 1485 1521 1557 1609 1661 1685 1570 1531 1629 1709 1790 1682 1573 1542 1511 1470 1566 1585 1604 1666 1727
1120 1727 1674 1621 1621 1621 1579 1674 1641 1608 1506 1542 1623 1704 1587 1470 1450 1429 1400 1508 1562 1617 1645 1674 1598 1522 1506 1490 1588 1548 1431 1452 1613 1636
1115 1636 1585 1534 1541 1548 1575 1602 1711 1591 1608 1625 1584 1681 1631 1582 1643 1705 1738 1633 1587 1678 1648 1619 1579 1539 1613 1688 1670 1651 1633 1614 1568 1521 1509 1497
1110 1497 1490 1483 1536 1589 1674 1620 1567 1651 1636 1621 1546 1471 1508 1545 1513 1481 1435 1390 1378 1367 1461 1555 1640 1725 1742 1622 1435 1478 1621 1534 1399 1401 1444 1488
1104 1488 1569 1787 1856 1787 1689 1591 1556 1522 1521 1521 1522 1524 1637 1613 1561 1508 1608 1708 1723 1739 1780 1821 1830 1701 1765 1828 1755 1681 1676 1671 1594 1516 1476 1574 1558
1099 1558 1543 1510 1478 1411 1483 1669 1717 1672 1627 1643 1658 1654 1649 1782 1777 1708 1501 1409 1454 1458 1599 1672 1744 1694 1644 1654 1665 1645 1487 1522 1556 1599 1641 1615
$$ packed form
1134A562J9K3K3m6m6k4k5N9N9j18J12O9o9j02L5J8J8J04J04j03j02l8l7l8l8M7M7k2k2J5J5
1129A499n4n4R7R7j8j8J9K0J9K0R9J00j07j06K1K1K1K1O0O0j00j00o4o5l0l0R9R8o2o2n0n0
1125A401J9J8O1O1Q7Q7R9l9j22j22l3l2L6L6N2N2K4j15l9R8Q0Q1j08j09l1l1m1R6J9J9O2O1
1120A727n3n3%%m2R5l3l3j02L6Q1Q1j17j17k0k1k9J08N4N5K8K9p6p6j6j6R8m0j17K1J61K3
1115A636n1n1PPK7K7J09j20J7J7m1R7n0m9O1O2L3j05m6R1l0k9m0m0P4P5j8j9j8j9m6m7j2j2
1110A497ppN3N3Q5n4n3Q4j5j5p5p5L7L7l2l2m6m5j2j1R4R4Q5Q5J7j20j87M3J43q7j35KM3M4
1104A488Q1K18O9o9r8r8l5l4j%JKJ13k4n2n3J00J00J5J6M1M1Rj29O4O3p3p4nnp7p8m0R8j6
1099A558j5l3l2o7P2J86M8m5m5J6J5mnJ33no9k07r2M5MJ41P3P2n0n0J0J1k0j58L5L4M3M2k6
$$ plain form
1094 1615 1588 1576 1564 1621 1678 1670 1662 1683 1841 1857 1735 1665 1595 1706 1818 1860 1903 1836 1769 1633 1497 1623 1750 1761 1773 1812 1851 1890 1929 1901 1873
1089 1873 1862 1713 1659 1743 1741 1738 1745 1752 1751 1887 2113 2339 2488 3050 4005 5465 6306 6367 5517 3979 3181 2703 2398 2230 2166 2101 1969 1837
1085 1837 1774 1711 1677 1643 1609 1575 1544 1512 1471 1431 1506 1444 1425 1406 1515 1625 1629 1632 1599 1702 1841 1841 1785 1729 1665 1600 1572 1543 1661 1641 1702 1762 1608
1080 1608 1453 1493 1532 1571 1610 1572 1534 1611 1687 1691 1694 1698 1701 1640 1579 1587 1594 1642 1689 1668 1647 1723 1799 1761 1722 1799 1876 1870 1726 1648 1570 1644 1718 1642 1566 1611 1792
1074 1792 1834 1738 1796 1855 1783 1711 1707 1704 1693 1681 1670 1659 1661 1664 1718 1635 1473 1449 1454 1459 1561 1663 1696 1730 1716 1703 1647 1728 1780 1832 1786 1740 1677 1751 1791 1694
1069 1694 1679 1665 1642 1619 1525 1431 1452 1473 1502 1532 1493 1455 1539 1623 1547 1471 1600 1728 1651 1573 1594 1614 1523 1569 1639 1708 1748 1651 1635 1619 1594 1570 1497
1064 1497 1424 1498 1434 1487 1541 1517 1493 1527 1560 1586 1611 1635 1521 1485 1449 1446 1443 1448 1454 1427 1538 1640 1743 1753 1762 1660 1696 1751 1806 1677 1686 1691 1696 1710 1724
1058 1724 1667 1611 1623 1635 1640 1644 1718 1791 1817 1843 1869 1895 1904 1912 2120 2467 3110 4166 5187 5429 5120 4123 3034 2358 2083 1946 1826 1707
$$ packed form
1094A615k7j2j2N7N7qqK1J58J6j22p0p0J11J12M2M3o7o7j36j36J26J27J1J2L9L9L9L9k8k8
1089A873j1j49n4Q4klPPjJ36K26K26J49N62R55J460Q41O1q50j538p98m78l05j68o4o5j32j32
1085A837o3o3l4l4l4l4l1l2m1m0P5o2j9j9J09J10MLl3J03J39%n6n6o4o5k8k9J18k0O1O0j54
1080A608j55M0L9L9L9l8l8P7P6MLMLo1o1QPM8M7k1k1P6P6l8l9P7P7oj44p8p8P4P4p6p6M5J81
1074A792M2r6N8N9p2p2mlj1j2j1j1KLN4q3j62k4NNJ02J02L3L4j4j3n6Q1N2N2m6m6o3P4M0r7
1069A694j5j4k3k3r4r4K1K1K9L0l9l8Q4Q4p6p6J29J28p7p8K1K0r1M6P0O9M0r7j6j6k5k4p3
1064A497p3P4o4N3N4k4k4L4L3K6K5K4j14l6l6llNOk7J11J02J03J0Rj02L6N5N5j29RNNJ4J4
1058A724n7n6J2J2NMP4P3K6K6K6K6RQK08L47O43J056J021K42l09r97j089o76k75j37j20j19
$$ plain form
1054 1707 1659 1612 1679 1746 1710 1674 1666 1797 1845 1755 1683 1611 1622 1634 1568 1640 1666 1692 1692 1692 1737 1783 1699 1478 1477 1477 1615 1615 1570 1525 1472 1419 1401 1383 1347 1450
1049 1450 1511 1435 1479 1524 1581 1639 1620 1738 1761 1784 1755 1726 1656 1723 1772 1822 1913 1867 1706 1683 1676 1669 1671 1673 1692 1710 1694 1678 1654 1630 1666 1702 1731 1622 1625
1043 1625 1628 1600 1572 1604 1637 1734 1694 1631 1568 1496 1654 1683 1711 1711 1711 1651 1591 1524 1594 1587 1580 1605 1631 1657 1683 1680 1677 1752 1689 1637 1584 1480 1514 1630 1745 1878
1038 1878 1873 1893 1913 1925 1937 1846 1756 1735 1714 1748 1783 1757 1731 1546 1499 1549 1737 1776 1814 1701 1588 1579 1570 1538 1644 1762 1652 1487 1459 1468 1477 1494 1512
1033 1512 1522 1532 1543 1553 1550 1548 1546 1543 1547 1551 1555 1559 1607 1654 1667 1680 1687 1695 1634 1573 1549 1525 1509 1494 1501 1646 1730 1678 1617 1693 1684 1674 1723 1773 1662 1550 1528 1506 1552
1027 1552 1599 1606 1613 1645 1678 1639 1462 1285 1245 1380 1515 1498 1481 1622 1764 1746 1727 1708 1688 1703 1718 1810 1901 1832 1763 1654 1546 1552 1558 1539 1520 1530
1022 1530 1678 1748 1681 1649 1754 1746 1600 1462 1462 1543 1624 1691 1620 1521 1652 1645 1638 1630 1621 1690 1622 1647 1673 1690 1706 1706 1706 1637 1568 1624 1681 1677 1674 1568 1599 1588
1016 1588 1577 1613 1649 1607 1704 1751 1797 1784 1771 1729 1687 1636 1723 1772 1821 1913 2005 2114 2223 2456 2918 3351 3785 4090 4165 4202 3918 3327 2736
$$ packed form
1054A707m8m7O7O7l6l6qJ31M8r0p2p2J1J2o6P2K6K6%%M5M6q4k21j%J38%m5m5n3n3j8j8l6J03
1049A450O1p6M4M5N7N8j9J18K3K3k9k9p0O7M9N0R1m6j61k3ppKKJ9J8j6j6k4k4L6L6K9j09L
1043A625Lk8k8L2L3R7m0o3o3p2J58K9K8%%o0o0o7P0ppK5K6K6K6llP5o3n2n3j04L4J16J15J33
1038A878nK0K0J2J2r1r0k1k1L4L5k6k6j85m7N0J88L9L8j13j13rrl2J06J18j10j65k8RRJ7J8
1033A512J0J0J1J0lkklMMMMM8M7J3J3PQo1o1k4k4j6j5PJ45Q4n2o1P6rj0M9N0j11j12k2k2M6
1027A552M7PPL2L3l9j77j77m0J35J35j7j7J41J42j8j9j9k0J5J5R2R1o9o9j09j08OOj9j9J0
1022A530J48P0o7l2J05qj46j38%Q1Q1O7p1r9J31ppqrO9o8K5K6J7J6%%o9o9N6N7mlj06L1j1
1016A588j1L6L6m2R7M7M6j3j3m2m2n1Q7M9M9R2R2J09J09K33M62M33M34L05P5L7k84n91n91
$$ plain form
1012 2736 2205 1811 1685 1787 1883 1840 1775 1710 1737 1765 1757 1750 1750 1749 1680 1611 1630 1648 1667 1686 1686 1687 1764 1704 1679 1655 1587 1519 1636 1753 1787 1683 1670 1656
1007 1656 1669 1681 1630 1578 1564 1688 1664 1641 1591 1542 1563 1584 1649 1713 1628 1682 1735 1789 1695 1739 1671 1604 1555 1507 1573 1640 1602 1565 1605 1508 1497 1486 1424 1499
1002 1499 1511 1522 1603 1683 1792 1762 1742 1721 1702 1682 1662 1642 1608 1574 1609 1644 1633 1622 1611 1599 1532 1465 1467 1469 1566 1663 1692 1720 1726 1732 1632 1532 1432 1470
996 1470 1464 1459 1444 1429 1492 1417 1427 1438 1440 1441 1507 1572 1603 1635 1690 1746 1686 1627 1572 1517 1523 1528 1657 1649 1555 1690 1700 1711 1701 1691 1544 1397 1410 1424 1458 1492
991 1492 1526 1560 1515 1471 1417 1502 1499 1497 1469 1440 1526 1613 1661 1573 1483 1394 1416 1576 1686 1658 1647 1636 1608 1579 1662 1608 1674 1740 1729 1718 1630 1542 1523 1504 1449
986 1449 1395 1455 1515 1521 1528 1570 1611 1610 1609 1574 1538 1533 1528 1522 1517 1536 1554 1573 1591 1608 1624 1640 1657 1627 1597 1671 1515 1436 1494 1576 1657 1740 1822 1836 1849 1796 1743 1656
980 1656 1569 1580 1591 1602 1613 1543 1473 1471 1470 1506 1542 1578 1614 1669 1724 1710 1695 1600 1504 1477 1450 1470 1490 1511 1531 1520 1509 1567 1624 1558 1492 1632 1772 1721 1670
974 1670 1653 1636 1602 1568 1568 1568 1550 1532 1514 1496 1549 1602 1541 1479 1562 1645 1659 1673 1631 1590 1548 1506 1591 1676 1555 1434 1469 1504 1539 1574 1593 1612 1760 1679
$$ packed form
1012B736n31l94j26J02R6m3o5o5K7K8qp%jo9o9J9J8J9J9%JP7o0k5k4o8o8J17J17L4j04j3j4
1007A656J3J2n1n2j4J24k4k3n0m9K1K1O5O4q5N4N3N4r4M4o8o7m9m8O6O7l8l7M0r7j1j1o2P5
1002A499J2J1Q1Q0J09l0k0k1j9k0k0k0l4l4L5L5j1j1j1j2o7o7KKR7R7K9K8OOj00j00j00L8
996A470onj5j5O3p5J0J1KJO6O5L1L2N5N6o0n9n5n5ONJ29qr4J35J0J1j0j0j47j47J3J4L4L4
991A492L4L4m5m4n4Q5lkk8k9Q6Q7M8q8r0q9K2J60J10k8j1j1k8k9Q3n4O6O6j1j1q8q8j9j9n5
986A449n4O0O0OPM2M1jjl5l6nnonJ9J8J9J8J7J6J6J7l0l0P4j56p9N8Q2Q1Q3Q2J4J3n3n3q7
980A656q7J1J1J1J1p0p0kjL6L6L6L6N5N5j4j5r5r6k7k7K0K0K1K0j1j1N8N7o6o6J40J40n1n1
974A670j7j7l4l4%%j8j8j8j8N3N3o1o2Q3Q3J4J4m2m1m2m2Q5Q5j21j21L5L5L5L5J9J9J48q1
$$ plain form
969 1679 1652 1626 1584 1543 1555 1567 1578 1590 1626 1662 1707 1751 1559 1504 1701 1760 1644 1527 1425 1552 1683 1676 1693 1709 1746 1782 1698 1477 1413 1486 1542
964 1542 1599 1569 1539 1578 1617 1639 1661 1622 1584 1623 1799 1770 1602 1588 1574 1612 1650 1778 1769 1594 1419 1462 1642 1780 1780 1810 1703 1647 1728 1773 1680 1707
960 1707 1734 1663 1592 1590 1588 1594 1599 1482 1364 1517 1532 1590 1648 1623 1597 1503 1409 1456 1503 1550 1597 1617 1638 1590 1542 1488 1433 1617 1663 1625 1587 1574 1562 1489 1416
954 1416 1403 1390 1599 1670 1604 1538 1644 1612 1542 1473 1450 1426 1471 1516 1571 1625 1645 1665 1574 1482 1505 1529 1564 1600 1635 1670 1602 1533 1533 1533 1538 1542 1492 1442 1297
949 1297 1382 1543 1476 1357 1376 1519 1661 1584 1645 1741 1698 1572 1446 1564 1681 1702 1723 1667 1611 1613 1478 1458 1575 1583 1590 1607 1623 1647 1670 1694 1717
944 1717 1658 1600 1464 1465 1484 1503 1462 1420 1535 1650 1641 1633 1619 1468 1351 1372 1412 1452 1500 1549 1666 1783 1786 1789 1745 1702 1607 1649 1690 1592 1573 1553 1687
939 1687 1683 1688 1693 1672 1651 1691 1730 1786 1705 1700 1696 1712 1728 1744 1760 1777 1794 1742 1690 1670 1651 1526 1401 1353 1442 1600 1620 1665 1709 1710 1711 1665 1619 1633 1647 1716 1647
933 1647 1579 1648 1694 1740 1688 1636 1526 1554 1619 1684 1666 1648 1656 1663 1796 1790 1702 1614 1594 1575 1521 1467 1492 1517 1662 1670 1662 1793 1837 1881 1749 1617 1600 1582
$$ packed form
969A679k7k6m2m1J2J2J1J2L6L6M5M4j92n5J97N9j16j17j02J27J31pJ7J6L7L6q4k21o4P3N6
964A542N7l0l0L9L9K2K2l9l8L9J76k9j68j4j4L8L8J28rj75j75M3J80J38%L0j07n6Q1M5r3K7
960A707K7p1p1kkONj17j18J53J5N8N8k5k6r4r4M7M7M7M7K0K1m8m8n4n5J84M6l8l8j3j2p3p3
954A416j3j3K09P1o6o6J06l2p0o9k3k4M5M5N5N4K0K0r1r2K3K4L5L6L5L5o8o9%%NMn0n0j45
949A297Q5J61o7j19J9J43J42p7O1R6m3j26j26J18J17K1K1n6n6Kj35k0J17QPJ7J6K4K3K4K3
944A717n9n8j36JJ9J9m1m2J15J15rqj4j51j17K1M0M0M8M9J17J17LLm4m3r5M2M1r8j9k0J34
939A687mNNk1k1M0L9N6q1nmJ6J6J6J6J7J7n2n2k0j9j25j25m8Q9J58K0M5M4JJm6m6J4J4O9o9
933A647o8O9M6M6n2n2j10K8O5O5j8j8QPJ33oq8q8k0j9n4n4K5K5J45QqJ31M4M4j32j32j7j8
$$ plain form
928 1582 1626 1670 1680 1690 1762 1834 1791 1748 1721 1693 1666 1638 1608 1579 1583 1588 1546 1504 1577 1650 1675 1700 1692 1683 1597 1511 1540 1707 1821 1706 1660 1614 1653 1691 1615
923 1615 1540 1534 1528 1523 1517 1627 1738 1734 1730 1747 1764 1713 1661 1618 1574 1599 1625 1658 1692 1657 1622 1663 1704 1677 1649 1653 1658 1490 1552 1694 1698 1602 1643 1545 1448 1427 1407
917 1407 1477 1547 1583 1618 1692 1765 1724 1683 1543 1402 1468 1534 1603 1671 1624 1578 1596 1614 1598 1582 1574 1566 1557 1549 1614 1678 1673 1669 1607 1545 1483 1421 1505 1589 1512 1435 1515
912 1515 1595 1560 1526 1521 1517 1546 1576 1579 1582 1653 1724 1693 1662 1596 1530 1540 1549 1558 1568 1586 1604 1613 1622 1684 1609 1543 1476 1508 1541 1574 1606 1647 1687 1659 1630 1611 1592 1607 1623
906 1623 1595 1567 1574 1580 1647 1713 1771 1829 1823 1680 1623 1565 1527 1627 1649 1671 1673 1675 1669 1662 1741 1682 1615 1685 1729 1636 1637 1639 1571 1640 1632 1624 1619 1614 1709 1804 1893 1753 1673 1593
900 1593 1521 1450 1539 1628 1598 1567 1528 1627 1585 1543 1579 1615 1626 1638 1709 1781 1817 1715 1588 1598 1590 1720 1807 1894 1943 1855 1844 1834 1784 1735 1723 1848 1743
895 1743 1638 1665 1691 1588 1622 1724 1690 1642 1594 1538 1482 1579 1677 1697 1718 1800 1744 1706 1668 1668 1806 1829 1715 1672 1629 1647 1664 1613 1561 1664 1630 1532
890 1532 1572 1641 1710 1642 1574 1612 1650 1772 1757 1705 1652 1631 1609 1588 1566 1647 1727 1807 1888 1820 1753 1685 1618 1554 1491 1478 1329 1399 1607 1615 1622 1639 1655 1636
$$ packed form
928A582M4M4J0J0P2P2m3m3k7k8k7k8l0k9MNm2m2P3P3K5K5qrq6q6K9J67J14j15m6m6L9L8p6
923A615p5oonoJ10J11mmJ7J7n1n2m3m4K5K6L3L4l5l5M1M1k7k8MNj68O2J42Mr6M1r8r7k1k0
917A407P0P0L6L5P4P3m1m1j40j41O6O6O9O8m7m6J8J8j6j6qqrqO5O4nmo2o2o2o2Q4Q4p7p7Q0
912A515Q0l5l4nmK9L0LLP1P1l1l1o6o6J0RRJ0J8J8RRO2p5o6o7L2L3L3L2M1M0k8k9j9j9J5J6
906A623k8k8POO7O6N8N8oj43n7n8l8J00K2K2KKopP9n9o7P0M4r3JKo8O9qqnnR5R5Q9j40q0q0
900A593p2p1Q9Q9l0l1l9R9m2m2L6L6J1J2P1P2L6j02j27J0qJ30Q7Q7M9q8j1j0n0m9j2J25j05
895A743j05K7K6j03L4J02l4m8m8n6n6R7R8K0K1Q2n6l8l8%J38K3j14m3m3J8J7n1n2J03l4r8
890A532M0O9O9o8o8L8L8J22j5n2n3k1k2k1k2Q1Q0Q0Q1o8o7o8o7o4o3j3j49P0K08QPJ7J6j9
$$ plain form
884 1636 1618 1574 1529 1554 1578 1607 1636 1559 1481 1451 1559 1735 1590 1583 1576 1701 1826 1866 1768 1713 1658 1629 1601 1641 1682 1698 1714 1721 1866 1934 2002 2015 1799
879 1799 1609 1649 1660 1671 1719 1767 1787 1669 1595 1659 1706 1753 1768 1784 1684 1585 1667 1750 1717 1685 1704 1722 1775 1828 1818 1808 1815 1684 1608 1668 1712 1756 1752 1748
874 1748 1736 1724 1819 1777 1735 1830 1829 1827 1757 1824 1790 1756 1730 1704 1703 1701 1846 1853 1870 1888 1896 1905 1851 1797 1820 1706 1713 1721 1719 1718 1677 1635 1663 1690 1672 1653 1634 1616 1680
868 1680 1744 1693 1642 1664 1687 1623 1697 1773 1712 1737 1762 1775 1788 1696 1603 1557 1649 1769 1889 1915 1803 1777 1751 1705 1796 1887 1841 1760 1679 1710 1879 1937 1857
863 1857 1803 1748 1740 1868 2014 1931 1879 1827 1769 1712 1661 1747 1757 1766 1811 1856 1901 1946 1955 1964 1973 1982 1942 1902 1931 1959 1940 1920 1936 1951 2022 2092 2126 2022 1991 1961
858 1961 1887 1813 1786 1760 1848 1936 2006 2077 2033 1989 1957 1924 1849 1911 1964 2017 2009 2002 1973 1944 1984 2023 1940 1856 1810 1901 1980 2059 2024 1988 2062 1997 1896 1794 1795
852 1795 1796 1788 1917 1984 2050 2042 2034 2112 1961 1930 2037 2084 2131 2153 2174 2126 2078 2098 2119 2110 2102 2127 2153 2149 2146 2176 2207 2143 2079 2130 2181 2033 1886 1991 2096
847 2096 2184 2272 2291 2310 2261 2212 2232 2251 2308 2364 2306 2247 2267 2287 2273 2258 2159 2059 2074 2089 2126 2162 2131 2099 2164 2229 2295 2360 2364 2368 2372 2376 2380 2384 2387 2391 2375 2358
$$ packed form
884A636j8m4m5K5K4K9K9p7p8l0J08J76j45ppJ25J25M0r8n5n5k9k8M0M1J6J6PJ45O8O8J3k16
879A799j90M0J1J1M8M8K0j18p4O4M7M7J5J6j00r9Q2Q3l3l2J9J8N3N3j0j0Pj31p6O0M4M4mm
874A748j2j2R5m2m2R5jkp0O7l4l4k6k6jkJ45PJ7J8QRn4n4K3j14PQkjm1m2K8K7j8j9j9j8O4
868A680O4n1n1K2K3o4P4P6o1K5K5J3J3r2r3m6R2J20J20K6j12k6k6m6R1R1m6q1q1L1J69N8q0
863A857n4n5qJ28J46q3n2n2n8n7n1Q6J0RM5M5M5M5RRRRm0m0K9K8j9k0J6J5P1P0L4j04l1l0
858A961p4p4k7k6Q8Q8P0P1m4m4l2l3p5O2N3N3qpk9k9M0L9q3q4m6R1P9P9l5l6P4o5j01j02J
852A795JqJ29O7O6qqP8j51l1J07M7M7K2K1m8m8K0K1rqK5K6mlL0L1o4o4N1N1j48j47J05J05
847B096Q8Q8J9J9m9m9K0J9N7N6n8n9K0K0j4j5r9j00J5J5L7L6l1l2O5O5O6O5MMMMMMLMj6j7
$$ plain form
841 2358 2342 2325 2283 2240 2267 2293 2370 2447 2455 2463 2497 2532 2532 2532 2524 2516 2576 2636 2696 2756 2655 2554 2627 2701 2614 2527 2568 2608 2649 2689 2722 2755 2719 2683 2722 2761 2766
836 2766 2770 2723 2675 2627 2579 2638 2697 2756 2815 2868 2920 2973 3025 3089 3153 3057 2960 2934 2907 2996 3084 3138 3192 3246 3299 3308 3317 3326 3334 3293 3252 3210 3169 3142 3115 3294 3474
830 3474 3515 3557 3599 3641 3662 3683 3635 3588 3593 3598 3718 3838 3871 3904 4005 4107 4082 4057 4138 4218 4369 4382 4437 4493 4485 4476 4502 4527 4540 4553 4643 4595 4712 4829
825 4829 4899 4833 4915 4998 5073 5147 5196 5246 5324 5539 5746 5815 5928 6040 6226 6274 6330 6387 6513 6640 6793 6945 7183 7283 7300 7318 7491 7665
821 7665 7907 8149 8378 8608 8723 8837 9157 9476 9796 10115 10379 10642 11021 11399 11722 12044 12482 12919 13411 13904 14362 14820 15408
817 15408 15997 16700 17404 18238 19073 19898 20862 21702 22542 23643 24743 26016 27289 28562 29972 31588 33341 35162 37121 39273
814 39273 41562 44143 46953 49984 53151 56669 60507 64761 69336 74313 79518 85136 91168 97368 103981 110850 117719
811 117719 124661 131464 137846 143724 148764 152842 155938 157887 158547 157876 155850 152586 148279 142916 136720 130111 123104 116096
$$ packed form
841B358j6j7m2m3K7K6P7P7QQL4L5%%qqO0O0O0O0j01j01P3P4q7q7M1M0M1M0L3L3l6l6L9L9N
836B766Mm7m8m8m8N9N9N9N9N3N2N3N2O4O4r6r7k6k7Q9Q8N4N4N4N3RRRQm1m1m2m1k7k7J79J80
830C474M1M2M2M2K1K1m8m7NNJ20J20L3L3J01J02k5k5Q1Q0J51J3N5N6qrK6K5J3J3R0m8J17J17
825D829P0o6Q2Q3P5P4M9N0P8K15K07O9J13J12J86M8N6N7J26J27J53J52K38J00J7J8J73J74
821G665K42K42K29K30J15J14L20L19L20L19K64K63L79L78L23L22M38M37M92M93M58M58N88
817A5408N89P03P04Q34Q35Q25R64Q40Q40J101J100J273J273J273J410J616J753J821J959K152
814C9273K289K581K810L031L167L518L838M254M575M977N205N618O032O200O613O869O869
811A17719O942O803O382N878N040M078L096J949O60o71k026l264m307n363o196o609p007p008
$$ plain form
809 116096 108897 101835 95052 88681 82775 77098 71810 66936 62446 58185 54320 50776 47444 44342 41766 39420 37159
806 37159 35035 32980 31154 29437 27857 26559 25260 24085 22910 21909 21046 20201 19355 18564 17910 17153 16534 15975 15553 15063
803 15063 14574 14058 13543 13153 12764 12443 12123 11885 11648 11264 11018 10611 10204 9840 9475 9343 9210 8957 8566 8300 8171 8024 7878
799 7878 7736 7594 7461 7328 7168 7147 7056 6828 6708 6588 6458 6329 6256 6182 6108 6034 5951 5869 5718 5566 5420 5274 5206 5137 5034 5069 5035
795 5035 4863 4814 4765 4776 4786 4651 4516 4527 4400 4260 4119 4084 4049 4055 4062 4069 4075 3998 3920 3911 3902 3859 3817 3707 3596 3618 3641 3595 3549 3569 3590 3576 3562 3527
790 3527 3492 3389 3285 3287 3289 3222 3155 3058 2960 3069 3178 3074 2969 2979 2989 3011 3034 3056 3078 3068 3057 3046 3035 2987 2938 2889 2841 2836 2832 2828 2823 2786 2750 2781 2813
785 2813 2827 2840 2738 2637 2682 2726 2702 2678 2683 2688 2693 2699 2690 2680 2637 2593 2612 2631 2581 2531 2495 2460 2493 2527 2509 2492 2543 2594 2533 2471 2445 2418 2455 2492 2460 2428
779 2428 2400 2373 2345 2318 2286 2254 2222 2191 2187 2184 2180 2177 2215 2254 2293 2332 2296 2260 2259 2257 2299 2342 2315 2288 2211 2133 2170 2207 2244 2282 2250 2219 2174 2128 2117 2106 2139 2173
$$ packed form
809A16096p199p062o783o371n906n677n288m874m490m261l865l544l332l102k576k346k261
806C7159k124k055j826j717j580j298j299j175j175j001q63q45q46p91o54p57o19n59m22m90
803A5063m89n16n15l90l89l21l20k38k37l84k46m07m07l64l65j32j33k53l91k66j29j47j46
799G878j42j42j33j33j60k1r1k28j20j20j30j29p3p4p4p4q3q2j51j52j46j46o8o9j03L5l4
795E035j72m9m9J1J0j35j35J1j27j40j41l5l5OPPOp7p8rrm3m2j10j11K2K3m6m6K0K1j4j4l5
790C527l5j03j04KKo7o7r7r8J09J09j04j05J0J0K2K3K2K2j0j1j1j1m8m9m9m8nmmnl7l6L1L2
785B813J4J3j02j01M5M4k4k4NNNOrj0m3m4J9J9n0n0l6l5L3L4j8j7N1N1o1o2k6k7L7L7l2l2
779B428k8k7k8k7l2l2l2l1mlmlL8L9L9L9l6l6jkM2M3k7k7p7p8L7L7L7L8l2l1m5m6j1j1L3L4
$$ plain form
774 2173 2093 2012 2034 2057 2148 2239 2204 2169 2203 2237 2298 2360 2214 2069 2072 2075 2087 1961 2003 2046 2045 2044 2030 2015 2001 1986 1940 1894 1849 1803 1828 1854 1802 1888 1928
768 1928 1968 2017 2066 2103 2140 2148 2019 1891 1901 1939 1977 2012 2047 2014 1980 2014 2048 2151 2253 2216 2179 2107 2036 1981 1926 1931 1936 2068 2063 2021 1979 1999 2020 2006
763 2006 1992 1959 1925 1823 1721 1796 1871 1832 1792 1858 1925 1922 1920 1888 1856 1939 2022 2004 1987 2038 2090 2011 1933 1892 1989 2023 2058 2075 2092 2205 2456 2762 2930
758 2930 3014 2869 2600 2332 2115 2037 1995 1953 2043 2133 2139 2145 2209 2042 1893 1882 1866 1850 1920 1991 1908 1962 1965 1968 1959 1812 1811 1811 1777 1743 1738 1870 1942 1877 1897
753 1897 1918 1962 2007 2052 2097 2425 2754 2853 2814 2691 2429 2228 2165 2048 1931 1865 1799 1760 1859 1957 1918 1944 1969 2020 2071 2079 2087 2103 1982 1902 1822 1770
748 1770 1856 1903 1951 1947 1943 1795 1785 1850 1914 1940 1827 1907 1987 1983 1980 1907 1835 1882 1928 1860 1792 1801 1811 1820 1829 1818 1806 1795 1783 1759 1734 1710 1685 1698 1710 1791 1872
742 1872 1778 1685 1660 1635 1665 1695 1725 1755 1805 1854 1904 1953 1943 1933 1889 1844 1666 1489 1609 1729 1765 1801 1802 1803 1755 1707 1814 1783 1689 1732 1690 1647 1706
737 1706 1765 1754 1744 1767 1790 1779 1768 1789 1810 1670 1531 1650 1770 1729 1688 1655 1623 1705 1787 1821 1855 1788 1722 1630 1767 1973 1949 1856 1762 1815 1867 1812
$$ packed form
774B173q0q1K2K3R1R1l5l5L4L4O1O2j46j45LLJ2j26M2M3jjj4j5j4j5m6m6m5m6K5K6n2Q6M0
768A928M0M9M9L7L7Qj29j28J0L8L8L5L5l3l4L4L4J03J02l7l7p2p1n5n5NNJ32nm2m2K0K1j4
763B006j4l3l4j02j02P5P5l9m0O6O7lkl2l2Q3Q3j8j7N1N2p9p8m1R7L4L5J7J7J13K51L06J68
758B930Q4j45k69k68k17p8m2m2R0R0OOO4j67j49j1j6j6P0P1q3N4LLrj47j%l4l4nJ32P2o5K0
753A897K1M4M5M5M5L28L29R9l9j23k62k01o3j17j17o6o6l9R9R8l9K6K5N1N1QQJ6j21q0q0n2
748A770Q6M7M8mmj48j0O5O4K6j13Q0Q0mlp3p2M7M6o8o8RJ0RRj1j2j1j2k4k5k4k5J3J2Q1Q1
742A872r4r3k5k5L0L0L0L0N0M9N0M9j0j0m4m5j78j77J20J20L6L6JJm8m8J07l1r4M3m2m3N9
737A706N9j1j0K3K3j1j1K1K1j40j39J19J20m1m1l3l2Q2Q2L4L4o7o6r2J37K06k4r3r4N3N2n5
$$ plain form
732 1812 1758 1789 1682 1645 1746 1821 1896 1882 1731 1624 1516 1571 1627 1674 1721 1729 1599 1486 1603 1623 1642 1608 1573 1564 1555 1615 1675 1676 1677 1747 1817 1771 1725
727 1725 1678 1632 1600 1568 1605 1642 1626 1610 1662 1715 1744 1773 1733 1694 1680 1666 1721 1775 1740 1704 1737 1771 1778 1785 1793 1800 1763 1726 1612 1635 1644 1653 1670 1688 1654 1621 1588
722 1588 1555 1600 1644 1655 1665 1600 1534 1583 1632 1621 1609 1666 1723 1667 1611 1547 1620 1629 1638 1586 1535 1571 1607 1556 1644 1664 1546 1515 1483 1504 1525 1546 1567 1547 1528
716 1528 1500 1473 1589 1567 1614 1662 1703 1607 1588 1570 1608 1646 1684 1721 1662 1602 1658 1713 1611 1509 1521 1534 1627 1721 1746 1771 1740 1709 1790 1733 1680 1627 1726
711 1726 1824 1800 1776 1752 1728 1751 1774 1720 1666 1887 1970 1962 1953 1916 1741 1796 1850 1838 1689 1599 1647 1719 1653 1562 1608 1604 1601 1675 1749 1727 1705 1717 1729 1662 1594
706 1594 1595 1596 1555 1514 1542 1570 1576 1583 1650 1716 1712 1569 1495 1559 1633 1708 1638 1569 1482 1532 1617 1565 1680 1795 1787 1779 1672 1564 1571 1578 1605 1631 1589 1547 1583 1619 1656
700 1656 1692 1750 1808 1752 1695 1651 1606 1596 1586 1611 1636 1593 1549 1670 1790 1750 1710 1610 1510 1478 1447 1489 1530 1606 1683 1706 1730 1719 1708 1739 1770 1654
695 1654 1676 1736 1795 1703 1610 1628 1645 1627 1610 1656 1701 1678 1654 1611 1569 1641 1712 1735 1757 1702 1785 1721 1657 1601 1545 1593 1642 1655 1669 1579 1490 1469 1448 1500 1552
$$ packed form
732A812n4L1j07l7J01P5P5j4j51j07j08N5N6M7M7Qj30j13J17K0J9l4l5rrO0O0JJP0P0m6m6
727A725m7m6l2l2L7L7j6j6N2N3K9K9m0l9j4j4N5N4l5l6L3L4PPQPl7l7j14K3RRJ7J8l4l3l3
722A588l3M5M4J1J0o5o6M9M9j1j2N7N7n6n6o4P3RRn2n1L6L6n1Q8K0j18l1l2K1K1K1K1k0j9
716A528k8k7J16k2M7M8M1r6j9j8L8L8L8L7n9o0N6N5j02j02J2J3R3R4K5K5l1l1Q1n7n3n3R9
711A726R8k4k4k4k4K3K3n4n4K21Q3qrl7j75N5N4j2j49r0M8P2o6r1M6mlP4P4k2k2J2J2o7o8
706A594JJm1m1K8K8OPO7O6mj43p4O4P4P5p0o9q7N0Q5n2J15J15qqj07j08PPK7K6m2m2L6L6L7
700A656L6N8N8n6n7m4m5j0j0K5K5m3m4J21J20m0m0j00j00l2l1M2M1P6P7K3K4j1j1L1L1j16
695A654K2O0N9r2r3J8J7j8j7M6M5k3k4m3m2P2P1K3K2n5Q3o4o4n6n6M8M9J3J4r0q9k1k1N2N2
$$ plain form
690 1552 1560 1707 1709 1711 1722 1733 1708 1682 1666 1649 1580 1648 1707 1766 1796 1825 1854 1884 1816 1749 1716 1683 1721 1759 1683 1607 1622 1637 1643 1649 1680 1574 1476 1378 1443 1507
684 1507 1571 1635 1671 1706 1742 1778 1807 1837 1761 1685 1600 1653 1688 1724 1788 1715 1572 1568 1592 1616 1611 1469 1527 1586 1635 1685 1658 1631 1604 1577 1568 1558 1617 1676 1671 1665
679 1665 1720 1775 1778 1643 1576 1648 1661 1674 1671 1667 1579 1629 1679 1591 1563 1536 1606 1676 1696 1578 1615 1652 1604 1694 1774 1855 1805 1755 1670 1585 1581 1576 1764 1814 1717 1620
673 1620 1620 1621 1680 1602 1495 1388 1329 1407 1529 1513 1521 1666 1697 1590 1509 1566 1536 1507 1496 1485 1508 1532 1611 1690 1655 1620 1572 1524 1519 1514 1483 1590 1689 1558
668 1558 1462 1504 1575 1509 1467 1563 1688 1812 1742 1672 1639 1744 1701 1658 1624 1590 1706 1823 1733 1643 1626 1609 1548 1488 1550 1475 1478 1480 1575 1670 1782 1757 1609
663 1609 1598 1740 1744 1725 1706 1747 1788 1758 1729 1639 1549 1479 1546 1650 1755 1737 1720 1668 1616 1635 1653 1706 1759 1791 1823 1933 1906 1748 1591 1462 1471 1599
658 1599 1727 1704 1680 1619 1559 1480 1540 1578 1479 1457 1573 1693 1813 1776 1601 1537 1610 1598 1586 1586 1585 1585 1585 1596 1608 1654 1699 1712 1724 1707 1553 1511 1607 1686
653 1686 1765 1680 1595 1476 1357 1404 1451 1464 1477 1564 1652 1706 1759 1672 1585 1659 1732 1768 1803 1679 1554 1432 1311 1441 1572 1624 1676 1693 1711 1620 1530
$$ packed form
690A552QJ47KKJ1J1k5k6j6j7o9O8N9N9L0K9K9L0o8o7l3l3L8L8p6p6J5J5OOL1j06r8r8O5O4
684A507O4O4L6L5L6L6K9L0p6p6q5N3L5L6O4p3j43mK4K4nj42N8N9M9N0k7k7k7k7rj0N9N9no
679A665N5N5Lj35o7P2J3J3lmq8N0N0q8k8k7P0P0K0j18L7L7m8R0Q0Q1n0n0q5q5mnJ88N0r7r7
673A620%JN9p8j07j07n9P8J22j6QJ45L1j07q1N7l0k9j1j1K3K4P9P9l5l5m8m8nnl1J07R9j31
668A558r6M2P1o6m2R6J25J24p0p0l3J05m3m3l4l4J16J17r0r0j7j7o1o0O2p5LKR5R5J12k5j48
663A609j1J42Mj9j9M1M1l0k9r0r0p0O7J04J05j8j7n2n2J9J8N3N3L2L2J10k7j58j57j29RJ28
658A599J28k3k4o1o0p9O0L8r9k2J16J20J20l7j75o4P3j2j2%j%%J1J2M6M5J3J2j7j54m2R6P9
653A686P9q5q5j19j19M7M7J3J3Q7Q8N4N3q7q7P4P3L6L5j24j25j22j21J30J31N2N2J7J8r1r0
$$ plain form
648 1530 1473 1417 1399 1380 1310 1378 1535 1555 1592 1629 1605 1580 1590 1600 1592 1584 1575 1567 1639 1710 1790 1733 1748 1764 1703 1641 1683 1726 1733 1741 1643 1544 1606 1668 1616 1564 1547
643 1547 1529 1596 1662 1694 1726 1632 1538 1513 1488 1520 1552 1506 1599 1620 1641 1671 1701 1670 1638 1641 1644 1681 1718 1687 1655 1616 1577 1595 1476 1460 1674 1682 1689 1707 1725 1811
637 1811 1898 1780 1662 1649 1637 1723 1671 1697 1723 1753 1783 1822 1723 1707 1691 1735 1779 1766 1754 1707 1660 1701 1741 1712 1684 1730 1777 1755 1733 1769 1805 1841 1877 1829
632 1829 1782 1700 1617 1564 1511 1619 1726 1703 1680 1772 1863 1883 1904 1889 1875 1816 1757 1766 1776 1724 1673 1736 1799 1837 1874 1797 1720 1825 1930 1829 1728 1718
627 1718 1709 1699 1690 1706 1722 1739 1755 1708 1661 1615 1568 1566 1564 1563 1561 1628 1695 1601 1508 1593 1678 1694 1710 1720 1731 1775 1820 1780 1740 1734 1728 1693 1657 1621 1585 1572 1558 1613 1668
621 1668 1576 1483 1460 1436 1541 1645 1635 1625 1605 1584 1633 1681 1682 1683 1683 1684 1686 1688 1575 1463 1463 1464 1579 1694 1678 1662 1681 1699 1724 1748 1772 1796 1761 1726 1691 1655
616 1655 1695 1735 1615 1494 1526 1557 1735 1775 1712 1649 1586 1522 1481 1577 1733 1660 1597 1673 1742 1674 1586 1636 1599 1563 1547 1530 1514 1497 1567 1637 1646 1655 1573 1629
611 1629 1722 1814 1795 1776 1749 1721 1732 1604 1555 1505 1544 1583 1622 1661 1680 1698 1717 1736 1661 1587 1627 1667 1659 1651 1566 1618 1564 1511 1465 1420 1386 1352 1387 1422 1492
$$ packed form
648A530n7n6j8j9p0O8J57K0L7L7k4k5J0J0qqrqP2P1Q0n7J5J6o1o2M2M3PQr8r9O2O2n2n2j7
643A547j8O7O6L2L2r4r4k5k5L2L2m6R3K1K1L0L0l1l2LLL7L7l1l2l9l9J8j19j6K14QPJ8J8Q6
637A811Q7j18j18j3j2Q6n2K6K6L0L0L9r9j6j6M4M4j3j2m7m7M1M0k9k8M6M7k2k2L6L6L6L6m8
632A829m7q2q3n3n3J08J07k3k3R2R1K0K1j5j4n9n9RJ0n2n1O3O3L8L7p7p7J05J05j01j01j0
627A718rj0rJ6J6J7J6m7m7m6m7kkjkO7O7r4r3Q5Q5J6J6J0J1M4M5m0m0ool5l6l6l6j3j4N5N5
621A668r2r3k3k4J05J04j0j0k0k1M9M8JJ%JKKj13j12%JJ15J15j6j6J9J8K5K4K4K4l5l5l5l6
616A655M0M0j20j21L2L1J78M0o3o3o3o4m1R6J56p3o3P6O9o8q8N0l7l6j6j7j6j7P0P0RRq2N6
611A629R3R2j9j9k7k8J1j28m9n0L9L9L9L9J9J8J9J9p5p4M0M0qqq5N2n4n3m6m5l4l4L5L5P0
$$ plain form
605 1492 1563 1625 1687 1696 1568 1440 1450 1486 1521 1574 1489 1529 1569 1609 1511 1489 1467 1543 1619 1682 1608 1619 1631 1590 1686 1713 1603 1637 1671 1628 1584 1547 1509 1471
600 1471 1434 1441 1449 1447 1446 1535 1487 1516 1545 1498 1452 1612 1771 1733 1695 1657 1619 1579 1540 1491 1580 1520 1461 1409 1358 1428 1499 1500 1502 1477 1453 1504 1691 1740 1651 1648 1645
594 1645 1643 1641 1639 1638 1637 1636 1635 1635 1548 1461 1443 1425 1435 1444 1523 1601 1559 1517 1467 1554 1582 1610 1501 1529 1586 1643 1626 1471 1428 1385 1494 1603 1587 1571 1564 1557 1459 1497
589 1497 1528 1558 1565 1573 1580 1588 1529 1471 1528 1584 1593 1603 1612 1621 1615 1608 1473 1567 1630 1692 1577 1599 1625 1650 1616 1581 1587 1592 1520 1586 1592 1598 1536 1611 1588 1566 1483 1400 1466 1531
583 1531 1490 1449 1439 1566 1500 1435 1387 1339 1290 1242 1330 1417 1436 1455 1422 1388 1469 1550 1538 1526 1453 1381 1330 1417 1418 1418 1544 1532 1528 1525 1517 1509 1492 1614 1614 1615 1624 1634
577 1634 1595 1556 1518 1479 1553 1628 1702 1777 1706 1636 1505 1603 1657 1710 1657 1467 1419 1509 1556 1465 1500 1534 1560 1587 1566 1544 1515 1623 1647 1671 1635 1599 1592 1586
572 1586 1528 1608 1718 1691 1598 1505 1402 1437 1464 1490 1492 1493 1563 1633 1571 1510 1483 1455 1483 1511 1599 1687 1744 1663 1659 1656 1662 1668 1606 1544 1482 1420 1427 1434 1420 1406 1461 1516
566 1516 1506 1496 1374 1390 1489 1588 1572 1556 1630 1566 1545 1524 1543 1563 1599 1498 1454 1548 1521 1495 1526 1558 1521 1483 1501 1519 1468 1417 1396 1376 1277 1317 1288 1259
$$ packed form
605A492P1O2O2Rj28j28J0L6L5N3q5M0M0M0r8k2k2P6P6O3p4J1J2m1R6K7j10L4L4m3m4l7l8l8
600A471l7PQkjQ9m8K9K9m7m6J60J59l8l8l8l8m0l9m9Q9o0n9n2n1P0P1JKk5k4N1J87M9q9ll
594A645kkkjjjj%q7q7j8j8J0RP9P8m2m2n0Q7K8K8j09K8N7N7j7j55m3m3J09J09j6j6ppr8L8
589A497L1L0PQPQn9n8N7N6RJ0RRopj35R4O3O2j15K2K6K5l4l5ONp2O6OOo2P5k3k2q3q3O6O5
583A531m1m1j0J27o6o5m8m8m9m8Q8Q7J9J9l3l4Q1Q1j2j2p3p2n1Q7J%J26j2mlqqj7J22%JRJ0
577A634l9l9l8l9P4P5P4P5p1p0j31R8N4N3n3j90m8R0M7r1L5L4K6K7k1k2k9J08K4K4l6l6po
572A586n8Q0J10k7r3r3j03L5K7K6KJP0P0o2o1k7k8K8K8Q8Q8N7q1mlOOo2o2o2o2PPj4j4N5N5
566A516j0j0j22J6R9R9j6j6P4o4k1k1J9K0L6j01m4R4k7k6L1L2l7l8J8J8n1n1k1k0r9M0k9k9
$$ plain form
561 1259 1231 1340 1334 1329 1290 1388 1426 1464 1519 1437 1298 1159 1309 1459 1551 1642 1619 1595 1641 1686 1694 1565 1505 1445 1445 1445 1464 1483 1536 1589 1605 1621 1603 1585
555 1585 1556 1526 1532 1537 1604 1671 1670 1668 1579 1490 1561 1633 1608 1583 1593 1602 1605 1607 1575 1544 1509 1475 1441 1407 1354 1300 1407 1515 1469 1423 1530 1636 1659 1544 1377
550 1377 1440 1436 1433 1478 1524 1544 1564 1515 1467 1504 1540 1692 1843 1759 1676 1592 1508 1557 1605 1654 1702 1643 1584 1526 1467 1382 1297 1419 1540 1451 1362 1342 1321 1318
545 1318 1315 1426 1537 1553 1568 1515 1461 1491 1520 1550 1580 1612 1643 1641 1638 1596 1555 1582 1609 1574 1538 1503 1468 1497 1526 1487 1447 1389 1331 1387 1444 1559 1674 1628
540 1628 1582 1533 1483 1433 1383 1445 1507 1501 1494 1487 1481 1543 1605 1544 1482 1429 1376 1363 1488 1535 1583 1654 1725 1682 1639 1527 1414 1386 1494 1484 1474 1473 1471 1451 1431 1411
534 1411 1391 1421 1450 1479 1508 1489 1469 1433 1534 1666 1662 1583 1504 1515 1526 1537 1548 1443 1337 1300 1264 1324 1385 1377 1369 1431 1492 1554 1616 1564 1513 1530 1547 1558
529 1558 1570 1389 1346 1365 1384 1411 1438 1473 1508 1551 1457 1420 1384 1408 1432 1448 1463 1522 1444 1432 1419 1468 1516 1571 1626 1613 1599 1593 1586 1580 1574 1568 1563 1617 1672 1692 1574
523 1574 1482 1527 1646 1627 1695 1762 1634 1505 1369 1369 1430 1491 1492 1492 1491 1490 1540 1452 1500 1686 1794 1765 1710 1654 1624 1594 1554 1514 1637 1531 1529 1528 1512 1496
$$ packed form
561A259k8J09onl9R8L8L8N5q2j39j39J50J50R2R1k3k4M6M5Qj29o0o0%%J9J9N3N3J6J6j8j8
555A585k9l0ONO7O7jkq9q9P1P2k5k5J0RLKl2l1l5l4l4l4n3n4J07J08m6m6J07J06K3j15j67
550A377O3mlM5M6K0K0m9m8L7L6J52J51q4q3q4q4M9M8M9M8n9n9n8n9q5q5J22J21q9q9k0k1l
545A318lJ11J11J6J5n3n4L0K9L0L0L2L1klm2m1K7K7l5l6l5l5K9K9l9m0n8n8N6N7J15J15m6
540A628m6m9n0n0n0O2O2oppoO2O2o1o2n3n3j3J25M7M8P1P1m3m3j12j13k8J08j0j0jkk0k0k0
534A411k0L0K9K9K9j9k0l6J01J32mp9p9J1J1J1J1j05j06l7l6O0O1qqO2O1O2O2n2n1J7J7J1
529A558J2j81m3J9J9K7K7L5L5M3r4l7l6K4K4J6J5N9p8j2j3M9M8N5N5j3j4opooonN4N5K0j18
523A574r2M5J19j9O8O7j28j29j36%O1O1J%jjN0q8M8J86J08k9n5n6l0l0m0m0J23j06kjj6j6
$$ plain form
518 1496 1415 1335 1414 1494 1498 1503 1473 1443 1466 1490 1583 1675 1598 1520 1512 1503 1539 1575 1542 1510 1571 1633 1580 1527 1569 1611 1585 1558 1490 1422 1468 1515 1498 1482 1466 1449 1446
512 1446 1444 1441 1438 1477 1516 1521 1525 1601 1677 1638 1599 1528 1457 1455 1453 1429 1406 1451 1496 1519 1542 1565 1588 1584 1579 1506 1433 1399 1365 1399 1434 1553 1672 1676 1681 1662 1644 1625 1607
507 1607 1656 1705 1685 1665 1680 1695 1641 1587 1601 1615 1628 1642 1692 1743 1679 1615 1615 1615 1616 1616 1608 1600 1592 1584 1559 1534 1509 1484 1513 1543 1573 1602 1604 1605 1606 1607 1555 1503 1451 1399 1415
500 1415 1430 1446 1461 1510 1559 1493 1427 1447 1466 1511 1556 1603 1511 1497 1483 1553 1622 1532 1441 1404 1367 1253 1277 1333 1390 1509 1629 1668 1478 1408 1476 1463 1449
495 1449 1444 1439 1379 1319 1405 1353 1392 1431 1462 1492 1506 1520 1534 1548 1566 1585 1603 1621 1572 1523 1542 1561 1621 1680 1662 1782 1740 1697 1594 1491 1429 1366 1372 1378 1400
490 1400 1422 1367 1449 1491 1533 1583 1634 1540 1446 1421 1396 1409 1421 1425 1428 1544 1523 1427 1331 1268 1343 1455 1566 1478 1389 1415 1441 1429 1416 1317 1356 1501 1509 1487
485 1487 1466 1485 1504 1437 1507 1509 1373 1392 1410 1371 1331 1405 1480 1529 1578 1466 1355 1305 1255 1320 1384 1445 1506 1567 1628 1541 1455 1437 1419 1415 1410 1475 1539 1541 1542 1544
479 1544 1545 1502 1460 1417 1374 1418 1461 1504 1548 1520 1492 1465 1437 1427 1416 1406 1395 1364 1332 1301 1269 1315 1361 1338 1315 1279 1242 1366 1490 1445 1400 1355 1310 1339
$$ packed form
518A496q1q0P9Q0MNl0l0K3K4R3R2p7p8qrL6L6l3l2O1O2n3n3M2M2k6k7o8o8M6M7j7j6j6j7l
512A446kllL9L9NMP6P6l9l9p1p1kkk4k3M5M5K3K3K3K3mnp3p3l4l4L4L5J19J19MNj9j8j9j8
507A607M9M9k0k0J5J5n4n4J4J4J3J4N0N1o4o4%%J%qqqqk5k5k5k5K9L0L0K9KJJJn2n2n2n2J6
500A415J5J6J5M9M9o6o6K0J9M5M5M7r2j4j4P0O9r0r1l7l7j14K4N6N7J19J20L9j90p0O8j3j4
495A449nno0o0Q6n2L9L9L1L0J4J4J4J4J8J9J8J8m9m9J9J9O0N9j8J20m2m3j03j03o2o3OOK2
490A400K2n5Q2M2M2N0N1r4r4k5k5J3J2MLJ16k1r6r6o3P5J12J11q8q9K6K6j2j3r9L9J45Qk2
485A487k1J9J9o7P0Kj36J9J8l9m0P4P5M9M9j12j11n0n0O5O4O1O1O1O1q7q6j8j8mnO5O4KJK
479A544Jm3m2m3m3M4M3M3M4k8k8k7k8j0j1j0j1l1l2l1l2M6M6k3k3l6l7J24J24m5m5m5m5K9
$$ plain form
474 1339 1367 1396 1425 1386 1347 1378 1408 1396 1384 1371 1359 1440 1521 1488 1454 1507 1560 1544 1529 1504 1480 1387 1294 1345 1397 1380 1363 1402 1440 1479 1518 1499 1480 1529 1579
469 1579 1534 1489 1513 1537 1536 1535 1534 1532 1458 1384 1424 1465 1520 1576 1563 1550 1578 1606 1635 1663 1606 1549 1560 1572 1506 1440 1443 1446 1443 1440 1437 1434 1425 1416 1476 1536 1512 1488 1464 1441 1541
462 1541 1642 1628 1615 1562 1510 1527 1543 1457 1370 1398 1426 1401 1375 1464 1553 1553 1553 1485 1416 1395 1374 1422 1470 1410 1350 1405 1460 1497 1535 1572 1610 1583 1555 1460 1364
457 1364 1305 1246 1347 1449 1496 1543 1590 1637 1649 1661 1673 1685 1645 1606 1566 1526 1494 1462 1430 1398 1514 1631 1588 1544 1483 1422 1476 1530 1453 1377 1369 1361 1377 1392
452 1392 1408 1424 1461 1499 1421 1344 1328 1311 1364 1417 1491 1565 1570 1575 1569 1562 1556 1549 1508 1467 1495 1523 1537 1550 1563 1577 1613 1650 1494 1338 1308 1507 1655 1665 1675 1685
446 1685 1686 1688 1707 1726 1677 1628 1613 1598 1583 1568 1543 1519 1563 1607 1530 1454 1377 1301 1320 1339 1427 1515 1508 1501 1495 1488 1539 1590 1573 1555 1572 1589 1605 1622 1607 1592 1508 1424
441 1424 1366 1308 1364 1421 1440 1459 1470 1480 1578 1538 1507 1476 1444 1412 1440 1468 1629 1653 1547 1442 1471 1499 1528 1557 1585 1614 1651 1688 1582 1613 1714 1676
436 1676 1636 1596 1469 1481 1468 1456 1521 1586 1641 1696 1683 1669 1588 1508 1551 1593 1430 1404 1406 1409 1532 1518 1512 1507 1500 1493 1485 1478 1340 1201 1191 1319 1408 1497 1517 1538
$$ packed form
474A339K8K9K9l9l9L1L0j2j2j3j2Q1Q1l3l4N3N3j6j5k5k4r3r3N1N2j7j7L9L8L9L9j9j9M9N0
469A579m5m5K4K4jjjkp4p4M0M1N5N6j3j3K8K8K9K8n7n7J1J2o6o6LLllllrrO0O0k4k4k4k3J00
462A541J01j4j3n3n2J7J6q6q7K8K8k5k6Q9Q9%%o8o9k1k1M8M8o0o0N5N5L7L8L7L8k7k8r5r6
457A364n9n9J01J02M7M7M7M7J2J2J2J2m0l9m0m0l2l2l2l2J16J17m3m4o1o1N4N4p7p6qqJ6J5
452A392J6J6L7L8p8p7j6j7N3N3P4P4NNopopm1m1K8K8J4J3J3J4L6L7j56j56l0J99J48J0J0J0
446A685JKJ9J9m9m9j5j5j5j5k5k4M4M4p7p6p7p6J9J9Q8Q8ppopN1N1j7j8J7J7J6J7j5j5q4q4
441A424n8n8N6N7J9J9J1J0R8m0l1l1l2l2K8K8J61K4j06j05K9K8K9K9K8K9L7L7j06L1J01l8
436A676m0m0j27J2j3j2O5O5N5N5j3j4q1q0M3M2j63k6KLJ23j4onppqpj38j39j0J28Q9Q9K0K1
$$ plain form
430 1538 1630 1585 1557 1529 1487 1582 1562 1405 1315 1225 1286 1348 1432 1517 1532 1548 1538 1529 1450 1372 1395 1419 1365 1448 1481 1514 1572 1493 1367 1378 1418 1458 1517 1576
425 1576 1566 1556 1457 1359 1289 1357 1488 1482 1494 1505 1494 1482 1539 1597 1537 1478 1457 1572 1593 1615 1575 1536 1467 1398 1398 1397 1417 1437 1457 1476 1479 1482 1484 1487 1483 1478 1465 1452
419 1452 1581 1573 1519 1465 1564 1525 1449 1374 1394 1415 1366 1318 1422 1525 1560 1595 1598 1600 1543 1485 1434 1520 1538 1418 1432 1447 1487 1527 1519 1511 1425 1478 1526 1575 1563
414 1563 1552 1550 1549 1547 1546 1539 1533 1526 1520 1499 1478 1526 1574 1568 1562 1488 1413 1372 1330 1632 1706 1576 1585 1579 1435 1435 1435 1426 1417 1513 1608 1588 1569 1619 1670 1652 1634 1571 1508 1483 1595
408 1595 1610 1625 1579 1534 1596 1659 1616 1572 1479 1523 1618 1485 1394 1302 1271 1378 1437 1358 1322 1423 1511 1599 1613 1488 1425 1362 1359 1356 1353 1351 1417 1483 1484 1484 1416 1347
402 1347 1324 1301 1433 1427 1402 1515 1473 1430 1423 1416 1434 1452 1563 1536 1527 1517 1434 1489 1466 1443 1431 1418 1465 1513 1550 1450 1488 1525 1530 1397 1410 1424 1433 1443 1452 1462
397 1462 1480 1497 1403 1446 1451 1456 1539 1621 1565 1509 1453 1397 1450 1502 1632 1624 1607 1591 1580 1340 1263 1185 1208 1231 1276 1321 1401 1481 1585 1690 1680 1670 1645 1620
391 1620 1586 1552 1661 1632 1574 1517 1403 1427 1526 1624 1617 1473 1466 1460 1576 1555 1520 1622 1733 1616 1559 1639 1572 1504 1514 1525 1563 1601 1631 1660 1723 1649 1618
$$ packed form
430A538R2m5k8k8m2R5k0j57r0r0O1O2Q4Q5J5J6j0rp9p8K3K4n4Q3L3L3N8p9j26J1M0M0N9N9
425A576j0j0r9r8p0O8J31oJ2J1j1j2N7N8o0n9k1J15K1K2m0l9o9o9%jK0K0K0J9LLKLmnj3j3
419A452J29qn4n4R9l9p6p5K0K1m9m8J04J03L5L5LKn7n8n1Q6J8j20J4J5M0M0qqq6N3M8M9j2
414A563j1kjkjpopok1k1M8M8oop4p5m1m2L02P4j30Roj44%%rrR6R5k0j9N0N1j8j8o3o3k5J12
408A595J5J5m6m5O2O3m3m4r3M4R5j33r1r2l1J07N9p9l6J01Q8Q8J4j25o3o3lllkO6O6J%o8o9
402A347k3k3J32ok5J13m2m3ppJ8J8J11k7rj0q3N5k3k3j2j3M7M8L7j00L8L7Nj33J3J4RJ0RJ0
397A462J8J7r4M3NNQ3Q2n6n6n6n6N3N2J30qj7j6j1k40p7p8K3K3M5M5Q0Q0J04J05j0j0k5k5
391A620l4l4J09k9n8n7j14K4R9R8pj44poJ16k1l5J02J11j17n7Q0o7o8J0J1L8L8L0K9O3p4l1
$$ plain form
386 1618 1587 1593 1600 1624 1511 1548 1724 1744 1535 1445 1491 1501 1511 1568 1396 1344 1429 1455 1480 1514 1548 1529 1510 1423 1335 1415 1494 1414 1333 1395 1458 1452 1445 1476 1507
381 1507 1377 1248 1368 1487 1446 1406 1329 1252 1336 1420 1478 1536 1526 1515 1538 1562 1516 1471 1450 1429 1408 1387 1389 1392 1509 1626 1600 1574 1548 1522 1522 1522 1453 1385
376 1385 1414 1444 1439 1434 1421 1408 1396 1383 1362 1341 1319 1298 1323 1348 1407 1466 1534 1603 1557 1510 1428 1346 1333 1319 1342 1364 1386 1409 1457 1505 1484 1464 1470 1477 1449 1421 1458
370 1458 1494 1497 1499 1448 1397 1346 1296 1349 1402 1524 1646 1554 1462 1440 1417 1388 1360 1446 1532 1488 1445 1470 1495 1559 1622 1652 1681 1575 1469 1432 1395 1383 1371 1358
365 1358 1346 1413 1480 1478 1475 1446 1416 1501 1586 1518 1451 1498 1545 1522 1500 1443 1386 1380 1375 1404 1433 1378 1324 1338 1352 1401 1450 1430 1411 1343 1275 1276 1278 1433 1589 1539 1488
359 1488 1546 1605 1594 1583 1481 1378 1345 1311 1395 1479 1494 1509 1504 1499 1494 1489 1524 1560 1595 1630 1579 1529 1478 1427 1445 1463 1481 1499 1461 1424 1386 1348 1376 1404 1363 1322
354 1322 1360 1398 1436 1474 1492 1509 1527 1545 1572 1598 1510 1422 1389 1356 1254 1153 1230 1308 1385 1463 1490 1518 1432 1345 1305 1264 1258 1253 1354 1456 1444 1431 1437 1442 1414
349 1414 1385 1443 1500 1489 1478 1504 1530 1487 1445 1431 1418 1439 1460 1455 1449 1513 1576 1575 1574 1504 1434 1367 1300 1348 1395 1358 1321 1398 1475 1478 1481 1415 1349 1445 1541 1568 1595 1488
$$ packed form
386A618l1OPK4j13L7J76K0k09r0M6J0J0N7j72n2Q5K6K5L4L4j9j9q7q8Q0P9q0q1O2O3opL1L1
381A507j30j29J20J19m1m0p7p7Q4Q4N8N8j0j1K3K4m6m5k1k1k1k1KLJ17J17k6k6k6k6%%o9o8
376A385K9L0nnj3j3j2j3k1k1k2k1K5K5N9N9O8O9m6m7q2q2j3j4K3K2K2K3M8M8k1k0OPk8k8L7
370A458L6LKn1n1n1n0N3N3J22J22r2r2k2k3k9k8Q6Q6m4m3K5K5O4O3L0K9j06j06l7l7j2j2j3
365A358j2O7O7klk9l0Q5Q5o8o7M7M7k3k2n7n7onK9K9n5n4J4J4M9M9k0j9o8o8JKJ55J56n0n1
359A488N8N9j1j1j02j03l3l4Q4Q4J5J5nnnnL5L6L5L5n1n0n1n1J8J8J8J8l8l7l8l8K8K8m1m1
354A322L8L8L8L8J8J7J8J8K7K6q8q8l3l3j02j01P7P8P7P8K7K8q6q7m0m1onJ01J02j2j3ONk8
349A414k9N8N7j1j1K6K6m3m2j4j3K1K1noO4O3jjp0p0o7o7M8M7l7l7P7P7LLo6o6R6R6K7K7j07
$$ plain form
343 1488 1380 1387 1395 1430 1465 1646 1689 1587 1484 1488 1491 1458 1425 1452 1479 1585 1554 1408 1399 1437 1475 1531 1586 1538 1628 1612 1458 1345 1369 1306 1244 1360 1476
338 1476 1431 1386 1333 1281 1237 1193 1224 1392 1483 1574 1643 1712 1713 1713 1690 1666 1527 1389 1474 1560 1531 1502 1530 1559 1432 1443 1580 1580 1551 1522 1447 1372 1297 1223
333 1223 1274 1326 1377 1429 1415 1401 1387 1374 1407 1441 1440 1439 1509 1580 1590 1599 1525 1587 1590 1455 1306 1294 1357 1420 1467 1515 1448 1381 1367 1352 1260 1306 1410 1515 1594
327 1594 1673 1557 1440 1438 1436 1419 1402 1368 1471 1537 1466 1412 1357 1301 1245 1304 1363 1435 1506 1435 1592 1741 1660 1616 1573 1431 1427 1460 1493 1504 1515 1637 1622
322 1622 1540 1458 1437 1415 1376 1337 1290 1380 1441 1503 1458 1413 1550 1687 1663 1639 1594 1549 1504 1458 1468 1477 1294 1249 1307 1365 1440 1377 1384 1390 1311 1369 1432 1494 1496
317 1496 1498 1520 1542 1494 1447 1354 1261 1197 1270 1422 1437 1423 1409 1418 1427 1330 1233 1176 1256 1327 1398 1416 1434 1417 1400 1387 1374 1344 1451 1493 1397 1388 1378 1450 1522 1479
311 1479 1436 1465 1494 1661 1598 1433 1406 1485 1563 1532 1364 1195 1165 1223 1282 1315 1348 1295 1241 1265 1288 1291 1432 1504 1438 1394 1349 1457 1565 1539 1514 1489
306 1489 1463 1422 1381 1409 1437 1482 1527 1512 1497 1411 1462 1505 1548 1506 1464 1448 1432 1503 1437 1396 1493 1599 1568 1553 1539 1528 1517 1506 1495 1506 1516 1527 1538 1520
$$ packed form
343A488j08PQL5L5J81M3j02j03MLl3l3K7K7J06l1j46rL8L8N6N5m8R0j6j54j13K4o3o2J16J16
338A476m5m5n3n2m4m4L1J68R1R1O9O9J%k3k4j39j38Q5Q6k9k9K8K9j27J1J37%k9k9p5p5p5p4
333A223N1N2N1N2j4j4j4j3L3L4jjP0P1J0Rp4O2Lj35j49j2O3O3M7M8o7o7j4j5r2M6J04J05P9
327A594P9j16j17kkj7j7l4J03O6p1n4n5n6n6N9N9P2P1p1J57J49q1m4m3j42mL3L3J1J1J22j5
322A622q2q2k1k2l9l9m7R0O1O2m5m5J37J37k4k4m5m5m5m6J0Rj83m5N8N8P5o3POp9N8O3O2K
317A496KK2K2m8m7r3r3o4P3J52J5j4j4RRr7r7n7Q0P1P1J8J8j7j7j3j3l0J07M2r6rj0P2P2m3
311A479m3K9K9J67o3j65k7P9P8l1j68j69l0N8N9L3L3n3n4K4K3LJ41P2o6m4m5J08J08k6k5k5
306A489k6m1m1K8K8M5M5j5j5q6N1M3M3m2m2j6j6P1o6m1R7J06l1j5j4j1j1j1j1J1J0J1J1j8
$$ plain form
301 1520 1502 1484 1465 1444 1422 1401 1379 1398 1417 1402 1387 1385 1384 1451 1518 1481 1444 1441 1438 1474 1510 1408 1445 1384 1461 1461 1460 1513 1429 1344 1397 1398 1399 1477 1555 1549 1543 1511 1479
295 1479 1471 1601 1578 1418 1359 1438 1363 1287 1265 1244 1329 1413 1469 1386 1322 1257 1207 1294 1270 1246 1312 1377 1374 1371 1345 1319 1303 1286 1232 1316 1377 1438 1524 1381 1324
290 1324 1404 1446 1488 1615 1605 1543 1481 1419 1357 1301 1384 1389 1394 1416 1438 1538 1500 1476 1452 1419 1386 1405 1424 1512 1599 1531 1462 1471 1480 1432 1521 1464 1407 1368 1329 1320
285 1320 1447 1487 1389 1325 1399 1468 1400 1417 1435 1437 1440 1442 1445 1462 1479 1496 1513 1512 1512 1512 1511 1506 1501 1495 1490 1469 1448 1281 1251 1302 1353 1327 1439 1507 1437 1418 1400 1413 1425
279 1425 1506 1588 1606 1624 1573 1523 1487 1451 1449 1448 1423 1398 1372 1347 1381 1414 1448 1482 1438 1395 1352 1309 1341 1373 1362 1350 1370 1252 1203 1291 1259 1226 1271 1316 1363
273 1363 1409 1447 1485 1578 1533 1497 1461 1494 1527 1408 1288 1294 1438 1504 1570 1451 1333 1374 1416 1412 1409 1465 1522 1546 1432 1395 1359 1333 1308 1342 1377 1418 1322
268 1322 1337 1352 1392 1431 1402 1373 1404 1436 1476 1379 1353 1327 1407 1487 1534 1582 1561 1540 1504 1467 1396 1325 1344 1363 1442 1521 1589 1519 1412 1305 1299 1292 1285 1279 1326 1373
263 1373 1420 1468 1420 1373 1394 1415 1344 1273 1308 1343 1404 1327 1397 1466 1514 1562 1541 1520 1481 1442 1404 1365 1346 1328 1343 1359 1425 1491 1488 1485 1447 1409 1397 1385 1448 1373
$$ packed form
301A520j8j8j9k1k2k1k2J9J9j5j5kjO7O7l7l7llL6L6j02L7o1P7%jN3q4q5N3JJP8P8ool2l2
295A479qJ30k3j60n9P9p5p6k2k1Q5Q4N6q3o4o5n0Q7k4k4O6O5llk6k6j6j7n4Q4O1O1Q6j43n7
290A324Q0M2M2J27j0o2o2o2o2n6Q3NNK2K2J00l8k4k4l3l3J9J9Q8Q7o8o9RRm8Q9n7n7l9l9r
285A320J27M0r8o4P4O9o8J7J8KLKLJ7J7J7J7j%%jnnonk1k1j67l0N1N1k6J12O8p0j9j8J3J2
279A425Q1Q2J8J8n1n0l6l6kjk5k5k6k5L4L3L4L4m4m3m3m3L2L2j1j2K0j18m9Q8l2l3M5M5M7
273A363M6L8L8R3m5l6l6L3L3j19j20OJ44O6O6j19j18M1M2mlN6N7K4j14l7l6k6k5L4L5M1r6
268A322J5J5M0L9k9k9L1L2M0r7k6k6Q0Q0M7M8k1k1l6l7p1p1J9J9P9P9O8p0j07j07oppoM7M7
263A373M7M8m8m7K1K1p1p1L5L5O1p7P0O9M8M8k1k1l9l9l8l9j9j8J5J6O6O6lll8l8j2j2O3p5
$$ plain form
257 1373 1385 1396 1330 1402 1465 1527 1566 1604 1574 1544 1461 1379 1488 1460 1462 1464 1457 1451 1412 1374 1404 1435 1375 1315 1255 1195 1247 1300 1353 1405 1438 1472 1390 1309 1281 1253
252 1253 1259 1265 1318 1371 1395 1282 1224 1303 1383 1325 1289 1392 1339 1287 1333 1379 1339 1436 1478 1382 1372 1362 1405 1447 1489 1532 1484 1436 1388 1340 1272 1205 1260 1316 1203
246 1203 1228 1290 1352 1377 1401 1383 1364 1385 1268 1335 1402 1475 1411 1425 1438 1350 1261 1288 1314 1345 1376 1484 1592 1456 1457 1449 1441 1416 1391 1366 1341 1346 1351 1424 1498
241 1498 1561 1625 1528 1431 1432 1434 1436 1438 1374 1311 1316 1322 1367 1413 1450 1487 1485 1345 1351 1358 1378 1398 1418 1438 1451 1464 1443 1421 1321 1220 1271 1322 1397 1335 1349 1364 1347 1331
235 1331 1322 1314 1264 1352 1293 1235 1241 1247 1252 1258 1319 1379 1517 1517 1544 1570 1554 1538 1478 1418 1428 1437 1469 1501 1498 1496 1533 1570 1492 1414 1407 1400 1454 1507 1594 1543 1500 1458 1478 1498
229 1498 1440 1383 1477 1434 1434 1434 1382 1330 1269 1346 1392 1437 1492 1546 1485 1423 1430 1437 1427 1416 1475 1533 1490 1448 1371 1293 1306 1318 1330 1343 1357 1372 1386 1401 1395 1390 1454 1517
223 1517 1571 1624 1563 1502 1406 1310 1283 1256 1333 1409 1417 1425 1431 1437 1477 1517 1490 1462 1434 1406 1355 1305 1369 1432 1410 1388 1366 1344 1371 1398 1356 1314 1341 1368 1396 1423 1386
218 1386 1348 1345 1341 1295 1248 1315 1383 1390 1396 1403 1410 1434 1459 1483 1508 1472 1437 1436 1435 1541 1647 1729 1583 1405 1364 1392 1421 1357 1294 1230 1167 1210 1253 1296 1339 1349 1359
$$ packed form
257A373J2J1o6P2O3O2L9L8l0l0q3q2J09k8KKpol9l8L0L1o0o0o0o0N2N3N3N2L3L4q2q1k8k8
252A253OON3N3K4j13n8P9Q0n8l6J03n3n2M6M6m0R7M2r6j0j0M3M2M2M3m8m8m8m8o8o7N5N6j13
246A203K5O2O2K5K4j8j9K1j17O7O7P3o4J4J3q8q9K7K6L1L1J08J08j36Jqqk5k5k5k5NNP3P4
241A498O3O4r7r7JKKKo4o3NOM5M6L7L7kj40OPK0K0K0K0J3J3k1k2j00j01N1N1P5o2J4J5j7j6
235A331rqn0Q8n9n8OONOO1O0J38%K7K6j6j6o0o0J0RL2L2lkL7L7p8p8ppN4N3Q7n1m3m2K0K0
229A498n8n7R4m3%%n2n2o1P7M6M5N5N4o1o2PPj0j1N9N8m3m2p7p8J3J2J2J3J4J5J4J5onO4O3
223A517N4N3o1o1r6r6k7k7P7P6QQOOM0M0k7k8k8k8n1n0O4O3k2k2k2k2K7K7m2m2K7K7K8K7l7
218A386l8lmm6m7O7O8POPPK4K5K4K5l6l5jjJ06J06Q2j46j78m1K8K9o4o3o4o3M3M3M3M3J0J0
$$ plain form
212 1359 1369 1379 1396 1412 1359 1307 1371 1435 1465 1495 1491 1488 1416 1344 1265 1187 1223 1259 1344 1428 1398 1369 1410 1451 1377 1304 1328 1352 1342 1332 1347 1361 1376 1391 1456 1520
207 1520 1516 1511 1457 1403 1418 1433 1424 1415 1431 1448 1534 1482 1362 1379 1396 1412 1437 1462 1524 1586 1487 1388 1409 1430 1408 1523 1469 1414 1368 1323 1326 1329 1255 1319 1376 1433 1376
201 1376 1319 1359 1261 1207 1152 1130 1108 1200 1293 1325 1358 1496 1635 1686 1599 1513 1564 1570 1576 1476 1376 1391 1407 1465 1524 1478 1571 1594 1481 1525 1569 1568 1429
196 1429 1382 1335 1348 1361 1306 1252 1275 1161 1371 1581 1586 1590 1440 1429 1500 1572 1492 1413 1448 1484 1448 1411 1375 1339 1370 1401 1424 1446 1538 1491 1522 1554 1561 1568 1489
191 1489 1548 1607 1528 1458 1525 1486 1448 1417 1387 1331 1276 1288 1301 1270 1239 1277 1314 1388 1463 1422 1382 1374 1367 1334 1301 1263 1363 1506 1511 1437 1500 1512 1525 1461 1398
185 1398 1450 1501 1479 1456 1399 1342 1359 1377 1429 1481 1442 1403 1433 1463 1482 1501 1564 1488 1445 1402 1316 1230 1166 1102 1199 1296 1355 1415 1363 1449 1431 1413 1378 1344 1291
180 1291 1376 1384 1392 1413 1435 1456 1478 1417 1356 1410 1464 1455 1445 1478 1374 1326 1278 1337 1395 1464 1533 1487 1442 1461 1481 1354 1365 1290 1215 1286 1220 1244 1131 1072 1242
174 1242 1282 1322 1299 1276 1342 1270 1199 1264 1317 1370 1317 1264 1261 1258 1196 1133 1183 1371 1413 1455 1455 1455 1455 1456 1447 1439 1430 1422 1421 1420 1350 1280 1320 1360 1286 1212 1195 1179 1277 1375
$$ packed form
212A359J0J0J7J6n3n2O4O4L0L0mlp2p2p9p8L6L6Q5Q4l0k9M1M1p4p3K4K4j0j0J5J4J5J5O5O4
207A520mnn4n4J5J5rrJ6J7Q6n2j20J7J7J6K5K5O2O2r9r9K1K1k2J15n4n5m6m5LLp4O4N7N7n7
201A376n7M0r8n4n5k2k2R2R3L2L3J38J39N1q7q6N1OOj00j00J5J6N8N9m6R3K3j13M4M4jj39
196A429m7m7J3J3n5n4K3j14K10K10NMj50j1P1P2q0p9L5L6l6l7l6l6L1L1K3K2R2m7L1L2PPp9
191A489N9N9p9p0O7l9l8l1l0n6n5J2J3l1l1L8L7P4P5m1m0qpl3l3l8J00J43Np4O3J2J3o4o3
185A398N2N1k2k3n7n7J7J8N2N2l9l9L0L0J9J9O3p6m3m3q6q6o4o4R7R7N9O0n2Q6j8j8l5l4n3
180A291Q5QQK1K2K1K2o1o1N4N4rj0L3j04m8m8N9N8O9O9m6m5J9K0j27J1p5p5P1o6K4j13n9J70
174A242M0M0k3k3O6p2p1O5N3N3n3n3llo2o3N0J88M2M2%%%Jrqrqjjp0p0M0M0p4p4j7j6R8R8
$$ plain form
168 1375 1336 1297 1327 1357 1395 1433 1497 1561 1508 1317 1332 1485 1460 1435 1453 1471 1393 1316 1353 1391 1356 1320 1354 1388 1351 1315 1347 1379 1382 1384 1386 1388 1307 1225 1304 1383
163 1383 1361 1340 1353 1366 1421 1476 1531 1587 1487 1388 1289 1190 1223 1255 1288 1321 1285 1250 1215 1179 1320 1461 1441 1422 1404 1387 1369 1352 1425 1498 1456 1414 1393
158 1393 1372 1282 1192 1215 1239 1262 1286 1366 1447 1459 1471 1486 1500 1480 1459 1352 1244 1251 1258 1232 1206 1249 1292 1261 1231 1166 1101 1186 1270 1286 1302 1423 1544 1504
153 1504 1464 1462 1460 1424 1387 1399 1410 1352 1295 1315 1334 1320 1305 1380 1454 1414 1373 1293 1214 1203 1192 1235 1278 1321 1364 1356 1347 1339 1330 1351 1371 1322 1274 1232 1191 1264 1337 1346
147 1346 1354 1431 1509 1424 1339 1292 1382 1323 1263 1221 1179 1241 1439 1437 1435 1493 1413 1410 1407 1388 1370 1351 1333 1348 1363 1379 1394 1405 1417 1428 1439 1463 1488 1443 1399 1403 1407 1411
141 1411 1416 1330 1244 1318 1393 1352 1312 1387 1461 1461 1461 1375 1427 1509 1454 1407 1498 1463 1428 1367 1306 1299 1291 1353 1415 1345 1275 1366 1457 1383 1309 1304 1299 1326 1354 1304 1392 1379
135 1379 1365 1360 1354 1335 1315 1295 1275 1311 1347 1374 1402 1443 1346 1396 1445 1355 1265 1132 1137 1226 1316 1300 1283 1336 1390 1374 1358 1353 1349 1412 1476 1447 1418 1389 1359 1321 1282
130 1282 1364 1583 1607 1494 1535 1577 1521 1466 1496 1389 1310 1370 1403 1436 1497 1421 1422 1423 1492 1560 1514 1468 1376 1283 1305 1328 1327 1326 1257 1187 1348 1508 1553 1599
$$ packed form
168A375l9l9L0L0L8L8O4O4n3j91J5J53k5k5J8J8p8p7L7L8l5l6L4L4l7l6L2L2LKKKq1q2P9P9
163A383k2k1J3J3N5N5N5N6j00r9r9r9L3L2L3L3l6l5l5l6J41J41k0j9j8j7j8j7P3P3m2m2k1
158A393k1r0r0K3K4K3K4Q0Q1J2J2J5J4k0k1j07j08PPk6k6M3M3l1l0o5o5Q5Q4J6J6J21J21m0
153A504m0kkl6l7J2J1n8n7K0J9j4j5P5P4m0m1q0p9j1j1M3M3M3M3qrqrK1K0m9m8m2m1P3P3R
147A346QP7P8q5q5m7R0n9o0m2m2O2J98kkN8q0llj9j8j9j8J5J5J6J5J1J2J1J1K4K5m5m4MMM
141A411Nq6q6P4P5m1m0P5P4%%q6N2Q2n5m7R1l5l5o1o1pqO2O2p0p0R1R1p4p4nnK7K8n0Q8j3
135A379j4noj9k0k0k0L6L6K7K8M1r7N0M9r0r0j33NQ9R0j6j7N3N4j6j6nmO3O4k9k9k9l0l8l9
130A282Q2K19K4j13M1M2n6n5L0j07p9O0L3L3O1p6JJO9O8m6m6r2r3K2K3jjo9p0J61J60M5M6
$$ plain form
124 1599 1477 1355 1301 1248 1275 1303 1321 1340 1464 1450 1394 1475 1509 1405 1241 1214 1333 1451 1463 1475 1480 1485 1464 1443 1351 1396 1433 1470 1400 1329 1328 1326 1334 1343
119 1343 1351 1359 1364 1369 1388 1178 1208 1239 1255 1271 1178 1084 1105 1126 1196 1265 1335 1405 1428 1451 1359 1267 1277 1288 1367 1447 1441 1436 1465 1494 1503 1513 1600 1549 1471 1394 1377 1359
113 1359 1343 1327 1418 1508 1585 1525 1474 1423 1484 1545 1563 1582 1488 1257 1180 1104 1103 1239 1427 1386 1419 1453 1541 1628 1574 1519 1353 1324 1338 1353 1454 1417 1431
108 1431 1445 1451 1456 1383 1311 1376 1303 1361 1281 1210 1138 1114 1227 1409 1454 1392 1329 1430 1302 1230 1295 1337 1380 1375 1370 1399 1429 1463 1497 1609 1584 1498 1413 1434
103 1434 1455 1438 1421 1404 1386 1374 1362 1350 1338 1339 1340 1384 1290 1339 1388 1359 1331 1296 1261 1340 1420 1441 1462 1414 1366 1367 1369 1499 1400 1384 1369 1374 1379 1358 1336 1507 1540
98 1540 1511 1481 1399 1455 1457 1459 1400 1342 1215 1089 1214 1340 1396 1452 1471 1352 1339 1326 1305 1283 1290 1296 1379 1325 1349 1372 1378 1384 1423 1325 1295 1265 1385 1368 1428
92 1428 1489 1422 1355 1403 1451 1337 1224 1317 1410 1409 1409 1435 1460 1535 1473 1373 1273 1310 1346 1375 1403 1512 1485 1333 1320 1471 1485 1424 1363 1348 1334 1431 1391
87 1391 1380 1369 1349 1329 1393 1457 1521 1585 1605 1626 1577 1529 1516 1504 1629 1616 1618 1482 1483 1485 1392 1299 1275 1251 1268 1286 1371 1457 1464 1470 1408 1345 1333 1321 1266 1348 1358
$$ packed form
124A599j22j22n4n3K7K8J8J9J24j4n6Q1L4j04j64k7J19J18J2J2NNk1k1r2M5L7L7p0p1jkQR
119A343QQNNJ9k10L0L1J6J6r3r4K1K1P0O9P0P0K3K3r2r2J0J1P9Q0onK9K9RJ0Q7n1p8p7j7j8
113A359j6j6R1R0P7o0n1n1O1O1J8J9r4k31p7p6jJ36J88m1L3L4Q8Q7n4n5j66k9J4J5J01l7J4
108A431J4ONp3p2O5p3N8q0p1p2k4J13J82M5o2o3J01j28p2O5M2M3nnK9L0L4L4J12k5q6q5K1
103A434K1j7j7j7j8j2j2j2j2JJM4r4M9M9k9k8l5l5P9Q0K1K1m8m8JKJ30r9j6j5NNk1k2J71L3
98A540k9l0q2N6KKn9n8j27j26J25J26N6N6J9j19j3j3k1k2POQ3n4K4K3OOL9r8l0l0J20j7O0
92A428O1o7o7M8M8j14j13R3R3j%K6K5P5o2j00j00L7L6K9K8J09k7j52j3J51J4o1o1j5j4R7m0
87A391j1j1k0k0O4O4O4O4K0K1m9m8j3j2J25j3Kj36JKr3r3k4k4J7J8Q5Q6POo2o3j2j2n5Q2J0
$$ plain form
82 1358 1368 1378 1388 1443 1361 1356 1351 1368 1385 1401 1418 1623 1827 1863 1898 1834 1633 1509 1384 1364 1344 1359 1373 1406 1438 1479 1382 1332 1281 1322 1364 1540 1486
77 1486 1447 1408 1459 1510 1446 1383 1451 1519 1587 1655 1546 1436 1327 1217 1338 1459 1466 1472 1437 1403 1445 1350 1297 1243 1250 1257 1346 1436 1411 1387 1398 1409 1420 1431
71 1431 1458 1485 1521 1419 1416 1413 1401 1390 1408 1426 1452 1478 1437 1534 1485 1435 1411 1386 1362 1337 1335 1333 1400 1466 1448 1430 1524 1480 1423 1365 1377 1251 1204 1158 1209 1260
66 1260 1391 1385 1378 1372 1408 1306 1282 1258 1330 1401 1473 1545 1508 1470 1433 1395 1393 1392 1467 1406 1370 1334 1359 1383 1466 1550 1481 1412 1297 1319 1507 1466 1402 1338 1328 1319
60 1319 1381 1442 1398 1354 1481 1745 1976 2206 2531 2995 3527 4059 4305 4322 3993 3342 2719 2234 2010 1924 1851 1779 1647 1514 1568 1622 1561
56 1561 1500 1456 1412 1437 1462 1487 1511 1552 1456 1339 1359 1399 1439 1475 1374 1351 1327 1327 1327 1362 1396 1338 1279 1298 1317 1242 1304 1403 1502 1502 1503 1288 1395 1484 1573
51 1573 1568 1562 1539 1516 1468 1419 1440 1598 1518 1439 1413 1387 1430 1472 1466 1461 1455 1449 1457 1466 1475 1484 1441 1398 1364 1329 1307 1422 1459 1497 1389 1281 1380 1478 1448 1418 1345 1409
45 1409 1382 1356 1338 1320 1390 1460 1415 1370 1393 1415 1369 1323 1268 1213 1226 1240 1201 1162 1104 1045 1010 1205 1348 1354 1350 1346 1342 1339 1420 1639 1573 1508 1507 1506 1505 1503 1479 1455
$$ packed form
82A358J0J0J0N5q2nnJ7J7J6J7K05K04L6L5o4k01j24j25k0k0J5J4L3L2M1r7n0n1M1M2J76n4
77A486l9l9N1N1o4o3O8O8O8O8j09j10j09j10J21J21POl5l4M2r5n3n4PPQ9R0k5k4J1J1J1J1
71A431K7K7L6j02llj2j1J8J8K6K6m1R7m9n0k4k5k4k5kkO7O6j8j8R4m4n7n8J2j26m7m6N1N1
66A260J31opoL6j02k4k4P2P1P2P2l7l8l7l8kjP5o1l6l6K5K4Q3Q4o9o9j15K2J88m1o4o4j0r
60A319O2O1m4m4J27K64K31K30L25M64N32N32K46J7l29o51o23m85k24q6p3p2j32j33N4N4o1
56A561o1m4m4K5K5K5K4M1r6j17K0M0M0L6j01k3k4%%L5L4n8n9J9J9p5O2R9R9%Jk15J07Q9Q9
51A573nok3k3m8m9K1J58q0p9k6k6M3M2onooQRRRm3m3l4l5k2J15L7L8j08j08R9R8l0l0p3O4
45A409k7k6j8j8P0P0m5m5K3K2m6m6n5n5J3J4l9l9n8n9l5J95J43OmmmlQ1K19o6o5jjjkk4k4
$$ plain form
39 1455 1388 1459 1403 1346 1290 1371 1327 1283 1256 1229 1303 1514 1409 1443 1463 1484 1514 1543 1474 1405 1418 1570 1602 1634 1560 1486 1465 1444 1431 1419 1408 1536 1531 1526
34 1526 1390 1484 1448 1412 1405 1397 1433 1468 1403 1476 1411 1346 1294 1380 1369 1358 1360 1591 1665 1602 1501 1539 1504 1470 1376 1510 1531 1551 1426 1530 1574 1618 1632 1646
29 1646 1462 1508 1485 1463 1532 1601 1581 1699 1588 1476 1396 1454 1512 1569 1453 1475 1503 1530 1422 1542 1542 1542 1408 1412 1253 1322 1328 1471 1452 1432 1216 1230
24 1230 1298 1504 1464 1562 1522 1620 1517 1552 1526 1501 1498 1633 1499 1503 1541 1578 1599 1620 1545 1608 1559 1647 1561 1613 1466 1549 1573 1597 1503 1547 1483 1649 1617
19 1617 1722 1705 1688 1558 1658 1637 1754 1670 1723 1654 1723 1625 1664 1498 1560 1551 1542 1459 1605 1573 1542 1313 1405 1357 1538 1527 1654 1580 1643 1604 1702 1533
14 1533 1594 1619 1644 1454 1494 1492 1719 1556 1623 1485 1576 1443 1540 1433 1648 1696 1881 1772 1800 1547 1707 1671 1956 1817 1908 1736 1885 1788
10 1788 1920 1875 2060 1969 2016 1840 2168 2067 2286 1990 2106 1902 1926 1898 2192 2106 2159 1800 1854 1718 2271 2452 3137 3704 4501 5009
6 5009 5516 5361 5619 5490 5956 5953 6637 6771 7227 7223 7999 8638 10056 11858 16458 22047 25204 24757 21879 16908 15194 14259 15571
$$ packed form
39A455o7P1n6n7n6Q1m4m4k7k7P4K11j05L4K0K1L0K9o9o9J3J52L2L2p4p4k1k1j3j2j1J28nn
34A526j36R4l6l6pqL6L5o5P3o5o5n2Q6j1j1KK31P4o3j01L8l5l4r4J34K1K0j25J04M4M4J4J4
29A646j84M6k3k2O9O9k0J18j11j12q0N8N8N7j16K2K8K7j08J20%%j34Mj59O9OJ43j9k0k16J4
24A230O8K06m0R8m0R8j03L5k6k5lJ35j34ML8L7K1K1p5O3m9Q8q6N2j47Q3K4K4r4M4o4J66l2
19A617J05j7j7j30J00k1J17q4N3o9O9r8L9j66O2rrq3J46l2l1k29R2m8J81j1J27p4O3l9R8j69
14A533O1K5K5j90M0kK27j63O7j38R1j33R7j07K15M8J85j09K8k53J60l6K85j39R1j72J49r7
10A788J32m5J85r1M7j76L28j01K19k96J16k04K4k8K94q6N3l59N4j36N53J81O85N67P97N08
6E009N07j55K58j29M66lO84J34M56mP76O39J418J802M600N589L157m47k878m971j714r35J312
$$ plain form
2 15571 16465 19056 21113 25326 29613 37614 46785 61138 77371 102546 137163 202276 318750 527721 684047
0 684047 693302 596264 373434 209940 131424 92678 70947 57968 47329 39043 31445 25956 21430 18806 16594
-2 16594 15620 14509 14267 14437 16745 21117 24334 23653 20404 14082 9943 7409 6226 5112 4583 3826 3660 3356 3226 2958
-5 2958 2979 2930 3131 2918 3381 4348 5141 4788 4526 4332 4313 3974 3736 3361 3209 3057 3034 2874 2787 2562 2598 2634 2763 2663 2604 2614 2680
-9 2680 2518 2453 2389 2284 2178 2265 2214 2168 2123 2199 2045 2087 2130 2089 2048 2013 1978 2011 2045 2035 2026 2017 2007 2009 2011 2004 1997 2016 1897 1856 1814 1832 1849 1867 1884 1873
-15 1873 1862 1859 1857 1777 1836 1817 1798 1799 1800 1732 1664 1752 1841 1769 1697 1677 1658 1639 1620 1670 1719 1614 1646 1737 1691 1585 1617 1593 1568 1510 1589 1716 1843 1735
-20 1735 1627 1430 1370 1348 1326 1320 1315 1241 1397 1527 1520 1412 1442 1550 1658 1663 1805 1707 1609 1588 1567 1553 1538 1592 1647 1615 1584 1475 1503 1525 1547 1544 1540
-25 1540 1531 1523 1629 1735 1668 1601 1603 1605 1608 1612 1546 1480 1461 1441 1536 1631 1695 1759 1708 1658 1629 1601 1573 1544 1575 1606 1671 1737 1605 1473 1456 1439 1412 1385 1395 1542
$$ packed form
2A5571Q94K591K057M213M287Q001R171J4353J6233K5175L4617O5113J16474K08971J56326
0F84047R255r7038k22830j63494p8516l8746k1731j2979j0639q286p598n489m526k624k212
-2A6594r74j111k42J70K308M372L217o81l249o322m139k534j183j114n29p57j66l04j30k68
-5B958K1m9K01k13M63R67P93l53k62j94j9l39k38l75j52j52k3j60q7k25L6L6J29j00n9J0O6
-9B680j62o5o4j05j06Q7n1m6m5P6j54M2M3m1m1l5l5L3L4j0rrj0KKppJ9j19m1m2J8J7J8J7j1
-15A873j1lkq0N9j9j9JJo8o8Q8Q9p2p2k0j9j9j9N0M9j05L2R1m6j06L2k4k5n8P9J27J27j08
-20A735j08j97o0k2k2onp4J56J30pj08L0J08J08NJ42r8r8k1k1j4j5N4N5l2l1j09K8K2K2lm
-25A540rqJ06J06o7o7KKLMo6o6j9k0R5R5O4O4n1n0k9k8k8k9L1L1O5O6j32j32j7j7k7k7J0J47
$$ plain form
-31 1542 1581 1620 1381 1463 1469 1613 1594 1575 1481 1526 1381 1374 1413 1452 1431 1409 1388 1367 1337 1445 1393 1341 1255 1306 1404 1502 1411 1549 1560 1571 1596 1622 1579
-36 1579 1536 1528 1520 1548 1577 1536 1496 1430 1364 1381 1535 1565 1595 1599 1603 1602 1601 1454 1445 1516 1588 1553 1519 1497 1474 1418 1361 1337 1313 1275 1467 1472 1478 1498 1518 1558 1598 1532
-41 1532 1466 1428 1527 1515 1503 1508 1513 1325 1276 1324 1372 1394 1416 1457 1498 1484 1470 1450 1660 1671 1683 1593 1503 1451 1536 1485 1433 1433 1433 1385 1474 1486 1498 1489 1480 1411 1342
-47 1342 1242 1279 1307 1335 1349 1364 1240 1254 1297 1477 1505 1396 1388 1380 1397 1415 1486 1556 1498 1669 1638 1608 1600 1593 1501 1547 1438 1466 1504 1542 1476 1549 1431
-52 1431 1314 1366 1417 1415 1414 1386 1358 1291 1362 1389 1417 1518 1618 1559 1499 1514 1528 1397 1403 1522 1642 1655 1668 1652 1636 1620 1604 1523 1443 1477 1511 1413 1316
-57 1316 1333 1350 1485 1620 1694 1769 1755 1880 1827 1773 1821 2097 2368 2638 3068 3635 4074 4283 4234 3864 3376 2889 2342 2024 1890 1893 1800
-61 1800 1707 1614 1659 1603 1547 1499 1451 1408 1364 1396 1564 1663 1624 1534 1581 1490 1535 1444 1352 1375 1399 1345 1429 1364 1299 1319 1340 1339 1476 1458 1578 1518 1457 1474
-66 1474 1492 1482 1473 1300 1357 1386 1415 1516 1480 1338 1426 1445 1464 1405 1345 1328 1312 1252 1329 1444 1559 1549 1540 1471 1401 1322 1379 1360 1340 1239 1138 1111
$$ packed form
-31A542L9L9k39Q2OJ44j9j9r4M5j45pL9L9k1k2k1k1l0J08n2n2q6N1R8R8r1J38J1J1K5K6m3
-36A579m3qqK8K9m1m0o6o6J7J54L0L0MMjjj47rP1P2l5l4k2k3n6n7k4k4l8J92NOK0K0M0M0o6
-41A532o6l8R9j2j2NNj88m9M8M8K2K2M1M1j4j4k0K10J1J2r0r0n2Q5n1n2%%m8Q9J2J2rro9o9
-47A342j00L7K8K8J4J5j24J4M3J80K8j09qqJ7J8P1P0n8J71l1l0qpr2M6j09K8L8L8o6P3j18
-52A431j17N2N1kjk8k8o7P1K7K8J01J00n9o0J5J4j31OJ19J20J3J3j6j6j6j6q1q0L4L4r8r7
-57A316J7J7J35J35P4P5j4J25n3n4M8K76K71K70M30N67M39K09m9l70m88m87n47l18j34Lr3
-61A800r3r3M5n6n6m8m8m3m4L2J68R9l9r0M7r1M5r1r2K3K4n4Q4o5o5K0K1jJ37j8J20o0o1J7
-66A474J8j0rj73N7K9K9J01l6j42Q8J9J9n9o0j7j6o0P7J15J15j0ro9p0p9N7j9k0j01j01k7
$$ plain form
-71 1111 1222 1369 1378 1405 1431 1411 1391 1406 1420 1397 1374 1282 1190 1214 1237 1329 1422 1397 1373 1417 1461 1409 1356 1261 1303 1340 1377 1336 1433 1455 1340 1233 1263
-76 1263 1289 1315 1350 1385 1350 1316 1350 1384 1440 1496 1518 1540 1461 1382 1363 1344 1412 1342 1221 1328 1355 1381 1361 1341 1328 1451 1437 1423 1353 1421 1480 1539 1516
-81 1516 1493 1470 1448 1498 1549 1531 1513 1475 1436 1432 1428 1437 1445 1394 1343 1285 1364 1332 1300 1313 1326 1339 1352 1307 1261 1362 1325 1358 1391 1347 1303 1353 1402 1337 1271 1338
-87 1338 1405 1434 1326 1418 1511 1475 1301 1277 1390 1384 1377 1355 1334 1459 1446 1449 1451 1514 1577 1551 1526 1424 1459 1406 1354 1379 1404 1358 1311 1379 1447 1458 1468 1410
-92 1410 1352 1337 1323 1368 1413 1487 1424 1360 1297 1397 1360 1254 1286 1276 1267 1265 1264 1386 1508 1515 1522 1516 1511 1445 1379 1306 1370 1417 1465 1475 1347 1334 1459 1477 1496
-97 1496 1408 1321 1333 1346 1359 1371 1380 1389 1397 1406 1402 1398 1402 1407 1452 1634 1610 1449 1431 1414 1457 1499 1470 1441 1300 1297 1279 1262 1254 1245 1235 1225 1215 1205 1223 1241 1371 1363 1355
-103 1355 1347 1400 1453 1394 1336 1346 1357 1407 1457 1401 1345 1197 1187 1252 1316 1311 1168 1139 1249 1331 1414 1391 1367 1369 1370 1337 1304 1354 1405 1516 1397 1352 1307 1362
-109 1362 1417 1406 1395 1530 1528 1432 1337 1394 1450 1420 1390 1409 1427 1568 1387 1224 1290 1281 1273 1353 1204 1158 1341 1475 1380 1345 1310 1295 1281 1309 1337 1382
$$ packed form
-71A111J11J47RK7K6k0k0J5J4k3k3r2r2K4K3R2R3k5k4M4M4n2n3r5M2L7L7m1R7K2j15j07L0
-76A263K6K6L5L5l5l4L4L4N6N6K2K2p9p9j9j9O8p0j21J07K7K6k0k0j3J23j4j4p0O8N9N9k3
-81A516k3k3k2N0N1j8j8l8l9mmRQn1n1n8P9l2l2J3J3J3J3m5m6J01l7L3L3m4m4N0M9o5o6O7
-87A338O7K9j08R2R3l6j74k4J13opk2k1J25j3LKO3O3k6k5j02L5n3n2K5K5m6m7O8O8J1J0n8
-92A410n8j5j4M5M5P4o3o4o3J00l7j06L2j0rkjJ22J22PPono6o6p3O4M7M8J0j28j3J25J8J9
-97A496q8q7J2J3J3J2RRQRmmMNM5J82k4j61j8j7M3M2k9k9j41lj8j7qrj0j0j0j0J8J8J30qq
-103A355qN3N3n9n8J0J1N0N0n6n6j48j0O5O4nj43k9J10Q2Q3k3k4KJl3l3N0N1J11j19m5m5N5
-109A362N5j1j1J35kr6r5N7N6l0l0J9J8J41j81j63O6rqQ0j49m6J83J34r5l5l5j5j4K8K8M5
$$ plain form
-113 1382 1290 1255 1358 1487 1478 1443 1409 1435 1460 1422 1383 1490 1460 1411 1362 1338 1315 1328 1340 1378 1417 1398 1241 1190 1277 1330 1246 1256 1129 1116 1103 1196
-118 1196 1289 1330 1372 1336 1300 1420 1403 1395 1386 1354 1323 1360 1397 1311 1225 1253 1281 1368 1454 1334 1214 1256 1297 1373 1450 1396 1342 1403 1464 1476 1487 1429 1372 1326
-124 1326 1280 1394 1508 1451 1393 1405 1416 1420 1424 1419 1415 1437 1321 1351 1381 1387 1393 1407 1284 1378 1473 1435 1397 1529 1523 1471 1419 1486 1416 1354 1292 1269 1245 1405 1427
-129 1427 1473 1382 1385 1389 1472 1417 1371 1325 1241 1157 1279 1401 1412 1422 1450 1340 1353 1503 1498 1493 1428 1363 1341 1319 1260 1338 1374 1409 1426 1443 1451 1459 1467 1338 1314
-134 1314 1429 1522 1478 1485 1493 1475 1458 1510 1561 1451 1342 1301 1260 1315 1370 1310 1250 1326 1402 1363 1324 1286 1248 1322 1258 1253 1248 1341 1433 1475 1379 1413 1308 1242
-139 1242 1313 1358 1404 1484 1427 1378 1329 1346 1363 1466 1432 1371 1448 1438 1429 1405 1380 1528 1446 1325 1341 1426 1511 1443 1374 1286 1197 1077 1185 1311 1299 1280
-144 1280 1260 1232 1204 1192 1181 1239 1297 1287 1278 1208 1138 1094 1189 1136 1084 1142 1201 1259 1317 1297 1276 1324 1372 1343 1314 1437 1559 1568 1439 1301 1301 1378 1317 1266
-149 1266 1352 1316 1280 1321 1362 1353 1345 1482 1482 1384 1286 1217 1285 1259 1233 1284 1335 1424 1513 1533 1553 1494 1435 1463 1352 1339 1464 1512 1422 1415 1409 1454 1499 1579 1521
$$ packed form
-113A382r2l5J03J29rl5l4K6K5l8l9J07l0m9m9k4k3J3J2L8L9j9j57n1Q7N3q4J0j27j3j3R3
-118A196R3M1M2l6l6J20j7qrl2l1L7L7q6q6K8K8Q7Q6j20j20M2M1P6P7n4n4O1O1J2J1n8n7m6
-124A326m6J14J14n7n8J2J1MMnmK2j16L0L0OOJ4j23R4R5l8l8J32on2n2O7p0o2o2k3k4J60K2
-129A427M6r1LMQ3n5m6m6q4q4J22J22J1J0K8j10J3J50nno5o5k2k2n9P8L6L5J7J7QQQj29k4
-134A314J15R3m4PQj8j7N2N1j10j09m1m1N5N5o0o0P6P6l9l9l8l8P4o4nnR3R2M2r6L4j05o6
-139A242P1M5M6Q0n7m9m9J7J7J03l4o1P7j0rk4k5J48q2j21J6Q5Q5o8o9q8q9j20J08J26j2j9
-144A280k0k8k8j2j1N8N8j0rp0p0m4R5n3n2N8N9N8N8k0k1M8M8k9k9J23J22Rj29j38%P7o1n1
-149A266Q6l6l6M1M1rqJ37%r8r8o9O8k6k6N1N1Q9Q9K0K0n9n9K8j11j3J25M8r0poM5M5Q0n8
$$ plain form
-155 1521 1505 1490 1480 1469 1459 1449 1400 1350 1338 1464 1471 1479 1426 1373 1331 1290 1274 1258 1366 1338 1194 1188 1281 1374 1442 1509 1394 1278 1324 1369 1327 1286 1313
-160 1313 1340 1360 1380 1400 1420 1383 1345 1376 1407 1415 1422 1395 1368 1388 1407 1358 1309 1311 1314 1282 1250 1302 1353 1345 1336 1297 1395 1416 1437 1471 1505 1425 1344 1283 1222 1275 1329
-165 1329 1352 1376 1433 1491 1505 1519 1464 1410 1370 1330 1359 1388 1388 1388 1364 1204 1157 1341 1352 1363 1426 1490 1484 1479 1430 1382 1402 1422 1360 1299 1306 1313 1311 1310 1308 1306 1269 1231
-171 1231 1194 1156 1186 1216 1246 1275 1305 1335 1365 1395 1472 1549 1627 1704 1603 1503 1403 1302 1330 1359 1387 1415 1359 1304 1282 1261 1372 1482 1386 1290 1343
-176 1343 1396 1449 1502 1471 1439 1442 1445 1377 1309 1402 1494 1367 1241 1275 1308 1346 1385 1423 1461 1544 1627 1504 1381 1469 1556 1575 1594 1496 1399 1371 1342 1299 1257
-181 1257 1328 1400 1344 1288 1347 1405 1407 1408 1409 1410 1375 1341 1306 1271 1331 1392 1452 1513 1493 1472 1418 1363 1328 1293 1327 1360 1255 1150 1197 1244 1331 1280 1230 1317 1334
-186 1334 1350 1453 1418 1390 1362 1290 1219 1203 1187 1294 1401 1357 1451 1433 1415 1413 1411 1444 1477 1455 1433 1411 1390 1388 1386 1315 1245 1328 1412 1427 1441 1431 1420 1444 1467
-192 1467 1405 1343 1395 1448 1426 1403 1416 1428 1400 1371 1351 1331 1260 1325 1314 1302 1282 1262 1241 1221 1234 1246 1250 1254 1364 1336 1194 1189 1238 1288 1277 1266 1354 1442 1453
$$ packed form
-155A521j6j5j0j1j0j0m9n0j2J26PQn3n3m2m1j6j6J08k8j44oR3R3O8O7j15j16M6M5m2m1K7
-160A313K7K0K0K0K0l7l8L1L1QPk7k7K0J9m9m9KLl2l2N2N1qrl9R8K1K1L4L4q0q1o1o1N3N4
-165A329K3K4N7N8J4J4n5n4m0m0K9K9%%k4j60m7J84J1J1O3O4onm9m8K0K0o2o1PPkjkkl7l8
-171A231l7l8L0L0L0K9L0L0L0L0P7P7P8P7j01j00j00j01K8K9K8K8n6n5k2k1J11J10r6r6N3
-176A343N3N3N3l1l2LLo8o8R3R2j27j26L4L3L8L9L8L8Q3Q3j23j23Q8Q7J9J9r8r7k8k9m3m2
-181A257P1P2n6n6N9N8KJJJl5l4l5l5O0O1O0O1k0k1n4n5l5l5L4L3j05j05M7M7Q7n1n0Q7J7
-186A334J6J03l5k8k8p2p1j6j6J07J07m4R4j8j8kkL3L3k2k2k2k1kkp1p0Q3Q4J5J4j0j1K4K3
-192A467o2o2N2N3k2k3J3J2k8k9k0k0p1O5j1j2k0k0k1k0J3J2MMJ10k8j42nM9N0j1j1Q8Q8J1
$$ plain form
-197 1453 1463 1523 1444 1443 1443 1457 1472 1418 1364 1425 1486 1395 1304 1270 1373 1331 1288 1209 1129 1132 1273 1262 1252 1318 1384 1406 1427 1388 1349 1233 1254 1267 1280 1318
-202 1318 1356 1326 1295 1267 1239 1212 1184 1213 1242 1270 1299 1328 1357 1386 1415 1382 1350 1317 1285 1338 1391 1454 1516 1415 1451 1411 1370 1401 1432 1463 1493 1508 1522 1537
-207 1537 1551 1429 1308 1255 1202 1246 1291 1335 1380 1366 1353 1313 1274 1206 1276 1337 1398 1422 1446 1435 1425 1302 1178 1124 1070 1220 1370 1351 1331 1396 1323
-212 1323 1190 1286 1392 1360 1222 1313 1352 1391 1401 1412 1443 1336 1376 1416 1414 1412 1341 1270 1320 1370 1304 1239 1214 1188 1231 1274 1197 1120 1166 1212 1125 1176 1265
-217 1265 1353 1373 1393 1525 1520 1484 1448 1326 1342 1397 1452 1433 1276 1235 1195 1137 1217 1286 1355 1398 1442 1477 1511 1340 1168 1208 1248 1287 1327 1338 1348 1359
-222 1359 1369 1363 1356 1350 1343 1304 1265 1312 1222 1171 1259 1375 1491 1368 1244 1236 1228 1290 1351 1299 1246 1304 1362 1421 1479 1478 1478 1477 1477 1410 1342 1189 1173 1285 1259 1205
-228 1205 1151 1210 1269 1251 1371 1374 1378 1536 1556 1430 1303 1274 1245 1382 1382 1383 1383 1385 1250 1227 1203 1280 1356 1441 1526 1441 1494 1470 1446 1388 1330 1272 1214 1252
-233 1252 1289 1292 1294 1282 1270 1318 1366 1482 1460 1447 1433 1455 1477 1479 1481 1238 1224 1319 1276 1248 1219 1296 1373 1325 1277 1298 1319 1282 1246 1166 1224 1241 1257 1308 1359
$$ packed form
-197A453J0O0p9j%J4J5n4n4O1O1r1r1l4J03m2m3p9q0LJ41j1j0O6O6K2K1l9l9j16K1J3J3L8
-202A318L8l0l1k8k8k7k8K9K9K8K9K9K9K9K9l3l2l3l2N3N3O3O2j01L6m0m1L1L1L1L0J5J4J5
-207A537J4j22j21n3n3M4M5M4M5j4j3m0l9o8P0O1O1K4K4j1j0j23j24n4n4J50J50j9k0O5p3
-212A323j33R6J06l2j38R1L9L9J0J1L1j07M0M0kkp1p1N0N0o6o5k5k6M3M3p7p7M6M6q7N1Q9
-217A265Q8K0K0J32nl6l6j22J6N5N5j9j57m1m0n8Q0O9O9M3M4L5L4j71j72M0M0L9M0J1J0J1
-222A359J0opopl9l9M7r0n1Q8J16J16j23j24qqO2O1n2n3N8N8N9N8j%j%o7o8j53j6J12k6n4
-228A205n4N9N9j8J20LMJ58K0j26j27k9k9J37%J%Kj35k3k4P7P6Q5Q5q5N3k4k4n8n8n8n8L8
-233A252L7LKj2j2M8M8J16k2j3j4K2K2KKk43j4R5m3k8k9P7P7m8m8K1K1l7l6q0N8J7J6N1N1
$$ plain form
-238 1359 1400 1303 1206 1247 1332 1417 1364 1449 1458 1467 1502 1399 1248 1235 1250 1266 1293 1320 1261 1339 1379 1281 1269 1257 1336 1416 1381 1346 1269 1193 1231 1269 1290 1312
-243 1312 1376 1303 1281 1258 1296 1333 1388 1443 1383 1323 1309 1294 1313 1333 1301 1270 1239 1208 1280 1353 1311 1269 1277 1284 1326 1368 1332 1296 1328 1361 1359 1358 1356 1354 1340 1325 1346
-249 1346 1366 1345 1324 1372 1420 1436 1453 1469 1485 1354 1224 1253 1283 1269 1256 1276 1297 1287 1277 1266 1256 1331 1406 1413 1419 1420 1420 1306 1192 1180 1169 1157 1146 1269
-254 1269 1392 1354 1317 1343 1369 1395 1421 1414 1407 1469 1530 1452 1374 1410 1447 1395 1343 1326 1308 1319 1329 1339 1349 1345 1340 1335 1330 1304 1278 1252 1226 1303 1380 1342 1305 1377 1449
-260 1449 1314 1180 1195 1210 1385 1560 1445 1331 1377 1423 1405 1388 1371 1354 1326 1298 1270 1242 1236 1230 1223 1217 1204 1191 1238 1286 1345 1266 1187 1246 1295 1344 1278
-265 1278 1212 1273 1197 1155 1250 1269 1287 1374 1461 1509 1419 1441 1463 1379 1294 1253 1212 1134 1193 1299 1405 1327 1387 1404 1421 1406 1391 1307 1223 1178 1133 1203 1273
-270 1273 1257 1242 1286 1330 1439 1410 1267 1261 1327 1393 1353 1313 1275 1237 1305 1373 1440 1369 1332 1296 1361 1289 1329 1369 1362 1354 1347 1340 1334 1329 1453 1347 1310 1272 1255 1238
-275 1238 1197 1157 1269 1380 1472 1427 1390 1354 1321 1287 1323 1359 1372 1386 1442 1361 1398 1435 1349 1263 1317 1371 1310 1249 1269 1290 1242 1194 1142 1089 1143 1197 1273
$$ packed form
-238A359M1r7r7M1Q5Q5n3Q5RRL5j03j51j3J5J6K7K7n9P8M0r8j2j2P9Q0l5l5p7p6L8L8K1K2
-243A312O4p3k2k3L8L7N5N5o0o0j4j5J9K0l2l1l1l1P2P3m2m2QPM2M2l6l6L2L3kjkkj4j5K1
-249A346K0k1k1M8M8J6J7J6J6j31j30K9L0j4j3K0K1j0j0j1j0P5P5POJ%j14j14j2j1j2j1J23
-254A269J23l8l7K6K6K6K6ppO2O1p8p8L6L7n2n2j7j8J1J0J0J0mnnnk6k6k6k6P7P7l8l7P2P2
-260A449j35j34J5J5J75J75j15j14M6M6j8j7j7j7k8k8k8k8oopoj3j3M7M8N9p9p9N9M9M9o6
-265A278o6O1p6m2R5J9J8Q7Q7M8r0K2K2q4q5m1m1p8N9J06J06p8O0J7J7j5j5q4q4m5m5P0P0
-270A273j6j5M4M4J09k9j43oO6O6m0m0l8l8O8O8O7p1l7l6O5p2M0M0pqpponJ24j06l7l8j7j7
-275A238m1m0J12J11R2m5l7l6l3l4L6L6J3J4N6q1L7L7q6q6N4N4o1o1K0K1m8m8n2n3N4N4P6
$$ plain form
-280 1273 1212 1151 1228 1282 1335 1329 1322 1267 1212 1156 1101 1268 1435 1381 1190 1178 1167 1216 1265 1320 1374 1438 1363 1290 1218 1205 1192 1161 1130 1167 1205 1229 1253 1278
-286 1278 1302 1378 1454 1416 1377 1355 1333 1396 1323 1210 1235 1289 1343 1325 1306 1357 1407 1369 1330 1326 1322 1316 1310 1415 1383 1366 1348 1287 1227 1270 1313 1321 1330 1302 1274 1349
-291 1349 1195 1120 1182 1221 1261 1278 1295 1312 1329 1380 1431 1368 1305 1383 1462 1457 1315 1275 1235 1255 1275 1226 1177 1243 1309 1370 1430 1376 1322 1320 1317 1246 1175 1217 1259
-296 1259 1370 1480 1481 1481 1358 1235 1329 1285 1318 1351 1366 1382 1440 1360 1369 1378 1447 1516 1501 1487 1403 1319 1279 1238 1189 1278 1366 1455 1437 1420 1354 1287 1290 1293 1266
-302 1266 1239 1247 1254 1342 1429 1448 1467 1409 1352 1260 1169 1194 1219 1176 1132 1150 1168 1220 1273 1374 1475 1461 1448 1487 1525 1573 1483 1478 1473 1390 1308 1291 1274 1257 1240
-307 1240 1247 1254 1286 1319 1330 1203 1190 1315 1293 1270 1317 1363 1355 1209 1178 1285 1304 1324 1283 1243 1176 1110 1195 1281 1439 1459 1405 1351 1282 1351 1343 1334 1313 1291
-312 1291 1260 1230 1211 1055 1136 1218 1256 1294 1264 1234 1219 1204 1190 1175 1210 1245 1203 1160 1305 1312 1362 1412 1340 1268 1197 1125 1248 1371 1334 1296 1356 1416 1433
-317 1433 1450 1455 1323 1311 1299 1316 1470 1556 1504 1402 1301 1351 1402 1389 1376 1355 1333 1421 1371 1206 1179 1196 1213 1238 1264 1351 1438 1411 1383 1303 1223 1203
$$ packed form
-280A273o1o1P7N4N3opn5n5n6n5J67J67n4j91j2j1M9M9N5N4O4p5p3p2j3j3l1l1L7L8K4K4K5
-286A278K4P6P6l8l9k2k2O3p3j13K5N4N4j8j9N1N0l8l9mmooJ05l2j7j8o1o0M3M3QRk8k8P5
-291A349j54p5O2L9M0J7J7J7J7N1N1o3o3P8P9nj42m0m0K0K0m9m9O6O6O1O0n4n4klp1p1M2M2
-296A259J11J10J%j23j23R4m4L3L3J5J6N8q0RRO9O9j5j4q4q4m0m1m9Q9Q8Q9j8j7o6o7LLk7
-302A266k7QPQ8Q7J9J9n8n7r2r1K5K5m3m4J8J8N2N3J01J01j4j3L9L8M8r0nnq3q2j7j7j7j7
-307A240PPL2L3J1j27j3J25k2k3M7M6qj46l1J07J9K0m1m0o7o6Q5Q6J58K0n4n4o9O9qrk1k2
-312A291l1l0j9j56Q1Q2L8L8l0l0j5j5j4j5L5L5m2m3J45PN0N0p2p2p1p2J23J23l7l8O0O0J7
-317A433J7Nj32j2j2J7J54Q6n2j02j01N0N1j3j3k1k2Q8n0j65k7J7J7K5K6Q7Q7k7k8q0q0k0
$$ plain form
-322 1203 1184 1147 972 1081 1191 1289 1387 1362 1337 1332 1189 1152 1253 1363 1336 1196 1286 1408 1529 1513 1497 1368 1377 1386 1395 1404 1552 1507 1462 1381 1300
-327 1300 1253 1207 1251 1296 1272 1247 1208 1169 1199 1228 1282 1336 1330 1324 1235 1284 1256 1228 1233 1239 1287 1198 1118 1038 1196 1216 1109 1138 1188 1238 1272 1170 1144 1119 1215
-332 1215 1312 1248 1183 1160 1136 1181 1226 1216 1206 1195 1185 1205 1225 1279 1334 1262 1191 1189 1187 1247 1308 1300 1291 1328 1364 1297 1367 1283 1336 1355 1373 1400 1428 1386 1345 1356
-338 1356 1368 1379 1391 1422 1452 1397 1480 1535 1453 1423 1393 1433 1474 1445 1417 1385 1353 1389 1426 1419 1413 1407 1400 1389 1378 1289 1338 1326 1314 1422 1393 1377 1362 1407 1452 1421
-343 1421 1390 1325 1259 1250 1241 1223 1343 1293 1243 1201 1160 1204 1249 1294 1338 1352 1366 1379 1393 1393 1392 1357 1322 1380 1437 1334 1231 1217 1203 1189 1175 1202 1229 1257 1284
-349 1284 1281 1277 1273 1270 1226 1182 1139 1095 1164 1233 1293 1353 1344 1198 1052 1043 1106 1169 1241 1312 1300 1289 1363 1300 1243 1324 1319 1314 1389 1464 1378 1293 1230 1167 1178 1327 1483
-354 1483 1502 1446 1390 1357 1323 1212 1238 1217 1195 1217 1238 1169 1099 1067 1172 1160 1148 1297 1446 1538 1492 1408 1325 1279 1233 1187 1141 1198 1255 1227 1335 1431
-359 1431 1390 1365 1341 1331 1321 1310 1300 1327 1355 1382 1409 1320 1231 1349 1467 1428 1389 1351 1312 1310 1308 1306 1304 1295 1285 1276 1267 1280 1293 1458 1622 1574 1387 1356 1324
$$ packed form
-322A203j9l7j75J09J10R8R8k5k5nj43l7J01J10k7j40R0J22J21j6j6j29RRRRJ48m5m5q1q1
-327A300m7m6M4M5k4k5l9l9L0K9N4N4ooq9M9k8k8NOM8q9q0q0J58K0j07K9N0N0L4j02k6k5R6
-332A215R7o4o5k3k4M5M5j0j0j1j0K0K0N4N5p2p1kkO0O1qrL7L6o7P0q4N3J9J8K7K8m2m1J1
-338A356J2J1J2L1L0n5Q3N5q2l0l0M0M1k9k8l2l2L6L7poopj1j1q9M9j2j2J08k9j6j5M5M5l1
-343A421l1o5o6rrj8J20n0n0m2m1M4M5M5M4J4J4J3J4%jl5l5N8N7j03j03j4j4j4j4K7K7K8K7
-349A284lmmlm4m4m3m4O9O9O0O0rj46j46rO3O3P2P1j2j1P4o3n7Q1nnP5P5q6q5o3o3J1J49J56
-354A483J9n6n6l3l4j11K6k1k2K2K1o9p0l2J05j2j2J49J49R2m6q4q3m6m6m6m6N7N7k8J08R6
-359A431m1k5k4j0j0j1j0K7K8K7K7q9q9J18J18l9l9l8l9kkkkrj0rrJ3J3J65J64m8j87l1l2
$$ plain form
-364 1324 1256 1326 1387 1448 1387 1326 1293 1399 1440 1344 1334 1324 1296 1267 1239 1210 1210 1209 1209 1209 1208 1208 1208 1208 1268 1328 1302 1414 1446 1340 1259 1408 1373 1338 1248 1158
-370 1158 1226 1293 1292 1291 1337 1383 1277 1171 1182 1331 1334 1337 1240 1144 1162 1180 1273 1366 1299 1231 1225 1219 1247 1276 1274 1273 1307 1340 1363 1385 1434 1482 1441 1263 1200 1274
-375 1274 1266 1258 1319 1380 1427 1336 1208 1079 1076 1074 1185 1297 1319 1340 1201 1062 1112 1161 1211 1261 1269 1277 1207 1276 1262 1248 1243 1238 1318 1399 1420 1440 1398 1492 1523
-381 1523 1415 1297 1248 1312 1376 1382 1388 1360 1332 1338 1343 1349 1354 1328 1302 1345 1387 1323 1258 1307 1357 1378 1400 1352 1304 1297 1289 1350 1412 1413 1415 1302 1188 1299 1411 1361
-386 1361 1312 1242 1171 1058 1083 1197 1311 1319 1326 1348 1369 1390 1412 1305 1199 1207 1216 1293 1370 1378 1387 1341 1296 1298 1231 1140 1187 1186 1185 1282 1380 1362 1345 1242 1139
-392 1139 1108 1078 1121 1233 1268 1167 1142 1118 1153 1189 1193 1197 1270 1343 1374 1406 1276 1147 1222 1296 1383 1333 1250 1236 1243 1250 1218 1186 1223 1259 1247 1235 1107 1117
-397 1117 1231 1277 1256 1235 1238 1242 1314 1386 1427 1467 1494 1590 1631 1534 1519 1504 1446 1387 1398 1409 1382 1355 1363 1370 1401 1432 1395 1357 1341 1325 1308 1292 1315 1337 1446
-402 1446 1417 1301 1323 1345 1230 1124 1156 1162 1168 1283 1260 1315 1370 1381 1391 1488 1448 1365 1421 1356 1291 1297 1302 1240 1177 1151 1126 1247 1230 1139 1048 1123 1336
$$ packed form
-364A324o8P0O1O1o1o1l3J06M1r6j0j0k8k9k8k9%j%%j%%%O0O0k6J12L2j06q1J49l5l5r0r0
-370A158O8O7jjM6M6j06j06J1J49LLr7r6J8J8R3R3o7o8ooK8K9kjL4L3K3K2M9M8m1j78o3P4
-375A274qqO1O1M7r1j28j29lkJ11J12K2K1j39j39N0M9N0N0QQp0O9j4j4nnQ0Q1K1K0m2R4L1
-381A523j08j18m9O4O4OOk8k8ONONk6k6M3M2o4o5M9N0K1K2m8m8pqO1O2JKj13j14J11J12n0
-386A361m9p0p1j13K5J14J14QPK2K1K1K2j07j06QRP7P7QRm6m5Ko7r1M7jjR7R8j8j7j03j03
-392A139l1l0M3J12L5j01k5k4L5L6MMP3P3L1L2j30j29P5P4Q7n0q3j4PPl2l2L7L6j2j2j28J0
-397A117J14M6k1k1LMP2P2M1M0K7R6M1r7j5j5n8n9J1J1k7k7QPL1L1l7l8j6j6j7j6K3K2J09
-402A446k9j16K2K2j15j06L2OOJ15k3N5N5J1J0R7m0q3N6o5o5ONo2o3k6k5J21j7r1r1P5K13
$$ plain form
-407 1336 1371 1407 1382 1358 1276 1194 1226 1259 1308 1357 1378 1261 1203 1282 1275 1268 1260 1251 1302 1353 1410 1328 1256 1183 1159 1135 1231 1189 1191 1331 1308 1284 1353 1284 1293 1301 1254
-413 1254 1207 1220 1233 1350 1331 1311 1291 1452 1475 1416 1356 1350 1345 1271 1196 1259 1323 1317 1312 1328 1345 1293 1241 1218 1194 1240 1285 1273 1261 1318 1375 1386 1398 1350 1301
-418 1301 1183 1203 1257 1173 1203 1234 1255 1277 1311 1346 1380 1415 1412 1409 1484 1421 1410 1400 1381 1362 1309 1255 1271 1286 1257 1228 1191 1291 1286 1282 1320 1358 1348 1337 1292
-423 1292 1247 1237 1227 1243 1258 1258 1120 1129 1137 1221 1304 1273 1242 1352 1463 1458 1453 1406 1358 1242 1126 1111 1097 1151 1205 1274 1344 1344 1345 1334 1324 1348 1372 1313 1253
-429 1253 1262 1271 1305 1338 1303 1267 1200 1134 1058 1120 1196 1272 1288 1304 1302 1300 1298 1296 1279 1262 1280 1298 1258 1218 1246 1275 1296 1318 1339 1360 1302 1244 1269 1432 1400 1369 1450
-434 1450 1301 1149 1135 1152 1170 1169 1307 1410 1375 1373 1371 1403 1435 1314 1331 1383 1296 1227 1158 1195 1233 1237 1241 1185 1129 1073 1156 1195 1234 1233 1232 1231 1230 1252 1275 1297
-440 1297 1320 1278 1236 1263 1290 1261 1232 1203 1174 1254 1335 1415 1496 1361 1226 1252 1278 1321 1364 1338 1312 1296 1280 1333 1386 1355 1324 1293 1262 1260 1257 1255 1253 1313 1374
-445 1374 1366 1358 1298 1239 1340 1440 1420 1401 1381 1361 1350 1338 1258 1178 1188 1199 1209 1219 1225 1231 1237 1243 1252 1262 1271 1281 1277 1274 1270 1267 1263 1259 1323 1388 1413 1437 1393 1349 1353 1356 1360 1364
$$ packed form
-407A336L5L6k5k4q2q2L2L3M9M9K1j17n8P9ppqrN1N1N7q2p2p3k4k4R6m2KJ40k3k4O9o9RQm7
-413A254m7J3J3J17j9k0k0J61K3n9o0onp4p5O3O4onJ6J7n2n2k3k4M6M5j2j2N7N7J1J2m8m9
-418A301j18K0N4q4L0L1K1K2L4L5L4L5llP5o3j1j0j9j9n3n4J6J5k9k9l7J00nmL8L8j0j1m5
-423A292m5j0j0J6J5%j38RQQ4Q3l1l1J10J11nnm7m8j16j16j5j4N4N4O9P0%Jj1j0K4K4n9o0
-429A253RRL4L3l5l6o7o6p6O2P6P6J6J6kkkkj7j7J8J8m0m0K8K9K1K2K1K1n8n8K5J63l2l1Q1
-434A450j49j52j4J7J8jJ38J03l5kkL2L2j21J7N2q7o9o9L7L8MMn6n6n6Q3L9L9jjjjK2K3K2
-440A297K3m2m2K7K7k9k9k9k9Q0Q1Q0Q1j35j35K6K6M3M3k6k6j6j6N3N3l1l1l1l1klkkO0O1
-445A374qqo0n9J01J00k0j9k0k0j1j2q0q0J0J1J0J0OOOORJ0RJ0mlmlmmO4O5K5K4m4m4MLMM
$$ plain form
-452 1364 1325 1286 1315 1345 1329 1313 1298 1282 1246 1210 1174 1138 1186 1234 1168 1102 1163 1224 1216 1209 1260 1311 1294 1277 1259 1242 1294 1345 1318 1291 1333 1375 1351 1327 1417
-457 1417 1508 1427 1346 1334 1322 1314 1306 1183 1061 1092 1123 1154 1185 1187 1189 1192 1194 1230 1266 1233 1199 1123 1047 1086 1124 1153 1181 1209 1238 1269 1300 1331 1363 1377 1392 1338
-463 1338 1284 1286 1288 1290 1291 1291 1290 1289 1288 1404 1519 1428 1337 1307 1278 1248 1218 1232 1245 1189 1134 1194 1254 1314 1374 1268 1161 1170 1178 1223 1269 1314 1359 1329 1298 1336 1374
-468 1374 1406 1438 1401 1365 1273 1182 1251 1320 1329 1338 1232 1126 1153 1180 1207 1235 1228 1221 1329 1436 1378 1319 1261 1202 1263 1323 1315 1306 1278 1249 1221 1192 1172 1151 1055
-474 1055 1189 1392 1366 1322 1278 1259 1241 1222 1203 1188 1172 1225 1278 1246 1215 1326 1209 1061 1143 1273 1266 1171 1077 1134 1191 1194 1197 1200 1202 1245 1287 1329 1371 1282
-479 1282 1194 1266 1338 1355 1372 1303 1372 1418 1327 1356 1385 1363 1342 1303 1402 1458 1377 1313 1249 1279 1310 1272 1233 1206 1179 1229 1278 1255 1368 1370 1372 1234 1097 1119
-484 1119 1142 1244 1346 1334 1322 1351 1380 1294 1209 1177 1145 1027 1046 1223 1261 1157 1190 1128 1203 1244 1285 1295 1305 1316 1326 1276 1226 1291 1355 1384 1413 1442
-489 1442 1471 1403 1335 1267 1199 1176 1153 1129 1106 1084 1062 1023 1122 1199 1138 1049 960 1113 1266 1304 1343 1339 1335 1331 1327 1328 1328 1294 1260 1235 1211 1263 1316 1190 1202 1214
$$ packed form
-452A364l9l9K9L0j6j6j5j6l6l6l6l6M8M8o6o6O1O1qpN1N1j7j7j8j7N2N1k7k7M2M2k4k4R0
-457A417R1q1q1j2j2qqj23j22L1L1L1L1KKLKL6L6l3l4p6p6L9L8K9K8K8K9L1L1L1L2J4J5n4
-463A338n4KKKJ%jjjJ16J15r1r1l0k9l0l0J4J3n6n5O0O0O0O0j06j07RQM5M6M5M5l0l1L8L8
-468A374L2L2l7l6r2r1O9O9RRj06j06K7K7K7K8ppJ08J07n8n9n8n9O1O0qrk8k9k8k9k0k1r6
-474A055J34K03k6m4m4j9j8j9j9j5j6N3N3l2l1J11j17j48Q2J30pr5r4N7N7LLLKM3M2M2M2q9
-479A282q8P2P2J7J7o9O9M6r1K9K9k2k1l9R9N6q1o4o4L0L1l8l9k7k7N0M9k3J13KKj38j37K2
-484A119K3J02J02j2j2K9K9q6q5l2l2j18J9J77L8j04L3o2P5M1M1J0J0J1J0n0n0O5O4K9K9K9
-489A442K9o8o8o8o8k3k3k4k3k2k2l9R9P7o1q9q9J53J53L8L9mmmmJ%l4l4k5k4N2N3j26J2J2
$$ plain form
-494 1214 1088 1086 1083 1178 1273 1304 1198 1168 1139 1283 1427 1502 1440 1262 1313 1341 1369 1343 1317 1257 1197 1175 1154 1202 1249 1220 1191 1161 1132 1110 1088 1135 1182
-499 1182 1312 1441 1488 1397 1367 1336 1296 1257 1266 1274 1171 1205 1245 1286 1182 1079 1079 1215 1301 1386 1442 1360 1381 1403 1403 1266 1155 1182 1326 1332 1178 1161
-504 1161 1315 1330 1309 1287 1306 1187 1137 1225 1258 1292 1219 1146 1164 1182 1132 1081 1083 1084 1121 1157 1166 1175 1193 1211 1193 1314 1357 1400 1399 1398 1389 1379 1503 1489 1484 1479 1427
-510 1427 1375 1323 1271 1293 1314 1310 1306 1159 1149 1177 1204 1200 1196 1201 1205 1193 1318 1409 1362 1298 1233 1275 1316 1280 1245 1278 1311 1305 1299 1301 1166 1173 1180 1213 1246 1255 1264 1273 1282 1306
-516 1306 1330 1345 1361 1326 1153 1173 1192 1235 1279 1322 1365 1307 1250 1230 1348 1369 1391 1498 1468 1365 1262 1265 1268 1299 1330 1324 1180 1237 1294 1274 1254 1277 1301
-521 1301 1256 1211 1199 1188 1245 1303 1325 1348 1327 1306 1456 1467 1442 1416 1347 1278 1278 1278 1270 1262 1254 1245 1223 1200 1065 1068 1180 1293 1208 1122 1172 1221 1271 1320 1329 1337 1311
-527 1311 1286 1270 1255 1308 1362 1282 1203 1230 1257 1410 1425 1358 1290 1267 1243 1220 1197 1214 1231 1102 1110 1206 1302 1246 1190 1275 1359 1375 1391 1269 1147 1145 1281
-532 1281 1381 1342 1267 1191 1279 1230 1188 1147 1261 1374 1496 1481 1445 1410 1366 1321 1296 1271 1246 1221 1239 1257 1206 1155 1088 1020 1151 1281 1329 1238 1157
$$ packed form
-494A214j26klR5R5L1j06l0k9J44J44P5o2j78N1K8K8k6k6o0o0k2k1M8M7k9k9l0k9k2k2M7M7
-499A182J30J29M7r1l0l1m0l9RQj03L4M0M1j04j03%J36Q6Q5N6q2K1K2%j37j11K7J44Oj54j7
-504A161J54J5k1k2J9j19n0Q8L3L4p3p3J8J8n0n1KJL7L6RRJ8J8j8J21M3M3jjrj0J24j4nnn2
-510A427n2n2n2K2K1mmj47j0K8K7mmNMj2J25R1m7o4o5M2M1l6l5L3L3ooKj35PPL3L3RRRRK4
-516A306K4J5J6l5j73K0J9M3M4M3M3n8n7k0J18K1K2J07l0j03j03LLL1L1oj44N7N7k0k0K3K4
-521A301m5m5j2j1N7N8K2K3k1k1J50J1k5k6o9o9%%qqqrk2k3j35LJ12J13q5q6N0M9N0M9RQk6
-527A311k5j6j5N3N4q0p9K7K7J53J5o7o8k3k4k3k3J7J7j29QR6R6n6n6Q5Q4J6J6j22j22kJ36
-532A281J00l9p5p6Q8m9m2m1J14J13J22j5l6l5m4m5k5k5k5k5J8J8n1n1o7o8J31J30M8r1q1
$$ plain form
-536 1157 1075 1150 1225 1231 1237 1340 1443 1432 1421 1323 1226 1243 1259 1319 1379 1325 1270 1188 1107 1186 1264 1293 1322 1432 1405 1284 1231 1209 1186 1168 1288 1407
-541 1407 1389 1335 1281 1335 1319 1156 1130 1184 1170 1183 1333 1445 1420 1343 1267 1259 1251 1138 1162 1301 1302 1335 1368 1282 1196 1255 1384 1444 1368 1264 1299 1307 1316
-546 1316 1349 1246 1176 1244 1256 1267 1296 1325 1220 1253 1355 1319 1275 1230 1186 1142 1073 1142 1248 1354 1347 1340 1346 1283 1214 1282 1342 1332 1438 1543 1581 1299
-551 1299 1153 1145 1192 1171 1169 1166 1207 1178 1064 1086 1096 1106 1169 1232 1226 1220 1196 1171 1215 1259 1311 1364 1266 1305 1361 1347 1312 1277 1216 1155 1163 1171 1202 1233 1264 1295 1267
-557 1267 1240 1299 1220 1183 1283 1263 1243 1167 1091 1167 1243 1262 1144 1078 1012 1013 1153 1214 1276 1245 1214 1243 1272 1288 1166 1155 1145 1158 1171 1115 1060 1205
-562 1205 1351 1459 1430 1459 1488 1439 1390 1366 1342 1283 1225 1222 1220 1165 1249 1375 1363 1276 1190 1203 1216 1264 1312 1313 1314 1315 1316 1358 1401 1443 1486 1456 1426 1387 1349 1340
-567 1340 1193 1081 1106 1089 1072 1141 1210 1177 1282 1272 1124 1140 1156 1309 1325 1262 1200 1112 1161 1308 1317 1215 1341 1406 1470 1435 1399 1366 1333 1274 1215
-572 1215 1215 1353 1387 1422 1304 1323 1230 1138 1097 1056 1015 974 1080 1185 1307 1292 1271 1388 1462 1398 1365 1332 1290 1248 1215 1183 1219 1254 1255 1255 1246 1375 1356
$$ packed form
-536A157q2P5P5OOJ03J03j1j1r8r7J7J6O0O0n4n5q2q1P9P8K9K9J10k7j21n3k2k3j8J20J19
-541A407j8n4n4N4j6j63k6N4j4J3J50J12k5p7p6qqj13K4J39JL3L3q6q6N9J29O0p6j04L5QR
-546A316L3j03p0O8J2J1K9K9j05L3J02l6m4m5m4m4o9O9J06J06ppOo3o9O8O0j0J06J05L8k82
-551A299j46qM7k1klM1k9j14K2J0J0O3O3ook4k5M4M4N2N3r8L9N6j4l5l5o1o1QQL1L1L1L1k8
-557A267k7N9p9l7J00k0k0p6p6P6P6J9j18o6o6JJ40O1O2l1l1K9K9J6j22j1j0J3J3n6n5J45
-562A205J46J08k9K9K9m9m9k4k4n9n8lkn5Q4J26j2q7q6J3J3M8M8JJJJM2M3M2M3l0l0l9l8r
-567A340j47j12K5j7j7O9O9l3J05j0j48J6J6J53J6o3o2q8M9J47Rj02J26O5O4l5l6l3l3n9n9
-572A215%J38L4L5j18J9r3r2m1m1m1m1J06J05J22j5k1J17P4o4l3l3m2m2l3l2L6L5J%rJ29j9
$$ plain form
-577 1356 1337 1297 1120 1072 1161 1275 1253 1172 1091 1199 1307 1365 1287 1208 1266 1317 1368 1344 1320 1416 1281 1225 1306 1313 1183 1096 1147 1246 1344 1414 1347 1324
-582 1324 1302 1245 1188 1112 1174 1350 1388 1231 1073 1068 1063 1086 1109 1201 1293 1212 1132 1174 1217 1084 1089 1254 1281 1291 1300 1276 1251 1213 1313 1378 1306 1264 1222
-587 1222 1278 1333 1350 1229 1177 1263 1240 1216 1168 1119 1129 1140 1219 1299 1274 1249 1225 1200 1183 1166 1208 1251 1382 1376 1286 1197 1222 1247 1341 1435 1448 1461 1359
-592 1359 1258 1248 1238 1159 1081 1112 1144 974 943 1073 1066 1153 1240 1121 1140 1149 1159 1198 1236 1274 1313 1332 1352 1294 1236 1287 1201 1029 1087 1125 1163 1215 1268
-597 1268 1270 1272 1240 1208 1256 1305 1293 1281 1183 1223 1298 1234 1269 1303 1328 1354 1367 1381 1279 1178 1236 1294 1283 1272 1272 1271 1279 1286 1285 1422 1420 1419 1336 1391 1368 1346 1347 1348
-603 1348 1349 1350 1343 1335 1405 1337 1310 1283 1170 1194 1170 1145 1112 1217 1347 1340 1341 1342 1393 1307 1152 1134 1194 1253 1321 1388 1385 1382 1413 1445 1445 1446 1332 1219 1123 1027 1005
-608 1005 1122 1285 1311 1317 1323 1305 1426 1446 1329 1165 1231 1273 1316 1220 1125 1106 1088 1047 1143 1128 1113 1072 1030 1024 1017 1139 1261 1223 1185 1203 1221 1162 1241
-613 1241 1285 1329 1313 1297 1270 1243 1199 1293 1358 1286 1265 1245 1249 1254 1190 1125 1174 1223 1186 1287 1339 1254 1212 1308 1342 1377 1429 1343 1336 1329 1279 1229 1158 1086 955
$$ packed form
-577A356j9m0j77m8Q9J14k2q1q1J08J08N8p8p9N8N1N1k4k4R6j35n6Q1Pj30q7N1R9R8P0o7k3
-582A324k2n7n7p6O2J76L8j57j58nnK3K3R2R2q1q0M2M3j33NJ65K7J0Rk4k5l8J00O5p2m2m2
-587A222N6N5J7j21n2Q6k3k4m8m9J0J1P9Q0k5k5k4k5j7j7M2M3J31or0q9K5K5R4R4J3J3j02
-592A359j01j0j0p9p8L1L2j70l1J30pQ7Q7j19J9RJ0L9L8L8L9J9K0n8n8N1q6j72N8L8L8N2N3
-597A268KKl2l2M8M9j2j2r8M0P5o4L5L4K5K6J3J4j02j01N8N8j1j1%jQPjJ37kjq3N5k3k2JJ
-603A348JJpqP0o8k7k7j13K4k4k5l3J05J30pJJN1q6j55j8O0N9O8O7llL1L2%Jj14j13r6r6k2
-608A005J17J63K6OOj8J21K0j17j64O6M2M3r6r5j9j8m1R6j5j5m1m2opJ22J22l8l8J8J8n9P9
-613A241M4M4j6j6k7k7m4R4O5p2k1k0MNo4o5M9M9l7J01N2q5m2R6L4L5N2q6ppn0n0p1p2j31
$$ plain form
-619 955 1053 1127 1201 1174 1148 1167 1187 1321 1455 1385 1315 1279 1243 1268 1294 1259 1224 1155 1224 1327 1293 1282 1271 1209 1284 1191 1099 1175 1252 1260 1268 1276 1284 1293 1303 1303
-624 1303 1304 1380 1318 1334 1350 1289 1229 1169 1109 1077 1046 1120 1195 1295 1258 1298 1339 1335 1331 1259 1186 1269 1351 1227 1103 1118 1134 1149 1164 1214 1264 1313 1363 1352
-629 1352 1341 1253 1164 1200 1098 1064 1169 1202 1235 1251 1267 1227 1324 1344 1364 1390 1417 1408 1400 1421 1442 1271 1238 1254 1271 1296 1322 1300 1278 1247 1354 1403 1451
-635 1451 1348 1245 1268 1292 1281 1270 1271 1272 1205 1137 1188 1239 1307 1237 1158 1216 1188 1160 1152 1143 1101 1058 1133 1208 1215 1221 1235 1250 1195 1141 1097 1053 1124 1195 1165 1135
-640 1135 1165 1195 1296 1259 1266 1272 1299 1326 1284 1243 1301 1359 1348 1338 1232 1126 1135 1144 1171 1199 1201 1202 1166 1268 1257 1247 1221 1195 1203 1211 1278 1345 1260 1176 1057 1076
-646 1076 1124 1172 1268 1226 1202 1177 1128 1216 1192 1168 1205 1241 1235 1228 1275 1184 1179 1174 1067 1097 1197 1158 1050 941 990 1177 1282 1250 1303 1357 1395 1433 1357
-651 1357 1281 1271 1261 1252 1242 1250 1257 1299 1341 1284 1228 1331 1435 1421 1408 1428 1449 1478 1506 1420 1334 1259 1184 1101 1154 1254 1354 1348 1341 1233 1124 1053 1119 1186
-656 1186 1254 1215 1177 1159 1141 1123 1105 1185 1264 1229 1194 1160 1126 1092 1058 1103 1147 1115 1082 1186 1153 1128 1103 1061 1019 1046 1073 1134 1194 1186 1178 1261 1343 1311 1278
$$ packed form
-619I55R8P4P4k7k6J9K0J34J34p0p0l6l6K5K6l5l5o9O9J03l4j1j1o2P5r3r2P6P7QQQQRJ0%
-624A303JP6o2J6J6o1o0o0o0l2l1P4P5J00l7M0M1mmp2p3Q3Q2j24j24J5J6J5J5N0N0M9N0j1
-629A352j1q8q9L6j02l4J05L3L3J6J6m0R7K0K0K6K7rqK1K1j71l3J6J7K5K6k2k2l1J07M9M8
-635A451j03j03K3K4j1j1JJo7o8N1N1O8p0p9N8k8k8qrm2m3P5P5POJ4J5n5n4m4m4P1P1l0l0
-640A135L0L0J01l7POK7K7m2m1N8N8j1j0j06j06RRK7K8KJl6J02j1j0k6k6QQO7O7q5q4j19J9
-646A076M8M8R6m2k4k5m9Q8k4k4L7L6opM7r1nnj07L0J00l9j08j09M9J87J05l2N3N4L8L8p6
-651A357p6j0j0rj0QPM2M2n7n6J03J04j4j3K0K1K9K8q6q6p5p5q3N3J00J00opj08j09p1O6O7
-656A186O8l9l8j8j8j8j8Q0P9l5l5l4l4l4l4M5M4l2l3J04l3k5k5m2m2K7K7O1O0qqQ3Q2l2l3
$$ plain form
-661 1278 1244 1210 1185 1159 1116 1210 1301 1163 1033 1132 1214 1158 1020 1112 1257 1266 1248 1231 1197 1162 1256 1212 1220 1228 1106 1121 1082 1180 1358 1307 1242 1176 1176
-666 1176 1313 1305 1296 1229 1163 1131 1098 1207 1317 1297 1140 1183 1226 1295 1364 1414 1464 1445 1426 1405 1384 1294 1204 1166 1128 1159 1190 1216 1243 1200 1158 1209 1261
-671 1261 1321 1381 1278 1312 1269 1225 1207 1189 1230 1272 1344 1278 1175 1072 1183 1294 1322 1213 1212 1212 1202 1193 1190 1188 1185 1182 1148 1113 1148 1182 1132 1081 1145 1209 1239
-676 1239 1269 1265 1261 1210 1160 1301 1305 1277 1249 1281 1313 1271 1229 1118 1008 1022 1037 1086 1135 1152 1169 1168 1305 1379 1316 1225 1133 1098 1062 1142 1221 1286 1351 1333
-682 1333 1178 1134 1089 1105 1121 1144 1166 1154 1142 1191 1239 1219 1199 1181 1163 1128 1230 1327 1286 1272 1257 1166 1213 1182 1152 1229 1306 1314 1322 1287 1251 1190 1129 1029
-687 1029 1067 1133 1199 1256 1176 1173 1170 1153 1137 1121 1105 1153 1201 1223 1245 1136 1164 1261 1221 1270 1319 1351 1383 1432 1343 1217 1091 1127 1163 1250 1200 1190 1318
-692 1318 1325 1333 1334 1336 1354 1235 1276 1455 1386 1318 1232 1146 1103 1060 995 1067 1131 1194 1205 1216 1192 1168 1229 1290 1282 1274 1263 1252 1319 1248 1307 1366 1382 1398 1334 1270
-697 1270 1275 1279 1258 1237 1250 1263 1244 1225 1240 1255 1255 1255 1281 1306 1373 1302 1274 1245 1188 1131 1271 1412 1362 1175 1226 1277 1216 1156 1164 1172 1066 960 1005 1051 1143
$$ packed form
-661A278l4l4k5k6m3R4R1j38j30R9Q2n6j38R2J45Rj8j7l4l5R4m4QQj22J5l9R8J78n1o5o6%
-666A176J37qro7o6l2l3J09J10k0j57M3M3O9O9N0N0j9j9k1k1r0r0l8l8L1L1K6K7m3m2N1N2
-671A261O0O0j03L4m3m4j8j8M1M2P2o6j03j03J11J11K8j09j%j0rlklll4l5L5L4n0n1O4O4L0
-676A239L0mmn1n0J41Mk8k8L2L2m2m2j11j10J4J5M9M9J7J7jJ37P4o3r1r2l5l6Q0P9O5O5j8
-682A333j55m4m5J6J6K3K2j2j2M9M8k0k0j8j8l5J02R7m1j4j5r1M7l1l0P7P7QQl5l6o1o1j00
-687A029L8O6O6N7q0llj7j6j6j6M8M8K2K2j09K8R7m0M9M9L2L2M9q9j26j26L6L6Q7n0j0J28
-692A318PQJKJ8j19M1J79o9o8q6q6m3m3o5P2O4O3J1J1k4k4O1O1qqj1j1O7p1N9N9J6J6o4o4
-697A270NMk1k1J3J3j9j9J5J5%%K6K5O7p1k8k9n7n7J40J41n0j87N1N1o1o0QQj06j06M5M6R2
$$ plain form
-703 1143 1099 1200 1302 1199 1096 1154 1212 1217 1221 1192 1162 1107 1053 1067 1218 1417 1387 1288 1189 1141 1093 1160 1228 1224 1221 1286 1351 1338 1324 1302 1280 1369 1320
-708 1320 1234 1148 1183 1218 1184 1151 1181 1212 1286 1222 1127 1033 1081 1130 1230 1193 1155 1118 1230 1205 1111 1154 1225 1296 1410 1524 1447 1370 1439 1370 1350 1330
-713 1330 1302 1273 1295 1317 1278 1239 1130 1157 1222 1287 1263 1239 1284 1329 1362 1394 1235 1213 1300 1387 1454 1383 1243 1241 1313 1385 1406 1428 1381 1334 1309 1284 1259
-718 1259 1234 1277 1319 1247 1174 1143 1113 1197 1280 1283 1286 1246 1206 1222 1100 1055 1011 1122 1232 1229 1225 1189 1152 1185 1217 1197 1176 1156 1135 1192 1250 1192 1135 1239
-723 1239 1344 1333 1323 1375 1427 1441 1318 1223 1128 1148 1167 1139 1247 1244 1241 1182 1122 1217 1175 1146 1255 1286 1180 1146 1111 1183 1254 1282 1310 1178 1045 1080
-728 1080 1115 1150 1186 1221 1256 1222 1189 1103 1018 1094 1169 1157 1145 1133 1122 1144 1165 1153 1141 1124 1108 1152 1197 1282 1229 1219 1210 1236 1263 1324 1385 1346 1307 1268 1228
-733 1228 1234 1240 1177 1114 1077 1040 1118 1195 1204 1212 1220 1228 1164 1099 1195 1290 1335 1379 1309 1239 1310 1381 1337 1293 1228 1162 1131 1100 1089 1078 1181 1285 1299 1314 1362 1411
-739 1411 1321 1230 1209 1187 1224 1262 1264 1267 1247 1228 1277 1326 1219 1112 1166 1219 1221 1223 1191 1158 1168 1179 1155 1131 1055 980 1065 1149 1088 1027 1034 1042 1055 1067 1148 1230
$$ packed form
-703A143m4J01J02j03j03N8N8NMk9l0n5n4J4J51J99l0r9r9m8m8O7O8mlO5O5j3j4k2k2Q9m9
-708A320q6q6L5L5l4l3L0L1P4o4r5r4M8M9J00l7l8l7J12k5r4M3P1P1J14J14p7p7O9o9k0k0
-713A330k8k9K2K2l9l9j09K7O5O5k4k4M5M5L3L2j59k2Q7Q7O7p1j40kP2P2K1K2m7m7k5k5k5
-718A259k5M3M2p2p3l1l0Q4Q3LLm0m0J6j22m5m4J11J10lml6l7L3L2k0k1k0k1N7N8n8n7J04
-723A239J05j1j0N2N2J4j23r5r5K0J9k8J08lln9o0R5m2k9J09L1j06l4l5P2P1K8K8j32j33L5
-728A080L5L5L6L5L5l4l3q6q5P6P5j2j2j2j1K2K1j2j2j7j6M4M5Q5n3j0rK6K7O1O1l9l9l9m0
-733A228OOo3o3l7l7P8P7RQQQo4o5R6R5M5M4p0p0P1P1m4m4o5o6l1l1j1j1J03J04J4J5M8M9
-739A411r0r1k1k2L7L8KLk0j9M9M9j07j07N4N3KKl2l3J0J1k4k4p6p5Q5Q4o1o1PQJ3J2Q1Q2
$$ plain form
-744 1230 1264 1299 1300 1300 1295 1291 1286 1281 1254 1227 1200 1172 1172 1171 1239 1307 1270 1232 1229 1226 1251 1276 1232 1188 1180 1172 1232 1293 1211 1129 1116 1103 1107 1110 1149 1187 1171 1156 1209 1262 1250
-750 1250 1238 1226 1214 1238 1262 1217 1172 1244 1315 1271 1228 1216 1204 1192 1180 1195 1211 1226 1242 1217 1193 1168 1144 1180 1217 1254 1290 1361 1432 1343 1253 1215 1178 1254
-756 1254 1331 1194 1058 1035 1013 1102 1190 1278 1367 1365 1363 1361 1359 1337 1316 1294 1273 1186 1100 1129 1157 1156 1154 1152 1150 1184 1219 1253 1287 1325 1364 1403 1442 1379 1316 1321 1327 1279
-761 1279 1230 1182 1134 1175 1217 1259 1301 1262 1223 1184 1145 1154 1164 1242 1321 1389 1457 1364 1272 1262 1253 1175 1097 1183 1270 1196 1122 1136 1150 1163 1177 1225 1274 1208 1141
-767 1141 1110 1078 1115 1152 1210 1268 1325 1383 1283 1184 1198 1213 1218 1224 1229 1234 1268 1302 1267 1232 1243 1254 1265 1276 1319 1361 1289 1217 1234 1250 1267 1284 1247 1209 1103
-772 1103 996 1041 1086 1132 1177 1210 1244 1278 1311 1371 1431 1375 1320 1317 1313 1310 1306 1241 1176 1266 1218 1194 1308 1345 1244 1288 1331 1252 1172 1153 1134 1114 1095 1119 1143
-777 1143 1167 1191 1237 1282 1328 1373 1320 1267 1205 1281 1301 1321 1281 1241 1297 1353 1294 1235 1237 1240 1243 1245 1301 1357 1298 1239 1260 1281 1142 1003 1067 1131 1196 1260 1306
-783 1306 1352 1329 1306 1248 1191 1116 1179 1251 1185 1213 1242 1191 1278 1287 1296 1272 1249 1302 1218 1181 1144 1221 1299 1220 1279 1329 1379 1365 1351 1267 1184 1203 1222 1240 1259
$$ packed form
-744A230L4L5J%nmnnk7k7k7k8%jO8O8l7l8llK5K5m4m4qqO0O1q2q2j3j3MLL9L8j6j5N3N3j2
-750A250j2j2j2K4K4m5m5P2P1m4m3j2j2j2j2J5J6J5J6k5k4k5k4L6L7L7L6P1P1q9r0l8l7P6
-756A254P7j37j36k3k2Q9Q8Q8Q9kkkkk2k1k2k1q7q6K9K8jkkkL4L5L4L4L8L9L9L9o3o3NOm8
-761A279m9m8m8M1M2M2M2l9l9l9l9RJ0P8P9O8O8r3r2j0rp8p8Q6Q7p4p4J4J4J3J4M8M9o6o7
-767A141l1l2L7L7N8N8N7N8j00r9J4J5NONNL4L4l5l5J1J1J1J1M3M2p2p2J7J6J7J7l7l8j06
-772A103j07M5M5M6M5L3L4L4L3O0O0n6n5lmlmo5o5R0m8k4J14L7j01M4M3p9q0j9j9k0j9K4K4
-777A143K4K4M6M5M6M5n3n3o2P6K0K0m0m0N6N6n9n9KLLKN6N6n9n9K1K1j39j39O4O4O5O4M6
-783A306M6k3k3n8n7p5O3P2o6K8K9n1Q7RRk4k3N3q4l7l7P7P8p9N9N0N0j4j4q4q3J9J9J8J9
$$ plain form
-788 1259 1266 1273 1210 1148 1188 1228 1207 1187 1086 1123 1197 1271 1245 1218 1192 1166 1142 1119 1181 1106 1059 1150 1266 1244 1193 1141 1073 1142 1214 1287 1345 1266 1100 1163
-793 1163 1249 1335 1345 1355 1330 1305 1297 1289 1272 1393 1360 1327 1303 1278 1156 1034 1242 1311 1319 1326 1325 1324 1326 1329 1365 1402 1416 1430 1330 1230 1168 1105 1158 1210 1128
-799 1128 1046 1093 1277 1250 1223 1273 1323 1313 1303 1448 1455 1296 1276 1381 1257 1102 1176 1175 1175 1251 1327 1289 1250 1250 1251 1217 1182 1135 1088 1075 1062 1116 1170 1155
-804 1155 1140 1160 1179 1164 1149 1209 1270 1215 1161 1091 1020 1148 1275 1354 1296 1169 1180 1152 1124 1139 1154 1110 1067 1093 1119 1247 1375 1297 1218 1263 1308 1239
-809 1239 1169 1259 1350 1280 1209 1214 1218 1223 1227 1192 1156 1121 1086 1086 1087 1156 1226 1248 1271 1294 1316 1330 1344 1358 1372 1300 1227 1223 1219 1187 1155 1192 1229 1273 1316 1325 1334 1315 1296
-815 1296 1277 1258 1274 1289 1305 1320 1296 1271 1177 1084 1149 1215 1211 1208 1233 1259 1215 1172 1133 1094 1170 1246 1241 1235 1229 1224 1308 1393 1409 1425 1387 1348 1241 1134 1182 1231
-820 1231 1279 1328 1286 1245 1203 1161 1180 1200 1219 1238 1134 1030 1041 1051 1065 1079 1162 1245 1221 1197 1207 1218 1244 1270 1228 1185 1152 1119 1246 1373 1343 1312
-825 1312 1213 1114 1064 1014 1124 1234 1180 1126 1141 1156 1141 1127 1147 1167 1090 1013 1097 1180 1184 1189 1193 1197 1220 1242 1265 1288 1252 1216 1180 1144 1099 1054 1077 1101 1058
$$ packed form
-788A259PPo3o2M0M0k1k0j01L7P4P4k6k7k6k6k4k3O2p5m7R1J16k2n1n2o8O9P2P3N8p9j66O3
-793A163Q6Q6J0J0k5k5qqj7J21l3l3k4k5j22j22K08O9QPjjKLL6L7J4J4j00j00o2o3N3N2q2
-799A128q2M7J84k7k7N0N0j0j0J45Pj59k0J05j24j55P4j%P6P6l8l9%Jl4l5m7m7j3j3N4N4j5
-804A155j5K0J9j5j5O0O1n5n4p0p1J28J27P9n8j27J1k8k8J5J5m4m3K6K6J28J28p8p9M5M5o9
-809A239p0R0R1p0p1NMNMl5l6l5l5%JO9P0K2K3K3K2J4J4J4J4p2p3mml2l2L7L7M4M3RRj9j9
-815A296j9j9J6J5J6J5k4k5r4r3O5O6mlK5K6m4m3l9l9P6P6noonQ4Q5J6J6l8l9j07j07M8M9
-820A231M8M9m2m1m2m2J9K0J9J9j04j04J1J0J4J4Q3Q3k4k4J0J1K6K6m2m3l3l3J27J27l0l1
-825A312r9r9n0n0J10J10n4n4J5J5j5j4K0K0p7p7Q4Q3MNMMK3K2K3K3l6l6l6l6m5m5K3K4m3
$$ plain form
-830 1058 1014 1085 1156 1100 1044 1103 1161 1175 1189 1203 1218 1247 1277 1238 1199 1160 1121 1150 1180 1143 1105 1068 1031 1031 1031 1145 1260 1254 1248 1242 1237 1279 1321 1329 1336 1296 1255
-836 1255 1282 1310 1278 1246 1213 1181 1219 1257 1260 1263 1179 1095 1126 1157 1169 1182 1160 1139 1187 1234 1168 1101 1049 997 1060 1123 1105 1086 1067 1048 994 939 999 1060 1223
-841 1223 1386 1343 1300 1266 1232 1198 1164 1249 1335 1260 1185 1200 1216 1265 1315 1305 1296 1286 1276 1183 1090 1157 1224 1132 1040 1155 1269 1278 1286 1225 1164 1162 1160 1159 1157 1144
-847 1144 1131 1233 1335 1351 1367 1269 1170 1177 1184 1191 1199 1190 1181 1241 1301 1363 1424 1402 1242 1155 1067 1039 1012 1183 1354 1365 1375 1282 1189 1219 1249 1188 1265 1230 1194
-852 1194 1157 1120 1065 1148 1262 1238 1185 1132 1194 1256 1335 1277 1140 1141 1248 1217 1172 1127 1110 1231 1240 1250 1113 1114 1218 1185 1170 1154 1179 1205 1265 1325 1359
-857 1359 1394 1360 1326 1320 1314 1308 1302 1201 1100 1128 1155 1019 1113 1189 1127 1131 1135 1276 1280 1211 1141 1055 1106 1197 1288 1319 1349 1297 1245 1262 1278 1303 1329 1239 1150 1197
-863 1197 1244 1222 1200 1208 1216 1156 1095 1097 1099 1109 1120 1104 1227 1272 1316 1272 1228 1339 1312 1135 1096 1085 1074 1082 1091 1160 1229 1225 1084 1171 1259 1300 1203 1184 1164 1205
-868 1205 1246 1286 1327 1333 1339 1277 1214 1183 1152 1112 1072 1198 1187 1138 1089 1099 1108 1083 1058 1075 1093 1111 1129 1159 1190 1221 1251 1274 1298 1287 1276 1323 1369 1434 1360
$$ packed form
-830A058m4P1P1n6n6N9N8J4J4J4J5K9L0l9l9l9l9K9L0l7l8l7l7%%J14J15ooonM2M2QPm0m1
-836A255K7K8l2l2l3l2L8L8LLq4q4L1L1J2J3k2k1M8M7o6o7n2n2O3O3j8j9j9j9n4n5O0O1J63
-841A223J63m3m3l4l4l4l4Q5Q6p5p5J5J6M9N0j0rj0j0r3r3O7O7r2r2J15J14RQo1o1kkjkj3
-847A144j3J02J02J6J6r8r9PPPQrrO0O0O2O1k2j60q7q8k8k7J71J71J1J0r3r3L0L0o1P7l5l6
-852A194l7l7n5Q3J14k4n3n3O2O2P9n8j37JJ07l1m5m5j7J21RJ0j37JJ04l3j5j6K5K6O0O0L4
-857A359L5l4l4ooooj01j01K8K7j36R4P6o2MMJ41Mo9p0q6N1R1R1L1L0n2n2J7J6K5K6r0q9M7
-863A197M7k2k2QQo0o1KKJ0J1j6J23M5M4m4m4J11k7j77l9j1j1QRO9O9mj41Q7Q8M1r7j9k0M1
-868A205M1M0M1OOo2o3l1l1m0m0J26j1m9m9J0Rk5k5J7J8J8J8L0L1L1L0K3K4j1j1M7M6O5p4
$$ plain form
-873 1360 1282 1341 1314 1288 1317 1346 1375 1405 1363 1321 1280 1238 1210 1181 1152 1124 1132 1139 1079 1018 1093 1168 1243 1319 1321 1324 1327 1330 1304 1278 1253 1227 1204 1181 1158 1135 1170
-879 1170 1205 1292 1241 1114 1124 1163 1202 1184 1166 1149 1131 1090 1049 1160 1271 1340 1272 1281 1290 1270 1250 1230 1210 1180 1149 1119 1089 1052 1015 1093 1171 1167 1163 1193 1224
-884 1224 1232 1241 1284 1327 1280 1233 1299 1226 1279 1332 1316 1300 1212 1260 1266 1272 1254 1237 1134 1168 1258 1210 1248 1286 1312 1339 1206 1072 1072 1073 1039 1005 1084 1163 1173 1184
-890 1184 1188 1192 1127 1062 1166 1270 1259 1248 1226 1204 1250 1297 1281 1266 1181 1096 1175 1254 1264 1274 1289 1305 1251 1198 1244 1290 1267 1244 1247 1249 1217 1184 1178 1172 1165 1159 1108
-896 1108 1057 1041 1025 1106 1188 1201 1214 1306 1397 1374 1350 1267 1183 1100 1016 1074 1131 1188 1245 1217 1188 1159 1131 1161 1192 1222 1253 1248 1243 1273 1303 1214 1124 1241 1358
-901 1358 1369 1379 1389 1400 1325 1250 1290 1330 1362 1393 1356 1319 1292 1265 1239 1212 1245 1277 1309 1341 1313 1285 1257 1229 1262 1295 1328 1361 1330 1299 1234 1169 1232 1295
-906 1295 1243 1191 1147 1102 1127 1151 1166 1181 1230 1280 1253 1226 1198 1309 1241 1311 1320 1192 1167 1142 979 1046 1128 1211 1279 1210 1072 1072 1100 1128 1207 1285 1364
-911 1364 1443 1353 1264 1244 1224 1299 1375 1299 1223 1061 1037 1265 1355 1329 1302 1335 1368 1262 1156 982 1037 1159 1143 1068 992 972 1091 1132 1172 1166 1159 1084
$$ packed form
-873A360p8N9k7k6K9K9K9L0m2m2m1m2k8k9k9k8QPo0o1P5P5P5P6KLLLk6k6k5k6k3k3k3k3L5
-879A170L5Q7n1j27J0L9L9j8j8j7j8m1m1J11J11O9o8RRk0k0k0k0l0l1l0l0l7l7P8P8mmL0L1
-884A224QRM3M3m7m7O6p3N3N3j6j6q8M8OOj8j7j03L4R0m8L8L8K6K7j33j34%Jl4l4P9P9J0J1
-890A184MMo5o5J04J04j1j1k2k2M6M7j6j5q5q5P9P9J0J0J5J6n4n3M6M6k3k3LKl2l3oopon1
-896A108n1j6j6Q1Q2J3J3R2R1k3k4q3q4q3q4N8N7N7N7k8k9k9k8L0L1L0L1nnL0L0q9r0J17J17
-901A358J1J0J0J1p5p5M0M0L2L1l7l7k7k7k6k7L3L2L2L2k8k8k8k8L3L3L3L3l1l1o5o5O3O3
-906A295n2n2m4m5K5K4J5J5M9N0k7k7k8J11o8P0Rj28k5k5j63O7Q2Q3O8o9j38%K8K8P9P8P9
-911A364P9r0q9k0k0P5P6p6p6j62k4K28R0k6k7L3L3j06j06j74N5J22j6p5p6k0J19M1M0opp5
$$ plain form
-916 1084 1009 1122 1235 1266 1158 1197 1237 1156 1213 1218 1223 1168 1113 1184 1254 1210 1166 1233 1300 1298 1296 1178 1060 1019 979 952 1062 1095 1128 1113 1098 1066 1171
-921 1171 1230 1152 1125 1098 1142 1186 1230 1274 1241 1208 1244 1280 1240 1201 1230 1260 1237 1213 1224 1235 1220 1205 1258 1311 1228 1144 1220 1297 1259 1221 1192 1025 1052 1079
-926 1079 1081 1220 1265 1172 1123 1211 1222 1233 1252 1272 1230 1189 1216 1243 1195 1146 1080 1152 1250 1209 1187 1164 1121 1079 1105 1132 1126 1120 1183 1245 1260 1275 1247 1219 1256
-932 1256 1156 1247 1339 1281 1223 1165 1108 1144 1180 1182 1183 1135 1087 1108 1129 1108 1087 1135 1183 1195 1208 1185 1163 1160 1158 1155 1152 1200 1249 1220 1191 1220 1111 1149 1187 1178 1169
-937 1169 1125 1082 1045 1008 1086 1164 1158 1152 1261 1370 1297 1224 1220 1215 1209 1203 1197 1190 1193 1195 1189 1183 1241 1162 1230 1297 1265 1234 1202 1170 1141 1113 1006 1038 1062 1086 1128 1169 1158
-943 1158 1284 1349 1278 1127 1114 1161 1071 1095 1119 1234 1350 1351 1123 1015 1045 1171 1296 1356 1278 1135 1129 1151 1174 1261 1348 1275 1201 1181 1160 1140 1120
-948 1120 1041 962 998 1034 1157 1281 1329 1240 1201 1299 1320 1203 1202 1202 1115 1166 1197 1228 1153 1078 1060 1043 1171 1162 1181 1199 1209 1219 1236 1253 1201 1149 1180 1212
-953 1212 1128 1045 1089 1133 1178 1222 1242 1263 1169 1074 1106 1138 1170 1202 1111 1019 1080 1141 1211 1144 1132 1257 1405 1323 1219 1114 1172 1229 1287 1344 1370 1396
$$ packed form
-916A084p5J13J13L1j08L9M0q1N7NNn5n5P1P0m4m4O7O7kkj18j18m1m0k7J10L3L3j5j5l2J05
-921A171N9p8k7k7M4M4M4M4l3l3L6L6m0l9K9L0k3k4J1J1j5j5N3N3q3q4P6P7l8l8k9j67K7K7
-926A079KJ39M5r3m9Q8J1J1J9K0m2m1K7K7m8m9o6P2R8m1k2k3m3m2K6K7ooO3O2J5J5k8k8L7
-932A256j00R1R2n8n8n8n7L6L6KJm8m8K1K1k1k1M8M8J2J3k3k2lkllM8M9k9k9K9j09L8L8rr
-937A169m4m3l7l7P8P8ooJ09J09p3p3mnooopLKooN8p9O8O7l2l1l2l2k9k8j07L2K4K4M2M1j1
-943A158J26O5p1j51j3M7r0K4K4J15J16Jk28j08L0J26J25O0p8j43oK2K3Q7Q7p3p4k0k1k0k0
-948A120p9p9L6L6J23J24M8q9l9R8K1j17j%q7N1L1L1p5p5j8j7J28rJ9J8J0J0J7J7n2n2L1L2
-953A212q4q3M4M4M5M4K0K1r4r5L2L2L2L2r1r2O1O1P0o7j2J25J48q2j04j05N8N7N8N7K6K6
$$ plain form
-958 1396 1439 1345 1206 1205 1187 1168 1110 1052 1108 1165 1209 1254 1231 1207 1254 1301 1233 1166 1130 1094 1058 1022 1061 1099 1061 1160 1250 1341 1356 1235 1211 1188 1224 1261
-963 1261 1223 1185 1225 1127 1138 1149 1160 1171 1138 1242 1269 1296 1223 1150 1145 1141 1133 1126 1118 1111 1181 1250 1252 1253 1275 1298 1252 1205 1220 1235 1181 1127 1140 1153 1166 1180 1162 1144
-969 1144 1195 1246 1327 1408 1283 1158 1070 982 963 944 1009 1075 1140 1205 1263 1320 1262 1205 1176 1147 1119 1090 1166 1242 1203 1164 1207 1250 1293 1336 1257 1178 1099
-974 1099 1020 1159 1298 1276 1254 1159 1064 1083 1102 1177 1252 1167 1081 1099 1116 1133 1151 1178 1205 1118 1031 1122 1214 1237 1260 1190 1120 1050 980 1030 1081 1062 1044
-979 1044 1054 1065 1075 1085 1091 1096 1216 1336 1356 1375 1326 1277 1283 1289 1295 1300 1250 1200 1150 1100 1154 1208 1248 1287 1332 1148 1016 1021 1046 1070 1103 1136 1198 1260 1207 1154
-985 1154 1227 1299 1257 1215 1262 1308 1240 1172 1206 1240 1204 1169 1206 1244 1246 1249 1192 1134 1146 1157 1222 1287 1284 1280 1267 1254 1310 1366 1358 1349 1341 1332 1287 1242 1226 1347 1424 1363
-990 1363 1273 1184 1148 1112 1183 1253 1174 958 851 972 996 1020 989 959 962 966 1047 1128 1136 1282 1281 1281 1177 1074 961 987 1051 1115 1119 1123 1049 976 1017 1058
-996 1058 1107 1156 1214 1134 1251 1367 1306 1245 1285 1187 1167 1146 1185 1223 1339 1317 1310 1303 1287 1271 1218 1165 965 904 1028 1151 1252 1124 1115 1105 1116 1127
$$ packed form
-958A396M3r4j39jj8j9n8n8N6N7M4M5k3k4M7M7o8o7l6l6l6l6L9L8l8R9R0R1J5j21k4k3L6L7
-963A261l8l8M0r8J1J1J1J1l3J04K7K7p3p3nmqpqpP0O9KJK2K3m6m7J5J5n4n4J3J3J3J4j8j8
-969A144N1N1Q1Q1j25j25q8q8j9j9O5O6O5O5N8N7n8n7k9k9k8k9P6P6l9l9M3M3M3M3p9p9p9
-974A099p9J39J39k2k2r5r5J9J9P5P5q5q6J8J7J7J8K7K7q7q7R1R2K3K3p0p0p0p0N0N1j9j8
-979A044J0J1J0J0ONJ20J20K0J9m9m9OOONn0n0n0n0N4N4M0L9M5j84j32NK5K4L3L3O2O2n3n3
-985A154P3P2m2m2M7M6o8o8L4L4l6l5L7L8KLn7n8J2J1O5O5lmj3j3N6N6qrqrm5m5j6J21P7o1
-990A363r0q9l6l6P1P0p9k16j07J21K4K4l1l0LMQ1Q1QJ46j%j04j03j13K6O4O4MMp4p3M1M1
-996A058M9M9N8q0J17J16o1o1M0r8k0k1L9L8J16k2ppj6j6n3n3k00o1J24J23J01j28rj0J1J1
$$ plain form
-1000 1127 1097 1068 1081 957 1024 1091 1183 1276 1242 1209 1210 1211 1239 1266 1251 1235 1237 1100 1070 1177 1163 1011 1006 1000 1139 1139 1103 1066 1053 1041 1062 1084 1120 1157
-1006 1157 1193 1230 1200 1171 1073 975 989 1003 1052 1101 1084 1066 1049 1032 1059 1086 1078 1071 1090 1109 982 993 1047 1101 1164 1226 1133 1040 1015 990 1054 1117 1035 1090
-1011 1090 1078 1066 1097 1129 1111 1093 1144 1195 1196 1197 1163 1129 1094 1059 1138 1217 1181 1145 1178 1210 1274 1337 1325 1176 1128 1217 1288 1360 1298 1236 1320 1267 1237 1207
-1016 1207 1238 1268 1223 1177 1166 1155 1091 1028 941 1084 1289 1356 1262 1169 1202 1236 1235 1234 1244 1255 1196 1138 1162 1186 1049 913 1017 1121 1079 1175 1121 1068
-1021 1068 1129 1190 1207 1086 1111 1136 1119 1101 1152 1203 1265 1328 1312 1297 1305 1175 1131 1087 1044 1139 1233 1190 1193 1196 1198 1201 1138 1213 1211 1208 1201 1193 1152 1110 1119 1128 1068 1008
-1027 1008 1004 999 1032 1202 1188 1175 1179 1183 1045 1045 1041 1176 1268 1224 1141 1059 1086 975 979 1121 1192 1263 1228 1193 1111 1030 1063 1096 1155 1214 1238 1263 1219 1176 1210
-1032 1210 1106 1115 1123 1124 1124 1108 1093 991 1027 1157 1150 1113 1077 1111 1145 1110 1075 1126 1176 1104 1031 1117 1066 1092 1119 1128 1138 1208 1278 1335 1255 1137 1019 994
-1037 994 968 1011 1055 1106 1157 1131 1104 1176 1109 1094 1080 971 1000 1112 1224 1264 1305 1239 1173 1110 1185 1251 1317 1232 1146 1129 1112 1027 942 972 1001 1004 1006 1043
$$ packed form
-1000A127l0k9J3j24O7O7R2R3l4l3JJK8K7j5j6Kj37l0J07j4j52noJ39%l6l7j3j2K1K2L6L7
-1006A157L6L7l0k9r8r8J4J4M9M9j7j8j7j7K7K7qpJ9J9j27J1N4N4O3O2r3r3k5k5O4O3q2N5
-1011A090j2j2L1L2j8j8N1N1JJl4l4l5l5P9P9l6l6L3L2O4O3j2j49m8Q9P1P2o2o2Q4n3l0l0
-1016A207L1L0m5m6j1j1o4o3q7J43K05O7r4r3L3L4jjJ0J1n9n8K4K4j37j36J04J04m2R6n4n3
-1021A068O1O1J7j21K5K5j7j8N1N1O2O3j6j5Qj30m4m4m3R5R4m3LLKLo3P5klpqm1m2RRo0o0
-1027A008mnL3J70j4j3MMj38%mJ35R2m4q3q2K7j11MJ42P1P1l5l5q2q1L3L3N9N9K4K5m4m3L4
-1032A210j04RQJ%j6j5j02L6J30pl7l6L4L4l5l5N1N0p2p3Q6n1K6K7RJ0P0P0N7q0j18j18k5
-1037I94k6M3M4N1N1k6k7P2o7j5j4j09K9J12J12M0M1o6o6o3P5O6O6q5q6j7j7q5q5L0K9LKL7
$$ plain form
-1042 1043 1079 1114 1149 1114 1080 1112 1144 1176 1207 1198 1189 1068 1085 1192 1300 1287 1136 1140 1144 1174 1204 1192 1181 1169 1157 1200 1243 1251 1260 1225 1189 1300 1273 1192
-1048 1192 1111 1136 1161 1174 1188 1236 1283 1249 1214 1180 1145 1195 1245 1181 1116 1184 1251 1249 1248 1212 1176 1139 1103 1130 1157 1184 1210 1258 1306 1239 1172 1204 1236 1277 1180
-1053 1180 1097 1014 862 940 1091 1242 1202 1161 1137 1113 1055 996 1051 1105 1090 1076 1111 1147 1068 989 990 991 1061 1131 1185 1238 1224 1209 1139 1070 1115 1160 1158 1155
-1058 1155 1093 1030 1011 1129 1169 1210 1180 1151 1199 1109 1028 947 972 996 1026 1056 1016 977 1047 1117 1118 1119 1028 938 885 970 1059 1149 1087 1024 1058 1092 1083 1073 1168
-1063 1168 1125 1091 1056 1091 1125 1090 1056 1095 1133 1137 1142 1129 1116 1137 1158 1193 1227 1224 1084 1066 1049 1052 1192 1287 1244 1140 1175 1205 1235 1196 1157 1201 1107 1124
-1069 1124 1142 1089 1037 1098 1160 1165 1171 1070 969 907 982 1049 1116 1082 1049 1015 982 1024 1066 1117 1167 1191 1352 1284 1215 1165 1252 1340 1289 1275 1260 1237 1214
-1074 1214 1187 1159 1132 1104 1119 1133 1070 1144 1174 1205 1129 1053 1088 1123 1088 1054 998 942 992 1042 1104 1028 1012 1133 1271 1271 1242 1213 1181 1150 1118 1086 1096
-1079 1096 1106 1115 1125 1164 1203 1208 1213 1112 1011 1071 1131 1120 1109 1063 1018 1028 1039 1170 1164 1024 1022 1094 1167 1213 1259 1237 1214 1237 1259 1213 1167 1187 1208 1195
$$ packed form
-1042A043L6L5L5l5l4L2L2L2L1rrj21J7J07J08j3j51MML0L0j2j1j2j2M3M3QRl5l6J11k7q1
-1048A192q1K5K5J3J4M8M7l4l5l4l5N0N0o4o5O8O7kjl6l6l7l6K7K7K7K6M8M8o7o7L2L2M1r7
-1053A180q3q3j52P8J51J51m0m1k4k4n8n9N5N4j5j4L5L6p9p9JJP0P0N4N3j4j5p0o9M5M5kl
-1058A155o2o3j9J18M0M1l0k9M8r0q1q1K5K4L0L0m0l9P0P0JJr1r0n3Q5Q9R0o2o3L4L4rj0R5
-1063A168m3l4l5L5L4l5l4L9L8MNj3j3K1K1L5L4lj40j8j7LJ40R5m3j04L5L0L0l9l9M4r4J7
-1069A124J8n3n2O1O2NOj01j01o2P5O7O7l4l3l4l3M2M2N1N0K4J61o8o9n0Q7Q8n1j4j5k3k3
-1074A214k7k8k7k8J5J4o3P4L0L1p6p6L5L5l5l4n6n6N0N0O2p6j6J21J38%k9k9l2l1l2l2J0
-1079A096J0RJ0L9L9NNj01j01O0O0j1j1m6m5J0J1J31oj40kP2P3M6M6k2k3K3K2m6m6K0K1j3
$$ plain form
-1084 1195 1181 1174 1167 1013 998 1079 1159 1172 1184 1319 1317 1240 1164 1028 1029 1068 1107 1189 1271 1155 1268 1299 1330 1261 1192 1157 1122 1156 1190 1245 1300 1286 1272
-1089 1272 1261 1251 1248 1108 1083 1057 1082 1108 1128 1010 970 930 975 1020 1065 1111 1089 1068 1081 1094 1077 1059 1097 1134 1298 1233 1191 1149 1025 1040 1214 1252
-1094 1252 1193 1135 1183 1231 1260 1290 1285 1280 1196 1113 1145 1176 1129 1082 1035 988 965 943 989 1035 1123 1212 1185 1159 1151 1142 1100 1057 1048 1039 1021 1141 1161 1181 1210 1239
-1099 1239 1308 1377 1285 1194 1144 1095 1080 1065 1077 1088 1176 1128 1145 1163 1095 1164 1149 1135 1244 1352 1322 1292 1261 1231 1239 1247 1255 1262 1230 1198 1165 1133 1154 1175 1119
-1105 1119 1200 1273 1345 1312 1278 1230 1182 1194 1205 1297 1252 1215 1178 1191 1204 1025 983 972 960 1018 1075 1171 1129 1157 1184 1294 1267 1125 1121 1136 1151 1175 1199
-1110 1199 1164 1129 1076 1162 1252 1205 1175 1145 1174 1203 1309 1278 1253 1228 1263 1298 1270 1241 1136 1168 1197 1226 1195 1164 1114 1065 1130 1195 1121 1048 1089 1130 1119
-1115 1119 1107 1095 1084 1088 1093 1158 1223 1359 1356 1271 1185 1229 1273 1202 1132 1111 1090 1156 1084 1002 1057 1095 1134 1142 1150 1159 1167 1152 1137 1122 1107 1106 1106 1036 967 1019 1070 1016
-1121 1016 962 955 1086 1024 963 984 1006 1104 1065 1029 994 1018 1042 1068 1095 1112 1130 1175 1082 990 1035 1081 1128 1097 1203 1374 1408 1321 1234 1200 1167 1133 1099
$$ packed form
-1084A195j4ppj54j5Q1Q0J3J2J35kp7p6j36JL9L9Q2Q2j16J13L1L1o9o9l5l5L4L4N5N5j4j4
-1089A272j1j0lj40k5k6K5K6K0j18m0m0M5M5M5M6k2k1J3J3j7j8L8L7J64o5m2m2j24J5J74L8
-1094A252n9n8M8M8K9L0nnq4q3L2L1m7m7m7m7k3k2M6M6Q8Q9k7k6qrm2m3rrj8J20K0K0K9K9
-1099A239O9O9r2r1n0m9j5j5J2J1Q8m8J7J8o8O9j5j4J09J08l0l0l1l0QQQPl2l2l3l2K1K1n6
-1105A119Q1P3P2l3l4m8m8J2J1R2m5l7l7J3J3j79m2j1j2N8N7R6m2K8K7J10k7j42mJ5J5K4K4
-1110A199l5l5n3Q6R0m7l0l0K9K9J06l1k5k5L5L5k8k9j05L2K9K9l1l1n0m9O5O5p4p3M1M1j1
-1115A119j2j2j1MNO5O5J36lq5q6M4M4p1p0k1k1O6p2q2N5L8L9QQRQj5j5j5j5j%p0o9N2N1n4
-1121A016n4pJ31o2o1K1K2R8l9l6l5K4K4K6K7J7J8M5r3r2M5M6M7l1J06J71L4q7q7l4l3l4l4
$$ plain form
-1126 1099 1127 1155 1183 1211 1225 1238 1252 1266 1205 1144 1091 1039 1028 1155 1204 1254 1200 1146 1161 1176 1248 1321 1224 1128 1139 1012 1078 1143 1138 1133 1120 1107 1192 1140
-1131 1140 1097 1053 1093 1133 1233 1333 1310 1150 1066 1121 1003 1023 1043 1063 1086 1109 1132 1155 1132 1109 1078 1046 1125 1066 1085 1104 1159 1215 1157 1098 1121 1144
-1136 1144 1167 1190 1149 1108 1067 1026 1025 1025 1024 1023 1048 1073 1098 1123 1108 1092 1077 1062 1041 1019 998 977 1123 1269 1333 1258 1257 1256 1237 1219 1272 1188 1189 1191 1097 1140 1174
-1141 1174 1209 1206 1204 1201 1198 1265 1333 1285 1238 1232 1227 1153 1079 1045 1011 1011 1011 1057 1103 1115 1127 1073 1019 1126 1233 1238 1243 1282 1321 1325 1329 1218 1106 1114 1121 1128 1135 1177 1220 1262
-1147 1262 1305 1178 1051 993 935 1041 1146 1091 1036 1068 1101 1133 1165 1069 972 1036 1100 1221 1342 1394 1447 1367 1287 1222 1156 1051 1174 1169 1164 1094 1025
-1152 1025 1070 1115 1098 1081 1064 1047 1030 1013 1031 1048 1123 1198 1196 1193 1256 1181 1021 1089 1147 1205 1209 1212 1168 1124 1241 1358 1274 1190 1175 1159 1143 1127 1042 957
-1157 957 1007 1057 1038 1019 1117 1214 1152 1089 1076 1062 1084 1105 1095 1086 1076 1067 1115 1164 1143 1123 1113 1104 1094 1084 1125 1165 1137 1109 1100 1090 1196 1302 1265 1229 1193
-1163 1193 1156 1271 1386 1341 1295 1206 1117 1097 1076 1036 995 989 983 952 920 1003 1085 1072 1059 1080 1101 1041 980 989 997 1063 1128 1146 1163 1229 1066 1024 1119 1205
$$ packed form
-1126A099K8K8K8K8J4J3J4J4o1o1n3n2j1J27M9N0n4n4J5J5P2P3r7r6J1j27O6O5nnj3j3Q5n2
-1131A140m3m4M0M0J00J00k3j60q4N5j18K0K0K0K3K3K3K3k3k3l1l2P9n9J9J9N5N6n8n9K3K3
-1136A144K3K3m1m1m1m1j%jjK5K5K5K5j5j6j5j5k1k2k1k1J46J46O4p5jjj9j8N3q4JKr4M3L4
-1141A174L5lkllO7O8m8m7onp4p4l4l4%%M6M6J2J2n4n4J07J07NNL9L9MMj11j12QPPPM2M3M2
-1147A262M3j27j27n8n8J06J05n5n5L2L3L2L2r6r7O4O4J21J21N2N3q0q0o5o6j05J23nnp0o9
-1152A025M5M5j7j7j7j7j7j7J8J7P5P5klO3p5j60O8N8N8MLm4m4J17J17q4q4j5j6j6j6q5q5
-1157I57N0N0j9j9R8R7o2o3j3j4K2K1j0rj0rM8M9k1k0j0rj0j0M1M0k8k8rj0J06J06l7l6l6
-1163A193l7J15J15m5m6q9q9k0k1m0m1ool1l2Q3Q2j3j3K1K1o0o1RQO6O5J8J7O6j63m2R5Q6
$$ plain form
-1168 1205 1291 1225 1159 1124 1088 1088 1087 1125 1162 1132 1101 1033 966 1013 1060 1031 1002 1042 1082 1124 1166 1093 1020 1051 1082 1079 1075 1147 1218 1175 1132 1059 985 1026 1067 1092
-1173 1092 1118 1074 1031 1034 1038 1041 1044 1046 1047 1083 1119 1071 1022 1043 1064 1123 1181 1171 1161 1078 995 1027 1058 1049 1040 1065 1090 1098 1105 1043 982 1036 1090 1075 1060 1067 1073 1011 949 1046
-1179 1046 1143 1171 1199 1192 1185 1178 1171 1060 948 951 955 1049 1144 1125 1105 1155 1206 1179 1152 1219 1149 1156 1163 1094 1026 1026 1025 999 972 1014 1055 1063 1070 1078 1085 1129 1173 1216 1260 1192
-1186 1192 1124 1133 1142 1141 1277 1253 1091 1065 1038 1118 1197 1154 1111 1102 1093 1083 1073 985 1035 1052 1070 1044 1156 1168 1042 1070 1099 1111 1123 1178 1096 1118 1141 1112
-1191 1112 1221 1223 1224 1199 1175 1268 1361 1417 1335 1320 1306 1282 1259 1171 1083 1063 1044 1171 1298 1249 1201 1320 1210 1116 1161 1232 1303 1231 1159 1068 1114 1229
-1196 1229 1207 1189 1170 1221 1134 1111 1089 1058 1027 1106 1185 1178 1309 1355 1264 1181 1236 1253 1271 1182 1093 1040 987 989 990 1219 1219 1156 1231 1222 1214 1291 1231 1203 1175 1138
-1201 1138 1101 1208 1314 1306 1298 1196 1095 1062 1029 1092 1155 1217 1280 1279 1278 1243 1207 1108 1009 1024 1040 1140 1240 1179 1118 1056 993 999 1005 1018 1031 1079 1127 1159
-1206 1159 1192 1225 1257 1266 1275 1283 1292 1235 1179 1191 1203 1160 1116 1107 1097 1148 1198 1179 1161 1094 1027 1075 1123 1139 1154 1169 1184 1114 1044 1089 1133 1194 1255 1248 1240 1236 1232 1262
$$ packed form
-1168A205Q6o6o6l5l6%jL8L7l0l1o8o7M7M7k9k9M0M0M2M2p3p3L1L1lmP2P1m3m3p3p4M1M1K5
-1173A092K6m4m3LMLLKJL6L6m8m9K1K1N9N8j0j0q3q3L2L1rrK5K5QPo2o1N4N4j5j5POo2o2R7
-1179A046R7K8K8ppppj11j12LMR4R5j9k0N0N1k7k7O7p0PPo9o8%jk6k7M2M1QPQPM4M4M3M4o8
-1186A192o8RRjJ36k4j62k6k7Q0P9m3m3rrj0j0q8N0J7J8k6J12J2j26K8K9J2J2N5q2K2K3k9
-1191A112J09KJk5k4R3R3N6q2j5j4k4k3q8q8k0j9J27J27m9m8J19j10r4M5P1P1p2p2r1M6J15
-1196A229k2j8j9N1q7k3k2l1l1P9P9pJ31M6r1q3N5J7J8q9q9n3n3KJK29%o3P5rqP7o0k8k8l7
-1201A138l7J07J06qqj02j01l3l3O3O3O2O3jjl5l6r9r9J5J6J00J00o1o1o2o3OOJ3J3M8M8L2
-1206A159L3L3L2RRQRn7n6J2J2m3m4rj0N1N0j9j8o7o7M8M8J6J5J5J5p0p0M5M4O1O1pqmmL0
$$ plain form
-1212 1262 1293 1241 1188 1136 1084 1003 922 909 897 948 998 1049 1100 1175 1251 1212 1173 1170 1167 1164 1161 1120 1078 1037 996 999 1003 1076 1148 1143 1138 1098 1058 1111 1164 1102 1040 928
-1218 928 817 911 1006 1041 1075 886 972 1078 1183 1146 1108 1124 1140 1122 1104 1112 1121 1138 1156 1098 1177 1180 1182 1128 1074 1089 1104 1114 1123 1090 1195 1242 1290 1231
-1223 1231 1173 1164 1155 1077 999 1094 1188 1214 1240 1214 1188 1162 1137 1106 1076 1046 1016 946 875 788 838 1038 1101 1081 1061 1116 1034 1028 1023 1053 1083 1078 1074 1117 1161 1135
-1229 1135 1110 1188 1265 1182 1099 1150 1201 1217 1234 1156 1078 1014 950 827 934 980 1027 1034 1040 1081 1123 1110 1097 1153 1210 1239 1268 1297 1326 1269 1212 1078 1081 1152
-1234 1152 1223 1096 969 944 919 923 1065 1114 1026 981 1073 1110 1147 1133 1119 988 995 908 958 1052 1009 1044 1078 1112 1008 965 1059 1170 1144 1089 1034 1054
-1239 1054 1073 1093 1113 1084 1056 1096 1137 1143 1150 1122 1094 1085 1077 1103 1129 1113 1098 1048 999 1084 1169 1185 1201 1183 1164 1145 1127 1061 995 1044 1093 1028 964 968 973 977 982 1063
-1244 1063 1008 1036 1064 1161 1121 1090 1060 935 947 1107 1130 1032 934 1060 1185 1302 1420 1435 1313 1199 1086 1106 1126 1204 1144 960 1004 1026 1048
-1249 1048 1070 1093 1038 1121 1105 1089 1150 1211 1175 1139 1025 1049 1046 1043 1164 1284 1243 1202 1119 1172 1178 1184 1121 1195 1192 1190 1187 1184 1238 1154 1114 1074 1107 1140 1182 1086
$$ packed form
-1212A262L1n2n3n2n2q1q1j3j2N1N0N1N1P5P6l9l9llllm1m2m1m1LMP3P2nnm0m0N3N3o2o2j12
-1218I28j11R4R5L5L4j89Q6J06J05l7l8J6J6j8j8QRJ7J8n8P9LKn4n4J5J5J0Rl3J05M7M8n9
-1223A231n8rrp8p8R5R4K6K6k6k6k6k5l1l0l0l0p0p1q7N0K00O3k0k0N5q2onL0L0nmM3M4k6
-1229A135k5P8P7q3q3N1N1J6J7p8p8o4o4j23J07M6M7POM1M2j3j3N6N7K9K9K9K9n7n7j34LP1
-1234A152P1j27j27k5k5MJ42M9q8m5R2L7L7j4j4j31Pq7N0R4m3L5L4L4j04m3R4J11k6n5n5K0
-1239A054J9K0K0k9k8M0M1OPk8k8rqK6K6j6j5n0m9Q5Q5J6J6j8j9j9j8o6o6M9M9o5o4MNMNQ1
-1244A063n5K8K8R7m0l1l0j25J2J60K3r8r8J26J25J17J18J5j22j14j13K0K0P8o0j84M4K2K2
-1249A048K2K3n5Q3j6j6O1O1l6l6j14K4llJ21J20m1m1q3N3OOo3P4lkllN4q4m0m0L3L3M2r6
$$ plain form
-1254 1086 1141 1196 1128 1060 1124 1189 1227 1266 1006 884 891 898 956 1013 1147 1144 1136 1128 1068 1145 1113 1081 1041 1138 1188 1101 1022 1081 1110 1139 1176 1214 1180 1146 1112
-1260 1112 1078 1129 1179 1322 1326 1118 1138 1136 1133 1137 1140 1143 1147 1145 1143 1210 1277 1307 1337 1402 1467 1300 1134 1036 938 992 1047 1093 1139 1173 1068 912 986 1009 1033
-1265 1033 1071 1110 1125 1140 1190 1240 1280 1320 1292 1263 1221 1179 1137 1094 1127 1159 1123 1086 1109 1132 1155 1178 1103 1029 1083 1138 1082 1254 1436 1388 1215 1179
-1270 1179 1166 1154 1135 1117 1064 1011 1048 1085 1121 1158 1172 1185 1199 1213 1149 1085 1090 1095 1220 1344 1309 1273 1259 1245 1163 1081 1138 1195 1217 1240 1213 1185 1226 1268
-1275 1268 1224 1181 1172 1163 1119 1075 1146 1217 1220 1223 1112 1001 1017 1033 1049 1066 1082 1099 1001 903 978 1053 1051 1049 1151 1114 1087 1059 1075 1090 1071 1052 1105 1157 1184
-1280 1184 1210 1093 1114 1126 1139 1064 989 951 1051 1030 1010 1066 1123 1160 1198 1303 1409 1361 1313 1231 1148 1097 1046 1063 1081 1132 1184 1120 1057 1016 975 1002
-1285 1002 1168 1304 1212 1188 1164 1195 1227 1190 1152 1145 1138 1139 1141 1141 1278 1269 1260 1216 1173 1052 1069 1071 1073 1029 985 907 1058 1208 1130 1030 929 929 928 965 1001
-1291 1001 1089 1039 982 1062 1125 1188 1130 1073 1016 958 1002 1045 1055 1064 1084 1104 1009 914 1032 1150 1185 1082 1076 1069 1053 1038 990 943 1047 1151 1255 1221
$$ packed form
-1254A086N5N5o8o8O4O5L8L9k60j22PPN8N7J34lqqo0P7l2l2m0R7N0q7p9N9K9K9L7L8l4l4l4
-1260A112l4N1N0J43Mk08K0klMLLMkkO7O7L0L0O5O5j67j66r8r8N4N5M6M6L4j05j56P4K3K4
-1265A033L8L9J5J5N0N0M0M0k8k9m2m2m2m3L3L2l6l7K3K3K3K3p5p4N4N5n6J72J82m8j73l6
-1270A179j3j2j9j8n3n3L7L7L6L7J4J3J4J4o4o4NNJ25J24l5l6j4j4q2q2N7N7K2K3k7k8M1M2
-1275A268m4m3rrm4m4P1P1LLj11j11J6J6J6J7J6J7r8r8P5P5kkJ02l7k7k8J6J5j9j9N3N2K7
-1280A184K6j17K1J2J3p5p5l8J00k1k0N6N7L7L8J05J06m8m8q2q3n1n1J7J8N1N2o4o3m1m1K7
-1285A002J66J36r2k4k4L1L2l7l8ppJK%J37rrm4m3j21J7KKm4m4p8J51J50p8j00j01%jL7L6
-1291A001Q8n0n7Q0O3O3n8n7n7n8M4M3J0RK0K0r5r5J18J18L5j03opj6j5m8m7J04J04J04l4
$$ plain form
-1296 1221 1196 1170 1083 996 865 873 958 1044 1052 1197 1293 1250 1180 1109 1084 1059 1103 1147 1126 1105 1093 1081 971 997 1015 1033 1068 1102 1067 1033 1030 1027 1001 1112
-1301 1112 1297 1252 1107 1100 1096 1091 1095 1099 1104 1108 1113 1117 1127 1136 1180 1224 1230 1236 1173 1110 959 808 818 827 938 1050 1000 951 992 1033 1083 995 983 971 951 931 946
-1306 946 962 978 993 998 1003 1008 1013 1050 1088 1126 1164 1206 1248 1176 1104 1108 1112 1048 983 1076 1170 1288 1407 1387 1228 1147 1066 999 932 970 1009 1057 967 904 977 1188
-1312 1188 1261 1268 1276 1091 1045 1173 1301 1237 1172 1038 904 974 1044 953 863 867 872 991 1111 1058 1005 1013 1020 1068 979 1035 1092 1067 1041 1059 1077 1036 1132
-1317 1132 1193 1118 1046 974 1046 1118 1208 1161 1122 1083 1101 1118 1170 1223 1180 1137 1200 1263 1292 1183 1152 1121 1110 1099 1209 1181 1082 1120 1142 1163 1206 1249 1146
-1322 1146 1181 1176 1172 1220 1129 1077 1024 1083 1004 993 1119 1013 1045 1137 1229 1255 1144 1061 1115 1050 984 989 993 964 934 1021 1108 1126 1145 1135 1126 1082 1038 1083 1129
-1327 1129 1174 1220 1191 1162 1133 1104 1083 1062 1153 1106 1131 1157 1104 1052 1097 1141 1126 1110 1062 1152 1178 1204 1063 1151 1179 1207 1237 1267 1220 1173 1137 963 861
-1332 861 989 881 910 1023 998 1032 1066 1091 1116 1080 1044 1077 1110 1070 1030 1097 1163 1145 990 870 886 1006 1125 1184 1243 1265 1288 1241 1195 1196 1196 1111
$$ packed form
-1296A221k5k6q7q7j31QQ5Q6QJ45R6m3p0p1k5k5M4M4k1k1j2j2j10K6J8J8L5L4l5l4llk6J11
-1301A112J85m5j45pmnMMNMNMJ0RM4M4OOo3o3j51j51J0RJ11J12n0m9M1M1N0q8j2j2k0k0J5
-1306I46J6J6J5NNNNL7L8L8L8M2M2p2p2MMo4o5R3R4J18J19k0j59q1q1o7o7L8L9M8r0o3P3K11
-1312A188P3PQj85m6J28J28o4o5j34j34P0P0r1r0MNJ19J20n3n3QPM8q9N6N7k5k6J8J8m1R6
-1317A132O1p5p2p2P2P2R0m7l9l9J8J7N2N3m3m3O3O3K9j09l1l1j1j1J10k8r9L8K2K1M3M3j03
-1322A146L5nmM8r1n2n3N9p9j1J26j06L2R2R2K6j11q3N4o5o6NMk9l0Q7Q7J8J9j0rm4m4M5M6
-1327A129M5M6k9k9k9k9k1k1R1m7K5K6n3n2M5M4j5j6m8R0K6K6j41Q8K8K8L0L0m7m7l6j74j02
-1332H61J28j08K9J13k5L4L4K5K5l6l6L3L3m0m0O7O6j8j55j20J6J20J19N9N9K2K3m7m6J%q5
$$ plain form
-1337 1111 1164 1263 1224 1203 1182 1110 1039 1002 965 946 928 944 960 948 935 1069 1065 996 928 966 1003 1053 1103 1153 1202 1204 1206 1087 1106 1210 1176 1129 1081 1031
-1342 1031 1211 1147 1083 1138 1193 1134 1074 1102 1129 1156 1183 1181 1178 977 1006 1098 1189 1089 989 998 1007 1051 1094 1062 1030 1006 982 990 1135 1169 1202 1235 1267 1224
-1348 1224 1044 1000 1092 1099 1106 1037 967 1012 1057 1020 984 1016 1048 1041 1035 968 1131 1186 1241 1242 1243 1221 1200 1178 1157 1213 1268 1210 1151 1134 1117 1092 1067 1135 1066 1006
-1353 1006 946 938 930 871 949 1063 1040 1068 1096 1082 1068 977 1024 1055 1087 1021 955 915 1013 1033 1054 1045 1036 1027 1018 1071 1125 1144 1163 1245 1326 1330 1105 1092 1079 1034
-1359 1034 1127 1159 1052 1024 995 1038 944 1042 1140 1094 1049 986 1061 1150 1101 1061 1158 1233 1309 1241 1174 1013 989 1048 1108 1150 1192 1166 1139 1138 1136 1152 1030
-1364 1030 1031 1170 1109 1047 1095 1143 1122 1102 1100 1097 1095 1093 1084 1075 1134 1194 1248 1303 1243 1182 1222 1262 1181 1238 1353 1330 1233 1136 1071 1005 1045 1086 1185 1147 1186 1225
-1369 1225 1200 1175 1133 1228 1238 1109 1067 1025 1019 1013 1075 1137 1086 1035 1026 1018 952 1023 1132 1241 1218 1195 1207 1218 1170 1121 1141 1161 1071 982 1053 1124 1126 1129 1132 1134
-1375 1134 1111 1088 988 1025 1084 1143 1141 1140 1117 1095 1101 1244 1305 1229 1170 1111 1115 1118 1156 1193 1133 1072 1167 1124 1029 1073 1168 1125 1170 1077 1044 1148 1167 1185 1144
$$ packed form
-1337A111N3R9l9k1k1p2p1l7l7j9j8J6J6j2j3J34mo9o8L8L7N0N0N0M9KKj19J9J04l4m7m8n0
-1342A031J80o4o4N5N5n9o0K8K7K7K7klk01K9R2R1j00j00RRM4M3l2l2k4k4QJ45L4L3L3L2m3
-1348A224j80m4R2PPo9p0M5M5l7l6L2L2poo7J63N5N5JJk2k1k2k1N6N5n8n9j7j7k5k5O8o9o0
-1353A006o0qqn9P8J14k3K8K8j4j4r1M7L1L2o6o6m0R8K0K1rrrrN3N4J9J9Q2Q1Mk25j3j3m5
-1359A034R3L2j07k8k9M3r4R8R8m6m5o3P5Q9m9m0R7P5P6o8o7j61k4N9O0M2M2k6k7jkJ6j22
-1364A030JJ39o1o2M8M8k1k0klkkrrN9O0N4N5o0o1M0M0q1N7J15k3r7r7o5o6M0M1R9l8L9L9
-1369A225k5k5m2R5J0j29m2m2ooO2O2n1n1rqo6P1J09J09k3k3J2J1m8m9K0K0r0q9P1P1KLLK
-1375A134k3k3j00L7N9N9kjk3k2OJ43O1p6n9n9MLL8L7o0o1R5m3r5M4R5m3M5r3l3J04J9J8m1
$$ plain form
-1380 1144 1102 1099 1096 1102 970 1050 1130 1096 1061 931 938 983 1028 1013 999 985 971 1003 1035 1136 1237 1157 1077 1035 1130 1079 1028 985 942 901 860 1002 1007 1118
-1385 1118 1091 1019 947 934 921 1023 1124 1122 1119 1168 1080 1030 1118 1085 1053 1118 1183 1211 1101 1072 1044 1007 969 956 942 997 1052 1150 1247 1216 1046 1015 983
-1390 983 885 925 1090 1026 1039 1052 1061 1208 1162 1117 1194 1271 1320 1230 1140 1187 1122 1057 1001 1083 1198 1177 1200 1223 1169 1115 1191 1267 1268 1132 938 882 864
-1395 864 845 800 893 951 1009 1010 1148 1094 1041 1041 1041 1110 1178 1199 1219 1240 1260 1199 1138 1085 1033 984 1073 1084 1095 1111 1126 1142 1158 1181 1205 1159 1114 1153 1193
-1401 1193 1163 1134 1086 1038 1105 1172 1154 1136 1092 1048 927 944 961 977 969 1097 1148 1200 1222 1244 1240 1236 1123 1147 1240 1195 1216 1236 1308 1150 1109 1067 1080
-1406 1080 1094 1099 1105 1111 1117 1133 1149 1096 1043 994 945 1010 1076 1112 1147 1105 1063 1142 1084 1025 1104 1037 969 911 852 924 996 991 986 1031 938 845 890 880 870 868 867 905
-1411 905 944 982 1021 1046 1071 1096 1121 1134 1148 1001 991 1191 1162 1156 1149 1091 1033 1044 1055 1044 1032 1003 1112 1109 968 1028 1088 1038 989 1086 1045 1027 1008 1015
-1417 1015 1023 1044 1065 1018 970 1023 1077 984 1029 1021 1013 945 877 863 848 949 1049 1039 1029 993 957 895 971 1004 1037 960 883 797 849 898 947 936 925 978
$$ packed form
-1380A144m2llOj32Q0Q0l4l5j30PM5M5j5j4j4j4L2L2J01J01q0q0m2R5n1n1m3m3m1m1J42NJ11
-1385A118k7p2p2j3j3J02J01klM9q8n0Q8l3l2O5O5K8j10k9k8l7l8j3j4N5N5R8R7l1j70l1l2
-1390I83r8M0J65o4J3J3RJ47m6m5P7P7M9r0r0M7o5o5n6Q2J15k1K3K3n4n4P6P6Jj36j94n6j8
-1395H64j9m5R3N8N8JJ38n4n3%%O9O8K1K0K1K0o1o1n3n2m9Q9J1J1J6J5J6J6K3K4m6m5L9M0
-1401A193l0k9m8m8O7O7j8j8m4m4j21J7J7J6qJ28N1N2K2K2mmj13K4R3m5K1K0P2j58m1m2J3
-1406A080J4NOOOJ6J6n3n3m9m9O5O6L6L5m2m2P9n8n9P9o7o8n8n9P2P2nnM5r3r3M5j0j0kjL8
-1411I05L9L8L9K5K5K5K5J3J4j47j0K00k9opn8n8J1J1j1j2k9J09lj41O0O0n0m9R7m1j8j9P
-1417A015QK1K1m7m8N3N4r3M5qqo8o8j4j5J01J00j0j0l6l6o2P6L3L3p7p7q6N2M9M9j1j1N3
$$ plain form
-1422 978 1031 1050 1069 1125 1180 1227 1274 1326 1240 1118 995 981 967 987 1008 1043 1079 1071 1063 1115 1028 951 873 983 1093 1048 1141 1175 1072 1054 1037 1086 1135
-1427 1135 1155 1038 954 1007 1113 988 958 1065 1080 1096 1015 934 968 1002 1045 1087 1130 1173 1129 1086 965 982 1039 1096 1093 1090 1054 1019 1018 1017 1032 1047 1053 1059
-1432 1059 1212 1228 1252 1276 1277 1277 1277 1277 1222 1166 1102 1175 1134 1092 1174 1256 1215 1173 1141 1108 1084 1197 1276 1287 1262 1306 1311 1248 1265 1282 1180 1078 1075 1072 1001
-1437 1001 929 1013 1097 1138 1179 1202 1087 937 926 1035 1145 1148 1152 1047 942 997 1120 1263 1269 1242 1215 1096 977 1065 1152 1128 1104 1194 1285 1249
-1442 1249 1213 1177 1142 1098 1055 1016 977 942 976 1118 1122 1116 1110 982 853 904 956 1085 1076 1077 1078 1071 1063 1090 1117 1075 1033 1086 1140 1124 1109 1099 1089 1148 1208 1246
-1447 1246 1284 1217 1149 1084 1156 1194 1094 1109 1124 1131 1137 1095 1053 1045 1038 1151 1265 1214 1163 1161 1090 1041 1130 1194 1121 1087 1121 1179 1100 1063 1096 1052 1008 1003 998 1020
-1453 1020 1041 994 947 882 818 868 918 936 954 903 852 896 939 948 957 1039 1120 1087 1054 995 936 1037 1139 1186 1233 1211 1190 1136 1083 1099 1114 1068 1021 974
-1458 974 927 1023 1118 1179 1240 1172 1103 1103 1104 1170 1237 1097 957 985 1013 1041 1069 1004 939 988 1038 1124 1211 1312 1184 1201 1217 1220 1222 1226 1231 1201 1171 1129 1087
$$ packed form
-1422I78N3J9J9N6N5M7M7N2q6j22j23j4j4K0K1L5L6qqN2q7p7p8J10J10m5R3L4j03j8j7M9M9
-1427A135K0j17q4N3J06j25l0J07J5J6q1q1L4L4M3M2M3M3m4m3j21J7N7N7lll6l5jjJ5J5OO
-1432A059J53J6K4K4J%%%n5n6o4P3m1m2Q2Q2m1m2l2l3k4J13P9J1k5M4No3J7J7j02j02llp1
-1437A001p2Q4Q4M1M1K3j15j50j1J09J10LMj05j05N5J23J43Ok7k7j19j19Q8Q7k4k4R0R1l6
-1442A249l6l6l5m4m3l9l9l5L4J42Mooj28j29N1N2J29rJJpqK7K7m2m2N3N4j6j5j0j0N9O0L8
-1447A246L8o7o8o5P2L8j00J5J5POm2m2qpJ13J14n1n1kp1m9Q9O4p3l4L4N8p9l7L3m4m4nnK2
-1453A020K1m7m7o5o4N0N0J8J8n1n1M4M3RRQ2Q1l3l3n9n9J01J02M7M7k2k1n4n3J6J5m6m7m7
-1458I74m7R6R5O1O1o8o9%JO6O7j40j40K8K8K8K8o5o5M9N0Q6Q7J01j28J7J6LKMNl0l0m2m2
$$ plain form
-1463 1087 1159 1232 1232 1232 1164 1095 1099 1103 1221 1340 1232 1124 1176 1229 1151 1073 1110 1147 1157 1168 1212 1257 1247 1236 1157 1078 1083 1088 1161 1235 1226 1217 1139 1062 1059 1057 1034
-1469 1034 1012 980 1177 1263 1211 1047 1020 1192 1226 1176 1126 1102 1078 1103 1128 1154 1179 1153 1128 1171 1215 1217 1219 1152 1085 972 859 907 954 1005 1056 1000
-1474 1000 945 960 1112 1150 1051 1009 967 985 1003 983 963 925 1026 1118 1072 966 998 1038 1079 1136 1057 1007 957 1014 1070 1093 1117 1140 1163 1089 1015 1056
-1479 1056 1096 1095 1094 1093 1092 1122 1152 1312 1242 1171 1101 1168 1235 1324 1275 1097 919 918 917 985 1053 1033 1012 1069 1126 1047 1106 1199 1155 1093 1030 1074 1118 1142 1165
-1484 1165 1152 1001 941 882 974 1067 1130 1193 1141 1090 1156 1222 1259 1159 1003 984 957 930 923 1054 1184 1177 1171 1164 1158 1152 1102 1189 1062 1164 1198 1094 1116
-1489 1116 1139 1123 1107 1160 1214 1132 1050 969 887 911 935 924 914 1030 1147 1272 1260 1240 1220 1199 1179 1019 995 1056 1116 1080 1044 1077 1109 1130 1150 1102
-1494 1102 1053 1047 1041 1103 1166 1155 1144 1099 1054 1032 1011 989 967 1000 1032 1064 1097 1096 1096 1095 1094 1104 1114 1055 996 1110 1225 1178 1132 1072 1012 1021 1030 1113 1196 1165 1133
-1500 1133 1184 1235 1218 1200 1116 1032 1017 1003 1073 1144 1100 1056 1044 1033 1055 1078 1058 1038 1018 998 994 989 984 979 1026 1073 1051 1029 959 890 981 1072 1040 1007 1043 1079
$$ packed form
-1463A087P2P3%%o8o9MMJ18J19j08j08N2N3p8p8L7L7J0J1M4M5j0j1p9p9NNP3P4rrp8p7lkk3
-1469A034k2l2J97Q6n2j64k7J72L4n0n0k4k4K5K5K6K5k6k5M3M4KKo7o7j13j13M8M7N1N1n6
-1474A000n5J5J52L8r9m2m2J8J8k0k0l8J01R2m6j06L2M0M1N7p9n0n0N7N6K3K4K3K3p4p4M1
-1479A056M0jjjjL0L0J60p0p1p0O7O7Q9m9j78j78jjO8O8k0k1N7N7p9N9R3m4o2o3M4M4K4K3
-1484A165j3j51o0n9R2R3O3O3n2n1O6O6L7j00j56j9k7k7pJ31J30popoon0Q7j27J02L4j04K2
-1489A116K3j6j6N3N4q2q2q1q2K4K4j1j0J16J17J25j2k0k0k1k0j60k4O1O0l6l6L3L2K1K0m8
-1494A102m9ooO2O3j1j1m5m5k2k1k2k2L3L2L2L3j%jjJ0J0n9n9J14J15m7m6o0o0RRQ3Q3l1l2
-1500A133N1N1j7j8q4q4j5j4P0P1m4m4j2j1K2K3k0k0k0k0mnnnM7M7k2k2p0o9R1R1l2l3L6L6
$$ plain form
-1505 1079 1089 1100 1041 983 967 951 1004 1057 1055 1053 1085 1118 1075 1032 1104 1177 1162 1147 1133 1118 1078 1038 1066 1095 1102 1109 1117 1124 1119 1115 1111 1106 1098 1089 1081 1072 1126 1180 1166 1151 1185
-1511 1185 1219 1253 1287 1199 1110 1182 1254 1213 1172 1096 1020 1072 1123 1140 1156 1024 892 883 874 761 786 848 910 984 1059 1042 1163 1303 1213 1100 987
-1516 987 991 994 997 1001 966 931 982 895 812 865 948 1031 993 956 988 1019 983 946 979 1011 1008 1006 1115 1087 1127 1167 1129 1091 1111 1131 1082 1033 1011 989 1036 1220
-1522 1220 1302 1154 1014 1104 1177 1250 1222 1195 1145 1095 1046 996 995 995 916 976 1026 1077 1068 1058 1002 945 888 831 882 932 982 1032 1038 1044 1127 1073 1056 1040 1084
-1527 1084 1128 1111 1095 1078 1062 1096 1129 1103 1076 968 998 1110 1223 1130 1037 1059 1081 1080 1079 1017 956 986 1154 1130 1106 1115 1123 1132 1141 1111 1081 1129 1176 1056
-1532 1056 1073 1168 1125 1103 1219 1266 1176 1126 1214 1268 1183 1149 1253 1201 1150 1112 1074 1151 1228 1257 1287 1203 1118 1156 1195 1233 1272 1258 1245 1231 1218 1233 1248
-1537 1248 1149 1049 1096 1142 1074 1005 1040 1075 1041 1008 987 966 1059 1153 1207 1260 1199 1138 1181 1225 1245 1128 939 980 1075 1032 1157 1281 1337 1393 1213
-1542 1213 1171 1206 1104 1060 1154 1204 1118 1072 1026 1040 1054 1020 987 1113 1240 1155 1069 1027 985 934 1020 1063 1107 1105 1103 1153 1066 963 997 1100 1066 995
$$ packed form
-1505A079J0J1n9n8j6j6N3N3kkL2L3m3m3P2P3j5j5j4j5m0m0K8K9PPQPnmmnqrqrN4N4j4j5L4
-1511A185L4L4L4q8q9P2P2m1m1p6p6N2N1J7J6j32j32rrj13K5O2O2P4P5j7J21J40r0j13j13
-1516I87MLLMl5l5N1q7q3N3Q3Q3l8l7L2L1l6l7L3L2lkJ09k8M0M0l8l8K0K0m9m9k2k2M7J84
-1522A220Q2j48j40R0P3P3k8k7n0n0m9n0j%p9O0N0N1rj0n6n7n7n7N1N0N0N0OOQ3n4j7j6M4
-1527A084M4j7j6j7j6L4L3k6k7j08L0J12J13r3r3K2K2jjo2o1L0J68k4k4RQRRl0l0M8M7j20
-1532A056J7R5m3k2J16M7r0n0Q8N4q5l4J04n2n1l8l8P7P7K9L0q4q5L8L9L8L9j4j3j4j3J5J5
-1537A248r9j00M7M6o8o9L5L5l4l3k1k1R3R4N4N3o1o1M3M4K0j17j89M1R5m3J25J24N6N6j80
-1542A213m2L5j02m4R4N0q6m6m6J4J4l4l3J26J27q5q6m2m2n1Q6M3M4kkN0q7j03L4J03l4p1
$$ plain form
-1547 995 1062 1043 1023 1118 1213 1230 1248 1175 964 983 1002 1066 992 1065 1137 1196 1255 1280 1304 1215 1126 1028 1068 1112 1156 1140 1124 1142 1161 1145 1129 1131 1132 1099 1066
-1552 1066 1049 1032 938 981 994 1008 1177 1208 1202 1197 1183 1169 1168 1167 1089 1148 1156 1164 1257 1214 1082 950 1016 1081 1084 1087 1124 1161 1181 1202 1299 1260 1187 1114 1147 1180
-1558 1180 1070 961 1058 1154 1206 1257 1275 1292 1318 1345 1294 1243 1361 1341 1239 1136 1097 1057 1095 1133 1022 1047 1110 1173 1114 1054 1029 1004 1027 1049 1072
-1562 1072 1094 1120 1145 1136 1127 1006 885 934 982 973 1102 1196 1152 1129 1105 1141 1178 1093 1008 1084 1160 1195 1230 1150 1070 990 910 815 950 996 1041 987 932
$$ packed form
-1547I95O7j9k0R5R5J7J8p3k11J9J9O4p4P3P2N9N9K5K4q9q9r8M0M4M4j6j6J8J9j6j6KJl3l3
-1552A066j7j7r4M3J3J4J69L1onj4j4jjp8N9QQR3m3j32j32O6O5LLL7L7K0K1R7l9p3p3L3L3
-1558A180j10j09R7R6N2N1J8J7K6K7n1n1J18k0j02j03l9m0L8L8j11K5O3O3n9o0k5k5K3K2K3
-1562A072K2K6K5rrj21j21M9M8rJ29R4m4k3k4L6L7q5q5P6P6L5L5q0q0q0q0r5J35M6M5n4n5
$$ [...]
##END=	
##END=	
