##TITLE=	TC220
##JCAMPDX=	6.0	$$ NMR Plug-in v.1.14 of MestReNova 12.0.4-22023
##DATATYPE=	LINK
##BLOCKS=	2
##ORIGIN=	JEOL
##OWNER=	
##TITLE=	TC220
##JCAMPDX=	6.0	$$ NMR Plug-in 1.14 of MestReNova 12.0.4-22023
##BLOCKID=	1
##DATATYPE=	NMRSPECTRUM
##DATACLASS=	XYDATA
##NUMDIM=	1
##ORIGIN=	JEOL
##OWNER=	
##.OBSERVEFREQUENCY=	399.79071365325000897
##.OBSERVENUCLEUS=	^1H
##.SOLVENTNAME=	CHLOROFORM-D
##.PULSESEQUENCE=	proton.jxp
##LONGDATE=	2022/02/04 15:57:52.000
##.ACQUISITIONMODE=	SIMULTANEOUS
##$ORIGINALFORMAT=	JEOL Delta
##$PARAMETERFILE=	(datafile, ASCII, /Users/grace/Desktop/TC220_PROTON-1-1.jdf, 0)
$$ 
##$PARAMETERFILE=	(footer, BASE64, /Users/grace/Desktop/TC220_PROTON-1-1.jdf, 540672)
AQAAANodAABoZWFkZXIKICAgIGZpbGVuYW1lICAgICAgICA9PiAiVEMyMjBfUFJPVE9OIjsKICAgIHNh
bXBsZV9pZCAgICAgICA9PiAiVEMyMjAiOwogICAgY29tbWVudCAgICAgICAgID0+ICIiOwogICAgcHJv
Y2VzcyAgICAgICAgID0+ICJwcm90b25fYXV0b3BoYXNlLmxpc3QiOwogICAgYXV0b19kd2VsbCAgICAg
ID0gIFRSVUU7CiAgICBhdXRvX2ZpbHRlciAgICAgPSAgVFJVRTsKICAgIGF1dG9fZ2FpbiAgICAgICA9
PiBUUlVFOwogICAgZmlsdGVyX2xpbWl0ICAgID0+IDE2OwogICAgZm9yY2VfZHVhbF9tb2RlID0+IEZB
TFNFOwogICAgZGVjaW1hdGlvbl9yYXRlID0gIDA7CiAgICBmb3JjZV90dW5lICAgICAgPT4gRkFMU0U7
CiAgICBzYXZlX2Fib3J0ZWQgICAgPSAgVFJVRTsKICAgIHZlY3RvciAgICAgICAgICA9ICBUUlVFOwpl
bmQgaGVhZGVyOwoKaW5zdHJ1bWVudAogICAgcmVjdnJfZ2FpbiA9PiA0NjsKZW5kIGluc3RydW1lbnQ7
CgphY3F1aXNpdGlvbgogICAgeF9kb21haW4gICAgID0+ICJQcm90b24iOwogICAgeF9vZmZzZXQgICAg
ID0+IDVbcHBtXTsKICAgIHhfc3dlZXAgICAgICA9PiAxNVtwcG1dOwogICAgeF9wb2ludHMgICAgID0+
IDMyNzY4OwogICAgc2NhbnMgICAgICAgID0+IDg7CiAgICB4X3ByZXNjYW5zICAgPT4gMDsKICAgIG1v
ZF9yZXR1cm4gICA9PiAxOwogICAgeF9hY3FfdGltZSAgID0/IHhfcG9pbnRzIC8geF9zd2VlcDsKICAg
IHhfcmVzb2x1dGlvbiA9PyAxIC8geF9hY3FfdGltZTsKZW5kIGFjcXVpc2l0aW9uOwoKcHVsc2UKICAg
IGNvbGxlY3QgQ09NUExFWCxPQlM7CgogICAgbWFjcm8gb2JzX3ByZXNhdF90aW1lKCBkYW50ZV9wcmVz
YXQsIGRhbnRlX2xvb3AsIGRhbnRlX3B1bHNlLCBkYW50ZV9pbnRlcnZhbCwgcGhhc2VfZGFudGUsIHBo
c19zaGZ0LCBkYW50ZV9hdHRlbnVhdG9yLCBwcmVzYXRfdGltZSApIGlzCiAgICAgICAgd2hlbiBkYW50
ZV9wcmVzYXQgZG8KICAgICAgICAgICAgbG9vcCAxMDAgKiBkYW50ZV9sb29wIHRpbWVzCiAgICAgICAg
ICAgICAgICBkYW50ZV9wdWxzZSwgKE9CUy5HQVRFLCBPQlMuUEhTLnBoYXNlX2RhbnRlLmxzdGVwKHBo
c19zaGZ0KSwgT0JTLkFUTi5kYW50ZV9hdHRlbnVhdG9yKTsKICAgICAgICAgICAgICAgIGRhbnRlX2lu
dGVydmFsOwogICAgICAgICAgICBlbmQgbG9vcDsKICAgICAgICBlbmQgd2hlbjsKICAgICAgICB3aGVu
IG5vdCBkYW50ZV9wcmVzYXQgZG8KICAgICAgICAgICAgcHJlc2F0X3RpbWU7CiAgICAgICAgZW5kIHdo
ZW47CiAgICBlbmQgb2JzX3ByZXNhdF90aW1lOwoKICAgIG1hY3JvIGFjcSggZGVhZF90aW1lLCBkZWxh
eSwgcGhhc2UgKSBpcwogICAgICAgIGRlYWRfdGltZSwgT0JTLlBIUy4wOwogICAgICAgIGRlbGF5LCAo
T0JTLlBIUy4wLCBSQ1YuR0FURSk7CiAgICAgICAgYWNxdWlyZSAoT0JTLlBIUy4wLCBSQ1YuUEhTLnBo
YXNlKTsKICAgIGVuZCBhY3E7CgogICAgZXhwZXJpbWVudCAgICAgICAgICAgID0gICJwcm90b24uanhw
IjsKICAgIGNvbW1lbnRfMSAgICAgICAgICAgICA9PyAiKioqIFB1bHNlICoqKiI7CiAgICB4X2FuZ2xl
ICAgICAgICAgICAgICAgPT4gNDVbZGVnXSwgMVtkZWddLT4zNjBbZGVnXSA6IDFbZGVnXSwgaGVscCAi
ZmxpcCBhbmdsZSI7CiAgICB4XzkwX3dpZHRoICAgICAgICAgICAgPT4gNi4zOVt1c10sIGhlbHAgInNl
$$ [...]
RENfQkFMQU5DRUQgICAgICAgICAgICAgICAgIAMDLAAAAAAAAAAAAAAAAAABAAAAAAAAAAAAAAAAAAAA
AQAAAHhfc2NhbGUgICAgICAgICAgICAgICAgICAgICAAAAAAAAAAAAAAAAAAAAAAAAAAAAAAAAAAAAAA
AAAAAAAAAAAAAAAAAAAAAAAAAAAAAAAAAAAAAAAAAAAAAAAAAAAAAAAAAAAAAAAAAAAAAAAAAAAAAAAA
AAAAAAAAAAAAAAAAAAAAAAAAAAAAAAAAAAAAAAAAAAAAAAAAAAAAAAAAAAAAAAAAAAAAAAAAAAAAAAAA
AAAAAAAAAAAAAAAAAAAAAAAAAAAAAAAAAAAAAAAAAAAAAAAAAAAAAAAAAAAAAAAAAAAAAAAAAAAAAAAA
AAAAAAAAAAAAAAAAAAAAAAAAAAAAAAAAAAAAAAAAAAAAAAAAAAAAAAAAAAAAAAAAAAAAAAAAAAAAAAAA
AAAAAAAAAAAAAAAAAAAAAAAAAAAAAAAAAAAAAAAAAAAAAAAAAAAAAAAAAAAAAAAAAAAAAAAAAAAAAAAA
AAAAAAAAAAAAAAAAAAAAAAAAAAAAAAAAAAAAAAAAAAAAAAAAAAAAAAAAAAAAAAAAAAAAAAAAAAAAAAAA
AAAAAAAAAAAAAAAAAAAAAAAAAAAAAAAAAAAAAAAAAAAAAAAAAAAAAAAAAAAAAAAAAAAAAAAAAAAAAAAA
AAAAAAAAAAAAAAAAAAAAAAAAAAAAAAAAAAAAAAAAAAAAAAAAAAAAAAAAAAAAAAAAAAAAAAAAAAAAAAAA
AAAAAAAAAAAAAAAAAAAAAAAAAAAAAAAAAAAAAAAAAAAAAAAAAAAAAAAAAAAAAAAAAAAAAAAAAAAAAAAA
AAAAAAAAAAAAAAAAAAAAAAAAAAAAAAAAAAAAAAAAAAAAAAAAAAAAAAAAAAAAAAAAAAAAAAAAAAAAAAAA
AAAAAAAAAAAAAAAAAAAAAAAAAAAAAAAAAAAAAAAAAAAAAAAAAAAAAAAAAAAAAAAAAAAAAAAAAAAAAAAA
AAAAAAAAAAAAAAAAAAAAAAAAAAAAAAAAAAAAAAAAAAAAAAAAAAAAAAAAAAAAAAAAAAAAAAAAAAAAAAAA
AAAAAAAAAAAAAAAAAAAAAAAAAAAAAAAAAAAAAAAAAAAAAAAAAAAAAAAAAAAAAAAAAAAAAAAAAAAAAAAA
AAAAAAAAAAAAAAAAAAAAAAAAAAAAAAAAAAAAAAAAAAAAAAAAAAAAAAAAAAAAAAAAAAAAAAAAAAAAAAAA
AAAAAAAAAAAAAAAAAAAAAAAAAAAAAAAAAAAAAAAAAAAAAAAAAAAAAAAAAAAAAAAAAAAAAAAAAAAAAAAA
AAAAAAAAAAAAAAAAAAAAAAAAAAAAAAAAAAAAAAAAAAAAAAAAAAAAAAAAAAAAAAAAAAAAAAAAAAAAAAAA
AAAAAAAAAAAAAAAAAAAAAAAAAAAAAAAAAAAAAAAAAAAAAAAAAAAAAAAAAAAAAAAAAAAAAAAAAAAAAAAA
AAAAAAAAAAAAAAAAAAAAAAAAAAAAAAAAAAAAAAAAAAAAAAAAAAAAAAAAAAAAAAAAAAAAAAAAAAAAAAAA
AAAAAAAAAAAAAAAAAAAAAAAAAAAAAAAAAAAAAAAAAAAAAAAAAAAAAAAAAAAAAAAAAAAAAAAAAAAAAAAA
AAAAAAAAAAAAAAAAAAAAAAAAAAAAAAAAAAAAAAAAAAAAAAAAAAAAAAAAAAAAAAAAAAAAAAAAAAAAAAAA
AAAAAAAAAAAAAAAAAAAAAAAAAAAAAAAAAAAAAAAAAAAAAAAAAAAAAAAAAAAAAAAAAAAAAAAAAAAAAAAA
AAAAAAAAAAAAAAAAAAAAAAAAAAAAAAAAAAAAAAAAAAAAAAAAAAAAAAAAAAAAAAAAAAAAAAAAAAAAAAAA
AAAAAAAAAAAAAAAAAAAAAAAAAAAAAAAAAAAAAAAAAAAAAAAAAAAAAAAAAAAAAAAAAAAAAAAAAAAAAAAA
AAAAAAAAAAAAAAAAAAAAAAAAAAAAAAAAAAAAAAAAAAAAAAAAAAAAAAAAAAAAAAAAAAAAAAAAAAAAAAAA
AAAAAAAAAAAAAAAAAAAAAAAAAAAAAAAAAAAAAAAAAAAAAAAAAAAAAAAAAAAAAAAAAAAAAAAAAAAAAAAA
AAAAAAAAAAAAAAAAAAAAAAAAAAAAAAAAAAAAAAAAAAAAAAAAAAAAAAAAAAAAAAAAAAAAAAAAAAAAAAAA
AAAAAAAAAAAAAAAAAAAAAAAAAAAAAAAAAAAAAAAAAAAAAAAAAAAAAAAAAAAAAAAAAAAAAAAAAAAAAAAA
AAAAAAAAAAAAAAAAAAAAAAAAAAAAAAAAAAAAAAAAAAAAAAAAAAAAAAAAAAAAAAAAAAAAAAAAAAAAAAAA
AAAAAAAAAAAAAAAAAAAAAAAAAAAAAAAAAAAAAAAAAAAAAAAAAAAAAAAAAAAAAAAAAAAAAAAAAAAAAAAA
AAAAAAAAAAAAAAAAAAAAAAAAAAAAAAAAAAAAAAAAAAAAAAAAAAAAAAAAAAAAAAAAAAAAAAAAAAAAAAAA
AAAAAAAAAAAAAAAAAAAAAAAAAAAAAAAAAAAAAAAAAAAAAAAAAAAAAAAAAAAAAAAAAAAAAAAAAAAAAAAA
AAAAAAAAAAAAAAAAAAAAAAAAAAAAAAAAAAAAAAAAAAAAAAAAAAAAAAAAAAAAAAAAAAAAAAAAAAAAAAAA
AAAAAA==
##XUNITS=	HZ
##YUNITS=	ARBITRARY UNITS
##FIRSTX=	5001.712723709569218
##LASTX=	-993.37676639966048242
##XFACTOR=	-0.1143468212269780071
##YFACTOR=	4.3811559677124024789e-10
##NPOINTS=	52430
##XYDATA=	(X++(Y..Y))
$$ [...]
-9414C503621L02176L65496M53301N80717P44874R56756J220173J543242J913554K272310
$$ 3503621 3805797 4171293 4624594 5205311 5950185 6906941 8127114 9670356 11583910 13856220
-9404A3856220K566273K714681K695595K551714K295936J967614J536222R34966J75260o40770
$$ 13856220 16422493 19137174 21832769 24384483 26680419 28648033 30184255 31119221 31294481 30653711
-9394C0653711j377573j927559k274959k479208k612825k668175k595635k365150k010103
$$ 30653711 29276138 27348579 25073620 22594412 19981587 17313412 14717777 12352627 10342524
-9385A0342524j594460j224144r28278o95399n25934l99948l01647k29108j73755j31758j02651
$$ 10342524 8748064 7523920 6595642 5900243 5374309 4974361 4672714 4443606 4269851 4138093 4035442
-9374D035442o8289n2173m0719k5448j3996j827J7262L4441N3529Q1327J08050J44317J86312
$$ 4035442 3967153 3914980 3874261 3848813 3834817 3832990 3850252 3884693 3938222 4019549 4127599 4271916 4458228
-9361D458228K27591K77220L23031L65026L98714M17802M39754M66477M89144N08233N45455
$$ 4458228 4685819 4963039 5286070 5651096 6049810 6467612 6907366 7373843 7862987 8371220 8916675
-9350H916675N87449O65114P75827R37600J170476J478752J894876K445574L151839M041261
$$ 8916675 9504124 10169238 10945065 11882665 13053141 14531893 16426769 18872343 22024182 26065443
-9340B6065443N098753O220184P231870P901147Q057676P703104P050293O307514N448551
$$ 26065443 31164196 37384380 44616250 52517397 60575073 68278177 75328470 81635984 87084535
-9331H7084535M235481K414466J1011k520098m654168o101045o945348p544699q111635q466673
$$ 87084535 91320016 93734482 93745493 91225395 86571227 80470182 73524834 65980135 57868500 49401827
-9321D9401827q291060p432088o115952m745412l587324k697807k037834j560623j203437
$$ 49401827 41110767 33678679 27562727 22817315 19229991 16532184 14494350 12933727 11730290
-9312A1730290r40015p50091o01198m91655m19117l70443l43720l16519k89795k72138k53050
$$ 11730290 10790275 10040184 9438986 8947331 8528214 8157771 7814051 7497532 7207737 6935599 6682549
-9301F682549k37929k11205j71119j21491o1600m336O1041J33578J99975K57241L08779L50773
$$ 6682549 6444620 6233415 6062296 5940805 5879205 5874869 5935910 6069488 6269463 6526704 6835483 7186256
-9289G186256L82746M09469M36670M63395M92205N41834N98623O94064Q36032J038369J309900
$$ 7186256 7569002 7978471 8415141 8878536 9370741 9912575 10511198 11205262 12041294 13079663 14389563
-9278A4389563J680211K170378K807930L626812M638495N800966O957721P877773Q332075
$$ 14389563 16069774 18240152 21048082 24674894 29313389 35114355 42072076 49949849 58281924
-9269E8281924Q187754P596014O852036O084702N122411L652610J464622j181013l707149
$$ 58281924 66469678 74065692 80917728 87002430 92124841 95777451 97242073 96061060 92353911
-9260I2353911n627420o792294p468010q062845q601144q794888q332951p211723n772466
$$ 92353911 86726491 79934197 72466187 64403342 55802198 47007310 38674359 31462636 25690170
-9251B5690170m411474l323441k509089j909715j474029j149524r08400p28971o02034n21863
$$ 25690170 21278696 17955255 15446166 13536451 12062422 10912898 10004498 9275527 8673493 8151630
-9241H151630m71517m29524m10435l91347l75689l64235l57078l45624l27252l00528k57103
$$ 8151630 7680113 7250589 6840154 6448807 6073118 5708883 5351805 5006181 4678929 4378401 4121298
-9230D121298k15109j68282j18653p1887k9892L273L7632O7219P8672R6061J15148J32805
$$ 4121298 3906189 3737907 3619254 3547367 3517475 3520748 3558380 3625599 3704271 3800332 3915480 4048285
-9218D048285J51894J74322K08681K54970L12235L95448N06160O61252Q63587J122712J447211
$$ 4048285 4200179 4374501 4583182 4838152 5150387 5545835 6051995 6713247 7576834 8699546 10146757
-9207A0146757J831363K247488K618039K858551K903408K777425K528803K242475J890299
$$ 10146757 11978120 14225608 16843647 19702198 22605606 25383031 27911834 30154309 32044608
-9198C2044608J374915O60850k43936j159216j880754k362495k633548k800093k926077k961119
$$ 32044608 33419523 34080373 33836437 32677221 30796467 28433972 25800424 23000331 20074254 17113135
-9188A7113135k827503k523522k092127j626910j233691r19213o86335n16066l90079l00845
$$ 17113135 14285632 11762110 9669983 8043073 6809382 5890169 5203834 4687768 4297689 3996844
-9178C996844k35942j85898j59171j45693j39963j50078j50074j52583j52580j60576j60573
$$ 3996844 3760902 3575004 3415833 3270140 3130177 2980099 2830025 2677442 2524862 2364286 2203713
-9167B203713j60576j49120j37290j10563q2411o3320n1989m0533k0016q560n045O413P363
$$ 2203713 2043137 1894017 1756727 1646164 1563753 1500433 1448444 1407911 1387895 1379335 1374290 1380703 1388066
-9154A388066J8820K7406L8862M7449N8905O9631Q1084P6432P0705Q3231R4685R9098Q7646
$$ 1388066 1406886 1434292 1473154 1520603 1579508 1649139 1730223 1806655 1877360 1960591 2055276 2154374 2242020
-9141B242020P7446P7445Q7228R8681J12759J24212J39005J50458J67675J86763K00602K19690
$$ 2242020 2319466 2396911 2484139 2582820 2695579 2819791 2958796 3109254 3276929 3463692 3664294 3883984
-9129C883984K33052K52141K78864L05588L33355L75349M35477N00378N62653O42823P37788
$$ 3883984 4117036 4369177 4648041 4953629 5286984 5662333 6097810 6598188 7160841 7803664 8541452
-9118H541452Q71406J041880J259487J533881J888922K336425K905253L593863M422294N341513
$$ 8541452 9412858 10454738 11714225 13248106 15137028 17473453 20378706 23972569 28394863 33736376
-9108C3736376O269207P016033P317627O865714N426456K986499j17256l268675n784513p212317
$$ 33736376 40005583 47021616 54339243 61204957 66631413 69617912 69500656 66231981 60447468 53235151
-9098E3235151p513905o992323o049361n007140m048911l238166k577710k062328j653839
$$ 53235151 45721246 38728923 32679562 27672422 23623511 20385345 17807635 15745307 14091468
-9089A4091468j327548j079401q72770p00976n73684m78240m02368l37463k76146k18878j61139
$$ 14091468 12763920 11684519 10811749 10110773 9537089 9058849 8656481 8319018 8042872 7823994 7662855
-9078G662855r6236l9093J0539N5871R7868J48568K13472K53076K87439L11206L45568L84697
$$ 7662855 7566619 7527526 7538065 7593936 7691804 7840372 8053844 8306920 8594359 8905565 9251133 9635830
-9066I635830M19058M55919M90281N11156N16886N25382N59745O30010P40726Q91877J071311
$$ 9635830 10054888 10510807 11001088 11512244 12029130 12554512 13114257 13744267 14484993 15376870 16448181
-9055A6448181J285095J525612J818646K173693K591244L114267L774717M603153N649659
$$ 16448181 17733276 19258888 21077534 23251227 25842471 28956738 32731455 37334608 42984267
-9046D2984267O898043Q295146R719141J0957006J1670917J1559000J0371711Q060609M773601
$$ 42984267 49882310 58177456 67896597 78853603 90524520 102083520 112455231 120515840 125289441
-9037A25289441Q25351l271005o866279r412651j0741082j1073216j0742509r990425q978429
$$ 125289441 126114792 122843787 115977508 106564857 95823775 84750559 74008050 64017625 55039196
-9028E5039196p791132o564713n407962m398435l539458k833673k249567j778032j422987
$$ 55039196 47248064 40683351 35275389 30876954 27337496 24503823 22254256 20476224 19053237
-9019A9053237j166252j017360r71433r90517j015336j003880r35164q32085p01334n67711
$$ 19053237 17886985 16869625 15898192 14907675 13892339 12888459 11953295 11121210 10419876 9852165
-9009I852165m60823l57741k76619k11715j62337j27973j09844r0751p6916n7824l0150J1848
$$ 9852165 9391342 9033601 8756982 8545267 8382930 8254957 8145113 8054362 7977446 7919622 7889472 7901320
-8997G901320N7478R9475J47669J97303K51700L24241L99156M79333N82923P08909Q79269
$$ 7901320 7958798 8058273 8205942 8403245 8654945 8979186 9378342 9857675 10440598 11149507 12028776
-8986A2028776J089243J357429J697205K110939K649232L324954M153389N129273O209670
$$ 12028776 13118019 14475448 16172653 18283592 20932824 24257778 28411167 33540440 39750110
-8977C9750110P244612P996695Q119335P267994N264717K214407j390876m815325p314570
$$ 39750110 46994722 54991417 63110752 70378746 75643463 77857870 76466994 71651669 64337099
-8968F4337099q517134q529539p739285o606193n426530m368092l501478k806192k252629
$$ 64337099 55819965 47290426 39551141 32944948 27518418 23150326 19648848 16842656 14590027
-8959A4590027j826010j493870j224256j021916q65873p47522o60078o02809n50797n01164
$$ 14590027 12764017 11270147 10045891 9023975 8158102 7410580 6750502 6147693 5596896 5095732
-8949E095732m58190m16191l65611l15978k77328k35330j97158j62794j47002j35546j22664
$$ 5095732 4637542 4221351 3855740 3539762 3262434 3027104 2829946 2667152 2520150 2384604 2261940
-8938B261940j28387j31851j37574j45809j40079j32715j21259j06231q7139q0938p5209o5549
$$ 2261940 2133553 2001702 1864128 1718319 1578240 1445525 1324266 1218035 1130896 1049958 974749 909200
-8926I09200n4092n6713n6713o0769o0770m7527m7526n2299n2299l7028l7029l2256l2256
$$ 909200 855108 798395 741682 680913 620143 572616 525090 472791 420492 383464 346435 314179 281923
-8913B81923l2674l2674k4084k4084k8188k8189k8189k8189k8487k8486k1209k1210k2328
$$ 281923 249249 216575 192491 168407 140219 112030 83841 55652 27165 -1321 -22530 -43740 -66068
-8900f6068j2784j3977j3977j1292k0837j8332q787n849j1576p759p758j2173j2172j2173
$$ -66068 -78852 -92829 -106806 -118098 -138935 -157267 -166054 -171903 -183479 -191238 -198996 -211169 -223341 -235514
-8886b35514j2172j0995j0994o222o223n864n864n865n864q460q459j778j779o729o729l866
$$ -235514 -247686 -258681 -269675 -275897 -282120 -287984 -293848 -299713 -305577 -314037 -322496 -324274 -326053 -332782 -339511 -343377
-8870c43377l866m9m8m821m820o491o491o491o491o572o573o573o573n439n439L150L150m29
$$ -343377 -347243 -347292 -347340 -352161 -356981 -363472 -369963 -376454 -382945 -389517 -396090 -402663 -409236 -414675 -420114 -416964 -413814 -414243
-8852d14243m28m29m29P982P982J0846J0845J0935J0934O163O163J0457J0458J868J867K673
$$ -414243 -414671 -415100 -415529 -407547 -399565 -388719 -377874 -366939 -356005 -349842 -343679 -333222 -322764 -320896 -319029 -316356
-8836c16356K674r735r734j9398j9397j2717j2717j5226j5222j0454j0450j0692j0689n920
$$ -316356 -313682 -323417 -333151 -352549 -371946 -384663 -397380 -412606 -427828 -438282 -448732 -459424 -470113 -476033
-8822d76033n917k968k964p739p736J566J569j297j294m996m992k132k129o547o543J35J38
$$ -476033 -481950 -484918 -487882 -495621 -503357 -501791 -500222 -501519 -502813 -507809 -512801 -514933 -517062 -523609 -530152 -530017 -529879
-8805e29879n026n022J655J659l13l09l13l10j607j606J256J256N015N014K509K509L165Q892
$$ -529879 -534905 -539927 -538272 -536613 -536926 -537235 -537548 -537858 -539465 -541071 -539815 -538559 -533544 -528530 -526021 -523512 -520347 -511455
-8787e11455Q534Q534R488R488J4857K0583K4178K4177L5630M1357M1953M1953M2311L6585
$$ -511455 -502921 -494387 -484899 -475411 -460554 -439971 -415793 -391616 -355986 -314629 -272676 -230723 -188412 -151827
-8773a51827L2707K6981J6244O699p020k0382l4102l4101l7237m6782m9405m9406m4216l4672
$$ -151827 -119120 -92139 -75895 -69196 -76216 -96598 -130700 -164801 -202038 -248820 -298225 -347631 -391847 -426519
-8759d26519k7276k7275j4987r261j5703r977o099o100o099o099J819l907o86o86j0886j0886
$$ -426519 -453795 -481070 -496057 -505318 -521021 -530998 -537097 -543197 -549296 -555395 -553576 -557483 -558169 -558855 -569741 -580627
-8743e80627k297k297k863k863k863k863m594m593K088K088N93N92k270k271P13P12P035P035
$$ -580627 -582924 -585221 -588084 -590947 -593810 -596673 -601267 -605860 -603772 -601684 -601091 -600499 -602769 -605040 -604327 -603615 -596580 -589545
-8725e89545L844j883M201M202M261M262P721J3447J7564J7563J8279J8280L0269L5995M7091
$$ -589545 -585701 -587584 -583383 -579181 -574920 -570658 -562937 -549490 -531926 -514363 -496084 -477804 -447535 -411540 -364449
-8710c64449M7091M4824M4823L7428K7883K2753J7026N63j2799k0188l3546m5003m4999l9634
$$ -364449 -317358 -272534 -227711 -190283 -162400 -139647 -122621 -122058 -134857 -155045 -188591 -233594 -278593 -318227
-8696c18227l9631m9536m3806k7644k7641k3469j7739j1598n868q735q732m022m019L91L95
$$ -318227 -357858 -407394 -451200 -478844 -506485 -529954 -547693 -559291 -565159 -573894 -582626 -586648 -590667 -590276 -589881
-8681e89881R88m735j0584j036K032j1327k859k856p035j305j666j663q54q54q53q54j868
$$ -589881 -588893 -593628 -604212 -605248 -603216 -614543 -617402 -620258 -627293 -628598 -630264 -631927 -632781 -633635 -634488 -635342 -637210
-8664f37210j868j868j867K456K457j360M365N320m224J503J502j8j9j9j8J0539J0540N767
$$ -637210 -639078 -640946 -642813 -640357 -637900 -639260 -634895 -629575 -633799 -632296 -630794 -630812 -630831 -630850 -630868 -620329 -609789 -604022
-8646f04022N768J6057J6057J6058J6057P587P586J2956L411R96R99j0100j0096j1770j1766
$$ -604022 -598254 -582197 -566140 -550082 -534025 -526438 -518852 -505896 -502485 -501489 -500490 -510590 -520686 -532456 -544222
-8631e44222j1770j1766j3798j3794r026r022q370q366K20K24n701n696r29r24O82O86k181
$$ -544222 -555992 -567758 -581556 -595350 -604376 -613398 -621768 -630134 -629914 -629690 -635391 -641087 -642016 -642940 -642258 -641572 -643753
-8614f43753k177O97P01O97P01m612m608K069K073K05K05k658k658R80R81j883j883j659j659
$$ -643753 -645930 -645233 -644532 -643835 -643134 -647746 -652354 -650285 -648212 -648007 -647802 -650460 -653118 -652138 -651157 -653040 -654923 -656582 -658241
-8595f58241j659j659L531L530l150l150n566n567m611M932Q452K725k047k046k495k494k494
$$ -658241 -659900 -661559 -658028 -654498 -657648 -660798 -666364 -671931 -676542 -671610 -663158 -660433 -662480 -664526 -667021 -669515 -672009
-8578f72009k494m06m07m06m06L418L419L419L418K703K703K703K703N716N715N119N118N835
$$ -672009 -674503 -674909 -675316 -675722 -676128 -672710 -669291 -665872 -662454 -659751 -657048 -654345 -651642 -645926 -640211 -635092 -629974 -624139
-8560f24139l710j562M165K27K28N85N85P147P147K375K375P594P594J2367J2366J4514J4514
$$ -624139 -627849 -629411 -625246 -625019 -624791 -624206 -623621 -616474 -609327 -606952 -604577 -596983 -589389 -577022 -564656 -550142 -535628
-8543e35628K1194K1195L6219L6220K9180K9180J4388Q660m06j7586k5848k5847l1693l1694
$$ -535628 -514434 -493239 -457020 -420800 -391620 -362440 -348052 -339392 -339798 -357384 -383232 -409079 -440772 -472466
-8529d72466k5012k5012j6423j6422j1562j1561n238n238n059j0786j2933l389p117p117j748
$$ -472466 -497478 -522490 -538913 -555335 -566897 -578458 -583696 -588934 -593993 -604779 -617712 -621101 -628218 -635335 -637083
-8514f37083j749k583k584K188K189N67N70N67N70J0469J0472J0469J0472Q859Q861N995N999
$$ -637083 -638832 -641415 -643999 -641811 -639622 -639055 -638485 -637918 -637348 -626879 -616407 -605938 -595466 -586607 -577746 -571751 -565752
-8497e65752J342J346O114O118J998K002J999K002r25r21K297J1844J2229J2232J7955J7959
$$ -565752 -564410 -563064 -556950 -550832 -548834 -546832 -544833 -542831 -543756 -544677 -542380 -530536 -518307 -506075 -488120 -470161
-8481d70161K2070K7801L6865N4047N7351N7354N7350N7355M4883K7708Q735q440k3924m1100
$$ -470161 -448091 -420290 -383425 -329378 -272027 -214673 -157323 -99968 -55085 -27377 -18642 -27082 -51006 -92106
-8467i2106n0647n0643m5279m5275l6689l6685l0903l0899j8496j8492j3604j3600j0741j0737
$$ -92106 -142753 -193396 -238675 -283950 -320639 -357324 -388227 -419126 -437622 -456114 -469718 -483318 -494059 -504796
-8453e04796j167j163j1666j1662o774o770o774o771m074m075m075m075k405k405M59M59O065
$$ -504796 -505963 -507126 -518792 -530454 -537228 -543998 -550772 -557543 -561617 -565692 -569767 -573842 -576247 -578652 -578193 -577734 -571669
-8436e71669O066J652J651p833k106K904o640j435j435k032k032j137j137j137j137K501K502
$$ -571669 -565603 -563951 -562300 -570133 -572239 -569335 -575975 -577410 -578845 -580877 -582909 -584046 -585183 -586320 -587457 -584956 -582454
-8419e82454K501K502J3537J3537J3895J3895K0192K5918K7827K7827K8126L3851L2540J9178
$$ -582454 -579953 -577451 -563914 -550377 -536482 -522587 -502395 -476477 -448650 -420823 -392697 -358846 -326306 -307128
-8405c07128J0767k595j9894l3255l4448l4449l5522k5978k2786j7061j3003j3004j1274j1274
$$ -307128 -296361 -298956 -318850 -352105 -386553 -421002 -456524 -482502 -505288 -522349 -535352 -548356 -559630 -570904
-8391e70904m18m17n876j49l370l371o412o413r275r276k953k949k237p959q620k889j49j46
$$ -570904 -571322 -571739 -577615 -577764 -581134 -584505 -590917 -597330 -606605 -615881 -618834 -621783 -624020 -631979 -640599 -643488 -643637 -643783
-8373f43783K476l248k9k6J461J465l310l307j939j935M742M746j700j696J163J167n488n484
$$ -643783 -641307 -644555 -644584 -644610 -643149 -641684 -644994 -648301 -650240 -652175 -647433 -642687 -644387 -646083 -644920 -643753 -649241 -654725
-8355f54725J193J197J372J375k087k084K785o760o759K785k047k046J413J413N021N022K159
$$ -654725 -653532 -652335 -650963 -649588 -651675 -653759 -650974 -657734 -664493 -661708 -663755 -665801 -664388 -662975 -657954 -652932 -650773
-8338f50773K159K218K218N439k87j733j734k688O856J16J15M292j436q98M828J249J249M947
$$ -650773 -648614 -646396 -644178 -638739 -639026 -640759 -642493 -645181 -638325 -638209 -638094 -633802 -635238 -636136 -631308 -630059 -628810 -623863
-8320f23863M947K323p222k591O957N760N764K300K304N164N167M358M362j965j961n364L65
$$ -623863 -618916 -616593 -623815 -626406 -619449 -613689 -607925 -605625 -603321 -598157 -592990 -588632 -584270 -586235 -588196 -593560 -593195
-8303e93195P19n003j1382n652q83o607q817l087L829L833m642m638P27O457j360j357J860
$$ -593195 -592476 -597479 -608861 -614513 -615396 -622003 -630820 -633907 -630078 -626245 -630887 -635525 -634798 -628341 -629701 -631058 -629198
-8286f29198J864J707J708J111J111O301l244m556m556k975k975L706L706P23P23P24P23k774
$$ -629198 -627334 -625627 -623919 -622808 -621697 -615396 -618640 -623196 -627752 -630727 -633702 -629996 -626290 -625567 -624844 -624120 -623397 -626171
-8268f26171k774k773k774K595K595k69k68k193k192O71O71O577O576O577O576O946O946J1717
$$ -626171 -628945 -631718 -634492 -631897 -629302 -629571 -629839 -632032 -634224 -633553 -632882 -626305 -619729 -613152 -606576 -599630 -592684 -580967
-8250e80967J1718J0107J0107P244P244L560L561n030n029p773p773p774p773r399r398r399
$$ -580967 -569249 -559142 -549035 -541791 -534547 -530987 -527426 -532456 -537485 -545258 -553031 -560805 -568578 -577977 -587375 -596774
-8234e96774r399l911l911l910l911K919K919K919K919J726J727J726J726K792K793K792K793
$$ -596774 -606173 -610084 -613995 -617905 -621816 -618897 -615978 -613059 -610140 -608414 -606687 -604961 -603235 -600443 -597650 -594858 -592065
-8217e92065j920j920R43R43O506O505O506O506O446O446O684J2411J2367K1910K8353L7897
$$ -592065 -593985 -595905 -594962 -594019 -587513 -581008 -574502 -567996 -561550 -555104 -548420 -536009 -523642 -501732 -473379 -435482
-8201d35482M7680N7223P0109Q3470Q1904P2361N5895J9629j3895m6344p3068q2613q4857
$$ -435482 -387802 -330579 -260470 -177000 -95096 -22735 33160 52789 38894 -7450 -80518 -163131 -247988
-8188b47988p5313o0758m7397l8687l2961k0672j1129r787r786o327o326r131r130p818J726
$$ -247988 -323301 -384059 -431456 -470143 -503104 -523776 -534905 -544692 -554478 -560805 -567131 -576262 -585392 -593210 -591484
-8173e91484j197j196o01o00J010J011l762l762k57k57K606K606M694M693M694M694J924J927
$$ -591484 -592681 -593877 -594478 -595078 -594068 -593057 -596819 -600581 -600838 -601095 -598489 -595883 -591189 -586496 -581802 -577108 -575184 -573257
-8155e73257N026J0756N562j60O278O282L042L046N905N910R246R249J4376J4380J9147K4879
$$ -573257 -568231 -557475 -551913 -552073 -545795 -539513 -536471 -533425 -527520 -521610 -512364 -503115 -488739 -474359 -455212 -430333
-8139d30333K9288M6472N9353P6535J01228J18409J28817J28819J13665Q5036M5543J645l8923
$$ -430333 -401045 -354573 -295220 -218685 -117457 952 129769 258588 372253 457289 502832 504477 465554
-8126D65554o7551r0460r6187j00601j00601j03822r0460o8867n9323n1807l4627k1385k1385
$$ 465554 398003 307543 211356 110755 10154 -93668 -184128 -252995 -312318 -364125 -398752 -420137 -441522
-8113d41522j0409m682k535L191J2855J2854M623M623K595K595K237K237j1155j6881j3660
$$ -441522 -451931 -456613 -459148 -455957 -443102 -430248 -425625 -421002 -418407 -415812 -413575 -411338 -422493 -439374 -453034
-8098d53034j3660q530q530q531q530j3831j3832j3831j3832q343q344m884Q43p300p300J648
$$ -453034 -466694 -475224 -483754 -492285 -500815 -514646 -528478 -542309 -556141 -564484 -572828 -577712 -576869 -584169 -591469 -589821
-8082e89821J648O360O360J946J946P315J3041J0178J0178J4891K0616K9803L5530N1098P2096
$$ -589821 -588173 -581813 -575453 -573507 -571561 -564246 -551205 -541027 -530849 -515958 -495342 -465539 -430009 -378911 -306815
-8067c06815Q4026R7387J05858R6313O9829K9743j3496n7399r0804j04164r9512q6151p1596
$$ -306815 -222789 -125402 -19544 76769 146598 176341 162845 105446 14642 -89522 -189034 -275185 -346781
-8054c46781n8234m7497l4136k0415k0416k1012j5285n741n742q023k296l88l88O86O413R872
$$ -346781 -405015 -452512 -486648 -507063 -527479 -548491 -563776 -569517 -575259 -583282 -585578 -585966 -586354 -585668 -579255 -569383
-8038e69383R872J6016J6016J6971J1244J4645K4188J8462J8462J3395J3396M805M806j46
$$ -569383 -559511 -543495 -527479 -510508 -499264 -484619 -460431 -441969 -423507 -410112 -396716 -391911 -387105 -387251
-8024c87251j45j0644j0644j5595j5595j8458j8458j9532j9532j6669j6668j2762j2762j3358
$$ -387251 -387396 -398040 -408684 -424279 -439874 -458332 -476790 -496322 -515854 -532523 -549191 -561953 -574715 -588073
-8010e88073l814j0136j0137k860k859J614J614j249j249L285L284M22M21j674j674J189J190
$$ -588073 -591887 -602023 -612160 -615020 -617879 -616265 -614651 -615900 -617149 -613864 -610580 -610158 -609737 -611411 -613085 -611896 -610706
-7993f10706m180m179j316j316j734j733o506o506l105l106k42k42r88r88r88r88q69q69L904
$$ -610706 -614886 -619065 -620381 -621697 -623431 -625164 -631670 -638176 -641281 -644387 -644629 -644871 -645859 -646847 -647835 -648823 -649692 -650561 -646657
-7974f46657L903J846J845J846J845N067N066N067N066O171O170J0942J0946J2791J2792J7563
$$ -646657 -642754 -640908 -639063 -637217 -635372 -630305 -625239 -620172 -615106 -608935 -602765 -591823 -580877 -568086 -555294 -537731
-7958e37731J7567K1918K1918J9055J9058K3946K3946J5357J5360J338J339j525j521j3097
$$ -537731 -520164 -498246 -476328 -457273 -438215 -414269 -390323 -374966 -359606 -358268 -356929 -358454 -359975 -373072
-7944c73072j3097k3596k3592k5475k5474k0703k0699j4737j4738j4379j4376r197l471r66
$$ -373072 -386169 -409765 -433357 -458832 -484306 -505009 -525708 -540445 -555183 -569562 -583938 -593135 -596606 -597572
-7930e97572j0510r316l591J182J182m187m187K495K494J68J67M940M940K051K050K050K051
$$ -597572 -608082 -617398 -620989 -619807 -618625 -622812 -626999 -624504 -622010 -621842 -621675 -616735 -611795 -609744 -607694 -605644 -603593
-7913f03593Q2Q2N451m094m481m481n078n078n495n496n495n495l777l777R96R99J830J831
$$ -603593 -603511 -603429 -597978 -602072 -606553 -611034 -616112 -621190 -626685 -632181 -637676 -643171 -646948 -650725 -649729 -648730 -646900 -645069
-7895f45069J473J476q54o580k405P144P56m969J711J715M518M519J655J659n145n144J536
$$ -645069 -643596 -642120 -642974 -649554 -651959 -644815 -644059 -649028 -647317 -645602 -641084 -636565 -634910 -633251 -638396 -643540 -642004
-7878f42004J539j372j372J492J495l460l460l460l456j167j166L605L605j764j763L009L008
$$ -642004 -640465 -641837 -643209 -641717 -640222 -643682 -647142 -650602 -654058 -655225 -656391 -652786 -649181 -650945 -652708 -649699 -646691
-7861f46691N18N19N18N18J175J174M038M037k293k293n156n156N164N163N164N163N969N969
$$ -646691 -646173 -645654 -645136 -644618 -643443 -642269 -638231 -634194 -636487 -638780 -643936 -649092 -643928 -638765 -633601 -628438 -622469 -616500
-7843f16500Q832Q832J0920J0920O148O147J510J514j353j350o185o181o185o182j0181j0178
$$ -616500 -607668 -598836 -587916 -576996 -570848 -564701 -563191 -561677 -563030 -564380 -570565 -576746 -582931 -589113 -599294 -609472
-7827f09472n410n406m873m868J808J812Q98R02R488R492m828m824J853J857O147O152L284
$$ -609472 -614882 -620288 -625161 -630029 -628221 -626409 -625511 -624609 -615121 -605629 -610457 -615281 -613428 -611571 -605424 -599272 -595988
-7810e95988L289J3365J3370J0502J0506J5397J5401J5398J5401J7843J7847J7843J7846J1699
$$ -595988 -592699 -579334 -565964 -555462 -544956 -529559 -514158 -498760 -483359 -465516 -447669 -429826 -411980 -400281
-7796d00281J1703P882J3611Q060j480o255o253p903p900p308p303j5837o290m742R88N160
$$ -400281 -388578 -380696 -367085 -359025 -360505 -366760 -373013 -380916 -388816 -396124 -403427 -419264 -425554 -430296 -429308 -424148
-7780d24148n63O472J2202J6732J6736J2318J2322J3510J3515Q739Q743j760j756o532o528
$$ -424148 -424711 -418239 -406037 -389305 -372569 -360251 -347929 -334419 -320904 -312165 -303422 -305182 -306938 -313470 -319998
-7765c19998j9983j9979k8573k8569k6664k6660j9983j9980j8152j8149j6840p292q788q783
$$ -319998 -339981 -359960 -388533 -417102 -443766 -470426 -490409 -510389 -528541 -546690 -563530 -570822 -579610 -588393
-7751e88393n328n324m790m787m791m787j391j387J473J476j524j525m388m388q09q09l673
$$ -588393 -593721 -599045 -603835 -608622 -613413 -618200 -619591 -620978 -619505 -618029 -619553 -621078 -625466 -629854 -630663 -631472 -635145
-7734f35145l672M276M277m314m313m970m970j97j98j857j856j857j856N2N2k811k811K364
$$ -635145 -638817 -634541 -630264 -634578 -638891 -643861 -648831 -649028 -649226 -651083 -652939 -654796 -656652 -656600 -656548 -659359 -662170 -659806
-7716f59806K363K364K364O93O93O94O93O595O596J823J823k890k889k889k890j502j503j502
$$ -659806 -657443 -655079 -652715 -652022 -651329 -650635 -649942 -643347 -636751 -634928 -633105 -635995 -638884 -641773 -644663 -646165 -647668 -649170
-7698f49170j502l10l09l10l09K87K87K87K87J719J718j144j145L62L62k502k502k34k35K628
$$ -649170 -650672 -650982 -651291 -651601 -651910 -651623 -651336 -651049 -650762 -649043 -647325 -648469 -649614 -649252 -648890 -651392 -653894 -654128 -654363 -651735
-7678f51735K628j181j179m045m041j659j655J204J208N559N562p64p61o610q80O394l147
$$ -651735 -649107 -650288 -651467 -655512 -659553 -661212 -662867 -661663 -660455 -654896 -649334 -650098 -650859 -657469 -658349 -651955 -655102
-7661f55102n901j72P79P83K927K930O4O7m023m019K658K662k054k050O535O539k259k256
$$ -655102 -661003 -661175 -660396 -659613 -656686 -653756 -653692 -653625 -657648 -661667 -659009 -656347 -658401 -660451 -653916 -647377 -649636 -651892
-7643f51892k259k255M719M724M720M724j126j123j125j123m764m761L825L829K38K43K38
$$ -651892 -654151 -656406 -651687 -646963 -642243 -637519 -638645 -639768 -640893 -642016 -646780 -651541 -647716 -643887 -643649 -643406 -643168
-7626f43168K43j074j070j074j070l58l54M414M418l58l54O323O327M847M846M847M846P949
$$ -643168 -642925 -643999 -645069 -646143 -647213 -647571 -647925 -643511 -639093 -639451 -639805 -633482 -627155 -622308 -617462 -612615 -607769 -599820
-7608e99820P948P949P948N026N026j656j655m161m160p024p024r298r298r298r298k558k558
$$ -599820 -591872 -583923 -575975 -570949 -565923 -567579 -569234 -573395 -577555 -584579 -591603 -600901 -610199 -619497 -628795 -631353 -633911
-7591f33911k557k558l80l80l80l81R32R32j931j931L549L553j223j219m623m619N876N879
$$ -633911 -636468 -639026 -639406 -639786 -640166 -640547 -639615 -638683 -640614 -642545 -638996 -635443 -636666 -637885 -642508 -647127 -641251 -635372
-7573f35372R69R73R70R73J625J629J626J629m62m59m62m59K163K166K162K166K714K718K714
$$ -635372 -634403 -633430 -632460 -631487 -629862 -628233 -626607 -624978 -625440 -625899 -626361 -626820 -624657 -622491 -620329 -618163 -615449 -612731 -610017
-7554f10017K718J223J227J222J227L825L825r47r47r357r358p68p68R77R76l795l795k423
$$ -610017 -607299 -606076 -604849 -603627 -602400 -598575 -594750 -595697 -596644 -606001 -615359 -616127 -616895 -615918 -614942 -618737 -622532 -624955
-7536f24955k424k423k423j939j939K834K833J939J938r24r25N22N22L385L385L863L862O726
$$ -624955 -627379 -629802 -632225 -634164 -636103 -633269 -630436 -628497 -626559 -627483 -628408 -627886 -627364 -623979 -620594 -616731 -612869 -606143
-7518f06143O726j111j108J1297J1300J2907J2910J9588J9592J8723J8726J8007J8011J3892
$$ -606143 -599417 -600528 -601636 -590339 -579039 -566132 -553222 -533634 -514042 -495319 -476593 -458586 -440575 -426683
-7504d26683K441M109M112l385l382n532j6982k2473k2470j8417j8414j4898j4894j0125j0122
$$ -426683 -424242 -420133 -416021 -419406 -422788 -428320 -445302 -467775 -490245 -508662 -527076 -541974 -556868 -566993 -577115
-7489e77115q814q810n950n946k968k967J804J804J447J447J446J447N950N950N950N950R887
$$ -577115 -585929 -594739 -600689 -606635 -609603 -612570 -610766 -608962 -607515 -606068 -604622 -603175 -597225 -591275 -585325 -579375 -569488
-7472e69488R888O665O666O353O27p725L728K058l669k594k595R365R365P76P75L937L937
$$ -569488 -559600 -552935 -546269 -539916 -539289 -547014 -543286 -541228 -544897 -547491 -550086 -540721 -531356 -530580 -529805 -525868 -521931
-7455e21931J074J073O159O159N443N444P292m161r529l803l206l206J5J5l43l43J0155J0156
$$ -521931 -520857 -519784 -513625 -507466 -502023 -496579 -489287 -493448 -502977 -506780 -509986 -513192 -513177 -513162 -513505 -513848 -503693 -493537
-7437d93537J6217J6218K0990K0989J8783J8782J8067J8067J5889M437n74o301n943j1669
$$ -493537 -477320 -461102 -440112 -419123 -400340 -381558 -363491 -345424 -329535 -325098 -325672 -331973 -337916 -349585
-7423c49585j9304j9305k1064k1064k1064k1065k0885k0885j8022j8022j3250j3250q478q478
$$ -349585 -368889 -388194 -409258 -430322 -451386 -472451 -493336 -514221 -532243 -550265 -563515 -576765 -585243 -593721
-7409e93721m25m25m25m25j320j319L452L452r02r02r02r03R92R92R91R92R92R91R92R92M008
$$ -593721 -594146 -594571 -594996 -595421 -596741 -598060 -594608 -591156 -592058 -592960 -593862 -594765 -593773 -592781 -591790 -590798 -589806 -588815 -587823 -586831 -582823
-7388e82823M007M008M008M962M962j718j719K889K890K6K6k957k956J816J815l84l84n156
$$ -582823 -578816 -574808 -570800 -565838 -560876 -562594 -564313 -561424 -558534 -558508 -558482 -561439 -564395 -562579 -560764 -561148 -561532 -566688
-7370e66688n156k6k6m798m798l098l099k35k34p72p72p72p71k718k714J45J49n819n816j048
$$ -566688 -571844 -571870 -571896 -576694 -581492 -584590 -587689 -587924 -588158 -588930 -589702 -590474 -591245 -593963 -596677 -596532 -596383 -602202 -608018 -609066
-7350f09066j044K233K237K233K237J816J819J816J819J01J04J01J04M157M161M157M161P079
$$ -609066 -610110 -607877 -605640 -603407 -601170 -599354 -597535 -595719 -593900 -593799 -593695 -593594 -593490 -589333 -585172 -581015 -576854 -569775
-7332e69775P084P080P083J0182J0185J0182J0185J0070J0070J0070J0069P05P05n977n976
$$ -569775 -562691 -555611 -548528 -538346 -528161 -517979 -507794 -497724 -487654 -477584 -467515 -466810 -466105 -472082 -478058
-7317d78058q780q779q780q780o573o573o573o572m784m783m783m783k159k159k158k159l769
$$ -478058 -486838 -495617 -504397 -513177 -519750 -526323 -532896 -539468 -544252 -549035 -553818 -558601 -560760 -562919 -565077 -567236 -571005
-7300e71005l769K196p349k814O729P64P65L385L385L385L385K193K192K192K192N82N81N82
$$ -571005 -574774 -572578 -579927 -582741 -576012 -575248 -574483 -571098 -567713 -564328 -560943 -558750 -556558 -554366 -552174 -551592 -551011 -550429
-7282e50429N81K252K252K252K252j469j469j469j469k16k16k17k16N749N749M436n107J215
$$ -550429 -549848 -547596 -545344 -543092 -540840 -542309 -543778 -545247 -546716 -546932 -547148 -547365 -547581 -541832 -536083 -531647 -536754 -535539
-7264e35539J216L482L482L254L255L255L255J286J286J286J286K510K509K509K509Q39Q38
$$ -535539 -534323 -530841 -527359 -524105 -520850 -517595 -514340 -513054 -511768 -510482 -509196 -506686 -504177 -501668 -499159 -498320 -497482
-7247d97482Q39Q39M150M149M149M150K181K181O953O953M135M134M135M134M731M731M731
$$ -497482 -496643 -495804 -491654 -487505 -483356 -479206 -477025 -474844 -467891 -460938 -456803 -452669 -448534 -444400 -439669 -434938 -430207
-7230d30207M731N086N089j596j592L236L240L73L76J581J584j282j0823r634l903j044j040
$$ -430207 -425476 -420390 -415301 -416897 -418489 -415253 -412013 -411640 -411264 -409683 -408099 -409381 -420204 -429838 -433741 -434785 -435825
-7213d35825l572l567o435o431k081k076m944m940m377m373m377m373P494P497l005l001K267
$$ -435825 -439397 -442964 -449399 -455830 -457911 -459987 -464931 -469871 -474248 -478621 -482998 -487371 -479877 -472380 -475385 -478386 -476119
-7196d76119K267N130N130Q94Q95Q95Q95L787L788r84r84L370L370L371L370O375O375O375
$$ -476119 -473852 -468722 -463592 -462698 -461803 -460908 -460013 -456226 -452438 -453422 -454406 -451036 -447666 -444295 -440925 -434550 -428175 -421800
-7178d21800O376M943M944K080K080L900L900k781k782M854M854P718P717O349O349J6848
$$ -421800 -415424 -410481 -405537 -403457 -401377 -397477 -393577 -396358 -399140 -394286 -389432 -381714 -373997 -367648 -361299 -344451
-7162c44451J6848J6967J6966K1143K1142J5252N708O305O304K487K486j3738j3738k3492
$$ -344451 -327603 -310636 -293670 -272527 -251385 -236133 -230425 -224120 -217816 -215329 -212843 -226581 -240319 -263811
-7148b63811k3491k0628k0628k2477k2477k2477k2478j9748j9748p341p340j1755j1755l166
$$ -263811 -287302 -307930 -328558 -351035 -373512 -395989 -418467 -438215 -457963 -465304 -472644 -484399 -496154 -499320
-7134d99320l165j364j361j365j360K154K159K155K159L288L292o256o252K692K695K692K695
$$ -499320 -502485 -503849 -505210 -506575 -507935 -505781 -503622 -501467 -499308 -496020 -492728 -498984 -505236 -502544 -499849 -497157 -494462
-7117d94462k09k05k08k05l908l903l907l904m757m753R69R73m876m873m876m873j406j405
$$ -494462 -494671 -494876 -495084 -495289 -499197 -503100 -507007 -510911 -515668 -520421 -519452 -518479 -523355 -528228 -533104 -537977 -539383 -540788
-7099e40788j406j405J637J636m090m089K471K472l91l92J219J219J220J219m672m671J055
$$ -540788 -542194 -543599 -541962 -540326 -544416 -548505 -546034 -543562 -543953 -544345 -543126 -541907 -540687 -539468 -544140 -548811 -547756
-7082e47756J055j9j8k882k882J995J994q69q68k360k360k360k360J029J033L892L896J924
$$ -547756 -546701 -546720 -546738 -549620 -552502 -550507 -548513 -549382 -550250 -552610 -554970 -557330 -559690 -558661 -557628 -553736 -549840 -547916
-7064e47916J927l803l799J64J68J64J68J476J480J477J480P68P72P68P71j379j376j379j376
$$ -547916 -545989 -549792 -553591 -553427 -553259 -553095 -552927 -551451 -549971 -548494 -547014 -546246 -545474 -544706 -543935 -545314 -546690 -548069 -549445
-7045e49445N15N18N14N18N15N18N15N18j126j122j126j122m10m07m10m06Q87Q91Q87Q91J72
$$ -549445 -548930 -548412 -547898 -547380 -546865 -546347 -545832 -545314 -546440 -547562 -548688 -549810 -550220 -550627 -551037 -551443 -550556 -549665 -548778 -547887 -547715
-7024e47715J75J72J75J006J011J006J011J722J726J723J726l95l92l95l91J752J756J752
$$ -547715 -547540 -547368 -547193 -546187 -545176 -544170 -543159 -541437 -539711 -537988 -536262 -536657 -537049 -537444 -537835 -536083 -534327 -532575
-7006e32575J756r43r43r44r43K50K50K49K50J607J607J607J607o60o60o60o60k598k595L128
$$ -532575 -530819 -531762 -532705 -533649 -534592 -534342 -534092 -533843 -533593 -531986 -530379 -528772 -527165 -527825 -528485 -529145 -529805 -532403 -534998 -531870
-6986e31870L131j703j700J159J163j554j551j555j551J130J133J130J133k725k726L002L001
$$ -531870 -528739 -530442 -532142 -530983 -529820 -531374 -532925 -534480 -536031 -534901 -533768 -532638 -531505 -534230 -536956 -533954 -530953
-6969e30953j831j830J032J033J734J733J734J734K628K628K629K628K513K516K513K517M660
$$ -530953 -532784 -534614 -533582 -532549 -530815 -529082 -527348 -525614 -522986 -520358 -517729 -515101 -512588 -510072 -507559 -505042 -500382
-6952e00382M664M660M664K662K666K662K665L7M1L8M1n387n388n387n387L99L99L99L99J949
$$ -500382 -495718 -491058 -486394 -483732 -481066 -478404 -475739 -475702 -475661 -475623 -475582 -480969 -486357 -491744 -497131 -496732 -496333 -495934 -495535 -493586
-6932d93586J950r13r14n506n507K20K20O968O968J242J241R43R44j920j920j31j30j31j30
$$ -493586 -491636 -492549 -493463 -498969 -504476 -504256 -504036 -497068 -490100 -488858 -487617 -486674 -485730 -487650 -489570 -489701 -489831 -489962 -490092
-6913d90092M462M463j622j622K450l274L02R850P997Q001K867K871j548j543J316J320J0144
$$ -490092 -485630 -481167 -482789 -484411 -481961 -485235 -484933 -475083 -467086 -459085 -456218 -453347 -454895 -456438 -455122 -453802 -443658
-6896d43658J0148P281P285P908P911J3634J3638R160R163R161R163Q176Q180K449K454j727
$$ -443658 -433510 -426229 -418944 -411036 -403125 -389491 -375853 -366693 -357530 -348369 -339206 -331030 -322850 -320401 -317947 -319674
-6880c19674j722J137J141l128l124p900p897o050o047j279j275k532k527k532k528P50P53
$$ -319674 -321396 -320259 -319118 -322246 -325370 -333270 -341167 -347217 -353264 -354543 -355818 -358350 -360877 -363409 -365937 -365187 -364434
-6863c64434P430P434J659J663m88m85P05J2161L568p882k009k006n588n585m217m213K465
$$ -364434 -357004 -349570 -347911 -346248 -346736 -347221 -346516 -334355 -330787 -338669 -340678 -342684 -348272 -353857 -358074 -362287 -359822
-6846c59822K468L3L4L3L4M865M865R4R3P594P595R13R13L061L061R742R741P147P147J1919
$$ -359822 -357354 -357321 -357287 -357254 -357220 -352355 -347490 -347396 -347303 -339709 -332114 -331201 -330288 -327227 -324166 -314424 -304683 -297536 -290389 -278470
-6826b78470J1919R235R235R234R235J0353J0353L673L672r21r21r21r21j0826j0823j0827
$$ -278470 -266551 -257316 -248081 -238847 -229612 -219259 -208906 -205233 -201561 -202482 -203403 -204324 -205245 -216071 -226894 -237721
-6810b37721j0823k535k531r216r213k624k621k625k621l579l575J193J197L862L866L863
$$ -237721 -248544 -251079 -253610 -262826 -272039 -274663 -277284 -279909 -282530 -286109 -289684 -288491 -287294 -283432 -279566 -275703
-6794b75703L866q50q47l713l709j387j384m250m246q366q362q366q363p654p654r73r73J712
$$ -275703 -271837 -272687 -273534 -277247 -280956 -282343 -283727 -287977 -292223 -300589 -308951 -317317 -325680 -333334 -340988 -341961 -342934 -341222
-6776c41222J711J711J711m343m343m344m343O67O68O67O67Q057Q056Q057Q057R070R071J1934
$$ -341222 -339511 -337800 -336089 -340432 -344775 -349119 -353462 -352795 -352127 -351460 -350793 -342736 -334680 -326623 -318566 -309496 -300425 -288491
-6758b88491J1934O177O178O178O177N044N045n455n454l598l594q369q366n149n145q012
$$ -288491 -276557 -270380 -264202 -258024 -251847 -246803 -241758 -247213 -252667 -256265 -259859 -268228 -276594 -281743 -286888 -294900
-6742b94900q008j0458j0453J950J953L39L43L40L43Q392Q396J711J715M455M459M455M459
$$ -294900 -302908 -313366 -323819 -321869 -319916 -319577 -319234 -318894 -318551 -310159 -301763 -300052 -298337 -293882 -289423 -284968 -280509
-6725b80509Q6Q9m686m683K65K68p012p009m605j4144n917n913q720q717q720q716j75j72
$$ -280509 -280423 -280334 -285020 -289703 -289438 -289170 -296182 -303191 -307796 -321940 -327857 -333770 -342490 -351207 -359927 -368643 -368818 -368990
-6707c68990l038l035k025k020m888m884m321m317K360K364l84l81M388M392M493M496J629
$$ -368990 -372028 -375063 -377088 -379108 -383996 -388880 -393201 -397518 -395158 -392794 -393178 -393559 -389171 -384779 -380286 -375790 -374161
-6690c74161J633O521O524L657L661K494K495r914r913m544m545j682j681j666j667Q39Q39
$$ -374161 -372528 -366007 -359483 -355826 -352165 -349671 -347176 -357090 -367003 -371547 -376092 -377774 -379455 -381121 -382788 -381949 -381110
-6673c81110L463k263L62R906P467P468N201N200K577K576P348P348N261N260K397K398j481
$$ -381110 -377647 -379910 -379548 -369642 -362175 -354707 -349506 -344306 -341729 -339153 -331805 -324457 -319196 -313936 -311539 -309141 -310622
-6656c10622j480j480j480m216m217q989q988l441l441n78n78o976o975o021L523k203p930
$$ -310622 -312102 -313582 -315062 -319278 -323495 -332484 -341472 -344913 -348354 -348932 -349510 -356486 -363461 -369482 -365959 -368162 -376092
-6639c76092m112m112N77N78N78N78O97O97k166k166J488J487l284l285Q91Q91Q91Q91M493
$$ -376092 -380204 -384316 -383739 -383161 -382583 -382005 -381308 -380611 -382777 -384943 -383455 -381968 -385252 -388537 -387646 -386755 -385864 -384973 -380480
-6620c80480M492M493M492J391J390M254M254L836L837r36r36K822K823P594P594M955M955
$$ -380480 -375988 -371495 -367003 -365612 -364222 -359968 -355714 -351878 -348041 -348977 -349913 -347091 -344268 -336674 -329080 -324125 -319170
-6603c19170M954M955O923O924O923O923L911L911L911L911M626M627k054k055q451q452J38
$$ -319170 -314216 -309261 -302338 -295414 -288491 -281568 -277657 -273746 -269835 -265924 -261298 -256671 -258725 -260780 -269231 -277683 -277545
-6586b77545J38L76L77L76L77m127m127m127m127n48n48n49n48j75j75j75j75J196J197J197
$$ -277545 -277407 -277031 -276654 -276278 -275901 -280028 -284155 -288282 -292409 -292957 -293505 -294054 -294602 -294777 -294952 -295127 -295302 -294106 -292909 -291712
-6566b91712J196K256K256k517k516L567L568O431O432L731L736L732L736M209M213M209M212
$$ -291712 -290516 -288260 -286004 -288521 -291037 -287470 -283902 -277471 -271039 -267308 -263572 -259840 -256104 -251895 -247682 -243473 -239261
-6549b39261M96N00N268N271j60j56O520O524L315L318Q086Q090M985M988R041R045J2873
$$ -239261 -238765 -238265 -232997 -227726 -227886 -228042 -221522 -214998 -211683 -208365 -200279 -192189 -187204 -182216 -173175 -164130 -151257
-6532a51257J424L091L094Q698Q702K017K020N775N775r06r06R44R43R43R43K599K598k173
$$ -151257 -149833 -146742 -143648 -134950 -126248 -124231 -122211 -116436 -110661 -111567 -112473 -111529 -110586 -109643 -108700 -106101 -103503 -105676
-6514a05676k174n03n03n04n03M895M895J23J23L404L404N41N40N71N70L434L433M269M269
$$ -105676 -107850 -108353 -108856 -109360 -109863 -104968 -100073 -99950 -99827 -96423 -93019 -92478 -91938 -91367 -90797 -87363 -83930 -79661 -75392
-6495g5392M269M268N261N264N261N264R257R261R257R260J0405J0409J815J820O468O472
$$ -75392 -71123 -66855 -61594 -56330 -51069 -45805 -36548 -27287 -18030 -8770 1635 12044 13859 15679 22147 28619
-6479B8619O469O472R272R275O409O413J0345J0350J5118J5121J2478J2482J2478J2482J0928
$$ 28619 35088 41560 50832 60107 66516 72929 83274 93624 108742 123863 136341 148823 161301 173783 184711
-6464A84711J0931J0927J0931J0241J0245P378P382M634M638R406R410R138R142R137R142
$$ 184711 195642 206569 217500 227741 237986 245364 252746 257380 262018 271424 280834 289972 299114 308251 317393
-6449C17393R555R559J4328J4331J3954J3959J6817J6822J8428J8432J8667L0124K7287K7290
$$ 317393 326948 336507 350835 365166 379120 393079 409896 426718 445146 463578 482245 512369 539656 566946
-6435E66946K8002K8006L0568L0571L0806M2262M1088M1092N2303N2307O1488O1493O8170
$$ 566946 594948 622954 653522 684093 714899 757161 798249 839341 891644 943951 1005439 1066932 1135102
-6422A135102P9626Q6184R7641J04319J15774J22810J34267J48579J60036J71537J82994K02556
$$ 1135102 1214728 1300912 1398553 1502872 1618646 1741456 1875723 2024302 2184338 2355875 2538869 2741425
-6410B741425K21647K43357K85355L34503L84137M39608N19782O18561P36912Q51795R47241
$$ 2741425 2963072 3206429 3491784 3826287 4210424 4650032 5169814 5788375 6525287 7377082 8324323
-6399H324323J005934J017389R41784P54720M86050J61554j67008m53328o55190p65898p98561
$$ 8324323 9330257 10347646 11289430 12044150 12530200 12691754 12524746 12071418 11416228 10650330 9851769
-6388I851769p87104p25548o45374n63537m90997m20852l48312k94131k52133k11574j77212
$$ 9851769 9064665 8339117 7693743 7130206 6639209 6218357 5870045 5575914 5323781 5112207 4934995
-6377D934995j46913j20185r5851o9125n6988l0262m019P438L2129N1222P5078J01805J27944
$$ 4934995 4788082 4667897 4572046 4502921 4445933 4415671 4411652 4419090 4451219 4502441 4577519 4679324 4807268
-6364D807268J62306J93798K28161K66095L08093L41016L90650M44630M94263N46276O03543
$$ 4807268 4969574 5163372 5391533 5657628 5965721 6306737 6697387 7142017 7636280 8182556 8786099
-6353H786099O54601P04234P45271P64362P78891P90347Q12296Q39023Q83042R63216J055313
$$ 8786099 9440700 10144934 10890205 11654567 12433458 13223805 14036101 14875124 15758166 16721382 17776695
-6342A7776695J158393J258990J377344J491389J602107J717705J820787J886638J875186
$$ 17776695 18935088 20194078 21571422 23062811 24664918 26382623 28203410 30090048 31965234
-6333C1965234J747317J483896J068728N22802j00905p15552j239044j616994j817241j859235
$$ 31965234 33712551 35196447 36265175 36787977 36687072 35971520 34732476 33115482 31298241 29439006
-6323B9439006j777632j628744j448242j261175j096539r47651q24785p36977o77210o35215
$$ 29439006 27661374 26032630 24584388 23323213 22226674 21279023 20454238 19717261 19040051 18404836
-6313A8404836o09326o03600o08728o08730n96680n62321n19612m69981m08661l59031l00811
$$ 18404836 17795510 17191910 16583182 15974452 15377772 14815451 14295839 13825858 13417197 13058166 12757355
-6302A2757355k43548j93876j36608p5529j0626N9880J40052K31673L27118M23867N19313
$$ 12757355 12513807 12319931 12183323 12107794 12097168 12157048 12297100 12528773 12855891 13279758 13799071
-6291A3799071O22386P17831Q08735Q88909R46648R88646J022480J041571J078789J151329
$$ 13799071 14421457 15139288 15948023 16836932 17783580 18772226 19794706 20836277 21915066 23066395
-6281B3066395J257981J399236J564826J736622J913543K070071K187221K267397K313203
$$ 23066395 24324376 25723612 27288438 29025060 30938603 33008674 35195895 37463292 39776495
-6272C9776495K313207K257135K138790J946920J660598J255925P78721K63099k75195p86279
$$ 39776495 42089702 44346837 46485627 48432547 50093145 51349070 52127791 52390890 52115695 51329416
-6262E1329416j255853j669680k024718k291006k439889k470432k382630k217034j991794
$$ 51329416 50073563 48403883 46379165 44088159 41648270 39177838 36795208 34578174 32586380
-6253C2586380j756247j531007j341078j192189j086012j028746r97249r85798r77984r66530
$$ 32586380 30830133 29299126 27958048 26765859 25679847 24651101 23653852 22668054 21690070 20723540
-6243B0723540r43625r09265q70493q20863p66937p24945o85884o36251n87102n37470m80207
$$ 20723540 19779915 18870650 18000157 17179294 16412357 15687412 15001528 14365277 13778175 13240705 12760498
-6232A2760498m15305l46113k65938j77658q9850K725J05806K01124K81299L66237M31142
$$ 12760498 12345193 11999080 11733142 11555484 11465634 11468359 11574165 11775289 12056588 12422825 12853967
-6221A2853967M75681N17680N57762N99760O65013P60460Q64962R90951J132319J288847J452046
$$ 12853967 13329648 13847328 14405090 15004850 15669863 16430323 17295285 18286236 19418555 20707402 22159448
-6210B2159448J639116J834408K021479K177044K264853K228290K041229J721497J335913
$$ 22159448 23798564 25632972 27654451 29831495 32096348 34324638 36365867 38087364 39423277
-6201C9423277R43891N88844K91551N220l34456p81127j330866j914965k428444k760577k833592
$$ 39423277 40367168 40956012 41247563 41252783 40918327 40137200 38806334 36891369 34462925 31702348 28868756
-6190B8868756k699972k419340k087202j767949j496897j283347j126824j002273r06830q24841
$$ 28868756 26168784 23749444 21662242 19894293 18397396 17114049 15987225 14984952 14078122 13253281
-6180A3253281p59941p13175o71179o43145o31691o14513n95423n70527n36164n12785m86057
$$ 13253281 12493340 11780165 11108986 10465841 9834150 9219637 8624214 8053687 7517523 7004738 6518681
-6169F518681m53612m19248l85848l51485l10330k68332k25864j91502j58578j24215r1292
$$ 6518681 6065069 5645821 5259973 4908488 4598158 4329826 4103962 3912460 3753882 3629667 3538375
-6158C538375o4564l4385j5294N223L1951M9484P6212J04839J31568J58048K00047K47764
$$ 3538375 3473811 3439426 3424132 3429355 3461306 3510790 3587002 3691841 3823409 3981457 4181504 4429268
-6146D429268L05032L84364M72173N83837P17458Q67745J031904J198449J339702J418203
$$ 4429268 4734300 5118664 5590837 6174674 6892132 7759877 8791781 9990230 11329932 12748135
-6136A2748135J399115J228274Q96138M26537j27022o82014j143951j453896j595150j587037
$$ 12748135 14147250 15375524 16271662 16698199 16571177 15889163 14745212 13291316 11696166 10109129
-6126A0109129j461055j281237j086536r04721p40561n99070m95993m13437l33265k80147
$$ 10109129 8648074 7366837 6280301 5375580 4635019 4035949 3539956 3126519 2793254 2513107
-6116B513107k38152k03316j76593j61739j50287j37521j31795j25289j13833j05246r9517
$$ 2513107 2274955 2071639 1895046 1733307 1583020 1445499 1313704 1188415 1074582 969336 869819
-6105H69819r3256q1800o9516n8059n2754n2750m6311m6308k9132k9128k9132k9128k0363
$$ 869819 776563 694763 625247 567188 514434 461684 415373 369065 339933 310805 281673 252545 232182
-6092B32182k0360k0363k0360j7440j7437k0304k0300j1833j1829j7560j7556j0879j0875
$$ 232182 211822 191459 171099 153659 136222 115918 95618 83785 71956 54396 36840 25961 15086
-6079A5086j3742j3737j4917j4916r190r190p759p758m895m895n313n312n313n313p758p758
$$ 15086 1344 -12393 -27310 -42226 -51416 -60606 -68365 -76123 -81018 -85913 -91226 -96538 -101851 -107164 -114922 -122680
-6063a22680p759p758k382k383k382k382j190j189j189j189L224L225L225L225K151K151K152
$$ -122680 -130439 -138197 -140579 -142962 -145344 -147726 -148916 -150105 -151294 -152483 -149259 -146034 -142809 -139584 -137433 -135282 -133130
-6046a33130K151N771N775O845m604l952J778n026n021j5j2j4j2j864j860j864j861k990k986
$$ -133130 -130979 -125208 -119433 -112588 -117192 -121144 -119366 -124392 -129413 -129428 -129440 -129454 -129466 -131330 -133190 -135054 -136915 -139905 -142891
-6027a42891k990k986J12J15J12J16j887j882j887j883L21L24n405n403n025n026k162k163
$$ -142891 -145881 -148867 -148755 -148640 -148528 -148412 -150299 -152181 -154068 -155951 -155630 -155306 -160711 -166114 -171139 -176165 -178327 -180490
-6009a80490o71o71o71o71q80q80M847M847m340m339m340m340l646l646l646l646j022j021
$$ -180490 -181161 -181832 -182503 -183174 -184054 -184934 -180087 -175240 -179580 -183919 -188259 -192599 -196245 -199891 -203537 -207183 -208205 -209226
-5991b09226j022j021K662K661K662K662O94O93L557L557o98o93N029N033N209N212n19n14
$$ -209226 -210248 -211269 -208607 -205946 -203284 -200622 -199928 -199235 -195678 -192121 -192819 -193512 -188483 -183450 -178241 -173029 -173548 -174062
-5973a74062K181K185K181K184K301K304l427l422P020P024k524k520k584k580K80K83P587
$$ -174062 -171881 -169696 -167515 -165331 -163030 -160726 -164153 -167575 -160555 -153531 -156055 -158575 -161159 -163739 -163459 -163176 -155589
-5956a55589P591J860J864M425M429j301j297J424J424J424J425K259K259K259K260N2N2N2
$$ -155589 -147998 -146138 -144274 -139849 -135420 -136721 -138018 -136594 -135170 -133746 -132321 -130062 -127803 -125544 -123284 -123232 -123180 -123128
-5938a23128N2J723J722J723J722K230K229K229K230J514J513J514J513O495O494N3J1505
$$ -123128 -123076 -121353 -119631 -117908 -116186 -113956 -111727 -109498 -107268 -105754 -104241 -102727 -101214 -94719 -88225 -88172 -76667
-5921g6667M943M944J1386J1386J4953J4958J4953J4957J8891J8894R347R350R06R10j6274
$$ -76667 -71724 -66780 -55394 -44008 -29055 -14097 856 15813 34704 53598 62945 72295 73201 74111 57837
-5906E7837j6270j2277j2273o550o547o97o93l560l557n886n883j61j56p960p956R220R223
$$ 57837 41567 29290 17017 10467 3920 3223 2530 -1030 -4587 -10473 -16356 -16517 -16673 -24633 -32589 -23369 -14146
-5889a4146L494L497j518j513n086O372N652N655L504L508L505L508K625K628K625K628O204
$$ -14146 -10652 -7155 -8673 -10186 -15272 -8900 -3248 2407 5911 9419 12924 16432 19057 21685 24310 26938 33142
-5872C3142O207O204O207R455R458R455R458R84R88J0529J0532K0236K0241K0236K0241J9580
$$ 33142 39349 45553 51760 61215 70673 80128 89586 90570 91558 102087 112619 132855 153096 173332 193573 213153
-5856B13153J9584J8865J8868J9435P982n618n619l650l650L032L030k203k203O60O60M358
$$ 213153 232737 251602 270470 289905 297887 292269 286650 283000 279350 282382 285412 283209 281006 281666 282326 286684
-5840B86684M358o140o141P621P620K849K848K252K251N116N115K087K088k684k684J79J79
$$ 286684 291042 284902 278761 286382 294002 296851 299699 301951 304202 309318 314433 316520 318608 315924 313240 313419 313598
-5823C13598J78J79J704J704J704J704K896K897K897K897J778J778J779J778K971K972K971
$$ 313598 313776 313955 315659 317363 319067 320771 323667 326564 329461 332358 334136 335914 337693 339471 342442 345414 348385
-5806C48385K972N965N965N965N965N786N786J2467J2467O935O934O934O935R678R679J4450
$$ 348385 351357 357322 363287 369252 375217 381003 386789 399256 411723 418658 425592 432526 439461 449139 458818 473268
-5790D73268J4450J8246J8250J8245J8250J8365J8368J8365J8369J7903J7906K1482J0033
$$ 473268 487718 505964 524214 542459 560709 579074 597442 615807 634176 652079 669985 691467 701500
-5777G01500P284P289j12j08L549L553L549L553J939J942J939J942n950n946n950n947n950
$$ 701500 708784 716073 715961 715853 719402 722955 726504 730057 731996 733938 735877 737819 731869 725923 719973 714026 708076
-5760G08076n946n950n947n913n913n913n913K439K438N301N302Q478Q478J0148j305j2281
$$ 708076 702130 696180 690233 684320 678407 672494 666581 669020 671458 676759 682061 690539 699017 709165 707860 695579
-5744F95579j2280j2997j2996n242n242n242n242j662j663j663j663L468L467L467L467P524
$$ 695579 683299 670302 657306 652064 646822 641580 636338 634676 633013 631350 629687 633155 636622 640089 643556 651080
-5728F51080P523P524P523J4529J4529J4528J4529J9062J9062J4290J4291J5751J5752J0979
$$ 651080 658603 666127 673650 688179 702708 717236 731765 750827 769889 784179 798470 814221 829973 840952
-5714H40952J0980J4200J4201R428R429N089N089K226K225N328N327N56N55n469n469o97o97
$$ 840952 851932 866132 880333 889761 899190 904279 909368 911594 913819 919147 924474 925030 925585 920116 914647 913950 913253
-5697I13253j0122j0122r764r765o117l92J398q146j6855k2582k5444j9719j5811o267p79
$$ 913253 903131 893009 883245 873480 867363 866971 868369 860223 843368 820786 795342 775623 759812 753545 752766
-5682G52766p79n075n074p937j3664j8152q608p654p654r563r563m791m790n716n715K874
$$ 752766 751987 746912 741838 733901 720237 702085 693477 685823 678169 668606 659043 654252 649462 643746 638031 640905
-5666F40905k852n834L709M664M664k53k54M519M518Q337Q336L564L564Q157Q158N294N294
$$ 640905 638053 632219 635928 640592 645256 645003 644749 649268 653786 662123 670459 674023 677587 685744 693902 699196 704490
-5649G04490P560P561J0424J0424Q672Q672J5352J5353J0521J0521L840L840K110K110K110
$$ 704490 712050 719611 730035 740459 749131 757803 773155 788508 799029 809550 813390 817230 819340 821450 823560
-5634H23560K110r999r999r999r999j3645j3641j3645j3642j9610j9606j4839j4834j3078
$$ 823560 825670 815671 805672 795673 785674 772029 758388 744743 731101 711491 691885 677046 662212 649134
-5620F49134j3075q307q302n085n082r857r854n905n902q769q765q947q944m176m171j701
$$ 649134 636059 627752 619450 614365 609283 599426 589572 583667 577765 568996 560231 551284 542340 538164 533993 532292
-5604E32292j696j700j696L788L791L191L196L556n983q613k882O34O38l781l776L020L023
$$ 532292 530596 528896 527200 530988 534779 537970 541166 544722 538739 530126 527244 527878 528516 524735 520959 523979 527002
-5587E27002J57J60N287N290N14N19N309N312J2586J2591O859J6408J4257Q533P606P609P248
$$ 527002 527159 527319 532606 537896 538410 538929 544238 549550 562136 574727 581586 597994 612251 620784 628390 635999 643247
-5570F43247P251J044J048n637n634l959l956o822o819o823o818o823o819p687p684p688p683
$$ 643247 650498 651542 652590 646953 641319 637360 633404 626582 619763 612940 606122 599299 592480 584793 577109 569421 561738
-5553E61738q404q399q404q399j573j570j573j570l721l717l720l717J662J667J663J666n972
$$ 561738 553334 544935 536531 528132 526559 524989 523416 521846 518125 514408 510688 506971 508633 510300 511963 513629 507657
-5536E07657n969l109l106n179n178J503J502m66m66l687l687j68n894q042J502N977N976
$$ 507657 501688 498579 495473 490294 485116 486619 488121 487655 487189 483502 479815 479647 473753 465711 467213 473190 479166
-5519D79166J801J800M180M179J316J316K628K629K628K629L120L120L121L120L121L120L121
$$ 479166 480967 482767 486947 491126 492442 493758 496386 499015 501643 504272 507392 510512 513633 516753 519874 522994 526115
-5502E26115L120M22M21M21M22p72p72K092K091j010j011N671N671J256J256j606j607M000
$$ 526115 529235 529657 530078 530499 530921 530149 529377 531469 533560 532550 531539 537210 542881 544137 545393 543787 542180 546180
-5484E46180M000O864O863P043P042K271K270L449L449L448L449m187m187K136K137L720k005
$$ 546180 550180 557044 563907 570950 577992 580263 582533 585982 589431 592879 596328 592141 587954 590090 592227 595947 593942
-5467E93942J573J573j588M138R17R18L497L497L854L856R283J5009J1789J1788J3809J3810
$$ 593942 595515 597088 595500 599638 600555 601473 604970 608467 612321 616177 625460 640469 652258 664046 677855 691665
-5451F91665J0946J0946O710O711J939J938j49j49N67n160Q05O532O532Q05K050P778Q015
$$ 691665 702611 713557 720267 726978 728917 730855 730706 730557 731124 725964 726769 733301 739833 740638 742688 750466 758481
-5434G58481K289l914N629Q493K766p53Q791J1416N689J633P359J5592R864R172R171N950
$$ 758481 760770 756856 762485 770978 773744 772991 781782 793198 798887 800520 807879 823471 833335 842507 851678 857628
-5418H57628N950J1200J1199J1200J1199J0156J0155J0156J0155N980N980k251k252k699L027
$$ 857628 863578 874778 885977 897177 908376 918532 928687 938843 948998 954978 960958 958707 956455 953756 956783
-5403I56783M578M578R828R827J4242J4242J5732J0007O547O546N414N413J0543J0543J2125
$$ 956783 961361 965939 975767 985594 999836 1014078 1029810 1039817 1046364 1052910 1058324 1063737 1074280 1084823 1096948
-5388A096948J7850J8208J2482R738J5465J6299J6300Q277K550N771N771J2035J2034J3586
$$ 1096948 1114798 1133006 1145488 1155226 1170691 1186990 1203290 1211567 1214117 1219888 1225659 1237694 1249728 1263314
-5374A263314J9312J7936J7936J2210J7936K0144K0143K0501K0501J9488J9487K2947K8673
$$ 1263314 1282626 1300562 1318498 1330708 1348644 1368788 1388931 1409432 1429933 1449421 1468908 1491855 1520528
-5361A520528L4997L4996M0484M0485L9544M5272M1453M1454L8650K9106K0874J1330M067
$$ 1520528 1555525 1590521 1631005 1671490 1711034 1756306 1797759 1839213 1877863 1906969 1927843 1939173 1943240
-5348A943240r294j8600j8600k4565k4565k9337k9337j8846j8846j5982j5983n246n245K628
$$ 1943240 1933946 1915346 1896746 1872181 1847616 1818279 1788942 1770096 1751250 1735268 1719285 1714039 1708794 1711422
-5334A711422J4081J4246J4245K1642K1642Q281Q280p945p945k389k390J1926J1927J4909
$$ 1711422 1725503 1739749 1753994 1775636 1797278 1805559 1813839 1805894 1797949 1795560 1793170 1805096 1817023 1831932
-5320A831932J4909K6123J4670J2583J2583J5923K7376K1828K1829K5407K5408K2287K2291
$$ 1831932 1846841 1872964 1887634 1900217 1912800 1928723 1956099 1977927 1999756 2025163 2050571 2072858 2095149
-5307B095149K2287K2290K3719K3722K3719K3722K1989K1993J9125J9129J5965J5967K2645
$$ 2095149 2117436 2139726 2163445 2187167 2210886 2234608 2256597 2278590 2297715 2316844 2332809 2348776 2371421
-5294B371421K2649K0281K0285K6963K6965K7440K7443K2667K2671J4376J4380R604R607J1871
$$ 2371421 2394070 2414351 2434636 2461599 2488564 2516004 2543447 2566114 2588785 2603161 2617541 2627145 2636752 2648623
-5280B648623J1874J5927K7383L1074L1075K8927K8927K8569K8569L3341M4794M3840N5292
$$ 2648623 2660497 2676424 2703807 2734881 2765956 2794883 2823810 2852379 2880948 2914289 2959083 3002923 3058215
-5267C058215N2430N2429O0900O0900N2310N2310M9454M9454N9237N9237O6276Q5365R3476
$$ 3058215 3110645 3163074 3223974 3284874 3337184 3389494 3438948 3488402 3547639 3606876 3673152 3758517 3851993
-5254C851993R3477J04690J16144J21632J40720J52531J63984J76868J88322K01050K12506
$$ 3851993 3945470 4050160 4166304 4287936 4428656 4581187 4745171 4922039 5110361 5311411 5523917
-5243E523917K26341K53069K81817L00908L14267L25724L22141L10691K72989K30998J81245
$$ 5523917 5750258 6003327 6285144 6586052 6900319 7226043 7548184 7858875 8131864 8362862 8544107
-5232H544107J39254R8451O4095M9573M9578M6471N7928O8483P9940P9458O8011N6433L7348
$$ 8544107 8683361 8781812 8845907 8895480 8945058 8991529 9049457 9117940 9197880 9277338 9345349 9401782 9439130
-5219I439130J1338p748k3558k3554j8787j8782m631J4459K7103M6192N7049O8501Q8545J07633
$$ 9439130 9450468 9442720 9419162 9395608 9376821 9358039 9353408 9367867 9394970 9441162 9498211 9566712 9655257 9762890
-5205I762890J18071J29524J53861J72951J91919K11008K36776K55866K77063K96151L20490
$$ 9762890 9880961 10010485 10164346 10337297 10529216 10740224 10977000 11232866 11509929 11806080 12126570
-5194A2126570L47212L73936M08296M38001M64724M86200M91925M84410M84410M71048M51959
$$ 12126570 12473782 12847718 13256014 13694015 14158739 14644939 15136864 15621274 16105684 16576732 17028691
-5183A7028691M39433M33707M36122M24669M21568M15840M18466M18466M04268L92817L72951
$$ 17028691 17468124 17901831 18337953 18762622 19184190 19600030 20018496 20436962 20841230 21234047 21606998
-5172B1606998L38593L13301K78943K36829J87200J32797R0804O0322L3597J3318J864m4m5
$$ 21606998 21945591 22258892 22537835 22774664 22961864 23094661 23185465 23245787 23279384 23292702 23294566 23294522 23294477
-5159B3294477J2483K3933K8947K3219J6777J1049j058k0148l4225l9951m7608m7609m8683
$$ 23294477 23306960 23330893 23359840 23383059 23399836 23410885 23409827 23389679 23355454 23315503 23267895 23220286 23171603
-5146B3171603m8682n1726o3177p1289p7018q0357p4631m8622j4264K1049N5408R6449J46077
$$ 23171603 23122921 23071195 23008018 22936729 22859711 22779354 22704723 22656101 22641837 22662886 22718294 22814743 22960820
-5133B2960820J91978K41608K95534L52798M08749M58379N11826N69092O22957O57314O89050
$$ 22960820 23152798 23394406 23689940 24042738 24451487 24909866 25421692 25990784 26613741 27271055 27960105
-5122B7960105P08137P20307P20307P03843O84754O52313O10317N74527N24898M79205M29575
$$ 27960105 28668242 29388549 30108856 30812699 31497453 32149766 32760083 33334610 33859508 34338713 34768288
-5111C4768288L88059L46063K92142K42509K00994J59001J20466R3741O9878N0792L3013j352
$$ 34768288 35156347 35502410 35794552 36037061 36238055 36397056 36517522 36611263 36681141 36731933 36764946 36763594
-5099C6763594m0959p5315j12537j39262j57994j52267j31388j12299j01088j06810j45171
$$ 36763594 36722635 36647320 36534783 36395521 36237527 36085260 35953872 35841573 35740485 35633675 35488504
-5088C5488504k02431k76041l63849m37438m87068n10092n04367m79970m53246m33561m14473
$$ 35488504 35286073 35010032 34646183 34208745 33721677 33211585 32707218 32227248 31774002 31340441 30925968
-5077C0925968l95385l76295l52436l25713l06146k94694k89922k89922k86298k86298k71028
$$ 30925968 30530583 30154288 29801852 29476139 29169993 28875299 28585377 28295455 28009157 27722859 27451831
-5066B7451831k36668k08752j74392j30491q8495n0319q326K6750M5838O2422O2420O3973
$$ 27451831 27215163 27006411 26832019 26701528 26613033 26562714 26554388 26581138 26626976 26689398 26751818 26815791
-5054B6815791O3970O3105O8831Q5653J20013J65107K14739K45753K57211K33585J76325J23350
$$ 26815791 26879761 26942866 27011697 27097350 27217363 27382470 27597209 27842962 28100173 28333758 28510083 28633433
-5042B8633433Q1361O0835M9387L2205J3120j3154o2779r6664j23383j61208j80291j88048
$$ 28633433 28714794 28775629 28825016 28857221 28870341 28857187 28794408 28697744 28574361 28413153 28232862 28044814
-5030B8044814j88045j88588j82855j81309j92758k16384k43103k88918l46180l96552m38546
$$ 28044814 27856769 27668181 27485326 27304017 27111259 26894875 26651772 26362854 26016674 25620122 25181576
-5019B5181576m68131m94857n23250n49973n77653o04373o27163o38615o22388n88031n62024
$$ 25181576 24713445 24218588 23695338 23145365 22567712 21963339 21336176 20697561 20075173 19487142 18925118
-5008A8925118n27663m87578m45586m01262l59271l26819k84826k48796k06802j67193j32836
$$ 18925118 18397455 17909877 17464291 17063029 16703758 16376939 16092113 15843317 15636515 15469322 15336486
-4997A5336486r1139o4416l5305q583J8857M5582P4213J00937J39873J66598J99047K41042
$$ 15336486 15245347 15180931 15145626 15137043 15155900 15201482 15275695 15376632 15516505 15683103 15882150 16123192
-4985A6123192K92103L34096L77404M42304M85133M79405L96492K09426r253j73412k40220
$$ 16123192 16415295 16749391 17126795 17569099 18054232 18533637 18930129 19139555 19130302 18956890 18716670
-4974A8716670k28769j87021j52662j33812j22358j10011j10012j06432j06432j07029j07027
$$ 18716670 18487901 18300880 18148218 18014406 17892048 17782037 17672025 17565593 17459161 17352132 17245105
-4963A7245105r8439q6985o2948l6223j6061k1787n6795j36966k27754k92655l06017k79292
$$ 17245105 17146666 17059681 16996733 16960510 16944449 16922662 16865867 16728901 16501147 16208492 15902475 15623183
-4951A5623183k41593k07235j71443j44721j07975q1253n5006k8282j5755L334J3383J9111
$$ 15623183 15381590 15174355 15002912 14858191 14750216 14668963 14613957 14585675 14569920 14573254 14586637 14605748
-4939A4605748L1757L7483M2792N4245N7705N7705O4504O4505O7726O7727O8740P4466P8881
$$ 14605748 14637505 14674988 14717780 14772025 14829730 14887435 14951939 15016444 15084170 15151897 15220637 15295103 15373984
-4926A5373984R0334J06470J17925J23649J35106J62302J73759J87595K14321K34779K69140
$$ 15373984 15464318 15570788 15688713 15812362 15947468 16109770 16283529 16471124 16685445 16920224 17189364
-4915A7189364L01588L28315L29980L03263K47543J90282J67813J73543K08256K50253K87116
$$ 17189364 17490952 17819267 18149247 18452510 18700053 18890335 19058148 19231691 19439947 19690200 19977316
-4904A9977316L21477L51060L70152L91563M18289M34035M39766M49604M55332M57359M51634
$$ 19977316 20298793 20649853 21020005 21411568 21829857 22263892 22703658 23153262 23608594 24065953 24517587
-4893B4517587M36362M17272L93292L51299L09126K67132K35875K16786K13744K13743K08734
$$ 24517587 24953949 25371221 25764513 26115812 26424938 26692070 26927945 27144731 27358475 27572218 27780952
-4882B7780952J97280J88691J77237J63399J51945J46959J27868J07350R5894Q3789P2333
$$ 27780952 27978232 28166923 28344160 28507559 28659504 28806463 28934331 29041681 29137575 29221364 29293697
-4871B9293697O8517O8517O9052O9053P1918P1916P0246P0247O7025O7025O2163N6443O0611
$$ 29293697 29362214 29430731 29499783 29568836 29640754 29712670 29782916 29853163 29920188 29987213 30049376 30105819 30166430
-4858C0166430P2069Q4533J11261J24618J43709J67149K01513K27754K62117K91462L02918
$$ 30166430 30238499 30323032 30434293 30558911 30702620 30869769 31071282 31299036 31561153 31852615 32155533
-4847C2155533L16992L28449L30373L30375L25362L25367L24406L24412L27866L39325L52457
$$ 32155533 32472525 32800974 33131347 33461722 33787084 34112451 34436857 34761269 35089135 35428460 35780917
-4836C5780917L58188L67134L86222L97081M16166M30004M49098M83578N10302N17700N17696
$$ 35780917 36139105 36506239 36892461 37289542 37705708 38135712 38584810 39068388 39578690 40096390 40614086
-4825D0614086M89547M32274L81457L24193K69834K27842J87754J61030J31681J20232J15458
$$ 40614086 41103633 41535907 41917364 42241557 42511391 42739233 42926987 43088017 43219698 43339930 43455388
-4814D3455388J15458J29896J29900J40631J40635J40873J59962J83108K09828K42012K61097
$$ 43455388 43570846 43700742 43830642 43971273 44111908 44252781 44412743 44595851 44805679 45047691 45308788
-4803D5308788K81857K93310K98026K98021L01605L01601K98251K98254K92524K92529K90615
$$ 45308788 45590645 45883955 46181981 46480002 46781607 47083208 47381459 47679713 47972237 48264766 48555381
-4792D8555381K90619K90615K90619K97205K97209L01265L01265L10869L29959L50714L77439
$$ 48555381 48846000 49136615 49427234 49724439 50021648 50322913 50624178 50935047 51265006 51615720 51993159
-4781E1993159M09380M51377M99095N41092N94299O51567P12167P61800P98604Q25330Q46323
$$ 51993159 52402539 52853916 53353011 53894103 54488402 55139969 55852136 56613936 57412540 58237870 59084193
-4770E9084193Q57777Q60876Q49431Q06475P49215O75175O10263N46797M89539M24881L52334
$$ 59084193 59941970 60802846 61652277 62458752 63207967 63883142 64493405 65040202 65529741 65954622 66306956
-4759F6306956K69778J89617J32111R0110N9687N3968Q0337J29955J85671K58214L34538M07063
$$ 66306956 66576734 66766351 66898462 66988572 67048259 67102227 67182564 67312519 67498190 67756404 68090942 68498005
-4747F8498005M77217N42121O03682O60941P16292P65932Q15742Q57722R04496R38857R63082
$$ 68498005 68975222 69517343 70121025 70781966 71498258 72264190 73079932 73937654 74842150 75781007 76744089
-4736G6744089R74519R81805R76084R57708R38627R05585Q78852Q41149P91526P56221P21844
$$ 76744089 77718608 78700413 79676497 80634205 81572832 82478417 83357269 84198418 84989944 85746165 86468009
-4725H6468009O79440O37452N90685N41053M98573M56593M21510L94785L87745L87753L98492
$$ 86468009 87147449 87784901 88375586 88916639 89415212 89871805 90293315 90688100 91075845 91463598 91862090
-4714I1862090M25209M49782M91779N26624N60967N92293O19017O16160O04690N71775N37414
$$ 91862090 92287299 92737081 93228860 93755484 94316451 94908744 95527761 96143921 96748611 97320386 97857800
-4703I7857800M83488M10949L37356K64826J82261J02096K0492o7310j62279k65353l54566
$$ 97857800 98341288 98752237 99089593 99354419 99536680 99638776 99659268 99591958 99429679 99164326 98809760
-4692I8809760m27105m95333n29693n31131m96769m21374l18293k05619p9630M4913J48003
$$ 98809760 98382655 97887322 97357629 96826498 96329729 95908355 95590062 95384443 95304813 95349726 95497729
-4681I5497729K40813L13352L73468M38380M88811N38434N90932O40564O91624P41256Q05675
$$ 95497729 95738542 96051894 96425362 96863742 97352553 97890987 98481919 99122483 99814107 100555363 101361038
-4670A01361038Q70578R44452J032254J126255J206437J281366J330981J370111J404481J422847
$$ 101361038 102231616 103176068 104208322 105334577 106541014 107822380 109153361 110523472 111927953 113350800
-4660A13350800J411393J388010J346023J299970J235059J168735J111476J086971J075517
$$ 113350800 114762193 116150203 117496226 118796196 120031255 121199990 122311466 123398437 124473954
-4651A24473954J091256J133261J178837J243723J320564J408367J497375J585178J662945
$$ 124473954 125565210 126698471 127877308 129121031 130441595 131849962 133347337 134932515 136595460
-4642A36595460J712587J730008J710912J664161J614530J557475J515487J481135J462037
$$ 136595460 138308047 140038055 141748967 143413128 145027658 146585133 148100620 149581755 151043792
-4633A51043792J464435J483516J519313J568937J630311J710495J807360J918069K034272
$$ 151043792 152508227 153991743 155511056 157079993 158710304 160420799 162228159 164146228 166180500
-4624A66180500K167887K301996K427959K557239K683219K800117K910844L021553L139914
$$ 166180500 168348387 170650383 173078342 175635581 178318800 181118917 184029761 187051314 190191228
-4615A90191228L264925L375634L461038L533569L588923L630910L689615L754527L824660
$$ 190191228 193456153 196831787 200292825 203826394 207415317 211046227 214735842 218490369 222315029
-4606B22315029L912461M004583M107622M214062M340043M457673M560763M661914M764971
$$ 222315029 226227490 230232073 234339695 238553757 242893800 247351473 251912236 256574150 261339121
-4597B61339121M870918N012152N220714N499391N839867O225443O654470P124039P624558
$$ 261339121 266210039 271222191 276442905 281942296 287782163 294007606 300662076 307786115 315410673
-4588C15410673Q193408Q812324R488073J0237491J1050684J1884350J2750974J3649433J4584796
$$ 315410673 323604081 332416405 341904478 352141969 363192653 375077003 387827977 401477410 416062206
-4579D16062206J5559238J6563270J7596383J8653849J9743352K0877141K2037152K3216924
$$ 416062206 431621444 448184714 465781097 484434946 504178298 525055439 547092591 570309515
-4571E70309515K4392581K5526573K6575977K7496068K8237597K8753013K9002797K8968581
$$ 570309515 594702096 620228669 646804646 674300714 702538311 731291324 760294121 789262702
-4563G89262702K8646420K8069986K7290908K6279257K4868578K2818542J9868347J5901806
$$ 789262702 817909122 845979108 873270016 899549273 924417851 947236393 967104740 983006546
-4555I83006546J1080614N724345J88494n228859j0324868j4932806j8958120k2382509k5190943
$$ 983006546 994087160 999811505 999999999 994771140 984446272 969513466 950555346 928172837 902981894
-4546I02981894k7416616k9104085l0321916l1153236l1622873l1774702l1664095l1323364
$$ 902981894 875565278 846461193 816139277 784986041 753363168 721588466 689924371 658601007
-4538F58601007l0785023l0058392k9184114k8183416k7064865k5865774k4602162k3319844
$$ 658601007 627815984 597757592 568573478 540390062 513325197 487459423 462857261 439537417
-4530D39537417k2056267k0816361j9644310j8536711j7486899j6504464j5553864j4640031
$$ 439537417 417481150 396664789 377020479 358483768 340996869 324492405 308938541 294298510
-4522B94298510j3742864j2876853j2071347j1348356j0726090j0176951r669186r184363
$$ 294298510 280555646 267678793 255607446 244259090 233533000 223356049 213686863 204502500
-4514B04502500q714777q260599p798666p285663o693924n984741n118134m029632k575095
$$ 204502500 195787723 187527124 179728458 172442795 165748871 159764130 154645996 150616364 148041269
-4505A48041269n36708K437261O777440J2782605J9991640K6546540K9494712K6215383J6012328
$$ 148041269 147504561 149941822 156719262 169501867 189493507 216040047 245534759 271750142 287762470
-4496B87762470J157800j3453763k2742134k5085506k2897994j9274566j5857761j3097352
$$ 287762470 288920270 275466507 252724373 227638867 204740873 185466307 169608546 156511194
-4488A56511194j0948018r295455q001266o959081o130643n429632m845520m339685l893015
$$ 156511194 145563176 136267721 128266455 121307374 115176731 109747099 104901579 100561894 96668879
-4479I6668879l492176l152397k900912k744390k669478k635100k568539k450195k300831
$$ 96668879 93176703 90024306 87123394 84379004 81709526 79074426 76505887 74055692 71754861
-4470G1754861k151936k023565j920497j839370j766827j693225j635957j580127j515223
$$ 71754861 69602925 67579360 65658863 63819493 62052666 60359441 58723484 57143357 55628134
-4461E5628134j446911j374375j286090j167744j028398q48972o47826m60764l49838l49842
$$ 55628134 54181223 52806848 51520758 50353014 49324616 48475644 47827818 47367054 47017216 46667374
-4451D6667374m40748n20919n34042m99687l91834j66595K42641Q26741J582163K570933L893989
$$ 46667374 46226626 45705707 45171665 44671978 44280144 44113549 44356190 45182931 46765094 49336027 53230016
-4440E3230016N768459Q474691J2433608J8344417K6800515L7852151M8881348N4842858N1807802
$$ 53230016 58998475 67473166 79906774 98251191 125051706 162903857 211785205 266628063 318435865
-4431C18435865L7178111J2626763j6102069l8706403m6451450m2859074l5248426k7662778
$$ 318435865 355613976 368240739 352138670 313432267 266980817 224121743 188873317 161210539
-4423A61210539k1556903j6872626j3373095j0735104q709837p140781n902900m929401m181619
$$ 161210539 139653636 122781010 109407915 98672811 89962974 82822193 76919293 71989892 67808273
-4414F7808273l597515l073030k588181k225036k099047k242926k468165k535935k379407
$$ 67808273 64210758 61137728 58549547 56324511 54225464 51982538 49514373 46978438 44599031
-4405D4599031k095799j801833j559422j379984j234680j116327r86055q52433p39668o74763
$$ 44599031 42503232 40701399 39141977 37761993 36527313 35410986 34424931 33572498 32832830 32158067
-4395C2158067o79537p13896p38711p19621o42315n16331l80271k61919j66959j40233j60396
$$ 32158067 31478530 30764634 30025923 29306302 28663987 28147656 27767385 27505466 27338507 27198274 27037878
-4384B7037878j94752k14801j72799p8256N5363K45292N08711Q43111J289779J900603K744304
$$ 27037878 26843126 26628325 26455526 26377270 26432633 26677925 27186636 28029747 29319526 31220129 33964433
-4373C3964433L937294N651416Q130987J1662316J6343596K1676863K5944520K6536260K1237667
$$ 33964433 37901727 43553143 51684130 63346446 79690042 101366905 127311425 153847685 175085352
-4364A75085352R712195n226768j8248817k4592435k3825075j9523542j4930901j1226725
$$ 175085352 184797547 179570779 161321962 136729527 112904452 93380910 78450009 67223284
-4356F7223284q512380o546287n091757l995498l121254k414508j883857j577434j481991
$$ 67223284 58710904 52164617 47072860 43077362 39956108 37541600 35657743 34080309 32598318
-4347C2598318j483425j426158j269634j105475j034850j053938j083734j041738r37229p95979
$$ 32598318 31114893 29688735 28419101 27313626 26278776 25224838 24141104 23099366 22162137 21366158
-4337B1366158o68801n80996n08459m28291l18860j85242n6872p245r0516k69946m48422n66769
$$ 21366158 20697357 20116361 19607902 19179611 18860751 18675509 18618637 18611392 18520876 18250930 17802508 17235739
-4325A7235739n87019n37391m74400m09499l48000l13640k83099k56376k43697k32238k25563
$$ 17235739 16648720 16111329 15636929 15227430 14879430 14565790 14282691 14026315 13782618 13550380 13324817
-4314A3324817k06470j88042j68950j55115j43658j27943j08852r6328q4872p3781o8051p4854
$$ 13324817 13118347 12930305 12761355 12606240 12462582 12334639 12225787 12129459 12044587 11970806 11902755 11827901
-4302A1827901j01574j24543j58899j87774j87770j83358j64268j57232j51502j50075j50070
$$ 11827901 11726327 11601784 11442885 11255111 11067341 10883983 10719715 10562483 10410981 10260906 10110836
-4291A0110836j41126j29670j20130r3402n8092k3730K0759N5118N6071j6464j28845k16652
$$ 10110836 9969710 9840040 9719910 9626508 9568416 9544686 9565445 9620563 9676634 9660170 9531325 9314673
-4279I314673k51011k24287j71675j29681r4846o8120l8178j9088q112j3839k9646l5373j8671
$$ 9314673 9063662 8839375 8667700 8538019 8443173 8375053 8336875 8317787 8309675 8295836 8266190 8230817 8212146
-4266H212146K3324O8300Q7388N5893j6643j12053j92226k18948k07495j74569j40209j17184
$$ 8212146 8235470 8303770 8391158 8447051 8430408 8318355 8126129 7907181 7699686 7525117 7384908 7267724
-4254G267724j05732r7924r2194q0029p4299o7025n5568n5692m9961l9974m5696n1665n1661
$$ 7267724 7161992 7064068 6971874 6891845 6817546 6750521 6694953 6639261 6589300 6549326 6503630 6451965 6400304
-4241F400304n8346n8343n7988n7984n3977m8246n4573o6022o9128o9124n2665n2660m4433
$$ 6400304 6341958 6283615 6225627 6167643 6113666 6065420 6010847 5944825 5875697 5806573 5753908 5701248 5656815
-4228E656815m4428l8706l8703m4074m4071l4531l4526k7078k7074k7077k7075j6400j6397
$$ 5656815 5612387 5573681 5534978 5490904 5446833 5412302 5377776 5350698 5323624 5296547 5269472 5253072 5236675
-4215E236675j9263j9260j8249j8246q705q702o856o852j130j126l500l498j3044j3042k2588
$$ 5236675 5217412 5198152 5179903 5161657 5152952 5144250 5137394 5130542 5129412 5128286 5124786 5121288 5108244 5095202 5072614
-4200E072614k2586n887J3205L6943P8940J41451K13990L25176M74067O15795O57792M46256
$$ 5072614 5050028 5044141 5057346 5094289 5173229 5314680 5528670 5853846 6327913 6943708 7601500 8047756
-4188H047756q042l46027m64371n76399n82121m55546l37195k47395j74855j32865r8502q5144
$$ 8047756 8039714 7693687 7229316 6652917 6070796 5615250 5278055 5030660 4855805 4722940 4624438 4539294
-4176D539294o6052n5916m4458m0391l4661k2973j1516j3549j9271l6334l6331k8074k8069
$$ 4539294 4473242 4417326 4372868 4332477 4297816 4274843 4263327 4249778 4230507 4194173 4157842 4129768 4101699
-4163D101699k8074k8069k2227k2224q865q863r942r943P236P236O819O819J6363J6363J7646
$$ 4101699 4073625 4045556 4023329 4001105 3992240 3983377 3973435 3963492 3970728 3977964 3984783 3991602 4007965 4024328 4041974
-4148D041974J7645J8481K4207L2140N1229P4254J16249J70068K57874L64769M98387O36776
$$ 4041974 4059619 4078100 4102307 4134447 4185676 4259930 4376179 4546247 4804121 5168890 5667277 6304053
-4136F304053O63500M41122j3179l35353m53701n70855n70855m38669l27957k39434j74535
$$ 6304053 6967553 7408675 7395496 7060143 6606442 6035587 5464732 5026063 4698106 4458672 4284137
-4125D284137j27459r3100p4847n5758m9436m3709l1660l1660l2226k0773j0633j6360j6657
$$ 4284137 4156678 4063578 3988731 3932973 3883537 3839828 3808168 3776508 3744282 3723509 3712876 3696516 3679859
-4112C679859j6657j1289j1289q515q515n653n651P90P91L653L654r99r99j000r99P412P411
$$ 3679859 3663202 3651913 3640624 3632109 3623594 3617941 3612290 3613080 3613871 3617524 3621178 3620179 3619180 3618180 3617181 3624593 3632004
-4095C632004J686J685P914P916P914P915J4715J4715K0442K0442J4178J4178P736P736Q750
$$ 3632004 3633690 3635375 3643289 3651205 3659119 3667034 3681749 3696464 3716906 3737348 3751526 3765704 3773440 3781176 3789926
-4080C789926k703n805n804m523m522K278l448n656N797J1405N677J861l866o729o730r354
$$ 3789926 3787223 3781418 3775614 3771091 3766569 3768847 3765399 3759743 3765540 3776945 3782622 3784483 3780617 3773888 3767158 3757804
-4064C757804r354j2217j2217j2110j2108r246r246j0678j0677n906n905r992r991l311l310
$$ 3757804 3748450 3736233 3724016 3711906 3699798 3690552 3681306 3670628 3659951 3654045 3648140 3638148 3628157 3624846 3621536
-4049C621536l013l012J760J759Q65Q65Q65Q65m682m683j820j819n07n07M265M265N07N07
$$ 3621536 3618523 3615511 3617271 3619030 3619895 3620760 3621625 3622490 3617808 3613125 3611305 3609486 3608979 3608472 3612737 3617002 3617509 3618016
-4031C618016o174o174k978k979k979k979n066n067n067n066j905j905j905j905j1927j1926
$$ 3618016 3611842 3605668 3602690 3599711 3596732 3593753 3588687 3583620 3578553 3573487 3571582 3569677 3567772 3565867 3553940 3542014
-4015C542014j4790j4790j4894j4894k1575k1575k2052k2052l2551l2551k4408k4408k7272
$$ 3542014 3527224 3512434 3497540 3482646 3461071 3439496 3417444 3395392 3362841 3330290 3305882 3281474 3254202
-4002C254202k7272k4050k4051k8822k8823k5131k5132k0360k0359k2328k2328k2329k2327
$$ 3254202 3226930 3202880 3178829 3150007 3121184 3096053 3070921 3050561 3030202 3007874 2985546 2963217 2940890
-3989B940890k5191k5192k8055k8054k9605k9606k1016k1016j5334j5334j5333j5334j7900
$$ 2940890 2915699 2890507 2862452 2834398 2804793 2775187 2754171 2733155 2717821 2702487 2687154 2671820 2653920
-3976B653920j7898j7899j7900j2798j2799j2799j2799k0792k0792j7929j7928k0543k0542
$$ 2653920 2636022 2618123 2600223 2587425 2574626 2561827 2549028 2528236 2507444 2489515 2471587 2451044 2430502
-3963B430502j1953j1952j4339j4338j1476j1475j3354j3355j6217j6218k0810k0811k0095
$$ 2430502 2418549 2406597 2392258 2377920 2366444 2354969 2341615 2328260 2312043 2295825 2275015 2254204 2234109
-3950B234109k0095k2048j0596o062N391K0363L9452O3073Q9797J11093J11092Q6993K2093
$$ 2234109 2214014 2191966 2181370 2175308 2180699 2201062 2240514 2303587 2393384 2504477 2615569 2702562 2724655
-3937B724655o9053j33954j70221j58768j29383j02659p6770n7683m3247l7520l0362k4636
$$ 2724655 2655602 2521648 2351427 2192659 2063276 1960617 1883847 1826164 1782917 1745397 1715035 1690399
-3925A690399k5531k5530k2310k2309j4495j4495j1632j1632n801n801n801n801k1609k1608
$$ 1690399 1664868 1639338 1617028 1594719 1580224 1565729 1554097 1542465 1536664 1530863 1525062 1519261 1497652 1476044
-3911A476044k4472k4472j4868j4868j7731j7731j5644j5643k3040k3040j7143k8595k5374
$$ 1476044 1451572 1427100 1412232 1397364 1379633 1361902 1346258 1330615 1307575 1284535 1267392 1238797 1213423
-3898A213423j9647j8992j8991r924j5651j8365o912l214l214q224q224j2997j2996l661l661
$$ 1213423 1193776 1174784 1155793 1145869 1130218 1111853 1104941 1101727 1098513 1090289 1082065 1069068 1056072 1052411 1048750
-3883A048750O718J2444K0796L9884O0523R4883J37622J94886K69809L27073L03690J62436
$$ 1048750 1055468 1067912 1088708 1128592 1189115 1283998 1421620 1616506 1886315 2213388 2517078 2679514
-3871B679514m3716k38417l26563l07474k41619j76719j30192r5833p2450n3361m2416l0962
$$ 2679514 2635798 2397381 2070818 1763344 1521725 1345006 1214814 1118981 1046531 993170 950754 919792
-3859I19792k1180k1180j5393l941j197M530J1151J1151J7951O498j6228j6229j4082j4081
$$ 919792 898612 877432 862039 858098 856901 861431 872582 883733 901684 908182 891954 875725 861643 847562
-3845H47562o670o669j3351j3351j2873j2873o193o192q810q810m037m038q16q17R682R682
$$ 847562 840892 834223 820872 807521 794648 781775 775582 769390 760580 751770 747733 743695 742879 742062 751744 761426
-3829G61426J1576J1576J4440J4439J7064J7063J7064J7064J8123J8123J8122J8123J4723
$$ 761426 773002 784578 799018 813457 830521 847584 864648 881712 899835 917958 936080 954203 968926
-3816I68926J4722J5439J5438L3841M5293N3645Q8004J10492J21944J24809R0449K6944o0859
$$ 968926 983648 999087 1014525 1048366 1093659 1147304 1235308 1345800 1467744 1592553 1683002 1709946 1649087
-3803A649087j30058j49142j38408j11682q3052o3961n0573l1480k0390j4659o252o248j123
$$ 1649087 1519029 1369887 1231479 1119797 1036745 972784 922211 890731 870341 855682 849430 843182 842059
-3790H42059j118M73M78M73M77j2709j2706k210k208j882j879L84O114J4700K6157L4385L4389
$$ 842059 840941 841414 841892 842365 842842 830133 817427 815217 813009 811127 809248 809632 815746 830446 856603 890988 925377
-3773I25377K1023K1027J3626J3631J7205L6298O3733R0460J22311J33767J17538P5548J3746
$$ 925377 946400 967427 981053 994684 1011889 1048187 1111920 1202380 1324691 1458458 1575996 1651544 1665290
-3760A665290m3516q6467j13188j12654r3563o3979l7252j8287o830J0108J0110l761l8117
$$ 1665290 1621774 1535307 1422119 1309465 1215902 1151923 1114671 1096384 1089554 1099662 1109772 1106011 1067894
-3747A067894o6395p7845q2143p6412o0669m9212l9694l3964k9792k9788j9412j9409j2732
$$ 1067894 1001499 923654 841511 765099 704430 655218 615524 581560 551768 521980 502568 483159 470427
-3734D70427j2728j7026j7023j0346j0342j0107j0103N10n212j2418r62N85n137n499K31P147
$$ 470427 457699 440673 423650 413304 402962 392855 382752 383262 378050 365632 364670 365255 360118 354619 354850 361997
-3718C61997P150L807L810O670O673P803P807P803P807J2083J2083J8764J8764J9062J9062
$$ 361997 369147 372954 376764 383434 390107 397910 405717 413520 421327 433410 445493 464257 483021 502083 521145
-3703E21145J4290J4290Q475Q474l934l933k0158k0158k4931k4930k2649k2648q333q332j2807
$$ 521145 535435 549725 558200 566674 562740 558807 538649 518491 493560 468630 445981 423333 415000 406668 393861
-3688C93861j2806j7578j7579k0232k0233j9875j9875k8405k2679k3752j2299j3075j3071
$$ 393861 381055 363477 345898 325666 305433 285558 265683 237278 214599 190847 178548 165473 152402
-3675A52402j5222j5218j1942j1937j1942j1937j0928j0923m247m242l710l706q481q478j413
$$ 152402 137180 121962 110020 98083 86141 74204 63276 52353 48106 43864 40154 36448 27967 19489 18076
-3660A8076j409j0003r998p438p434p437p434n723n719k860k855q91q88p572p568J969J968
$$ 18076 16667 6664 -3334 -10772 -18206 -25643 -33077 -38800 -44519 -47379 -50234 -51125 -52013 -59585 -67153 -65184 -63216
-3643f3216q95q94L042L042l639l638J506J506l266l266N503N503N502N503j461j462p426
$$ -63216 -64111 -65005 -61963 -58921 -62560 -66198 -64692 -63186 -66452 -69718 -64215 -58712 -53210 -47707 -49168 -50630 -58056
-3626e8056p427r633J819L967L967J1811J1810Q232Q232O442n010j6703j6702j6038j6035
$$ -58056 -65483 -75116 -73297 -69330 -65363 -53552 -41742 -33510 -25278 -18836 -23846 -40549 -57251 -73289 -89324
-3611h9324j3176j3171m526m523p389p385m303m298m303m298j797j793o570o565k155k151
$$ -89324 -102500 -115671 -120197 -124720 -132109 -139494 -143797 -148095 -152398 -156696 -158493 -160286 -166856 -173421 -175576 -177727
-3595a77727k155k151l646l643l646l642k259k256j543j540l512P945M362j361J629m094m097
$$ -177727 -179882 -182033 -185679 -189322 -192968 -196610 -198869 -201125 -202668 -204208 -207720 -199775 -195413 -196774 -195145 -199239 -203336
-3578b03336m093l919l914Q54Q57l143l139L538L542L478L482L479L482N357N361K495K497
$$ -203336 -207429 -211348 -215262 -214408 -213551 -216694 -219833 -216295 -212753 -209275 -205793 -202314 -198832 -193475 -188114 -185619 -183122
-3561a83122L509L512R592J5323K3253L4709N7134O8590Q1234P5510N0334J5979k3536n0259
$$ -183122 -179613 -176101 -166509 -151186 -127933 -93224 -36090 32500 113734 189244 239578 255557 232021 181762
-3547A81762p4597q6051o7795m8709l9403k0315j6557j6557o774o774o297o297L84L84l530
$$ 181762 107165 21114 -46681 -95390 -134793 -155108 -171665 -188222 -194996 -201770 -208067 -214364 -213980 -213596 -217126
-3532b17126l531o67o68J182J182n499n499l889l888l889l888j30j31K733K733L560L560M396
$$ -217126 -220657 -221324 -221992 -220810 -219628 -225127 -230626 -234515 -238403 -242292 -246180 -246310 -246441 -243708 -240975 -237415 -233855 -229459
-3514b29459J0122O960m492K308K307K666K666N529N529J0837J0838J9428J9427K6757K6757
$$ -229459 -219337 -212377 -216869 -214561 -212254 -209588 -206922 -201393 -195864 -185027 -174189 -154761 -135334 -108577 -81820
-3499h1820M0954M6680N8014P7103Q5930Q0205N3212J8853q108k7197m2587m8314m2706m2706
$$ -81820 -40866 5814 63828 140931 226861 307066 360278 379131 371023 343826 301239 252925 210219 167513
-3485A67513m4328l2876l0727l0728k2734k2734j4144j4145q463q463L944L945M242M243M243
$$ 167513 123185 90309 59582 28854 6120 -16614 -30758 -44903 -53366 -61829 -57885 -53940 -49698 -45455 -41212
-3470d1212M242K126K125p39p38j991j991K782K781J036J037K110l616j57J1296J2490O763
$$ -41212 -36970 -34844 -32719 -33458 -34196 -36187 -38178 -35396 -32615 -31579 -30542 -28432 -32048 -32205 -20909 -8419 -1656
-3453a656K090K096Q414Q418M478M481J972J976O00O331M895J6352K2790J7068K5057K5061
$$ -1656 434 2530 10944 19362 23840 28321 30293 32269 32869 39200 44095 60447 83237 100305 125362 150423
-3437A50423K8785M7877N3839O5295Q0682R9773J15876J21605J13669P9313L4571j5054n6217
$$ 150423 179208 227085 280924 346219 426901 526674 642550 764155 877824 957137 991708 976654 920437
-3424I20437q2937r1053p1962o2074m2986k4852n764J1535L0624M2672M2673L3367K7641J6903
$$ 920437 837500 746447 674485 612411 569425 544573 538809 550344 580968 623640 666313 699680 727321 744224
-3410G44224N451n108j0834q686k960l96l95l7l7O464O465K0781K0781K0661K0662K5433K5434
$$ 744224 749675 744567 733733 725047 722087 721691 721296 721259 721222 727686 734151 754932 775713 796374 817036 842469 867903
-3393H67903K2213K2212J5532J5531J5879J5882J3015J3018J4924J4928J4089Q366J3641K5098
$$ 867903 890116 912328 927860 943391 959270 975152 988167 1001185 1016109 1031037 1045126 1053492 1067133 1092231
-3379A092231L1298L7029L9649L9653M0245N1703O2272O2275Q0167R9259J23474J57836K04837
$$ 1092231 1123529 1160558 1200207 1239860 1280105 1331808 1394080 1456355 1536522 1635781 1759255 1917091 2121928
-3366B121928K46835K74927K74931K03108R2399k1776j17215j41077j14351n2265K0273P7297
$$ 2121928 2368763 2643690 2918621 3121729 3214128 3192352 3075137 2934060 2819709 2767444 2787717 2865014
-3354B865014J11659J40287J40292J24301Q9946K5997l8900q6266q0537n1788m0331k3514
$$ 2865014 2976673 3116960 3257252 3381553 3471499 3497496 3458596 3372330 3291793 3240005 3199674 3176160
-3342C176160L214K3103L4560L8374M9832N8834P0291Q1502J00593J10880J10883J09568J15297
$$ 3176160 3179374 3202477 3237037 3275411 3325243 3384077 3454368 3535870 3636463 3747343 3858226 3967794 4083091
-3329D083091J25375J36832J58422J69878J80790J92247K16104K35196K57263K76355K91145
$$ 4083091 4208466 4345298 4503720 4673598 4854388 5046635 5262739 5497935 5755198 6031553 6322698
-3318F322698L10236L34481L61209M10357M52354M93153N50421N98137O32501O64216O98578
$$ 6322698 6632934 6967415 7328624 7738981 8191335 8684488 9234909 9833046 10465547 11129763 11828341
-3307A1828341P35320Q00224Q86117J004468J161465J386711J677237K009376K346758K617814
$$ 11828341 12563661 13363885 14250002 15254470 16415935 17802646 19479883 21489259 23836017 26453831
-3297B6453831K771950K791041K689870K533350K440676K505574K745133L123083L600049
$$ 26453831 29225781 32016822 34706692 37240042 39680718 42186292 44931425 48054508 51654557
-3288E1654557M077262M429911M502449M181972L414620K274107R57011l26200j414225k187308
$$ 51654557 55731819 60161730 64664179 68846151 72260771 74534878 75491889 75165689 73751464 71564156
-3278G1564156k611067k712456k586477k357890k109744j869951j644702j450486j278687
$$ 71564156 68953089 66240633 63654156 61296266 59186522 57316571 55671869 54221383 52942696
-3269E2942696j147308j051866r99615r80522r77303r77304r62746r43661q92890q27987p55456
$$ 52942696 51795388 50743522 49743907 48763385 47786082 46808778 45846032 44902371 44009481 43181494 42426038
-3258D2426038o75282n94158n13985m19979l16902k07145q1157O2956K19479M08215N87646
$$ 42426038 41750756 41156598 40642613 40222634 39905732 39698587 39617430 39680386 39899865 40308080 40895726
-3247D0895726P76616R94228J245280J592685K057965K657336L443054M515820N851036P152872
$$ 40895726 41672342 42666570 43911850 45504535 47562500 50219836 53662890 58178710 64029746 71182618
-3237G1182618P707965O917722N069505L240836K283324K248971L457722O546219J1213957
$$ 71182618 78890583 85808305 90877810 94118646 96401970 98650941 102108663 108654882 119868839
-3228A19868839J6302901K0236041K1079750J7654101J0694527K501357n290472j2833929
$$ 119868839 136171740 156407781 177487531 195141632 205836159 208337516 203047044 190213115
-3220A90213115j9320108k2209610k0976515j7721819j4335573j1497626r287198p591150
$$ 190213115 170893007 148683397 127706882 109985063 95649490 84151864 74864666 67273516
-3212F7273516o274051n239952m419150l741283l164816k662794k223760j849548j547948
$$ 67273516 60999465 55759513 51340363 47599080 44434264 41771470 39547710 37698162 36150214
-3203C6150214j347045j213424j122879j073247j058932j016936r29338q18624o94554n60933
$$ 36150214 34803169 33589745 32466866 31393619 30334687 29317751 28388413 27569789 26875235 26314302
-3193B6314302m23857k97875j82867n6885O9876K11124L65744N29899O96089Q60246J022975
$$ 26314302 25890445 25592570 25409703 25352818 25422694 25633818 25999562 26529461 27225550 28085796 29108771
-3182B9108771J202405J394913J627790J921749K253886K564904K751970K772492K638872
$$ 29108771 30311176 31706089 33333879 35255628 37509514 40074418 42826388 45598880 48237752
-3173D8237752K461945K343602K353622K594133L145067L942957M796207N433755N542306
$$ 48237752 50699697 53043299 55396921 57991054 61136121 65079078 69875285 75309040 80851346
-3164H0851346M858954L365286J292309j059013l383958n385851o794556p460264p479353
$$ 80851346 85710300 89075586 90367895 89308882 85924924 80539073 73744517 66284253 58804900
-3155E8804900p053685o362686n537480m724318l977011l316558k770559k323894j967896
$$ 58804900 51751215 45388529 39851049 35126731 31149720 27833162 25062603 22738709 20770813
-3146B0770813j673936j429012j226675j051540q95016p72435o69357o03740n77018n67354
$$ 20770813 19096877 17667865 16441190 15389650 14494634 13722199 13052842 12449102 11872084 11304730
-3136A1304730n67355n74512n74512n68760n42036n04575m54946m04601l54971l14886k80526
$$ 11304730 10737375 10162863 9588351 9019591 8477555 7972980 7518034 7113433 6758462 6443576 6163050
-3125F163050k59500k40412k29316k17864k03905j98179j82550j71098j56974j45522j45284
$$ 6163050 5903550 5663138 5433822 5215958 5012053 4813874 4631324 4460226 4303252 4157730 4012446
-3114D012446j33830j21542j21543j18679j07226j06630j06629r5416r5415r1359r1359p8952
$$ 4012446 3878616 3757074 3635531 3516852 3409626 3302996 3196367 3100951 3005536 2914177 2822818 2743866
-3102B743866p8951p1794p1793o5113o5112n9208n9207n2526n2526n9506n9505n8790n8790
$$ 2743866 2664915 2593121 2521328 2456215 2391103 2331895 2272688 2220162 2167636 2108130 2048625 1989835 1931045
-3089A931045n0856l9403l6540l6540l1365j9912j9674j9673j8242j8242j8600k4326j8600
$$ 1931045 1880189 1840786 1804246 1767706 1736341 1716429 1696755 1677082 1658840 1640598 1621998 1597672 1579072
-3076A579072l0053m1148l5421k5281j9554j2277j2277p531j3258k2443l3897l5567m7019
$$ 1579072 1549019 1507871 1472450 1447169 1427615 1415338 1403061 1395530 1382272 1359829 1325932 1290365 1243346
-3063A243346n2389m6662m0741k9289k6783k6783k0699k0699k0699k0699j6851j6851j6852
$$ 1243346 1190957 1144295 1103554 1074265 1047482 1020699 1000000 979301 958602 937903 921052 904201 887349
-3050H87349j6851j8045j8044j5181j5181j8179j8178j1498j1498j2750j2750r888r887j3623
$$ 887349 870498 852453 834409 819228 804047 785868 767690 756192 744694 731944 719194 709306 699419 685796
-3036F85796j3622p897p896j1773j1774j4637j4637j4398j4398j1535j1535j3742j3742j0879
$$ 685796 672174 664277 656381 644608 632834 618197 603560 589162 574764 563229 551694 537952 524210 513331
-3022E13331j0879j2623j2624j2624j2623q866q866q865q866p374p374p375p374k244k245
$$ 513331 502452 489829 477205 464581 451958 443092 434226 425361 416495 409121 401747 394372 386998 384754 382509
-3007C82509k244k245k993k994q720q720o215o215o215o215q243q243q243q243l948l948r675
$$ 382509 380265 378020 375027 372033 363313 354593 348378 342163 335948 329733 321490 313247 305004 296761 292813 288865 279190
-2990B79190r674o007o006k79k80j950j950p676p676o185o185m59m58k010k009L359o185m593
$$ 279190 269516 263509 257503 257224 256944 254994 253044 245368 237692 231507 225322 224863 224405 222395 220386 223745 217560 212967
-2972B12967m594n189n190n37n37n36n37M712M713j014j015q351q351j4077j4078p665p665
$$ 212967 208373 203184 197994 197457 196920 196384 195847 200559 205272 204258 203243 194892 186541 172464 158386 150721 143056
-2955A43056j0529j0528p307p308p307p307j760j759m623m623K356K356l370l370n063n063
$$ 143056 132527 121999 114692 107384 100077 92770 91010 89251 84628 80005 82361 84717 81347 77977 72914 67851
-2939F7851j0789j246j71n898k080k081j827j826j827j827j827j827j826j827n525n526j56
$$ 67851 57062 55816 55645 49747 47667 45586 43759 41933 40106 38279 36452 34625 32799 30972 25447 19921 19765
-2922A9765r701q388q388q985q984l020l020l020l020l020l019l020l020j711j711j712j711
$$ 19765 10064 1676 -6712 -15697 -24681 -27701 -30721 -33741 -36761 -39781 -42800 -45820 -48840 -50551 -52262 -53974 -55685
-2905e5685J868J868J867J868l605l605l605l605l605l606l605l605m187m186r66o692l471
$$ -55685 -53817 -51949 -50082 -48214 -51819 -55424 -59029 -62634 -66239 -69845 -73450 -77055 -81242 -85428 -86394 -93086 -96557
-2888i6557l471p408j681J987l740n886n887k80k79K583K584K121K125p42p38n156n152N70
$$ -96557 -100028 -107436 -109117 -107130 -110870 -116756 -122643 -122923 -123202 -120619 -118035 -115914 -113789 -114531 -115269 -120425 -125577 -125007
-2870a25007N74k05k01n931n928L493L497L135L140k204p926k203L527o558o554l695l691
$$ -125007 -124433 -124638 -124839 -130770 -136698 -133205 -129708 -126573 -123433 -125637 -133563 -135766 -132239 -138797 -145351 -149046 -152737
-2853a52737o97o420o424o93j950j946j592j588k50k46k50k46k218k215K87K91J689m034o543
$$ -152737 -153434 -159854 -166278 -166971 -168921 -170867 -172459 -174047 -174297 -174543 -174793 -175039 -177257 -179472 -179185 -178894 -177205 -181239 -187782
-2834a87782o539l143l139k785k781q601k871l69l65j085j081j085j081l456l453l456l452
$$ -187782 -194321 -197464 -200603 -203388 -206169 -214770 -217641 -218010 -218375 -219460 -220541 -221626 -222707 -226163 -229616 -233072 -236524
-2817b36524R58R62k263L467L639L639L638L643j014o741j014M716K09K09N66N71K09K08K09
$$ -236524 -235566 -234604 -236867 -233400 -229761 -226122 -222484 -218841 -219855 -226596 -227610 -222894 -222685 -222476 -221910 -221339 -221130 -220922 -220713
-2798b20713K13j171j171q12q09o062l36l35o059j439j439j797j793k513k513k513k509N97
$$ -220713 -220500 -221671 -222842 -223654 -224463 -230525 -230861 -231196 -237255 -238694 -240133 -241930 -243723 -246236 -248749 -251262 -253771 -253174
-2780b53174O00O00O01l460l456l456l456m77m74m73m74P16P20P19P20q13q09q09q09J275
$$ -253174 -252574 -251974 -251373 -254833 -258289 -261745 -265201 -265678 -266152 -266625 -267099 -266383 -265663 -264944 -264224 -265037 -265846 -266655 -267464 -266189
-2760b66189J279J278J279R47R51Q228Q228J782J1330J2642J2642J8705J8704J8704J8705
$$ -266189 -264910 -263632 -262353 -261406 -260455 -252227 -243999 -242217 -230887 -218245 -205603 -186898 -168194 -149490 -130785
-2745a30785J8286J8287J3515J3514K5072K5072K7696L7241L8553K9009K5430J5885M985m560
$$ -130785 -112499 -94212 -80697 -67183 -42111 -17039 10657 47898 86451 115460 140890 156775 161760 157200
-2731A57200j0644k0188k5198k5199k1023k1024k3543k3542k5691j6147j5670r943r346j5073
$$ 157200 146556 126368 101170 75971 54948 33924 10381 -13161 -38852 -54999 -70669 -80612 -89958 -105031
-2717a05031n861n861o576o577n323j1051p471p471q396k670J94n532n354n354n81n82k09
$$ -105031 -110892 -116753 -123329 -129906 -135229 -146280 -153751 -161222 -169618 -172288 -172094 -177626 -182980 -188334 -188915 -189497 -189706
-2700a89706N518N160N160L847L848N398J1125J4614J4615K0818K0818L1317M8495O2932N7205
$$ -189706 -184188 -179028 -173868 -170021 -166173 -160775 -149650 -135036 -120421 -99603 -78785 -47468 1027 63959 121164
-2685A21164M5741K8561J8899J8898J7824L5004N9222Q7855J23973J44970J30654P5298N149
$$ 121164 166905 195466 214365 233263 251087 286091 345313 433168 557141 702111 832765 908063 913212
-2672I13212n7843j01507j33957j51569j42025j13870q5238p6289n9109m6584l7040k6242
$$ 913212 855369 753862 619905 468336 326311 212441 127203 50914 -8195 -54779 -91819 -118061
-2660a18061k6243k2425j2881j0137j0136j3955j3955p169j443p527p527k755k755k755k756
$$ -118061 -144304 -166729 -179610 -189747 -199883 -213838 -227793 -234962 -236405 -243932 -251459 -254214 -256969 -259724 -262480
-2645b62480k650k651k651k651l843l844r81r80k069k069M611M612Q728Q727R086R086R011
$$ -262480 -265130 -267781 -270432 -273083 -276926 -280770 -281751 -282731 -284800 -286869 -282258 -277646 -268918 -260191 -251105 -242019 -233008
-2628b33008J4737J6646J6647J9569K5296K0165J4440J2094O368R469J5196K2235L1779M6094
$$ -233008 -218271 -201625 -184978 -165409 -140113 -119948 -105508 -93414 -87046 -77577 -62381 -40146 -8367 37727
-2614C7727N1822M1592K0594o606k7604m0369m9912n5997n5997m9883m4156m2248l2704k0654
$$ 37727 89549 131141 151735 145129 117525 77156 27244 -28753 -84750 -134633 -178789 -221037 -253741 -274395
-2600b74395k0654j4928j4927q038k312q395q396o965o964j0543m817O75n052m694J033J629
$$ -274395 -295049 -309977 -324904 -332942 -335254 -343649 -352045 -359010 -365974 -376517 -381334 -380659 -385711 -390405 -389372 -387743
-2584c87743J630k785k785m381m381L92L91k591k591k233k233m754R73k248k248r95r96L777
$$ -387743 -386113 -388898 -391683 -396064 -400445 -400053 -399662 -402253 -404844 -407077 -409310 -414064 -413091 -415339 -417587 -418582 -419578 -415801
-2566d15801L777j040j041j040j040k412k412k412k412m098m097l739l740k725L001L001k725
$$ -415801 -412024 -413064 -414105 -415145 -416185 -418597 -421009 -423421 -425833 -429931 -434028 -437767 -441507 -444232 -441231 -438230 -440955
-2549d40955n678n678K554K554l10l09K911K912l560K166K166l561l799l799m156m157M984
$$ -440955 -446633 -452311 -449757 -447203 -447513 -447822 -444911 -441999 -445559 -443393 -441227 -444788 -448587 -452386 -456542 -460699 -455715
-2532d55715M985j697j696J048J047J048J048L053L053j718j719L650L650j122j123l165l165
$$ -455715 -450730 -452427 -454123 -453075 -452028 -450980 -449932 -446879 -443826 -445544 -447263 -443613 -439963 -441085 -442208 -445373 -448538
-2515d48538l165l166J16J16J15J16q39q39q39q39k509k509k509k509k628k629k628k628M73
$$ -448538 -451703 -454869 -454753 -454637 -454522 -454406 -455245 -456084 -456923 -457762 -460271 -462780 -465289 -467798 -470426 -473055 -475683 -478311 -477838
-2496d77838M74M73M74K934K934K934K934n26n25K337K338o879o878k107k106l17l17l180
$$ -477838 -477364 -476891 -476417 -473483 -470549 -467615 -464681 -465207 -465732 -463395 -461057 -467936 -474814 -476921 -479027 -479344 -479661 -482841
-2478d82841l180l568l568N022N022K695K696K695K696K874K875l807l806j719j719j718j719
$$ -482841 -486021 -489589 -493157 -488135 -483113 -480418 -477722 -475027 -472331 -469457 -466582 -470389 -474195 -475914 -477633 -479351 -481070
-2461d81070K912K911K912K912o68o67o67o68L92L91L92L91j279j278j279j279j383j383j383
$$ -481070 -478158 -475247 -472335 -469423 -470091 -470758 -471425 -472093 -471701 -471310 -470918 -470527 -471806 -473084 -474363 -475642 -477025 -478408 -479791
-2442d79791j384j383j383j383j383R88R88R88R88K181K181m500m500m045m045M544M549j719
$$ -479791 -481175 -482558 -483941 -485324 -486707 -485719 -484731 -483743 -482755 -480574 -478393 -482893 -487393 -491438 -495483 -490939 -486390 -488109
-2424d88109j719m582m578K144K144K143K148M649M649j23j20J682J681J682J685j08j08l926
$$ -488109 -489828 -494410 -498988 -496844 -494700 -492557 -490409 -485760 -481111 -481234 -481354 -479672 -477991 -476309 -474624 -474732 -474840 -478766
-2406d78766J804O68q877r235l504L411L411j003r99R17R17R18R17k603k602K170K170L974
$$ -478766 -476962 -476294 -485171 -494406 -497910 -494499 -491088 -492091 -493090 -492173 -491256 -490338 -489421 -492024 -494626 -492456 -490286 -486312
-2388d86312L974m615m616l184l183l21l21K961K960l721l721r77r76r77r77j156j155j156
$$ -486312 -482338 -486953 -491569 -494753 -497936 -498257 -498578 -495617 -492657 -496378 -500099 -501076 -502052 -503029 -504006 -505162 -506317 -507473
-2370e07473j156K125K125K125K125L128L132j640j641K114K118J163m563n015M534Q709K982
$$ -507473 -508629 -506504 -504379 -502254 -500129 -497001 -493869 -495509 -497150 -495036 -492918 -491755 -496318 -501333 -496799 -488090 -485108
-2353d85108n730n726j313j312K889K893j879j879j405j402J819J820j406M325L967n578l911
$$ -485108 -490838 -496564 -497877 -499189 -496300 -493407 -495286 -497165 -498570 -499972 -498153 -496333 -497739 -493414 -489447 -495025 -498936
-2336d98936J820m862m861J998J998q65q65m324m325j461j462L88L88k476k475j879j879R84
$$ -498936 -497116 -501978 -506839 -504841 -502843 -503708 -504573 -508897 -513222 -514683 -516145 -515757 -515369 -517845 -520320 -522199 -524078 -523094
-2318e23094R84m884m884J797J797j782j782j782j782k408k409k408k409j991j990K781K781
$$ -523094 -522110 -526994 -531878 -530081 -528284 -530066 -531848 -533630 -535412 -537820 -540229 -542637 -545046 -547037 -549027 -546246 -543465
-2301e43465j547j547j548j543n33n33n33n30j219j219j219j216n03n03n03n00L39L39L40
$$ -543465 -545012 -546559 -548107 -549650 -550183 -550716 -551249 -551779 -552998 -554217 -555436 -556652 -557155 -557658 -558161 -558661 -558322 -557983 -557643
-2282e57643L43q54q54q53q51l060l061l061l057M1M1M1M5J241J245J242J245K792K797k935
$$ -557643 -557300 -558154 -559008 -559861 -560712 -563772 -566833 -569894 -572951 -572910 -572869 -572828 -572783 -571542 -570297 -569055 -567810 -565018 -562221 -565156
-2262e65156k930M9N2M8N3J360J365J361J364J83J86J83J86j010j007j010j007J451J454J450
$$ -565156 -568086 -568037 -567985 -567937 -567884 -566524 -565159 -563798 -562434 -562251 -562065 -561882 -561696 -562706 -563713 -564723 -565730 -564279 -562825 -561375
-2242e61375J454J450J454J450J454l91l88l88l87J756J759J760J760k643k640k640k639k643
$$ -561375 -559921 -558471 -557017 -555567 -554113 -554504 -554892 -555280 -555667 -553911 -552152 -550392 -548632 -551275 -553915 -556555 -559194 -561837
-2224e61837k640L087L087n26n22o248o249J026J029J029J029K024K028l698l699M888M891
$$ -561837 -564477 -561390 -558303 -558829 -559351 -565599 -571848 -570822 -569793 -568764 -567735 -565711 -563683 -567381 -571080 -566192 -561301
-2207e61301m652m653J980J983J980J983k554k550L173L176j912j909j913j909N93N97N93
$$ -561301 -565953 -570606 -568626 -566643 -564663 -562680 -565234 -567784 -564611 -561435 -563347 -565256 -567169 -569078 -568485 -567888 -567295
-2190e67295N96o75o71o75o71L382L385L381L386o60o56o60o56o60o57o59o57L84L84L84L84
$$ -567295 -566699 -567374 -568045 -568720 -569391 -566009 -562624 -559243 -555857 -556517 -557173 -557833 -558489 -559149 -559806 -560465 -561122 -560738 -560354 -559970 -559586
-2169e59586j286j286j286j286o45o45o45o45j003j003j003j003l881l881J845J846l046l046
$$ -559586 -560872 -562158 -563444 -564730 -565375 -566020 -566665 -567310 -568313 -569316 -570319 -571322 -575203 -579084 -577239 -575393 -578439 -581485
-2151e81485l046l046p64p64p65p64J861J860J860J861M77M77M77M77k744k743K982K983J93
$$ -581485 -584531 -587577 -588341 -589105 -589870 -590634 -588773 -586913 -585053 -583192 -582715 -582238 -581761 -581284 -584028 -586771 -583789 -580806 -580613
-2132e80613J94J94J94m5m4m5m5l732l732N813N812K591K591l135l136L665L665k062k062
$$ -580613 -580419 -580225 -580031 -580076 -580120 -580165 -580210 -583942 -587674 -581861 -576049 -573458 -570867 -574002 -577138 -573473 -569808 -571870 -573932
-2113e73932q68q69q69q68m25m25m25m25K90K91K91K91n15n14n15n14j57j56j57j56J487J488
$$ -573932 -574800 -575669 -576538 -577406 -577831 -578256 -578681 -579106 -578816 -578525 -578234 -577943 -578458 -578972 -579487 -580001 -580158 -580314 -580471 -580627 -579140 -577652
-2091e77652m239m239K94K95O021O021j883j883j882j883q09q09q09q09P12P12P12P12r58
$$ -577652 -581891 -586130 -585836 -585541 -579520 -573499 -575382 -577265 -579147 -581030 -581839 -582648 -583457 -584266 -583554 -582842 -582130 -581418 -582376
-2072e82376r58r58r58k718k718k718k718M560M559j167j166j950j950j950j950J749J748
$$ -582376 -583334 -584292 -585250 -587968 -590686 -593404 -596122 -591562 -587003 -588170 -589336 -591286 -593236 -595186 -597136 -595387 -593639
-2055e93639J749J748k755k755k755k755J659J659J659J659m977m977P49P49L374L374k352
$$ -593639 -591890 -590142 -592897 -595652 -598407 -601162 -599503 -597844 -596185 -594526 -599503 -604480 -603731 -602982 -599608 -596234 -598586
-2038e98586k353O60O60O60O60m14m14m13m14k852k852k852k853M068M067j659j659L695L695
$$ -598586 -600939 -600279 -599619 -598959 -598299 -598713 -599127 -599540 -599954 -602806 -605658 -608510 -611363 -607295 -603228 -604887 -606546 -602851 -599156
-2019e99156k032k032k390k390L337L337J30J31J30J31J204J204J204J204K50K50K50K50K49
$$ -599156 -601188 -603220 -605610 -608000 -604663 -601326 -601196 -601065 -600935 -600804 -599600 -598396 -597192 -595988 -595738 -595488 -595238 -594988 -594739
-2000e94739K50K50K50Q61Q61Q61Q62J159J160m567m567k360k360N03N03k181k181k181k181
$$ -594739 -594489 -594239 -593989 -593128 -592267 -591406 -590544 -589385 -588225 -592792 -597359 -599719 -602079 -601576 -601073 -603254 -605435 -607616 -609797
-1981f09797L84L84L84L84K05K05K05K05J921J920r44r43K517K516l210l210M85M85k379k379
$$ -609797 -609413 -609029 -608645 -608261 -608056 -607851 -607646 -607441 -605520 -603600 -604544 -605487 -602970 -600454 -603664 -606874 -606389 -605904 -608283 -610662
-1961f10662J976J976J976J976M25M25M25M25N44N45n182n183k16k16k16k17J395J394J394
$$ -610662 -608686 -606710 -604734 -602758 -602333 -601908 -601483 -601058 -600514 -599969 -605151 -610334 -610550 -610766 -610982 -611199 -609804 -608410 -607016
-1942f07016J395L094L095K31K31l646l646K080K080j629j629M097M097l76l77l240l239M932
$$ -607016 -605621 -602527 -599432 -599201 -598970 -602616 -606262 -604182 -602102 -603731 -605360 -601263 -597166 -597542 -597919 -601159 -604398 -599466
-1924e99466M932m611m612O37O38k226k225K915K915k811k811l169l169l05l06m451m452J275
$$ -599466 -594534 -599145 -603757 -603120 -602482 -604708 -606933 -604018 -601103 -603914 -606725 -609894 -613063 -613368 -613674 -618125 -622577 -621302
-1906f21302J275N689N690l8l7m470m470j607j607K569K569k95k94J017J018J018J018o379
$$ -621302 -620027 -614338 -608648 -608686 -608723 -613193 -617663 -619270 -620877 -618308 -615739 -616034 -616328 -615311 -614293 -613275 -612257 -618636
-1888f18636o379L165L165J760J760j104j103n279n280M265M266K9L0K893K893n040n041O86
$$ -618636 -625015 -621850 -618685 -616925 -615165 -616269 -617372 -622651 -627931 -623666 -619400 -619371 -619341 -616448 -613555 -618595 -623636 -622950
-1870f22950O86j536j536M191M190l564l564K162K163o71o72o71o71J835J834J476J477L963
$$ -622950 -622264 -623800 -625336 -621145 -616955 -620519 -624083 -621921 -619758 -620429 -621101 -621772 -622443 -620608 -618774 -617298 -615821 -611858
-1852f11858j764n342O110J816l911K6K6K6K6K6K7k838k837K174K173Q963k491m995P30K700
$$ -611858 -613622 -618964 -612854 -611038 -614949 -614923 -614897 -614871 -614845 -614819 -614792 -617630 -620467 -618293 -616120 -607157 -609648 -614643 -613913 -611213
-1832f11213K699J94J94j536j537j535j537l43l42K520K520M593M593m951m951k98k98K565
$$ -611213 -608514 -608320 -608126 -609662 -611199 -612734 -614271 -614614 -614956 -612436 -609916 -605323 -600730 -605681 -610632 -610930 -611228 -608663
-1814f08663K565k864k863k863k863K326K326K327K326l079l080l079l080r32r32r32r32p23
$$ -608663 -606098 -608962 -611825 -614688 -617551 -615225 -612899 -610572 -608246 -611325 -614405 -617484 -620564 -621496 -622428 -623360 -624292 -625015
-1796f25015p23p524L930N540j87J246J245j771L955J451j0003k188k189K822K823k070k069
$$ -625015 -625738 -633262 -629332 -623792 -623979 -622733 -621488 -623259 -619304 -617853 -627856 -630044 -632233 -629411 -626588 -628658 -630727
-1779f30727k069k069n18n18n19n18L158L158p80M948N066o386M14M14o30o30o30o31K472
$$ -630727 -632796 -634865 -635383 -635901 -636420 -636938 -633780 -630622 -631402 -626454 -621388 -627774 -627360 -626946 -627576 -628206 -628836 -629467 -626995
-1760f26995K472K472K472j231j230j230j231j946j946j946j946Q57Q58Q57Q58j111j111J752
$$ -626995 -624523 -622051 -619579 -620810 -622040 -623270 -624501 -626447 -628393 -630339 -632285 -631428 -630570 -629713 -628855 -629966 -631077 -629325
-1742f29325J752l676l676K051K050J812J812K528l199o002k76J275J275P777j767m631M914
$$ -629325 -627573 -631249 -634925 -632874 -630824 -629012 -627200 -624672 -627871 -633873 -634149 -632874 -631599 -623822 -625589 -630220 -625306
-1725f25306o86o86k953k952M265M265J759l966J222J223j998j998J580J581m145m146L862
$$ -625306 -625992 -626678 -629631 -632583 -628318 -624053 -622294 -626260 -625038 -623815 -625813 -627811 -626231 -624650 -628795 -632941 -629079
-1708f29079L863J357J357r70M758J536J536j596j596M131M131o845o845j118j119J133J134
$$ -629079 -625216 -623859 -622502 -623472 -618714 -617178 -615642 -617238 -618834 -614703 -610572 -617417 -624262 -625380 -626499 -625366 -624232
-1691f24232J491J491l519K207j372j372K09n518j938j939k774K953L310k415l803J924J923
$$ -624232 -622741 -621250 -624769 -622562 -623934 -625306 -625097 -630615 -632553 -634492 -637266 -634313 -631003 -633418 -637221 -635297 -633374
-1674f33374l802n116O12k968k967J133J133J134J133m77m77N607j19l371l370j223M504K893
$$ -633374 -637176 -642292 -641680 -644648 -647615 -646482 -645349 -644215 -643082 -643559 -644036 -638429 -638548 -641919 -645289 -646512 -642008 -639115
-1656f39115K893O114O114J298J297j566j565k461k461L266L266m47m48l310l311k416k416
$$ -639115 -636222 -630108 -623994 -622696 -621399 -622965 -624530 -626991 -629452 -626186 -622920 -623367 -623815 -627125 -630436 -632852 -635268
-1639f35268M48M47K491K490l73l73Q80Q80j983j984j942j942j943j942j764j763j764j763
$$ -635268 -634820 -634373 -631882 -629392 -629765 -630138 -629258 -628378 -630361 -632345 -634287 -636229 -638172 -640114 -641878 -643641 -645405 -647168
-1621f47168j241j242M485M485j898j897R65R66J040J040m686m686n71n70n71n70J16J15J16
$$ -647168 -648409 -649651 -645166 -640681 -642579 -644476 -643511 -642545 -641505 -640465 -645151 -649837 -650408 -650978 -651549 -652119 -652003 -651888 -651772
-1602f51772J15J309J308J309J309K289K289K289K289R17R17R17R18J454J454j410j409j230
$$ -651772 -651657 -650348 -649040 -647731 -646422 -644133 -641844 -639555 -637266 -636349 -635432 -634515 -633597 -632143 -630689 -632099 -633508 -634738
-1584f34738j230M496M496J513J514l616l617m093N451L303k424r91r92j350j349J931J931
$$ -634738 -635968 -631472 -626976 -625463 -623949 -627565 -631182 -635275 -629824 -626521 -628945 -629936 -630928 -632278 -633627 -631696 -629765
-1567f29765M795M794K487K486p057p057j152j152J711J711L99L99k464k465J831J830J473
$$ -629765 -624970 -620176 -617689 -615203 -622260 -629317 -630469 -631621 -629910 -628199 -627800 -627401 -629865 -632330 -630499 -628669 -627196
-1550f27196J473k152p877m299N246k390k390L933L934K128K129K129K129K248K248l478l479
$$ -627196 -625723 -627875 -635752 -640051 -634805 -637195 -639585 -635652 -631718 -629590 -627461 -625332 -623203 -620955 -618707 -622185 -625664
-1533f25664o841o841K703K703j234j234m098m097J53J53K419K420R697J53p244j517L552
$$ -625664 -632505 -639346 -636643 -633940 -635174 -636408 -640506 -644603 -644450 -644297 -641878 -639458 -629761 -629608 -636852 -638369 -634817
-1516f34817L553j815j816j338j339j338j338j906j905M060n484n126M418J674m053J342J343
$$ -634817 -631264 -633079 -634895 -636233 -637572 -638910 -640248 -642154 -644059 -639999 -645483 -650609 -646191 -644517 -648570 -647228 -645885
-1499f45885R84R84J700J700J700J700m02m03m03m02l028l027l027l027J021J022J021J022
$$ -645885 -644901 -643917 -642217 -640517 -638817 -637117 -637519 -637922 -638325 -638727 -641755 -644782 -647809 -650836 -649815 -648793 -647772 -646750
-1481f46750k737k736L944L944J633J633J037J036L721n824m54m55O97P01O97P01j152j148
$$ -646750 -649487 -652223 -648279 -644335 -642702 -641069 -640032 -638996 -635275 -641099 -641553 -642008 -641311 -640610 -639913 -639212 -640364 -641512
-1463f41512j152j149j823j819K949K953K054K058q09q05k845k841J9K2J808J812j055j051
$$ -641512 -642664 -643813 -645636 -647455 -644506 -641553 -639499 -637441 -638250 -639055 -641900 -644741 -644722 -644700 -642892 -641080 -642135 -643186
-1445f43186k905k900J868J871J689J693l083l080j68j67j68j68J204J204l567l568k122k121
$$ -643186 -646091 -648991 -647123 -645252 -643563 -641870 -644953 -648033 -648201 -648368 -648536 -648704 -647500 -646296 -649863 -653431 -655553 -657674
-1427f57674P42P42N03N03N04N03Q80Q80Q80Q79k878k878k878k878O368O367m130m131m92
$$ -657674 -656932 -656190 -655687 -655184 -654680 -654177 -653297 -652417 -651537 -650658 -653536 -656414 -659292 -662170 -655802 -649435 -653565 -657696 -658188
-1408f58188m93m309J416L322o218l717K013J293J298J651J656L99M02L99M03j629j626K189
$$ -658188 -658681 -662990 -661574 -658252 -664470 -668187 -666174 -664881 -663583 -661932 -660276 -659877 -659475 -659076 -658673 -660302 -661928 -659739
-1390f59739l535m272N275m55m51J335J338J335J338p53p49p53p49K61K64K61K65j271j272
$$ -659739 -663274 -667546 -662271 -662726 -663177 -661842 -660504 -659169 -657831 -658584 -659333 -660086 -660835 -660574 -660310 -660049 -659784 -661055 -662327
-1371f62327L501L501m314m313K367K368J711J711m731R95L99n327j749j748m96m96m96m96
$$ -662327 -658826 -655325 -659639 -663952 -661585 -659217 -657506 -655795 -660526 -659531 -659132 -664459 -666208 -667956 -668452 -668948 -669444 -669940
-1353f69940l239l240l77l76L858L859L99n328J61J60j98j97p12p12p12p13K390K390K390
$$ -669940 -673179 -676419 -676796 -677172 -673314 -669455 -669056 -674384 -674223 -674063 -674261 -674458 -675170 -675882 -676594 -677307 -674917 -672527 -670137
-1334f70137K389j069j071m291J436m74m73L105k621j338j338j697j696L493L494L493L493
$$ -670137 -667748 -668817 -669888 -674179 -672743 -673217 -673690 -670585 -673206 -674544 -675882 -677579 -679275 -675782 -672288 -668795 -665302
-1317f65302n693n693R88O715K121p423n03N223N022p05l46l47P1n656k792K934Q01Q02J159
$$ -665302 -670995 -676688 -675700 -668985 -666864 -674287 -674790 -669567 -664545 -665250 -665596 -665943 -665872 -671528 -674320 -671386 -670585 -669783 -668624
-1298f68624J160j823j823J756l971n596J31J323J324M544M545k375q101j734L993P72P71
$$ -668624 -667464 -669287 -671110 -669354 -673325 -678921 -678790 -677467 -676143 -671599 -667054 -669429 -677530 -679264 -675271 -674499 -673728
-1281f73728j912L814L814j913j133j133n071O56L937j789J789J790o0n9p76M951M056j670
$$ -673728 -675640 -671826 -668012 -669925 -671058 -672191 -677262 -676606 -672669 -674458 -672669 -670879 -670939 -670998 -671774 -666823 -662767 -664437
-1263f64437k863k863K956K957J405m321k114k114K301K300k20k20k20k20j473j472j473j472
$$ -664437 -667300 -670163 -667207 -664250 -662845 -667166 -669280 -671394 -669093 -666793 -667013 -667233 -667453 -667673 -669146 -670618 -672091 -673563
-1245f73563L787L788j938j939j104j103j104j103K222K222K222K222m340m340J387J387O7
$$ -673563 -669776 -665988 -667926 -669865 -670969 -672072 -673176 -674279 -672057 -669835 -667613 -665391 -669731 -674071 -672684 -671297 -671230
-1228f71230O7O8O7M25M25M25M25r62r62r62r62N839N838l706l706j409j409j409j410r32
$$ -671230 -671163 -671095 -671028 -670603 -670178 -669753 -669328 -670290 -671252 -672214 -673176 -667337 -661499 -665205 -668911 -670320 -671729 -673138 -674548 -675480
-1208f75480r32r32r32k021k020L706L705k31k31n958n957j644j644M082M082k837k837k837
$$ -675480 -676412 -677344 -678276 -680297 -682317 -678611 -674906 -675137 -675368 -681326 -687283 -688927 -690571 -686489 -682407 -685244 -688081 -690918
-1190f90918k837K591K591K591K591l91l92l91l92N455N454m090m090j107j107j108j107J607
$$ -690918 -693755 -691164 -688573 -685982 -683391 -683782 -684174 -684565 -684957 -679502 -674048 -678138 -682228 -683335 -684442 -685550 -686657 -685050
-1172f85050J607J607J607J75J75J75J75j8j9j8j9L202L203k524k524J264J264J264J263l746
$$ -685050 -683443 -681836 -680229 -680054 -679879 -679704 -679529 -679547 -679566 -679584 -679603 -676401 -673198 -675722 -678246 -676982 -675718 -674454 -673191 -676937
-1152f76937l747J979J980J670J671J670J670l58l58l58l58m77m77m77m77k864k863k863k863
$$ -676937 -680684 -678705 -676725 -675055 -673384 -671714 -670044 -670402 -670760 -671118 -671476 -671953 -672430 -672907 -673384 -676248 -679111 -681974 -684837
-1133f84837J893J894J894J894j446j447j446j447p75p76p75p76j491j491j492j491m96m96
$$ -684837 -682944 -681050 -679156 -677262 -678708 -680155 -681601 -683048 -683823 -684599 -685374 -686150 -687641 -689132 -690624 -692115 -692611 -693107
-1115f93107m95m96R36R35R36R36n26n25n26n26J90J90J91J90M58M59M58M59O424O423O97
$$ -693107 -693602 -694098 -693162 -692227 -691291 -690355 -690881 -691406 -691932 -692458 -692268 -692078 -691887 -691697 -691239 -690780 -690322 -689863 -683439 -677016 -676319
-1094f76319O98k793k792K934K934P1P1P0P1J1J2n86n85Q601r43o670K874J428J428K025K024
$$ -676319 -675621 -678414 -681206 -678272 -675338 -675267 -675196 -675126 -675055 -675044 -675032 -675618 -676203 -667602 -668545 -675215 -672341 -670913 -669485 -667460 -665436
-1073f65436N93N93N92N93o968o968j241j242l031l031l031l031P1P1P1P0J503J502J503J502
$$ -665436 -664843 -664250 -663658 -663065 -670033 -677001 -678242 -679484 -682515 -685546 -688577 -691608 -691537 -691466 -691395 -691325 -689822 -688320 -686817 -685315
-1053f85315k673k673k673k673J980J979J980J980o223o222m96m96K129K129K129K128K442
$$ -685315 -687988 -690661 -693334 -696007 -694027 -692048 -690068 -688088 -694311 -700533 -701029 -701525 -699396 -697267 -695138 -693010 -690568
-1036f90568K442l284l285K95K94K95K94l105l106K621K621J189J190J189J189j294j293M433
$$ -690568 -688126 -691410 -694695 -694400 -694106 -693811 -693517 -696622 -699728 -697107 -694486 -693297 -692107 -690918 -689729 -691023 -692316 -687883
-1018f87883M432J570J570J569J570o081o081l54l54L62L61L62L62J968J968l758l758N37
$$ -687883 -683451 -681881 -680311 -678742 -677172 -683253 -689334 -689688 -690042 -689680 -689319 -688957 -688595 -686627 -684659 -688417 -692175 -691638
-1000f91638N37N37N37o26o27N100N101k715k714k714k714K427K427k345k345J234J234j629
$$ -691638 -691101 -690564 -690027 -690653 -691280 -686180 -681079 -683794 -686508 -689222 -691936 -689509 -687082 -689427 -691772 -690538 -689304 -690933
-982f90933j629l92l91l92l91n70n71n70n71n22n22n22n22J447J447J446J447J148J148n532
$$ -690933 -692562 -692954 -693345 -693737 -694128 -694698 -695269 -695839 -696410 -696932 -697454 -697976 -698498 -697051 -695604 -694158 -692711 -691563 -690415 -695947
-962f95947n533l326l325L355L356J584J588j275j275L32L36L35L36L403L408l273l274J555
$$ -695947 -701480 -704806 -708131 -704776 -701420 -699836 -698248 -699523 -700798 -700466 -700130 -699795 -699459 -696056 -692648 -695921 -699195 -697640
-944f97640J558l213l214J331J335j529j528J867J872J871J872R88R92l781l780k05k01l065
$$ -697640 -696082 -699295 -702509 -701178 -699843 -701372 -702900 -701033 -699161 -697290 -695418 -694430 -693438 -697219 -700999 -701204 -701405 -704470
-926g04470l065k31k31k31k31M004M004p68p68k036k035K736K737j380j379j380j379k722
$$ -704470 -707535 -707766 -707997 -708228 -708459 -704455 -700451 -701219 -701987 -704023 -706058 -703322 -700585 -701965 -703344 -704724 -706103 -708825
-908g08825k721K050K051M377M377k304k304K766K766r7r7l198l199l199l199K498K498K498
$$ -708825 -711546 -709496 -707445 -703068 -698691 -700995 -703299 -700533 -697767 -697864 -697961 -701159 -704358 -707557 -710756 -708258 -705760 -703262
-890g03262K501k572k572k573k569P68P68L632L635R47R47j917j912M787M787J5J8m578m578
$$ -703262 -700761 -703333 -705905 -708478 -711047 -710279 -709511 -705879 -702244 -701297 -700350 -702267 -704179 -699392 -694605 -694590 -694572 -699150 -703728
-871g03728K103K106J79J79J79J82M18M18M17M21m477m478M113M112p20p19p20p19j063j062
$$ -703728 -701625 -699519 -699340 -699161 -698982 -698800 -698382 -697964 -697547 -697126 -701603 -706081 -701968 -697856 -698576 -699295 -700015 -700734 -701797 -702859
-851g02859j063j063l210l209L470L471k229k230O34O34J409J410J409J409L020L020l661
$$ -702859 -703922 -704985 -708195 -711404 -707934 -704463 -706692 -708922 -708288 -707654 -706245 -704835 -703426 -702017 -698997 -695977 -699638
-834f99638l661k289k290k289k289Q58Q57Q58Q57N00M99L363L363R92R91j871j872N525N526
$$ -699638 -703299 -705588 -707878 -710167 -712456 -711598 -710741 -709883 -709026 -708526 -708027 -704664 -701301 -700309 -699318 -701189 -703061 -697536 -692010
-815f92010P53P53m888m888L702L703l099l098J674J674k129k128K643K643q16q17L956L955
$$ -692010 -691257 -690504 -695392 -700280 -696578 -692875 -695974 -699072 -697398 -695724 -697853 -699981 -697338 -694695 -695511 -696328 -692372 -688417
-797f88417k333k334N29N30p83p83p83p83R77R77R76R77L840L840R77R77p09p08l572l571
$$ -688417 -690750 -693084 -692555 -692025 -692808 -693591 -694374 -695157 -694180 -693203 -692227 -691250 -687410 -683570 -682593 -681616 -682325 -683033 -686605 -690176
-777f90176j782j782K990K990J647J648l124l124R92R91R92R92l427l426L255L255L91L92
$$ -690176 -691958 -693740 -690750 -687760 -686113 -684465 -687589 -690713 -689721 -688730 -687738 -686746 -690173 -693599 -690344 -687089 -686698 -686306
-759f86306k472k472M21M22M21M21n93n92n365n365M481M481J618J619J439J439n242n242
$$ -686306 -688778 -691250 -690829 -690407 -689986 -689565 -690158 -690750 -696115 -701480 -696999 -692518 -690900 -689281 -687842 -686403 -691645 -696887
-741f96887R92R91R92R92L974L974m615m616l84l80l84l80r21r17r21r17m14m10m14m10j428
$$ -696887 -695895 -694904 -693912 -692920 -688946 -684972 -689587 -694203 -694587 -694967 -695351 -695731 -696652 -697569 -698490 -699407 -699821 -700231 -700645 -701055 -702483
-720g02483j424j428j424M671M672j01j01l381l382J391J391k934k935J838J838O45O45O45
$$ -702483 -703907 -705335 -706759 -702088 -697416 -697517 -697618 -700999 -704381 -702990 -701599 -704533 -707468 -705630 -703792 -703147 -702502 -701857
-702g01857O45n29n26n29n26J439J443J439J443J678J681j185j182L586L590n003m999P16
$$ -701857 -701212 -701741 -702267 -702796 -703322 -701883 -700440 -699001 -697558 -695880 -694199 -695384 -696566 -692980 -689390 -694393 -699392 -698676
-684f98676P15P16P16j670j670j671j670L057L057O994m459j536M191j297p024J088J089k133
$$ -698676 -697961 -697245 -696529 -698199 -699869 -701540 -703210 -700153 -697096 -690102 -694561 -696097 -691906 -693203 -700227 -699139 -698050 -700183
-666g00183k132q20q21q20q20N22N22N22N22k699k700K073K073L191L192n399n398K058K058
$$ -700183 -702315 -703135 -703956 -704776 -705596 -705074 -704552 -704030 -703508 -706207 -708907 -706834 -704761 -701570 -698378 -703777 -709175 -707117 -705059
-647g05059J342J342K729q724J059J2512N532n920j625j626Q69Q68L732L732r80r81r80r81
$$ -705059 -703717 -702375 -699646 -708370 -707311 -694799 -689267 -695187 -696812 -698438 -697569 -696701 -692969 -689237 -690217 -691198 -692178 -693159
-629f93159O30O30m43N283N998n454l426l427J481J480J480J480K196K196k577k576K673K673
$$ -693159 -692529 -691899 -692342 -687059 -681061 -686515 -689941 -693368 -691887 -690407 -688927 -687447 -685251 -683055 -685632 -688208 -685535 -682862
-611f82862K674K673k636k636K136K136J592J596j267j268J294J297n383n384J055J059J059
$$ -682862 -680188 -677515 -680151 -682787 -680651 -678515 -676923 -675327 -676594 -677862 -676568 -675271 -680654 -686038 -684983 -683924 -682865
-594f82865J059L620L623l057l057m828m824J857J856o52o49o49o48q6q2q2q2O30O34O33O34
$$ -682865 -681806 -678186 -674563 -677620 -680677 -685505 -690329 -688472 -686616 -687268 -687917 -688566 -689214 -689300 -689382 -689464 -689546 -688916 -688282 -687649 -687015
-573f87015j786j785j786j786J316J316J316J316R44R43R43R43l709l710M880M881l419l419
$$ -687015 -688801 -690586 -692372 -694158 -692842 -691526 -690210 -688894 -687950 -687007 -686064 -685121 -688830 -692540 -687660 -682779 -686198 -689617
-555f89617n56n55N18N18N19N18m81m81m81m81J189J190J189J189P87P87P86P91j838j838
$$ -689617 -690173 -690728 -690210 -689692 -689173 -688655 -689136 -689617 -690098 -690579 -689390 -688200 -687011 -685822 -685035 -684248 -683462 -682671 -684509 -686347
-535f86347j838j835q53q54q54q50N18N18N19N22J756J759l012l012k599k595K178K177M321
$$ -686347 -688185 -690020 -690873 -691727 -692581 -693431 -692913 -692395 -691876 -691354 -689598 -687839 -690851 -693863 -696462 -699057 -696879 -694702 -690381
-516f90381M324m47m47k837k834L0L0J662J663j200j201pqk870k871M272M273m317m317j454
$$ -690381 -686057 -686504 -686951 -689788 -692622 -692592 -692562 -690900 -689237 -690437 -691638 -691645 -691653 -694523 -697394 -693122 -688849 -693166 -697483 -698937
-496f98937j454J409J409K166K170o97o94J033J036j830j827K151K155K151K155j428j424
$$ -698937 -700391 -698982 -697573 -695407 -693237 -693934 -694628 -693595 -692559 -694389 -696216 -694065 -691910 -689759 -687604 -689032 -690456
-479f90456N253N257O90O93n037n033k949k945K777K782P19P24P19P23m73m70m73m70J845
$$ -690456 -685203 -679946 -679256 -678563 -683600 -688633 -691582 -694527 -691750 -688968 -688249 -687525 -686806 -686083 -686556 -687026 -687499 -687969 -686124
-460f86124J846l881l881J666J667J666J667k271k270N93N92k449k449L277L277L068L072
$$ -686124 -684278 -688159 -692040 -690374 -688707 -687041 -685374 -687645 -689915 -689322 -688730 -691179 -693628 -690351 -687074 -684006 -680934
-443f80934k658k655M977M981p49p46M619M623j107j103J756J759J756J760j268j267j268
$$ -680934 -683592 -686247 -681270 -676289 -677038 -677784 -673165 -668542 -669649 -670752 -668996 -667237 -665481 -663721 -664989 -666256 -667524
-426f67524j267o458o457L087L087l922l922j059j059R70R69L833L832J737J738l989l989
$$ -667524 -668791 -675249 -681706 -678619 -675532 -679454 -683376 -684435 -685494 -684524 -683555 -679722 -675890 -674153 -672415 -676404 -680393
-409f80393M84M85M85M84l780l781J947J946j991j991j991j991j551j551j551j550K505K505
$$ -680393 -679909 -679424 -678939 -678455 -682235 -686016 -684069 -682123 -684114 -686105 -688096 -690087 -691638 -693189 -694740 -696290 -693785 -691280
-391f91280K506K505j49j49j50j49q65q64q65q65p27p27p27p27J241J242j622j622J271J272
$$ -691280 -688774 -686269 -686418 -686567 -686717 -686866 -687731 -688595 -689460 -690325 -691052 -691779 -692506 -693233 -691992 -690750 -692372 -693994 -692723 -691451
-371f91451m455m456M075M075j651j652o319o320L225L225P20P19P20P19J272J271m455m455
$$ -691451 -695906 -700362 -696287 -692212 -693863 -695515 -701834 -708154 -704929 -701704 -700984 -700265 -699545 -698826 -697554 -696283 -700738 -705193
-353g05193q76q77q76q76J093J092O819O819J8J9J8J9k114k114k113k114L254L255k472k472
$$ -705193 -706069 -706946 -707822 -708698 -707605 -706513 -699694 -692875 -692857 -692838 -692820 -692801 -694915 -697029 -699142 -701256 -698002 -694747 -697219 -699691
-333f99691J339J338J339J338m328m329j465j465n11n11N216N216o30o30l494l493L124L125
$$ -699691 -698352 -697014 -695675 -694337 -698665 -702994 -704459 -705924 -706435 -706946 -701730 -696514 -697144 -697774 -701268 -704761 -701637 -698512
-315f98512k603k598N808N809Q2Q6l96l95l95l91M99N00k364k360r77r76M749M754m377m377
$$ -698512 -701115 -703713 -697905 -692096 -692014 -691928 -692324 -692719 -693114 -693505 -693006 -692506 -694870 -697230 -698207 -699183 -694434 -689680 -694057 -698434
-295f98434J349J354K557K558l169l165m482m481J245J249K24K24K23K24N82N81N82N81J790
$$ -698434 -697085 -695731 -693174 -690616 -693785 -696950 -701432 -705913 -704668 -703419 -703195 -702971 -702748 -702524 -701942 -701361 -700779 -700198 -698408
-276f98408J790J789J790J78J79k684k684m220m221J506J507j357j357J506J506L176L177
$$ -698408 -696618 -694829 -693039 -692861 -692682 -695366 -698050 -702270 -706491 -704985 -703478 -704835 -706192 -704686 -703180 -700004 -696827
-259f96827L176L177p01p01p01p01j074j070j070j070K565K569k95k94J074J077O804O804
$$ -696827 -693651 -690474 -691175 -691876 -692577 -693278 -694352 -695422 -696492 -697562 -694997 -692428 -692723 -693017 -691943 -690866 -684062 -677258
-241f77258K088K091l635l635Q13Q16Q17Q16l124l120l121l120Q42Q47Q46Q46j782j778j779
$$ -677258 -675170 -673079 -676714 -680349 -679536 -678720 -677903 -677087 -680211 -683331 -686452 -689572 -688730 -687883 -687037 -686191 -687973 -689751 -691530
-222f91530j778r54r55r54r55j789j790K386K386L192o353j342M384L88L88n936n935J730
$$ -691530 -693308 -694262 -695217 -696171 -697126 -698915 -700705 -698319 -695933 -692741 -699094 -700436 -696052 -695664 -695276 -701212 -707147 -705417
-204g05417J730J730J730K982K983l699l698m295m295M295M295Q35Q35k028k028M10M10L273
$$ -705417 -703687 -701957 -700227 -697245 -694262 -697961 -701659 -705954 -710249 -705954 -701659 -700824 -699989 -702017 -704045 -703635 -703225 -699952
-186f99952L274M168M168o04o04k61k61k61k61j275j275j275j275l06l05l06l06l05l06l06
$$ -699952 -696678 -692510 -688342 -688946 -689550 -689811 -690072 -690333 -690594 -691869 -693144 -694419 -695694 -696000 -696305 -696611 -696917 -697222 -697528 -697834
-166f97834l06P98P98P98P98j708j707L064L065k919k920n5n6j786j786j786j786J23J24M895
$$ -697834 -698140 -697342 -696544 -695746 -694948 -696656 -698363 -695299 -692234 -695153 -698073 -698128 -698184 -699970 -701756 -703542 -705328 -705205 -705081 -700186
-146g00186M895N40N41k323k322J808J808j055j055l382l381L299L300o53o52o53o52m291
$$ -700186 -695291 -694751 -694210 -696533 -698855 -697047 -695239 -696294 -697349 -700731 -704112 -700813 -697513 -698166 -698818 -699471 -700123 -704414
-128g04414m291m291m292N552N551N551N551P20P20N491N492j46j45j45j46o409o408j637
$$ -704414 -708705 -712996 -717288 -711736 -706185 -700634 -695083 -694363 -693643 -688152 -682660 -682806 -682951 -683096 -683242 -689651 -696059 -697696
-110f97696j637k874k874L806j920n201M344M701j026m28m29p87p86K971K971K972K971j715
$$ -697696 -699333 -702207 -705081 -701275 -703195 -708396 -704052 -699351 -700377 -700805 -701234 -702021 -702807 -699836 -696865 -693893 -690922 -692637
-92f92637j715j715j715k430k431k431k431p30p31p31p31K849K848K848K849j074j074j074
$$ -692637 -694352 -696067 -697782 -700212 -702643 -705074 -707505 -708235 -708966 -709697 -710428 -707579 -704731 -701883 -699034 -700108 -701182 -702256
-74g02256j073l58l58l58l58j849j849j849j850J014J015j850j849P46P45n935n935R872R872
$$ -702256 -703329 -703687 -704045 -704403 -704761 -706610 -708459 -710308 -712158 -711144 -710129 -711979 -713828 -713082 -712337 -718272 -724207 -714335 -704463
-55g04463J283J282J551J551J551J551k386k386K386K386k610k609k610k610L952L952q20
$$ -704463 -703180 -701898 -700347 -698796 -697245 -695694 -698080 -700466 -698080 -695694 -698304 -700913 -703523 -706133 -702181 -698229 -699049
-38f99049q20j865j864j864j864p90p91L982L982Q54Q53Q54Q54n18n19n18n18j100j100p542
$$ -699049 -699869 -701734 -703598 -705462 -707326 -708116 -708907 -704925 -700943 -700089 -699236 -698382 -697528 -698046 -698565 -699083 -699601 -700701 -701801 -709343
-18g09343L911j816j815j100j100m1m1m1m1m1m1m1m1j75j75j76j75J018J018J018J017J64
$$ -709343 -705432 -707248 -709063 -710163 -711263 -711304 -711345 -711386 -711427 -711468 -711509 -711550 -711591 -711766 -711941 -712117 -712292 -711274 -710256 -709238 -708221 -708057
3g08057J64J64J65q50q50q51q50K819K818j953j954J626J625j237j238O26O26O27O26j700
$$ -708057 -707893 -707729 -707564 -708414 -709264 -710115 -710965 -708146 -705328 -707281 -709235 -707609 -705984 -707221 -708459 -707833 -707207 -706580 -705954 -707654
23g07654j700j700j700J491J491J492J491k98k98k99k98k155k155L572L571n44n44K319K319
$$ -707654 -709354 -711054 -712754 -711263 -709772 -708280 -706789 -707087 -707385 -707684 -707982 -710137 -712292 -708720 -705149 -705693 -706237 -703918 -701599
42g01599j827j827j827j827q12q13q13q13L691L691k035k036R47R47m422m421M69O197J066
$$ -701599 -703426 -705253 -707080 -708907 -709719 -710532 -711345 -712158 -708467 -704776 -706811 -708847 -707900 -706953 -711375 -715796 -715327 -709130 -708064
61g08064m660k990O554O196l348n89n85m407J324j544j540M541M545k229k226R92m732K424
$$ -708064 -712724 -715714 -709160 -702964 -706312 -706901 -707486 -711893 -710569 -712113 -713653 -709112 -704567 -706796 -709022 -708030 -712762 -710338
79g10338K427K065K069j588j588j588j588k76k76o34o34P539J812o659K886M615m929j469
$$ -710338 -707911 -705846 -703777 -705365 -706953 -708541 -710129 -710405 -710681 -711315 -711949 -704410 -702598 -709257 -706371 -701756 -706685 -708154
97g08154j468p360j633Q73Q76P53P53P53P57L795L795J290J294p240j514O718k822k751K979
$$ -708154 -709622 -716982 -718615 -717742 -716866 -716113 -715360 -714607 -713850 -710055 -706260 -704970 -703676 -710916 -712430 -705712 -708534 -711285 -708306
116g08306q39q39l706l702l702l702l80l77l956J771N347l77k524k524k919k919K807K807
$$ -708306 -709145 -709984 -713690 -717392 -721094 -724796 -725176 -725553 -729509 -727738 -722391 -722768 -725292 -727816 -730735 -733654 -730847 -728040
134g28040O01O00j547p274j443M284L568L568j324j323j324j323J931J931r32r32l378l378
$$ -728040 -727439 -726839 -728386 -735660 -737103 -732819 -729251 -725683 -727007 -728330 -729654 -730977 -729046 -727115 -728047 -728979 -732357 -735735
152g35735K707K707m004J722L870L870L750j976m481m481J5J5J5J8J506J507M369M373m518
$$ -735735 -733028 -730321 -734325 -732603 -728733 -724863 -721113 -723089 -727570 -732051 -732036 -732021 -732006 -731988 -730482 -728975 -724606 -720233 -724751
171g24751m519J208J212K222K222K222K225m321m321m320m318l84l84l84l80l84l84N342N347
$$ -724751 -729270 -728062 -726850 -724628 -722406 -720184 -717959 -722280 -726601 -730921 -735239 -735623 -736007 -736391 -736771 -737155 -737539 -732197 -726850
190g26850j458j458J406J409j27j26K736K736j319j320j320j320m54m55m55m55K766K767k961
$$ -726850 -728308 -729766 -728360 -726951 -727078 -727204 -724468 -721732 -723051 -724371 -725691 -727011 -727465 -727920 -728375 -728830 -726064 -723297 -726258
209g26258k960K99K98K98K98n9o0o0n9P15P16P16P16K684K685o860o860l58l58K505K506j372
$$ -726258 -729218 -728919 -728621 -728323 -728025 -728084 -728144 -728204 -728263 -727548 -726832 -726116 -725400 -722716 -720031 -726891 -733751 -734109 -734467 -731962 -729456 -730828
231g30828j372j372j372J789J790J789J790M77M77M78M77Q20Q20q724q724j208j208j208j207
$$ -730828 -732200 -733572 -734944 -733155 -731365 -729576 -727786 -727309 -726832 -726354 -725877 -725057 -724237 -732961 -741685 -742893 -744101 -745309 -746516
250g46516J088J089J088J089L713L714L713L713M5M8M5M9o12o08l474l471n52n48N175N178
$$ -746516 -745428 -744339 -743251 -742162 -738449 -734735 -731022 -727309 -727264 -727216 -727171 -727122 -727734 -728342 -731816 -735287 -735839 -736387 -731212 -726034
270g26034o71o67K192K196m288m283J439J443R02R06m825m820K975K979K975K979j439j436
$$ -726034 -726705 -727372 -725180 -722984 -727272 -731555 -730116 -728673 -727771 -726865 -731690 -736510 -733535 -730556 -727581 -724602 -726041 -727477
288g27477j439j435R3R3R4R3R3R3R3R4J330J331J331J331l39l39l39l40J987J988J987J987
$$ -727477 -728916 -730351 -730258 -730165 -730071 -729978 -729885 -729792 -729699 -729605 -728275 -726944 -725613 -724282 -724621 -724960 -725299 -725639 -723652 -721664 -719677 -717690
310g17690O15O15O15O15l560l560J211J212J152J152J152J152m44m40m43m40j637j633j636
$$ -717690 -717075 -716460 -715845 -715230 -718790 -722350 -721139 -719927 -718775 -717623 -716471 -715319 -715763 -716203 -716646 -717086 -718723 -720356 -721992
329g21992j633J480J483J481J483j621j618L150L154R58R62n723n719P79P83P79P83m037m034
$$ -721992 -723625 -722145 -720662 -719181 -717698 -719319 -720937 -717787 -714633 -713675 -712713 -718436 -724155 -723376 -722593 -721814 -721031 -725068 -729102
348g29102P34P39K583K587k79k76K427K427m36m36L39L39L39L40n835n834K755K755L590L590
$$ -729102 -728368 -727629 -725046 -722459 -722738 -723014 -720587 -718160 -718596 -719032 -718693 -718354 -718015 -717675 -723510 -729344 -726589 -723834 -720244 -716654
368g16654P27P27m51m51m51m51J517J518J517J517q24q24q24q23q24q24q24q24N11N10N11
$$ -716654 -715927 -715200 -715651 -716102 -716553 -717004 -715487 -713969 -712452 -710935 -711759 -712583 -713407 -714230 -715054 -715878 -716702 -717526 -717015 -716505 -715994
389g15994N11j637j636j637j637K047K047K047K046L956L955k725k725K80K79k584k583j331
$$ -715994 -715483 -717120 -718756 -720393 -722030 -719983 -717936 -715889 -713843 -709887 -705932 -708657 -711382 -711102 -710823 -713407 -715990 -717321
407g17321j331J532J533J293J294J294J293j629j629j629j630J492J495J495J495j134j129
$$ -717321 -718652 -717120 -715587 -714294 -713000 -711706 -710413 -712042 -713671 -715300 -716930 -715438 -713943 -712448 -710953 -712087 -713216
424g13216j130j130R25R28R29R28j342j339m201m202L340L345j428j428M175M180M179M179
$$ -713216 -714346 -715476 -714551 -713623 -712694 -711766 -713108 -714447 -718648 -722850 -719510 -716165 -717593 -719021 -714846 -710666 -706487 -702308
442g02308l459l457l456l456N97O00O00O01Q05Q09Q05Q09K595K599k178k173l0k6k893k889
$$ -702308 -705767 -709224 -712680 -716136 -715539 -714939 -714339 -713738 -712933 -712124 -711319 -710510 -707915 -705316 -707494 -709667 -709697 -709723 -712616 -715505
462g15505k118k114K654K659K102K107K103K106m041m038m041m038K610K613K610K613k878
$$ -715505 -717623 -719737 -717083 -714424 -712322 -710215 -708112 -706006 -710047 -714085 -718126 -722164 -719554 -716941 -714331 -711718 -714596
479g14596k874k878k875N138N137N138N141q28q28q27q24p38p39p38p34J946J946o644o640
$$ -714596 -717470 -720348 -723223 -718085 -712948 -707810 -702669 -703497 -704325 -705152 -705976 -706714 -707453 -708191 -708925 -706979 -705033 -711677 -718317
498g18317J544J543J544J547L572L571l109l106K32K31K31K35J006J007J007J010l36l31l36
$$ -718317 -716773 -715230 -713686 -712139 -708567 -704996 -708105 -711211 -710979 -710748 -710517 -710282 -709276 -708269 -707262 -706252 -706588 -706919 -707255
517g07255l32J752J756m928m925M99N04M99N04L183L188j588j585L788L788r84r84k655k654
$$ -707255 -707587 -705835 -704079 -709007 -713932 -713433 -712929 -712430 -711926 -708743 -705555 -707143 -708728 -704940 -701152 -702136 -703120 -705775 -708429
536g08429k655k654k39k38k39k39k923k923J850J849o90o86o90o86l91l88l91l88J338J343
$$ -708429 -711084 -713738 -713977 -714215 -714454 -714693 -717616 -720539 -718689 -716840 -717530 -718216 -718906 -719592 -719983 -720371 -720762 -721150 -719812 -718469
556g18469J338J342R81R84R80R85n339n339L88L88N398N398l28l28r54r55r54r54J79J79J78
$$ -718469 -717131 -715789 -714808 -713824 -712844 -711859 -717198 -722537 -722149 -721761 -716363 -710965 -711293 -711621 -712575 -713530 -714484 -715438 -715259 -715080 -714902
577g14902J79L557L561O93O97m496m492J230J234k3j8k3j8J528J533J528J532j319j316j320
$$ -714902 -714723 -711166 -707605 -706912 -706215 -710711 -715203 -713973 -712739 -712762 -712780 -712803 -712821 -711293 -709760 -708232 -706700 -708019 -709335 -710655
597g10655j316J305J308J305J309n74n71n74n70j469j465j469j466J921J920r44r43K397K397
$$ -710655 -711971 -710666 -709358 -708053 -706744 -707318 -707889 -708463 -709033 -710502 -711967 -713436 -714902 -712981 -711061 -712005 -712948 -710551 -708154
616g08154l329l329k703k703J60J61K904K904M1M1j405j406j405j406J100J100j764j763l240
$$ -708154 -711483 -714812 -717515 -720218 -720058 -719897 -716993 -714089 -714048 -714007 -715412 -716818 -718223 -719629 -718529 -717429 -719193 -720956 -724196
635g24196l240K487K487r14r13r13r14m55m55m54m55j648j648j648j648J603J604J603J603
$$ -724196 -727436 -724949 -722462 -723376 -724289 -725202 -726116 -726571 -727026 -727480 -727935 -729583 -731231 -732879 -734527 -732924 -731320 -729717 -728114
654g28114n44n45n44n44n56n55n56n55n56n55n56n55J726J726J726J726o00o00o01o00K729
$$ -728114 -728658 -729203 -729747 -730291 -730847 -731402 -731958 -732513 -733069 -733624 -734180 -734735 -733009 -731283 -729557 -727831 -728431 -729031 -729632 -730232 -727503
675g27503K729j34j34J894J894l833l832L236L236L72L73n22n22n22n21J017J018J018J018
$$ -727503 -724774 -724908 -725042 -723148 -721254 -725087 -728919 -725683 -722447 -722075 -721702 -722224 -722746 -723268 -723789 -722772 -721754 -720736 -719718
694g19718l098l099k34k35K926K927k800k800K032K032q31q32N48N48k315k315q84q83q84
$$ -719718 -722816 -725915 -726149 -726384 -723458 -720531 -723331 -726131 -724099 -722067 -722898 -723730 -723182 -722634 -724949 -727264 -728148 -729031 -729915
713g29915q83M28M29M29M29L530L531L530L531m14m14m14m13P79P79P79P79Q69Q69Q68Q69
$$ -729915 -730798 -730370 -729941 -729512 -729083 -725553 -722022 -718492 -714961 -715375 -715789 -716203 -716616 -715837 -715058 -714279 -713500 -712631 -711762 -710894 -710025
734g10025q02q01q02q01k95k94k95k94j488j487j488j488P20P20P19P20m74m73m74m73r06
$$ -710025 -710827 -711628 -712430 -713231 -713526 -713820 -714115 -714409 -715897 -717384 -718872 -720360 -719640 -718920 -718201 -717481 -717955 -718428 -718902 -719375 -720281
755g20281r06r06r06K87K87K87K87j085j085j085j084J539J540J540J540j794j793j793j793
$$ -720281 -721187 -722093 -722999 -722712 -722425 -722138 -721851 -722936 -724021 -725106 -726190 -724651 -723111 -721571 -720031 -721825 -723618 -725411 -727204
774g27204J308J309J308J309m21m22m21m21mmK860K859l128l128K599K599m739m739R88R88
$$ -727204 -725896 -724587 -723279 -721970 -722391 -722813 -723234 -723655 -723659 -723663 -720803 -717944 -721072 -724200 -721601 -719002 -723741 -728480 -727492 -726504
794g26504L315L314k412k412r81r80r81r80K069K069K069K069k464k464k465k464j241j242
$$ -726504 -723189 -719875 -722287 -724699 -725680 -726660 -727641 -728621 -726552 -724483 -722414 -720345 -722809 -725273 -727738 -730202 -731443 -732685
812g32685j241j242K338K337K338K337J9J9J8J9K822K822K823K822m373m373j510j510j152
$$ -732685 -733926 -735168 -732830 -730493 -728155 -725818 -725799 -725780 -725762 -725743 -722921 -720099 -717276 -714454 -718827 -723200 -724710 -726220 -727372
831g27372j152M574M575q47q46K017K017K017K017q46q47j017j018j018j018R51R50R51R51
$$ -727372 -728524 -723950 -719375 -720222 -721068 -719051 -717034 -715017 -713000 -713846 -714693 -715710 -716728 -717746 -718764 -717813 -716863 -715912 -714961
850g14961J23J23J23J23J376J375m350m351k651k651K13K12L4L3L4L4K546K546l180l180N410
$$ -714961 -714838 -714715 -714592 -714469 -713093 -711718 -716068 -720419 -723070 -725721 -725508 -725296 -725262 -725229 -725195 -725161 -722615 -720069 -723249 -726429 -721019
871g21019N409l17l17o45o45o45o45J91J90J90J90j808j808j809j808p94p94j748L978P333
$$ -721019 -715610 -715927 -716244 -716889 -717534 -718179 -718824 -718633 -718443 -718253 -718063 -719871 -721679 -723488 -725296 -726090 -726884 -728632 -724654 -717321
891g17321k211k211k211K562K561l02l02m757m757R69R69J94J94J94J94K416K416K415K416
$$ -717321 -719532 -721743 -723954 -721392 -718831 -719133 -719435 -724192 -728949 -727980 -727011 -726817 -726623 -726429 -726235 -723819 -721403 -718988 -716572
910g16572j640j641j640j640J961J961J961J961j141j141j141j141Q28Q28Q27Q28q42q43q43
$$ -716572 -718212 -719853 -721493 -723133 -721172 -719211 -717250 -715289 -716430 -717571 -718712 -719853 -719025 -718197 -717370 -716542 -717384 -718227 -719070
929g19070q42L88L87L88L88O26O26n100n100K744K744k983k982J193J193J193J193K915K916
$$ -719070 -719912 -719524 -719137 -718749 -718361 -717735 -717109 -722209 -727309 -724565 -721821 -724804 -727786 -726593 -725400 -724207 -723014 -720099 -717183
948g17183k811k811j260j261o986o987M713M712j014j014m056m057N488N488J044J044j819
$$ -717183 -719994 -722805 -724065 -725326 -732312 -739299 -734586 -729874 -730888 -731902 -735958 -740015 -734527 -729039 -727995 -726951 -728770
965g28770j820J581J581J581J580j886j887j886j887M079M079j648j648K319K319l408l407
$$ -728770 -730590 -729009 -727428 -725847 -724267 -726153 -728040 -729926 -731813 -727734 -723655 -725303 -726951 -724632 -722313 -725721 -729128
982g29128Q27Q28L691L691m094m093J633J633o94o93o94o93J439J439J439J439R62R62m765
$$ -729128 -728301 -727473 -723782 -720091 -724185 -728278 -726645 -725012 -725706 -726399 -727093 -727786 -726347 -724908 -723469 -722030 -721068 -720106 -724871
1001g24871m764l423l422K304K304R92R91R92R92K095K095l631l631R61R62R62R62k647k647
$$ -724871 -729635 -733058 -736480 -734176 -731872 -730880 -729889 -728897 -727905 -725810 -723715 -727346 -730977 -730016 -729054 -728092 -727130 -729777 -732424
1020g32424K16K17Q72Q72O599O599l598l597l598l598k524k524L203L202l120l121K606K606
$$ -732424 -732208 -731991 -731119 -730247 -723648 -717049 -720647 -724244 -727842 -731440 -733964 -736488 -733285 -730083 -733203 -736324 -733718 -731112
$$ [...]
##$OBSERVEDINTEGRALS=	(X Y Z)
(1.3727953644098223052, 1.501115631141018536, 4.0950934301930352888)
(1.3207611892640402917, 1.3734093369779145632, 6.6394037792048523627)
(1.226209413777894941, 1.2883741362971941058, 6.2030891293800864972)
(1.2903323997650257837, 1.3184733805888375624, 19.255610141607807151)
(6.90537066165103397, 6.9703495479753962982, 0.97098568593027245743)
(6.7457921878762476808, 6.8378770701013662503, 1.9783746307196401482)
(3.7966499622575753392, 3.8416737449967151008, 2.9970928134433707513)
(2.6186671603395019758, 2.7099609051167052876, 2.0020391195123594663)
(2.5434995910496231986, 2.6186671603395019758, 2.0110137017667835124)
(1.7315076593074940625, 1.8511969619437720347, 1.9763638061586981109)
(0.88199153123691054201, 0.9607614438579306082, 3.8709337620830917004)
##$OBSERVEDMULTIPLETS=	
(1, 6.90537066165103397, 6.9703495479753962982, 6.93786010481321469, 0.97170802667411004805, 1, d, A, 7.97778)
(2, 6.7457921878762476808, 6.8378770701013662503, 6.7960415570318684075, 1.9798463935098136179, 2, m, B)
(3, 3.7966499622575753392, 3.8416737449967151008, 3.81916185362714522, 2.9993224263857474199, 3, s, C)
(4, 2.6186671603395019758, 2.7099609051167052876, 2.6588624592182337203, 2.0035284869126570584, 2, q, D, 7.61578 7.61578 7.57983)
(5, 2.5434995910496231986, 2.6186671603395019758, 2.5847199965390554866, 2.012509745585194576, 2, t, E, 7.48047 7.48047)
(6, 1.7315076593074940625, 1.8511969619437720347, 1.7915369831823220181, 1.9778340730457597552, 2, p, F, 7.422 7.422 7.52411 7.52411)
(7, 0.88199153123691054201, 0.9607614438579306082, 0.9215275626944191556, 3.873813447348863459, 4, t, G, 6.74567 6.74567)
(8, 1.3727953644098223052, 1.501115631141018536, 1.4412459314454750814, 4.098139873490101337, 4, m, H)
(9, 1.3207611892640402917, 1.3734093369779145632, 1.3366292446149434792, 6.6443429991480522645, 7, d, I, 10.4719)
(10, 1.226209413777894941, 1.2883741362971941058, 1.2669410227575046424, 6.2077037638497118976, 6, t, J, 7.5535 7.5535)
(11, 1.2903323997650257837, 1.3184733805888375624, 1.3023522905163467112, 19.269934875694289644, 19, s, K)
##$OBSERVEDMULTIPLETSPEAKS=	
(1, 6.9478376566058264174, 0.037429039620031523405)
(1, 6.9379964725420917304, 0.00068446786135543718956)
(1, 6.9278825530206038508, 0.04785049481020803297)
(2, 6.8153651787317963695, 0.024461608841286678478)
(2, 6.8105035413028636171, 0.036391561632030069995)
(2, 6.7930886050674361698, 0.022845933148231908211)
(2, 6.7882291162626193781, 0.015253474109884965215)
(2, 6.773021343794630944, 0.017050964960925639458)
(2, 6.7683040792458175616, 0.013079686070972587272)
(3, 3.81916185362714522, 0.20198509086626684206)
(4, 2.6874490137471354068, 0.013598257153914656073)
(4, 2.6683093627180882734, 0.041011888700436857635)
(4, 2.6493255842632010832, 0.041868348054925924595)
(4, 2.6303658761445087855, 0.014093305893594205991)
(5, 2.6034337523252006896, 0.030064765007704101485)
(5, 2.5847147548727735789, 0.055286217263090145502)
$$ [...]
5.4247910860047312553, 1.3957017190564747618e-05
5.5423200382162827182, 3.4394268192122050829e-05
6.5671440016839293108, 7.8245191956979859684e-05
6.5720098267898956479, 7.7842191247005405744e-05
6.587209866136428893, 8.924769388876124972e-05
6.5920640091041402542, 9.748742927956082925e-05
6.6137684745472196113, 0.00015132864091683276091
6.6185623715641721532, 0.00017873453721429800314
6.6915329362894064857, 6.710671271149948173e-05
6.696692563919997454, 6.6214281197718579623e-05
6.7095165882301159854, 8.4485834579063587876e-05
6.7140220121355067562, 0.00036592814218404617725
6.7230274022410467794, 0.00013350685684120441226
6.7338607103783783003, 1.4494431830725656657e-05
6.7429784132001238106, 0.00031237828895179650061
6.7554110105754787696, 5.9230799767352272699e-05
6.7683040792458175616, 0.013079686070972587272
6.773021343794630944, 0.017050964960925639458
6.7882291162626193781, 0.015253474109884965215
6.7930886050674361698, 0.022845933148231908211
6.8105035413028636171, 0.036391561632030069995
6.8153651787317963695, 0.024461608841286678478
6.8325818451383479868, 0.0001720870298135044967
6.8368557125890783155, 5.9821709091145517116e-05
6.8491885405392638475, 9.5171016617344396295e-05
6.8539670699100447848, 0.00016004659918266824956
6.878234663332766452, 0.00017381316103763831357
6.8843868341366531993, 0.00020578380166650812465
6.8899973827095370993, 0.00019715177060892783508
6.8991509051191739488, 0.00024756915641942201217
6.9055609276377047934, 0.00010666844145697464326
6.9185014151610895183, 0.00038293497193272519642
6.9278825530206038508, 0.04785049481020803297
6.9379964725420917304, 0.00068446786135543718956
6.9478376566058264174, 0.037429039620031523405
6.9578376431623505383, 0.00038621089322193950496
6.9655572955397184742, 7.1216426388088388023e-05
6.969013622930715357, 0.00024573988629711287623
6.9740243717132717194, 0.00010638216131582185124
6.9853663121145723736, 5.6863686203304201637e-05
6.9890242680925034335, 6.7562843017898965544e-05
6.9947736535953533021, 9.5466595340156361099e-05
7.0032065771908902363, 0.00019556653282782639333
7.0081587672043781367, 0.00023732695543365260171
7.0136355278661071111, 6.6128673168750723801e-05
7.0228621349241375782, 3.9308318487947552938e-05
7.02895063082222471, 7.0488329149401778668e-05
7.0344996671089514706, 6.7565288765011191695e-05
7.0405075324508494816, 3.189476130396280614e-05
7.0602427837882135719, 2.7947240582921940193e-05
7.0780469337406923813, 0.00012643056123789317619
7.0979971776510044634, 9.1491138256182214178e-05
7.1060670306597142343, 2.5301924215852046764e-05
7.1258802693340070888, 0.00022291135696747533482
7.1458451154202000666, 0.00019748032773707078547
7.1531402255788085753, 1.5644042755961566876e-05
7.1729339291059321937, 1.3638383453833210801e-05
7.1986755612851061059, 1.3842507318029274833e-05
7.2600386306198805286, 0.0029685990989210897864
7.5195490590623261795, 1.544270185894489335e-05
8.133382827524425096, 3.911155269443304536e-05
##END=	
##END=	
