##TITLE=	tsh21

##JCAMP-DX=	6.0	$$ MestReNova 14.1.0-24037
##DATA TYPE=	LINK
##BLOCK_ID=	1
##BLOCKS=	2    
##ORIGIN=	Mestrelab Research S.L.
##OWNER=	tsh21
##$MNOVA/LINK_BLOCK_TYPE=	ITEM	$$ NMR Spectrum
##$MNOVA/ITEM/POLYGON=	(XY..XY)
5321,5835
8722,5835
8722,8208
5321,8208
5321,5835
##$MNOVA/ITEM/Z=	0
##$MNOVA/ITEM/ANGLE=	0
##TITLE=	tsh21
##JCAMP-DX=	6.0	$$ MestReNova 14.1.0-24037
##BLOCK_ID=	2
##DATA TYPE=	NMR SPECTRUM
##DATA CLASS=	XYDATA
##NUMDIM=	1
##ORIGIN=	JEOL
##OWNER=	tsh21
##.OBSERVE FREQUENCY=	399.79071365325000897
##.OBSERVE NUCLEUS=	^1H
##.SOLVENT NAME=	CHLOROFORM-D
##.PULSE SEQUENCE=	proton.jxp
##LONGDATE=	2022/02/23 20:01:43.000
##.ACQUISITIONMODE=	SIMULTANEOUS
##$ORIGINAL FORMAT=	JEOL Delta
##$MNOVA/SCALES_VERSION=	8
##$PARAMETER FILE=	(datafile, ASCII, //icnas1.cc.ic.ac.uk/tsh21/Desktop/tsh21_PROTON_FT-1-1.jdf, 0)
$$ 
##$PARAMETER FILE=	(footer, BASE64, //icnas1.cc.ic.ac.uk/tsh21/Desktop/tsh21_PROTON_FT-1-1.jdf, 540672)
AQAAANodAABoZWFkZXIKICAgIGZpbGVuYW1lICAgICAgICA9PiAidHNoMjFfUFJPVE9OIjsKICAgIHNh
bXBsZV9pZCAgICAgICA9PiAidHNoMjEiOwogICAgY29tbWVudCAgICAgICAgID0+ICIiOwogICAgcHJv
Y2VzcyAgICAgICAgID0+ICJwcm90b25fYXV0b3BoYXNlLmxpc3QiOwogICAgYXV0b19kd2VsbCAgICAg
ID0gIFRSVUU7CiAgICBhdXRvX2ZpbHRlciAgICAgPSAgVFJVRTsKICAgIGF1dG9fZ2FpbiAgICAgICA9
PiBUUlVFOwogICAgZmlsdGVyX2xpbWl0ICAgID0+IDE2OwogICAgZm9yY2VfZHVhbF9tb2RlID0+IEZB
TFNFOwogICAgZGVjaW1hdGlvbl9yYXRlID0gIDA7CiAgICBmb3JjZV90dW5lICAgICAgPT4gRkFMU0U7
CiAgICBzYXZlX2Fib3J0ZWQgICAgPSAgVFJVRTsKICAgIHZlY3RvciAgICAgICAgICA9ICBUUlVFOwpl
bmQgaGVhZGVyOwoKaW5zdHJ1bWVudAogICAgcmVjdnJfZ2FpbiA9PiA0NjsKZW5kIGluc3RydW1lbnQ7
CgphY3F1aXNpdGlvbgogICAgeF9kb21haW4gICAgID0+ICJQcm90b24iOwogICAgeF9vZmZzZXQgICAg
ID0+IDVbcHBtXTsKICAgIHhfc3dlZXAgICAgICA9PiAxNVtwcG1dOwogICAgeF9wb2ludHMgICAgID0+
IDMyNzY4OwogICAgc2NhbnMgICAgICAgID0+IDg7CiAgICB4X3ByZXNjYW5zICAgPT4gMDsKICAgIG1v
ZF9yZXR1cm4gICA9PiAxOwogICAgeF9hY3FfdGltZSAgID0/IHhfcG9pbnRzIC8geF9zd2VlcDsKICAg
IHhfcmVzb2x1dGlvbiA9PyAxIC8geF9hY3FfdGltZTsKZW5kIGFjcXVpc2l0aW9uOwoKcHVsc2UKICAg
IGNvbGxlY3QgQ09NUExFWCxPQlM7CgogICAgbWFjcm8gb2JzX3ByZXNhdF90aW1lKCBkYW50ZV9wcmVz
YXQsIGRhbnRlX2xvb3AsIGRhbnRlX3B1bHNlLCBkYW50ZV9pbnRlcnZhbCwgcGhhc2VfZGFudGUsIHBo
c19zaGZ0LCBkYW50ZV9hdHRlbnVhdG9yLCBwcmVzYXRfdGltZSApIGlzCiAgICAgICAgd2hlbiBkYW50
ZV9wcmVzYXQgZG8KICAgICAgICAgICAgbG9vcCAxMDAgKiBkYW50ZV9sb29wIHRpbWVzCiAgICAgICAg
ICAgICAgICBkYW50ZV9wdWxzZSwgKE9CUy5HQVRFLCBPQlMuUEhTLnBoYXNlX2RhbnRlLmxzdGVwKHBo
c19zaGZ0KSwgT0JTLkFUTi5kYW50ZV9hdHRlbnVhdG9yKTsKICAgICAgICAgICAgICAgIGRhbnRlX2lu
dGVydmFsOwogICAgICAgICAgICBlbmQgbG9vcDsKICAgICAgICBlbmQgd2hlbjsKICAgICAgICB3aGVu
IG5vdCBkYW50ZV9wcmVzYXQgZG8KICAgICAgICAgICAgcHJlc2F0X3RpbWU7CiAgICAgICAgZW5kIHdo
ZW47CiAgICBlbmQgb2JzX3ByZXNhdF90aW1lOwoKICAgIG1hY3JvIGFjcSggZGVhZF90aW1lLCBkZWxh
eSwgcGhhc2UgKSBpcwogICAgICAgIGRlYWRfdGltZSwgT0JTLlBIUy4wOwogICAgICAgIGRlbGF5LCAo
T0JTLlBIUy4wLCBSQ1YuR0FURSk7CiAgICAgICAgYWNxdWlyZSAoT0JTLlBIUy4wLCBSQ1YuUEhTLnBo
YXNlKTsKICAgIGVuZCBhY3E7CgogICAgZXhwZXJpbWVudCAgICAgICAgICAgID0gICJwcm90b24uanhw
$$ [...]
AAAAAAAAAAAAAAAAAAAAAAAAAAAAAAAAAAAAAAAAAAAAAAAAAAAAAAAAAAAAAAAAAAAAAAAAAAAAAAAA
AAAAAAAAAAAAAAAAAAAAAAAAAAAAAAAAAAAAAAAAAAAAAAAAAAAAAAAAAAAAAAAAAAAAAAAAAAAAAAAA
AAAAAAAAAAAAAAAAAAAAAAAAAAAAAAAAAAAAAAAAAAAAAAAAAAAAAAAAAAAAAAAAAAAAAAAAAAAAAAAA
AAAAAAAAAAAAAAAAAAAAAAAAAAAAAAAAAAAAAAAAAAAAAAAAAAAAAAAAAAAAAAAAAAAAAAAAAAAAAAAA
AAAAAAAAAAAAAAAAAAAAAAAAAAAAAAAAAAAAAAAAAAAAAAAAAAAAAAAAAAAAAAAAAAAAAAAAAAAAAAAA
AAAAAAAAAAAAAAAAAAAAAAAAAAAAAAAAAAAAAAAAAAAAAAAAAAAAAAAAAAAAAAAAAAAAAAAAAAAAAAAA
AAAAAAAAAAAAAAAAAAAAAAAAAAAAAAAAAAAAAAAAAAAAAAAAAAAAAAAAAAAAAAAAAAAAAAAAAAAAAAAA
AAAAAAAAAAAAAAAAAAAAAAAAAAAAAAAAAAAAAAAAAAAAAAAAAAAAAAAAAAAAAAAAAAAAAAAAAAAAAAAA
AAAAAAAAAAAAAAAAAAAAAAAAAAAAAAAAAAAAAAAAAAAAAAAAAAAAAAAAAAAAAAAAAAAAAAAAAAAAAAAA
AAAAAAAAAAAAAAAAAAAAAAAAAAAAAAAAAAAAAAAAAAAAAAAAAAAAAAAAAAAAAAAAAAAAAAAAAAAAAAAA
AAAAAAAAAAAAAAAAAAAAAAAAAAAAAAAAAAAAAAAAAAAAAAAAAAAAAAAAAAAAAAAAAAAAAAAAAAAAAAAA
AAAAAAAAAAAAAAAAAAAAAAAAAAAAAAAAAAAAAAAAAAAAAAAAAAAAAAAAAAAAAAAAAAAAAAAAAAAAAAAA
AAAAAAAAAAAAAAAAAAAAAAAAAAAAAAAAAAAAAAAAAAAAAAAAAAAAAAAAAAAAAAAAAAAAAAAAAAAAAAAA
AAAAAAAAAAAAAAAAAAAAAAAAAAAAAAAAAAAAAAAAAAAAAAAAAAAAAAAAAAAAAAAAAAAAAAAAAAAAAAAA
AAAAAAAAAAAAAAAAAAAAAAAAAAAAAAAAAAAAAAAAAAAAAAAAAAAAAAAAAAAAAAAAAAAAAAAAAAAAAAAA
AAAAAAAAAAAAAAAAAAAAAAAAAAAAAAAAAAAAAAAAAAAAAAAAAAAAAAAAAAAAAAAAAAAAAAAAAAAAAAAA
AAAAAAAAAAAAAAAAAAAAAAAAAAAAAAAAAAAAAAAAAAAAAAAAAAAAAAAAAAAAAAAAAAAAAAAAAAAAAAAA
AAAAAAAAAAAAAAAAAAAAAAAAAAAAAAAAAAAAAAAAAAAAAAAAAAAAAAAAAAAAAAAAAAAAAAAAAAAAAAAA
AAAAAAAAAAAAAAAAAAAAAAAAAAAAAAAAAAAAAAAAAAAAAAAAAAAAAAAAAAAAAAAAAAAAAAAAAAAAAAAA
AAAAAAAAAAAAAAAAAAAAAAAAAAAAAAAAAAAAAAAAAAAAAAAAAAAAAAAAAAAAAAAAAAAAAAAAAAAAAAAA
AAAAAAAAAAAAAAAAAAAAAAAAAAAAAAAAAAAAAAAAAAAAAAAAAAAAAAAAAAAAAAAAAAAAAAAAAAAAAAAA
AAAAAAAAAAAAAAAAAAAAAAAAAAAAAAAAAAAAAAAAAAAAAAAAAAAAAAAAAAAAAAAAAAAAAAAAAAAAAAAA
AAAAAAAAAAAAAAAAAAAAAAAAAAAAAAAAAAAAAAAAAAAAAAAAAAAAAAAAAAAAAAAAAAAAAAAAAAAAAAAA
AAAAAAAAAAAAAAAAAAAAAAAAAAAAAAAAAAAAAAAAAAAAAAAAAAAAAAAAAAAAAAAAAAAAAAAAAAAAAAAA
AAAAAAAAAAAAAAAAAAAAAAAAAAAAAAAAAAAAAAAAAAAAAAAAAAAAAAAAAAAAAAAAAAAAAAAAAAAAAAAA
AAAAAAAAAAAAAAAAAAAAAAAAAAAAAAAAAAAAAAAAAAAAAAAAAAAAAAAAAAAAAAAAAAAAAAAAAAAAAAAA
AAAAAAAAAAAAAAAAAAAAAAAAAAAAAAAAAAAAAAAAAAAAAAAAAAAAAAAAAAAAAAAAAAAAAAAAAAAAAAAA
AAAAAAAAAAAAAAAAAAAAAAAAAAAAAAAAAAAAAAAAAAAAAAAAAAAAAAAAAAAAAAAAAAAAAAAAAAAAAAAA
AAAAAAAAAAAAAAAAAAAAAAAAAAAAAAAAAAAAAAAAAAAAAAAAAAAAAAAAAAAAAAAAAAAAAAAAAAAAAAAA
AAAAAAAAAAAAAAAAAAAAAAAAAAAAAAAAAAAAAAAAAAAAAAAAAAAAAAAAAAAAAAAAAAAAAAAAAAAAAAAA
AAAAAAAAAAAAAAAAAAAAAAAAAAAAAAAAAAAAAAAAAAAAAAAAAAAAAAAAAAAAAAAAAAAAAAAAAAAAAAAA
AAAAAAAAAAAAAAAAAAAAAAAAAAAAAAAAAAAAAAAAAAAAAAAAAAAAAAAAAAAAAAAAAAAAAAAAAAAAAAAA
AAAAAA==
##XUNITS=	HZ
##YUNITS=	ARBITRARY UNITS
##FIRSTX=	4996.3953975176882523
##LASTX=	-998.48826098519202787
##DELTAX=	-0.22869887683603098982
##XFACTOR=	1
##YFACTOR=	8.7643986797553745294e-08
##FIRSTY=	-0.00057283579371869564056
##MINY=	-0.00063910864992067217827
##MAXY=	1.6539348363876342773
##NPOINTS=	26214
##XYDATA=	(X++(Y..Y))
$$ [...]
4336 -6766 -6764 -6653 -6543 -6592 -6641 -6668 -6695 -6824 -6593 -6564 -6535 -6571 -6608 -6644 -6681 -6633 -6585 -6645 -6705 -6758 -6811 -6757 -6702 -6744 -6787 -6721 -6656 -6644 -6632 -6621 -6609 -6605 -6601 -6596
4328 -6596 -6592 -6648 -6705 -6653 -6602 -6610 -6618 -6626 -6634 -6739 -6844 -6697 -6550 -6644 -6739 -6654 -6568 -6575 -6582 -6589 -6596 -6585 -6574 -6671 -6768 -6691 -6615 -6647 -6678 -6700 -6721 -6635 -6548 -6532 -6515 -6606 -6697
4319 -6697 -6703 -6709 -6715 -6721 -6672 -6624 -6684 -6744 -6729 -6715 -6700 -6686 -6739 -6792 -6737 -6682 -6664 -6647 -6630 -6613 -6562 -6511 -6568 -6625 -6697 -6769 -6662 -6554 -6534 -6514 -6674 -6834 -6780 -6726
4312 -6726 -6699 -6672 -6520 -6799 -6727 -6655 -6634 -6613 -6592 -6571 -6563 -6555 -6548 -6540 -6609 -6677 -6638 -6599 -6526 -6452 -6487 -6522 -6591 -6660 -6593 -6527 -6753 -6547 -6341 -6568 -6538 -6509 -6506 -6504
4304 -6504 -6575 -6647 -6539 -6431 -6465 -6499 -6533 -6567 -6563 -6558 -6554 -6550 -6561 -6572 -6583 -6594 -6544 -6494 -6552 -6611 -6609 -6608 -6606 -6605 -6610 -6615 -6621 -6626 -6596 -6565 -6535 -6504 -6499 -6493 -6730 -6536 -6519 -6502 -6566
4295 -6566 -6630 -6633 -6637 -6640 -6643 -6643 -6643 -6643 -6643 -6622 -6602 -6582 -6561 -6514 -6466 -6527 -6587 -6513 -6438 -6544 -6650 -6647 -6645 -6642 -6639 -6587 -6535 -6605 -6674 -6528 -6597 -6423 -6466 -6531 -6596 -6566 -6537 -6551
4286 -6551 -6565 -6458 -6567 -6649 -6731 -6646 -6562 -6528 -6495 -6461 -6428 -6496 -6563 -6510 -6672 -6641 -6609 -6591 -6573 -6676 -6780 -6689 -6599 -6755 -6695 -6769 -6628 -6638 -6647 -6630 -6612
4279 -6612 -6778 -6727 -6691 -6654 -6691 -6729 -6658 -6587 -6641 -6695 -6641 -6586 -6600 -6613 -6748 -6667 -6704 -6742 -6753 -6763 -6821 -6663 -6627 -6590 -6707 -6823 -6881 -6723 -6720 -6718 -6580 -6658
4272 -6658 -6662 -6667 -6698 -6730 -6671 -6828 -6554 -6639 -6559 -6479 -6601 -6724 -6651 -6577 -6599 -6620 -6749 -6662 -6697 -6732 -6632 -6531 -6611 -6691 -6683 -6675 -6680 -6686 -6540 -6611 -6682 -6537 -6574
4264 -6574 -6611 -6635 -6659 -6655 -6652 -6649 -6645 -6632 -6619 -6605 -6592 -6617 -6642 -6666 -6691 -6717 -6743 -6661 -6579 -6630 -6681 -6623 -6566 -6650 -6734 -6566 -6398 -6495 -6593 -6582 -6571 -6529 -6486 -6552 -6617
4256 -6617 -6615 -6613 -6611 -6609 -6619 -6628 -6637 -6646 -6554 -6462 -6550 -6638 -6619 -6600 -6581 -6562 -6538 -6514 -6599 -6683 -6641 -6599 -6556 -6514 -6524 -6533 -6543 -6552 -6570 -6587 -6604 -6622 -6666 -6711 -6647 -6583 -6655 -6726 -6689
4247 -6689 -6653 -6650 -6647 -6536 -6425 -6487 -6549 -6611 -6672 -6615 -6558 -6608 -6659 -6727 -6796 -6756 -6717 -6646 -6575 -6504 -6433 -6516 -6600 -6683 -6766 -6768 -6770 -6665 -6559 -6641 -6723 -6697 -6671 -6672 -6673
4239 -6673 -6674 -6676 -6697 -6719 -6740 -6762 -6642 -6522 -6510 -6497 -6536 -6574 -6613 -6651 -6652 -6652 -6652 -6652 -6636 -6619 -6602 -6585 -6597 -6609 -6397 -6544 -6863 -6823 -6886 -6589 -6609 -6629 -6627 -6624 -6603
4231 -6603 -6581 -6559 -6537 -6495 -6453 -6591 -6730 -6701 -6673 -6644 -6616 -6632 -6649 -6665 -6682 -6636 -6591 -6654 -6717 -6692 -6667 -6641 -6616 -6612 -6608 -6604 -6600 -6595 -6591 -6587 -6583 -6612 -6642 -6672 -6701 -6697 -6693 -6689 -6685
4222 -6685 -6576 -6468 -6539 -6610 -6668 -6726 -6676 -6625 -6628 -6630 -6632 -6635 -6630 -6626 -6621 -6617 -6621 -6625 -6629 -6633 -6697 -6762 -6719 -6676 -6666 -6656 -6647 -6637 -6689 -6740 -6683 -6626 -6585 -6543 -6610 -6676 -6607 -6539 -6578 -6618
4213 -6618 -6698 -6778 -6750 -6723 -6681 -6640 -6599 -6557 -6577 -6596 -6616 -6635 -6621 -6607 -6592 -6578 -6636 -6693 -6643 -6593 -6610 -6627 -6644 -6661 -6630 -6599 -6677 -6754 -6624 -6495 -6545 -6595 -6607
4206 -6607 -6619 -6632 -6644 -6640 -6637 -6633 -6630 -6648 -6665 -6683 -6701 -6674 -6647 -6619 -6592 -6621 -6649 -6678 -6706 -6667 -6628 -6778 -6568 -6699 -6614 -6507 -6615 -6676 -6737 -6704 -6670 -6661 -6652 -6643 -6634 -6670
4198 -6670 -6705 -6741 -6777 -6715 -6653 -6699 -6745 -6757 -6769 -6782 -6794 -6781 -6768 -6755 -6742 -6649 -6555 -6641 -6727 -6791 -6855 -6812 -6768 -6735 -6703 -6778 -6854 -6823 -6793 -6762 -6732 -6676 -6621 -6673
4190 -6673 -6726 -6847 -6968 -6836 -6705 -6725 -6744 -6547 -6711 -6753 -6579 -6779 -6762 -6672 -6581 -6788 -6634 -6601 -6568 -6621 -6674 -6666 -6658 -6650 -6642 -6660 -6677 -6587 -6496 -6504 -6513 -6521 -6530
4182 -6530 -6622 -6714 -6698 -6682 -6689 -6696 -6703 -6709 -6659 -6608 -6666 -6723 -6693 -6663 -6632 -6602 -6602 -6602 -6602 -6603 -6648 -6693 -6738 -6783 -6727 -6671 -6615 -6559 -6644 -6730 -6707 -6685 -6696 -6707 -6718 -6728 -6732 -6737 -6741 -6745
4173 -6745 -6716 -6687 -6657 -6628 -6626 -6624 -6644 -6665 -6477 -6648 -6617 -6587 -6612 -6638 -6663 -6688 -6612 -6535 -6567 -6598 -6596 -6594 -6592 -6589 -6591 -6593 -6595 -6596 -6659 -6721 -6676 -6630 -6598 -6566 -6534 -6502 -6526 -6550
4164 -6550 -6574 -6598 -6612 -6625 -6639 -6652 -6639 -6625 -6612 -6598 -6633 -6667 -6702 -6736 -6707 -6679 -6650 -6622 -6641 -6661 -6681 -6701 -6675 -6650 -6625 -6600 -6608 -6617 -6626 -6635 -6621 -6607 -6702 -6796 -6819 -6843
4156 -6843 -6758 -6674 -6596 -6518 -6548 -6578 -6571 -6565 -6558 -6551 -6605 -6659 -6605 -6551 -6618 -6686 -6645 -6604 -6618 -6631 -6645 -6658 -6650 -6643 -6635 -6627 -6681 -6734 -6679 -6624 -6689 -6755 -6820 -6886 -6852 -6819 -6785 -6751
4147 -6751 -6661 -6571 -6589 -6607 -6695 -6782 -6748 -6714 -6740 -6550 -6576 -6601 -6670 -6522 -6604 -6686 -6661 -6636 -6610 -6585 -6600 -6615 -6631 -6646 -6582 -6519 -6563 -6607 -6598 -6588 -6471 -6569 -6510
4140 -6510 -6668 -6609 -6550 -6572 -6595 -6617 -6639 -6558 -6477 -6505 -6532 -6474 -6416 -6479 -6326 -6504 -6683 -6546 -6625 -6628 -6630 -6660 -6690 -6516 -6559 -6723 -6671 -6565 -6675 -6637 -6598
4133 -6598 -6767 -6720 -6673 -6625 -6747 -6652 -6679 -6706 -6673 -6639 -6484 -6544 -6603 -6661 -6625 -6805 -6638 -6687 -6614 -6757 -6759 -6760 -6775 -6790 -6741 -6691 -6642 -6593 -6649 -6706 -6654 -6603
4126 -6603 -6590 -6577 -6685 -6577 -6618 -6659 -6700 -6741 -6565 -6605 -6632 -6659 -6699 -6740 -6672 -6604 -6638 -6671 -6705 -6738 -6718 -6697 -6798 -6683 -6730 -6776 -6823 -6653 -6653 -6652 -6759 -6650
4118 -6650 -6647 -6644 -6627 -6610 -6594 -6577 -6560 -6543 -6549 -6555 -6561 -6566 -6572 -6578 -6584 -6589 -6585 -6581 -6599 -6617 -6487 -6716 -6635 -6555 -6636 -6717 -6690 -6663 -6609 -6555 -6502 -6448 -6502 -6557 -6611 -6665 -6639 -6612 -6586
4109 -6586 -6559 -6558 -6557 -6555 -6554 -6564 -6574 -6584 -6594 -6548 -6502 -6650 -6797 -6666 -6750 -6916 -6721 -6787 -6852 -6787 -6722 -6778 -6834 -6783 -6731 -6693 -6656 -6618 -6580 -6598 -6617 -6635 -6654 -6625
4101 -6625 -6597 -6569 -6541 -6539 -6538 -6537 -6535 -6518 -6501 -6484 -6466 -6519 -6571 -6624 -6676 -6678 -6681 -6791 -6902 -6758 -6614 -6650 -6686 -6639 -6592 -6652 -6713 -6724 -6735 -6746 -6758 -6749 -6741 -6732 -6724 -6688 -6653
4093 -6653 -6617 -6582 -6634 -6686 -6738 -6791 -6773 -6756 -6738 -6721 -6750 -6780 -6702 -6623 -6669 -6714 -6760 -6805 -6774 -6742 -6710 -6678 -6680 -6682 -6562 -6658 -6732 -6805 -6784 -6763 -6719 -6675 -6753 -6615
4085 -6615 -6675 -6735 -6674 -6612 -6679 -6746 -6705 -6663 -6617 -6570 -6631 -6692 -6693 -6693 -6572 -6667 -6734 -6801 -6773 -6745 -6677 -6608 -6770 -6715 -6687 -6658 -6616 -6575 -6566 -6558 -6658 -6758 -6653 -6547
4077 -6547 -6549 -6551 -6538 -6525 -6511 -6498 -6550 -6601 -6653 -6489 -6606 -6507 -6719 -6570 -6579 -6588 -6575 -6561 -6547 -6534 -6520 -6506 -6537 -6567 -6597 -6628 -6653 -6679 -6489 -6659 -6766 -6657
4070 -6657 -6693 -6728 -6712 -6695 -6692 -6689 -6529 -6584 -6613 -6642 -6682 -6505 -6451 -6396 -6435 -6475 -6514 -6553 -6547 -6542 -6536 -6530 -6553 -6575 -6598 -6620 -6526 -6431 -6444 -6458 -6576 -6695 -6656 -6617 -6488
4062 -6488 -6719 -6626 -6533 -6721 -6694 -6609 -6523 -6538 -6554 -6461 -6585 -6451 -6532 -6493 -6669 -6624 -6580 -6563 -6546 -6415 -6501 -6523 -6762 -6663 -6564 -6466 -6367 -6197 -5811 -5213
4055 -5213 -4832 -5200 -5064 -5022 -5917 -6157 -6398 -6445 -6493 -6488 -6484 -6479 -6475 -6518 -6561 -6496 -6431 -6540 -6648 -6577 -6505 -6621 -6737 -6803 -6509 -6575 -6641 -6591 -6540 -6504 -6684
4048 -6684 -6621 -6558 -6684 -6594 -6625 -6657 -6618 -6578 -6647 -6499 -6604 -6493 -6597 -6702 -6650 -6598 -6667 -6736 -6529 -6537 -6618 -6699 -6586 -6689 -6549 -6625 -6570 -6516 -6606 -6695
4041 -6695 -6505 -6676 -6644 -6611 -6615 -6619 -6501 -6600 -6644 -6688 -6773 -6642 -6585 -6744 -6646 -6765 -6730 -6696 -6661 -6627 -6698 -6553 -6638 -6722 -6670 -6617 -6767 -6557 -6576 -6596 -6593
4034 -6593 -6589 -6644 -6699 -6646 -6592 -6600 -6607 -6583 -6559 -6861 -6658 -6740 -6821 -6771 -6722 -6673 -6623 -6633 -6643 -6667 -6691 -6505 -6535 -6539 -6542 -6662 -6566 -6591 -6616 -6541 -6465 -6569 -6673 -6589
4026 -6589 -6505 -6515 -6526 -6689 -6637 -6598 -6559 -6623 -6687 -6643 -6599 -6618 -6637 -6683 -6513 -6558 -6820 -6766 -6713 -6747 -6781 -6708 -6634 -6646 -6657 -6669 -6681 -6641 -6601 -6547 -6494 -6645
4019 -6645 -6579 -6635 -6692 -6624 -6556 -6475 -6610 -6590 -6570 -6549 -6529 -6635 -6524 -6536 -6763 -6635 -6723 -6582 -6656 -6670 -6684 -6590 -6712 -6682 -6651 -6621 -6591 -6710 -6612 -6636
4012 -6636 -6660 -6666 -6672 -6880 -6729 -6741 -6754 -6730 -6707 -6782 -6640 -6728 -6816 -6724 -6632 -6648 -6664 -6666 -6668 -6670 -6672 -6708 -6743 -6685 -6626 -6562 -6714 -6637 -6560 -6552 -6545 -6645 -6746 -6719 -6692
4004 -6692 -6773 -6639 -6754 -6653 -6660 -6667 -6680 -6693 -6719 -6746 -6552 -6574 -6570 -6565 -6675 -6568 -6570 -6788 -6736 -6684 -6645 -6606 -6617 -6628 -6760 -6677 -6687 -6698 -6696 -6693 -6678 -6662 -6647 -6631
3997 -6631 -6690 -6749 -6627 -6506 -6529 -6552 -6575 -6597 -6595 -6593 -6470 -6562 -6537 -6512 -6500 -6488 -6582 -6676 -6662 -6647 -6645 -6642 -6841 -6681 -6649 -6617 -6764 -6552 -6555 -6557 -6537 -6517 -6553 -6589
3989 -6589 -6625 -6661 -6735 -6810 -6776 -6742 -6706 -6670 -6634 -6598 -6641 -6684 -6726 -6769 -6748 -6728 -6707 -6687 -6696 -6705 -6715 -6724 -6747 -6770 -6658 -6762 -6857 -6737 -6739 -6740 -6894 -6833 -6784 -6736 -6644
3981 -6644 -6551 -6638 -6726 -6721 -6716 -6725 -6733 -6704 -6890 -6654 -6633 -6644 -6655 -6801 -6731 -6674 -6617 -6654 -6692 -6675 -6659 -6642 -6625 -6555 -6485 -6522 -6560 -6506 -6451 -6504 -6558 -6696 -6835 -6721
3973 -6721 -6607 -6537 -6466 -6503 -6540 -6576 -6612 -6648 -6684 -6688 -6693 -6711 -6729 -6582 -6650 -6692 -6733 -6748 -6547 -6696 -6630 -6650 -6670 -6663 -6656 -6671 -6471 -6500 -6529 -6576 -6624 -6658 -6692 -6780
3965 -6780 -6652 -6632 -6612 -6830 -6832 -6654 -6692 -6635 -6578 -6657 -6735 -6614 -6709 -6695 -6682 -6529 -6592 -6701 -6809 -6878 -6731 -6719 -6707 -6591 -6692 -6671 -6650 -6702 -6754 -6711
3958 -6711 -6669 -6633 -6814 -6706 -6598 -6470 -6558 -6448 -6338 -6122 -6411 -6550 -6474 -6169 -6081 -6303 -6524 -6623 -6361 -6157 -5738 -6180 -6407 -6476 -6545 -6598
3952 -6598 -6435 -6488 -6542 -6636 -6515 -6394 -6489 -6519 -6548 -6591 -6634 -6593 -6552 -6645 -6523 -6452 -6598 -6608 -6619 -6568 -6518 -6697 -6660 -6700 -6740 -6644 -6549 -6688 -6611 -6655 -6700
3945 -6700 -6661 -6622 -6583 -6544 -6520 -6496 -6472 -6448 -6513 -6579 -6740 -6540 -6526 -6513 -6585 -6656 -6634 -6611 -6588 -6566 -6570 -6573 -6577 -6581 -6686 -6791 -6716 -6641 -6630 -6619 -6607 -6596 -6601 -6605 -6610 -6614
3937 -6614 -6586 -6558 -6530 -6502 -6638 -6774 -6730 -6686 -6687 -6688 -6689 -6690 -6680 -6669 -6681 -6694 -6518 -6703 -6686 -6668 -6646 -6624 -6601 -6579 -6617 -6655 -6693 -6731 -6706 -6681 -6656 -6631 -6636 -6642 -6648 -6654
3929 -6654 -6693 -6733 -6665 -6596 -6617 -6639 -6660 -6681 -6635 -6589 -6650 -6712 -6693 -6674 -6654 -6635 -6636 -6637 -6746 -6855 -6863 -6870 -6770 -6670 -6698 -6726 -6646 -6566 -6586 -6607 -6628 -6649 -6629 -6609
3921 -6609 -6589 -6569 -6640 -6711 -6674 -6637 -6699 -6761 -6823 -6885 -6753 -6621 -6691 -6761 -6526 -6650 -6752 -6854 -6829 -6803 -6778 -6753 -6800 -6846 -6785 -6724 -6704 -6684 -6663 -6643 -6679
3914 -6679 -6715 -6751 -6787 -6799 -6811 -6836 -6861 -6798 -6951 -6875 -6799 -6813 -6827 -6734 -6856 -6654 -6669 -6575 -6697 -6588 -6695 -6694 -6693 -6719 -6745 -6771 -6796 -6736 -6676 -6845 -6799 -6840
3907 -6840 -6881 -6800 -6720 -6753 -6787 -6712 -6638 -6691 -6745 -6812 -6663 -6717 -6770 -6811 -6851 -6828 -6805 -6661 -6732 -6749 -6765 -6566 -6582 -6626 -6669 -6596 -6522 -6725 -6567 -6611 -6656 -6678
3899 -6678 -6700 -6723 -6745 -6693 -6641 -6684 -6727 -6830 -6718 -6727 -6736 -6715 -6693 -6672 -6651 -6663 -6675 -6701 -6727 -6557 -6603 -6757 -6695 -6693 -6692 -6556 -6635 -6630 -6625 -6633 -6641 -6710 -6779 -6753 -6728 -6612
3891 -6612 -6712 -6691 -6670 -6658 -6645 -6741 -6837 -6752 -6667 -6582 -6497 -6615 -6733 -6742 -6752 -6708 -6663 -6633 -6602 -6524 -6662 -6678 -6694 -6662 -6630 -6599 -6567 -6584 -6602 -6606 -6826 -6680
3884 -6680 -6535 -6655 -6775 -6665 -6556 -6554 -6553 -6619 -6686 -6644 -6603 -6618 -6632 -6647 -6662 -6726 -6790 -6674 -6558 -6588 -6619 -6649 -6679 -6666 -6653 -6640 -6627 -6630 -6632 -6635 -6638 -6729 -6821 -6732
3876 -6732 -6644 -6623 -6601 -6688 -6775 -6742 -6709 -6675 -6642 -6660 -6678 -6697 -6715 -6716 -6716 -6717 -6717 -6745 -6773 -6800 -6828 -6745 -6661 -6578 -6495 -6607 -6720 -6724 -6729 -6758 -6787 -6613 -6800 -6838 -6876
3868 -6876 -6828 -6781 -6775 -6770 -6742 -6714 -6842 -6609 -6809 -6792 -6721 -6650 -6673 -6696 -6693 -6689 -6685 -6682 -6684 -6687 -6689 -6692 -6694 -6697 -6699 -6702 -6701 -6701 -6700 -6700 -6715 -6731 -6638 -6545 -6551 -6558 -6564 -6570 -6576 -6583 -6589 -6595 -6531 -6467 -6511 -6555
3857 -6555 -6696 -6837 -6726 -6615 -6724 -6833 -6763 -6692 -6707 -6722 -6737 -6751 -6738 -6725 -6698 -6671 -6792 -6698 -6725 -6752 -6723 -6695 -6666 -6638 -6728 -6819 -6680 -6757 -6698 -6639
3851 -6639 -6594 -6549 -6627 -6705 -6676 -6646 -6728 -6809 -6710 -6611 -6668 -6724 -6673 -6621 -6627 -6633 -6761 -6673 -6672 -6672 -6658 -6643 -6675 -6706 -6724 -6742 -6887 -6814 -6756 -6697 -6636 -6574 -6606 -6639 -6753
3843 -6753 -6650 -6669 -6688 -6696 -6703 -6710 -6718 -6725 -6732 -6740 -6747 -6773 -6799 -6825 -6852 -6858 -6863 -6748 -6848 -6851 -6854 -6763 -6672 -6684 -6696 -6843 -6774 -6690 -6823 -6712 -6601 -6628 -6654 -6668 -6681 -6768 -6639
3834 -6639 -6619 -6598 -6669 -6525 -6610 -6695 -6703 -6711 -6732 -6753 -6626 -6714 -6681 -6649 -6745 -6842 -6722 -6819 -6688 -6773 -6751 -6728 -6724 -6720 -6717 -6713 -6682 -6651 -6621 -6590 -6608 -6625 -6521 -6634
3826 -6634 -6753 -6871 -6873 -6659 -6671 -6683 -6681 -6679 -6685 -6691 -6644 -6596 -6665 -6735 -6697 -6658 -6644 -6629 -6668 -6708 -6740 -6773 -6752 -6731 -6858 -6986 -6861 -6736 -6756 -6775 -6794 -6814 -6749
3819 -6749 -6684 -6673 -6661 -6624 -6586 -6657 -6727 -6785 -6843 -6793 -6743 -6876 -7010 -6891 -6773 -6755 -6738 -6720 -6703 -6741 -6780 -6710 -6640 -6692 -6744 -6688 -6632 -6667 -6703 -6738 -6774 -6754
3812 -6754 -6734 -6715 -6695 -6711 -6726 -6688 -6649 -6636 -6624 -6719 -6814 -6716 -6617 -6698 -6780 -6752 -6724 -6750 -6776 -6832 -6887 -6762 -6637 -6644 -6651 -6604 -6557 -6607 -6657 -6869 -6650 -6834 -6586
3804 -6586 -6662 -6738 -6729 -6721 -6658 -6596 -6676 -6756 -6729 -6701 -6690 -6680 -6669 -6658 -6664 -6670 -6676 -6682 -6671 -6660 -6595 -6529 -6600 -6671 -6634 -6597 -6630 -6662 -6695 -6728 -6732 -6737 -6687 -6638 -6696 -6754 -6704 -6654
3795 -6654 -6699 -6743 -6680 -6616 -6623 -6629 -6689 -6750 -6762 -6774 -6732 -6690 -6689 -6688 -6741 -6795 -6745 -6694 -6644 -6594 -6706 -6818 -6821 -6825 -6755 -6684 -6722 -6759 -6720 -6680 -6748 -6817 -6775 -6733 -6691 -6649
3787 -6649 -6748 -6847 -6767 -6686 -6683 -6680 -6730 -6781 -6726 -6671 -6723 -6776 -6782 -6787 -6738 -6690 -6682 -6675 -6775 -6876 -6853 -6829 -6806 -6783 -6727 -6671 -6668 -6666 -6751 -6835 -6812 -6788 -6653 -6518 -6563 -6608
3779 -6608 -6614 -6620 -6679 -6739 -6676 -6613 -6550 -6487 -6568 -6649 -6676 -6703 -6756 -6810 -6756 -6702 -6649 -6596 -6723 -6851 -6811 -6772 -6732 -6693 -6660 -6628 -6703 -6778 -6700 -6622 -6724 -6826 -6772
3771 -6772 -6719 -6773 -6828 -6769 -6709 -6650 -6591 -6601 -6611 -6622 -6632 -6641 -6651 -6660 -6669 -6679 -6688 -6697 -6706 -6674 -6641 -6609 -6576 -6564 -6552 -6647 -6743 -6705 -6667 -6628 -6590 -6579 -6568 -6665 -6762 -6766 -6770 -6774 -6778
3762 -6778 -6795 -6813 -6830 -6848 -6786 -6725 -6772 -6819 -6778 -6737 -6696 -6655 -6672 -6690 -6707 -6725 -6743 -6760 -6778 -6795 -6727 -6658 -6590 -6521 -6588 -6654 -6613 -6571 -6648 -6724 -6693 -6661 -6632 -6602
3755 -6602 -6573 -6543 -6614 -6684 -6646 -6608 -6570 -6532 -6603 -6673 -6653 -6633 -6613 -6593 -6545 -6498 -6559 -6620 -6631 -6641 -6651 -6662 -6618 -6574 -6639 -6703 -6707 -6711 -6714 -6718 -6701 -6685 -6668 -6652 -6655 -6657 -6660 -6662
3746 -6662 -6665 -6668 -6670 -6673 -6636 -6600 -6563 -6527 -6553 -6580 -6606 -6632 -6609 -6585 -6562 -6538 -6578 -6617 -6656 -6696 -6722 -6747 -6773 -6799 -6755 -6711 -6667 -6623 -6654 -6685 -6607 -6530 -6595 -6659 -6724 -6789
3738 -6789 -6783 -6777 -6771 -6765 -6699 -6632 -6673 -6715 -6698 -6682 -6665 -6649 -6666 -6683 -6700 -6718 -6720 -6723 -6725 -6728 -6746 -6764 -6674 -6584 -6616 -6648 -6680 -6711 -6648 -6586 -6631 -6676 -6715 -6754 -6793 -6832 -6714 -6595
3729 -6595 -6657 -6719 -6713 -6707 -6701 -6695 -6700 -6705 -6711 -6716 -6707 -6698 -6689 -6680 -6660 -6639 -6619 -6599 -6680 -6761 -6662 -6563 -6565 -6567 -6569 -6571 -6582 -6593 -6603 -6614 -6635 -6657 -6679 -6701 -6617 -6533 -6629 -6725 -6659 -6593 -6635 -6677
3719 -6677 -6683 -6689 -6695 -6701 -6714 -6726 -6739 -6751 -6724 -6696 -6668 -6640 -6761 -6881 -6750 -6619 -6577 -6535 -6574 -6614 -6819 -6593 -6610 -6627 -6643 -6660 -6677 -6694 -6695 -6696 -6723 -6751 -6461 -6603
3712 -6603 -6681 -6760 -6749 -6737 -6726 -6714 -6618 -6522 -6605 -6689 -6671 -6654 -6636 -6619 -6640 -6661 -6682 -6703 -6798 -6893 -6809 -6724 -6703 -6683 -6662 -6641 -6715 -6789 -6755 -6721 -6709 -6697 -6685 -6674
3704 -6674 -6655 -6636 -6618 -6599 -6653 -6707 -6761 -6815 -6720 -6626 -6639 -6652 -6670 -6688 -6598 -6508 -6610 -6713 -6635 -6557 -6624 -6690 -6702 -6715 -6725 -6735 -6691 -6647 -6705 -6764 -6714 -6665 -6764
3696 -6764 -6862 -6853 -6844 -6770 -6696 -6675 -6655 -6684 -6713 -6500 -6718 -6704 -6690 -6649 -6608 -6609 -6610 -6475 -6773 -6714 -6655 -6623 -6592 -6547 -6503 -6567 -6631 -6637 -6644 -6596 -6549 -6573 -6596 -6620 -6643
3688 -6643 -6578 -6514 -6557 -6600 -6684 -6767 -6671 -6575 -6640 -6706 -6771 -6836 -6838 -6839 -6732 -6625 -6609 -6593 -6631 -6668 -6696 -6724 -6454 -6617 -6662 -6707 -6725 -6742 -6659 -6575 -6672 -6769 -6719
3681 -6719 -6669 -6593 -6516 -6775 -6601 -6563 -6524 -6640 -6755 -6762 -6770 -6719 -6667 -6724 -6781 -6639 -6498 -6536 -6574 -6624 -6673 -6723 -6772 -6707 -6642 -6685 -6727 -6770 -6813 -6775 -6737 -6540
3673 -6540 -6775 -6767 -6759 -6760 -6762 -6763 -6764 -6816 -6868 -6741 -6613 -6589 -6564 -6648 -6732 -6684 -6635 -6587 -6538 -6579 -6619 -6606 -6592 -6575 -6558 -6649 -6740 -6692 -6643 -6648 -6654 -6638 -6622 -6606 -6590 -6587 -6583 -6688
3665 -6688 -6792 -6714 -6637 -6667 -6697 -6614 -6531 -6627 -6724 -6746 -6768 -6736 -6703 -6784 -6864 -6764 -6665 -6711 -6757 -6749 -6741 -6758 -6776 -6794 -6812 -6732 -6653 -6681 -6710 -6695 -6681 -6802 -6490
3657 -6490 -6641 -6792 -6664 -6536 -6536 -6537 -6537 -6537 -6627 -6718 -6700 -6682 -6689 -6696 -6649 -6602 -6656 -6711 -6711 -6711 -6700 -6689 -6679 -6668 -6635 -6603 -6679 -6755 -6641 -6528 -6595 -6661 -6691 -6720 -6749
3649 -6749 -6779 -6738 -6698 -6657 -6617 -6635 -6653 -6671 -6689 -6741 -6792 -6844 -6896 -6784 -6671 -6667 -6663 -6739 -6816 -6785 -6753 -6740 -6727 -6714 -6700 -6786 -6872 -6849 -6827 -6806 -6785 -6764 -6743 -6736 -6729
3641 -6729 -6721 -6714 -6809 -6904 -6891 -6878 -6845 -6811 -6778 -6745 -6727 -6710 -6692 -6675 -6684 -6694 -6703 -6713 -6718 -6723 -6728 -6733 -6738 -6743 -6748 -6753 -6744 -6735 -6726 -6717 -6607 -6497 -6567 -6636 -6643 -6650 -6657 -6664 -6655 -6646 -6637 -6628 -6658 -6688 -6717
3631 -6717 -6747 -6750 -6752 -6755 -6757 -6731 -6704 -6678 -6651 -6669 -6688 -6706 -6724 -6692 -6660 -6628 -6596 -6669 -6743 -6708 -6674 -6702 -6730 -6758 -6786 -6706 -6626 -6726 -6826 -6796 -6767 -6738 -6709 -6718 -6727 -6736 -6745
3622 -6745 -6723 -6702 -6681 -6659 -6699 -6738 -6669 -6601 -6619 -6637 -6656 -6674 -6719 -6764 -6702 -6639 -6649 -6660 -6670 -6681 -6691 -6701 -6712 -6722 -6678 -6635 -6699 -6763 -6783 -6802 -6713 -6624 -6648 -6672
3615 -6672 -6696 -6719 -6676 -6632 -6696 -6760 -6724 -6687 -6677 -6667 -6448 -6661 -6631 -6601 -6633 -6665 -6697 -6729 -6716 -6702 -6689 -6676 -6652 -6629 -6848 -6635 -6677 -6718 -6733 -6748 -6685 -6623
3607 -6623 -6740 -6858 -6768 -6678 -6697 -6715 -6694 -6672 -6650 -6628 -6629 -6630 -6630 -6631 -6700 -6769 -6630 -6492 -6788 -6652 -6579 -6506 -6653 -6799 -6765 -6732 -6714 -6696 -6678 -6660 -6756 -6852
3600 -6852 -6768 -6683 -6700 -6717 -6734 -6751 -6712 -6673 -6634 -6595 -6626 -6656 -6687 -6717 -6625 -6532 -6548 -6563 -6563 -6563 -6562 -6562 -6596 -6630 -6665 -6699 -6706 -6714 -6721 -6728 -6718 -6708 -6698 -6687 -6704 -6721 -6725 -6728 -6838
3591 -6838 -6732 -6748 -6763 -6711 -6659 -6715 -6771 -6711 -6651 -6698 -6746 -6709 -6673 -6690 -6707 -6730 -6753 -6632 -6727 -6922 -6757 -6606 -6815 -6817 -6819 -6749 -6680 -6605 -6747 -6767 -6787 -6842
3584 -6842 -6896 -6721 -6762 -6786 -6810 -6862 -6697 -6743 -6789 -6767 -6746 -6721 -6696 -6671 -6646 -6684 -6721 -6624 -6743 -6816 -6674 -6689 -6704 -6499 -6653 -6605 -6557 -6595 -6632 -6670 -6708
3577 -6708 -6726 -6745 -6750 -6756 -6833 -6694 -6569 -6660 -6581 -6718 -6855 -6775 -6787 -6583 -6546 -6724 -6700 -6675 -6718 -6761 -6685 -6609 -6708 -6591 -6664 -6738 -6604 -6470 -6644 -6601
3570 -6601 -6680 -6759 -6732 -6704 -6676 -6648 -6697 -6746 -6673 -6816 -6788 -6759 -6743 -6728 -6760 -6792 -6594 -6613 -6640 -6668 -6723 -6777 -6759 -6956 -6731 -6721 -6667 -6612 -6747 -6666 -6661 -6656 -6714
3562 -6714 -6772 -6564 -6716 -6666 -6616 -6652 -6687 -6722 -6758 -6761 -6764 -6714 -6663 -6616 -6568 -6629 -6690 -6639 -6589 -6647 -6705 -6725 -6744 -6764 -6784 -6638 -6493 -6600 -6707 -6729 -6752 -6666
3555 -6666 -6580 -6631 -6681 -6678 -6674 -6667 -6660 -6707 -6754 -6709 -6664 -6674 -6683 -6635 -6587 -6593 -6598 -6596 -6593 -6568 -6543 -6806 -6709 -6761 -6812 -6722 -6632 -6649 -6667 -6714 -6761 -6754 -6747 -6731 -6715 -6700 -6684 -6722 -6760
3546 -6760 -6691 -6621 -6694 -6766 -6785 -6803 -6770 -6737 -6650 -6562 -6623 -6683 -6635 -6587 -6566 -6546 -6633 -6720 -6670 -6620 -6624 -6628 -6635 -6642 -6650 -6657 -6631 -6605 -6578 -6552 -6589 -6626 -6663 -6700 -6720 -6740 -6760
3538 -6760 -6780 -6737 -6694 -6650 -6607 -6638 -6668 -6698 -6728 -6706 -6685 -6663 -6641 -6720 -6798 -6769 -6739 -6710 -6680 -6745 -6810 -6901 -6776 -6651 -6742 -6765 -6789 -6718 -6647 -6668 -6689 -6711 -6732
3530 -6732 -6701 -6671 -6654 -6637 -6565 -6709 -6732 -6755 -6757 -6760 -6776 -6576 -6632 -6688 -6865 -6827 -6797 -6984 -6734 -6700 -6708 -6716 -6737 -6759 -6828 -6896 -6979 -6845 -6743 -6640 -6583 -6742
3523 -6742 -6667 -6591 -6638 -6684 -6593 -6501 -6576 -6651 -6776 -6685 -6526 -6727 -6599 -6687 -6689 -6692 -6555 -6634 -6456 -6495 -6649 -6587 -6781 -6759 -6760 -6761 -6627 -6709 -6672 -6636 -6613 -6591
3515 -6591 -6710 -6829 -6696 -6562 -6576 -6589 -6603 -6616 -6715 -6814 -6711 -6607 -6832 -6696 -6763 -6830 -6807 -6784 -6761 -6738 -6688 -6637 -6681 -6726 -6831 -6719 -6730 -6740 -6721
3509 -6721 -6703 -6684 -6665 -6659 -6654 -6541 -6643 -6552 -6678 -6695 -6712 -6697 -6683 -6668 -6654 -6656 -6658 -6661 -6663 -6632 -6600 -6677 -6754 -6757 -6759 -6762 -6765 -6707 -6649 -6699 -6749 -6797 -6845 -6784 -6724 -6725 -6725 -6726 -6726 -6754
3500 -6754 -6781 -6700 -6620 -6645 -6670 -6695 -6720 -6707 -6693 -6679 -6666 -6701 -6737 -6665 -6593 -6701 -6810 -6739 -6667 -6605 -6542 -6660 -6777 -6686 -6595 -6756 -6917 -6731 -6546 -6684
3493 -6684 -6822 -6709 -6596 -6662 -6729 -6715 -6700 -6686 -6672 -6721 -6770 -6819 -6869 -6783 -6697 -6791 -6885 -6701 -6517 -6512 -6508 -6632 -6756 -6700 -6644 -6650 -6656 -6663 -6669 -6766 -6862 -6778 -6695 -6663
3485 -6663 -6631 -6599 -6568 -6599 -6630 -6661 -6693 -6748 -6802 -6749 -6696 -6650 -6603 -6665 -6727 -6660 -6594 -6635 -6677 -6763 -6850 -6828 -6807 -6716 -6625 -6714 -6804 -6785 -6766 -6748 -6729 -6739 -6748 -6758 -6767
3477 -6767 -6716 -6665 -6722 -6778 -6740 -6701 -6662 -6623 -6672 -6721 -6662 -6603 -6641 -6678 -6608 -6537 -6667 -6797 -6747 -6697 -6720 -6743 -6766 -6788 -6766 -6744 -6722 -6700 -6734 -6768 -6694 -6619 -6651
3469 -6651 -6682 -6714 -6746 -6764 -6782 -6800 -6818 -6809 -6800 -6791 -6782 -6737 -6693 -6648 -6604 -6701 -6798 -6787 -6776 -6762 -6748 -6734 -6719 -6725 -6732 -6738 -6744 -6707 -6671 -6635 -6598 -6643 -6688 -6733 -6777 -6730 -6682 -6635
3461 -6635 -6587 -6621 -6654 -6688 -6721 -6688 -6655 -6623 -6590 -6620 -6650 -6681 -6711 -6681 -6652 -6865 -6647 -6712 -6777 -6707 -6637 -6551 -6464 -6486 -6507 -6535 -6564 -6592 -6620 -6671 -6723 -6666 -6609
3453 -6609 -6607 -6604 -6601 -6598 -6694 -6790 -6778 -6766 -6763 -6760 -6757 -6754 -6632 -6510 -6811 -6681 -6635 -6590 -6698 -6805 -6785 -6765 -6745 -6725 -6743 -6761 -6779 -6798 -6785 -6773 -6761 -6749 -6709 -6670 -6631
3445 -6631 -6592 -6635 -6678 -6721 -6765 -6745 -6725 -6705 -6686 -6718 -6751 -6783 -6816 -6864 -6913 -6853 -6793 -6784 -6774 -6765 -6755 -6739 -6723 -6706 -6690 -6712 -6733 -6755 -6776 -6656 -6535 -6667 -6799
3438 -6799 -6792 -6785 -6779 -6772 -6774 -6776 -6779 -6781 -6845 -6908 -6864 -6819 -6784 -6749 -6713 -6678 -6748 -6818 -6780 -6742 -6715 -6689 -6770 -6851 -6723 -6594 -6646 -6697 -6717 -6737 -6757 -6777 -6808 -6838 -6868 -6898 -6822
3429 -6822 -6747 -6779 -6812 -6791 -6771 -6750 -6730 -6718 -6707 -6803 -6900 -6835 -6770 -6704 -6639 -6691 -6743 -6795 -6847 -6834 -6822 -6702 -6581 -6718 -6854 -6882 -6910 -6843 -6776 -6708 -6641 -6709
3422 -6709 -6777 -6844 -6912 -6813 -6715 -6724 -6733 -6727 -6720 -6714 -6707 -6719 -6730 -6742 -6753 -6738 -6722 -6707 -6691 -6712 -6733 -6754 -6775 -6740 -6705 -6670 -6634 -6731 -6827 -6743 -6659 -6694 -6728 -6641 -6769 -6748 -6727
3413 -6727 -6786 -6846 -6745 -6860 -6745 -6630 -6691 -6751 -6704 -6657 -6704 -6751 -6569 -6603 -6668 -6732 -6703 -6673 -6607 -6541 -6655 -6769 -6639 -6508 -6558 -6607 -6719 -6832 -6764
3407 -6764 -6696 -6779 -6863 -6946 -6669 -6863 -6698 -6631 -6781 -6903 -6809 -6864 -6703 -6686 -6670 -6618 -6926 -6829 -6733 -6780 -6827 -6697 -6783 -6801 -6819 -6841 -6862 -6951 -6824 -6814
3400 -6814 -6804 -6781 -6757 -6725 -6693 -6769 -6845 -6773 -6701 -6723 -6745 -6826 -6692 -6881 -6710 -6752 -6795 -6693 -6807 -6759 -6712 -6732 -6752 -6747 -6743 -6765 -6571 -6498 -6640 -6688 -6736 -6859
3393 -6859 -6765 -6806 -6847 -6730 -6828 -6873 -6917 -6711 -6721 -6717 -6713 -6778 -6842 -6812 -6782 -6664 -6761 -6804 -6631 -6736 -6841 -6825 -6808 -6758 -6708 -6766 -6823 -6800 -6776 -6699 -6621 -6565
3385 -6565 -6508 -6560 -6612 -6636 -6660 -6685 -6709 -6807 -6906 -6896 -6887 -6789 -6691 -6702 -6712 -6729 -6746 -6737 -6727 -6959 -6760 -6696 -6631 -6636 -6642 -6701 -6760 -6719 -6677 -6689 -6701 -6738 -6775 -6811 -6848
3377 -6848 -6731 -6614 -6604 -6595 -6606 -6617 -6628 -6639 -6684 -6728 -6773 -6817 -6781 -6744 -6708 -6672 -6687 -6703 -6719 -6735 -6751 -6767 -6783 -6799 -6794 -6790 -6786 -6781 -6804 -6827 -6849 -6872 -6820 -6769 -6717 -6665
3369 -6665 -6762 -6859 -6848 -6837 -6804 -6771 -6845 -6920 -6867 -6813 -6841 -6869 -7050 -6800 -6793 -6785 -6796 -6807 -6817 -6828 -6731 -6634 -6716 -6799 -6744 -6688 -6687 -6685 -6751 -6817 -6775 -6733 -6752 -6770 -6789
3361 -6789 -6808 -6813 -6818 -6769 -6719 -6710 -6700 -6798 -6897 -6816 -6735 -6763 -6790 -6759 -6728 -6805 -6882 -6800 -6717 -6815 -6912 -6855 -6797 -6847 -6898 -6868 -6839 -6809 -6780 -6757 -6734 -6711 -6688 -6695 -6702 -6731 -6760
3353 -6760 -6620 -6841 -6751 -6660 -6716 -6771 -6827 -6883 -6832 -6782 -6732 -6682 -6701 -6721 -6740 -6759 -6752 -6744 -6737 -6729 -6793 -6858 -6720 -6942 -6887 -6832 -6800 -6767 -6751 -6735 -6827 -6919 -6881 -6842
3345 -6842 -6804 -6765 -6701 -6637 -6753 -6870 -6808 -6746 -6793 -6839 -6724 -6609 -6675 -6740 -6722 -6703 -6685 -6667 -6595 -6523 -6631 -6739 -6711 -6684 -6657 -6630 -6697 -6764 -6723 -6682 -6762
3338 -6762 -6843 -6815 -6787 -6745 -6703 -6661 -6619 -6640 -6660 -6681 -6702 -6673 -6643 -6722 -6800 -6717 -6634 -6730 -6827 -6840 -6852 -6865 -6878 -6796 -6715 -6741 -6767 -6806 -6846 -6885 -6924 -6777 -6629
3330 -6629 -6734 -6838 -6871 -6903 -6828 -6752 -6737 -6723 -6708 -6693 -6828 -6964 -6847 -6731 -6749 -6768 -6786 -6804 -6817 -6830 -6735 -6640 -6668 -6697 -6725 -6754 -6765 -6777 -6789 -6800 -6785
3323 -6785 -6770 -6754 -6739 -6743 -6747 -6751 -6754 -6713 -6672 -6631 -6589 -6624 -6659 -6694 -6728 -6779 -6829 -6772 -6714 -6760 -6806 -6852 -6898 -6875 -6851 -6827 -6803 -6810 -6818 -6825 -6832 -6758 -6684 -6718 -6753 -6673 -6594 -6622
3314 -6622 -6651 -6713 -6775 -6730 -6684 -6724 -6764 -6803 -6843 -6813 -6783 -6753 -6723 -6713 -6703 -6693 -6683 -6646 -6609 -6572 -6535 -6576 -6616 -6657 -6697 -6656 -6616 -6683 -6750 -6774 -6798 -6714 -6629 -6615
3307 -6615 -6600 -6694 -6787 -6773 -6758 -6743 -6728 -6747 -6766 -6785 -6804 -6758 -6712 -6666 -6619 -6654 -6689 -6723 -6758 -6724 -6690 -6655 -6621 -6668 -6714 -6761 -6808 -6811 -6814 -6817 -6820 -6803 -6786 -6782 -6778 -6708 -6853
3298 -6853 -6769 -6684 -6726 -6768 -6809 -6851 -6808 -6764 -6815 -6866 -6951 -6819 -6810 -6800 -6765 -6730 -6817 -6687 -6686 -6685 -6670 -6655 -6615 -6575 -6643 -6711 -6619 -6528 -6544 -6560 -6656 -6751 -6667 -6582 -6612
3290 -6612 -6643 -6794 -6730 -6767 -6805 -6734 -6663 -6613 -6778 -6714 -6650 -6717 -6784 -6743 -6701 -6660 -6619 -6686 -6753 -6793 -6834 -6780 -6726 -6677 -6843 -6781 -6934 -6784 -6850 -6831 -6812 -6637
3283 -6637 -6823 -6698 -6573 -6609 -6646 -6682 -6718 -6734 -6750 -6766 -6782 -6740 -6699 -6644 -6589 -6775 -6745 -6607 -6685 -6700 -6715 -6757 -6799 -6672 -6762 -6865 -6751 -6643 -6750
3276 -6750 -6722 -6695 -6795 -6896 -6708 -6737 -6643 -6766 -6780 -6795 -6767 -6738 -6710 -6682 -6713 -6745 -6776 -6808 -6776 -6745 -6713 -6682 -6723 -6765 -6820 -6875 -6663 -6666 -6714 -6763 -6866 -6754
3269 -6754 -6898 -6826 -6646 -6682 -6691 -6700 -6722 -6745 -6754 -6763 -6785 -6592 -6578 -6781 -6754 -6727 -6700 -6673 -6813 -6737 -6674 -6611 -6682 -6753 -6824 -6895 -6811 -6726 -6750 -6774 -6828 -6883 -6829 -6776
3261 -6776 -6776 -6777 -6656 -6751 -6774 -6797 -6632 -6826 -6811 -6796 -6790 -6784 -6816 -6632 -6678 -6724 -6794 -6864 -6813 -6762 -6937 -6895 -6746 -6812 -6723 -6634 -6739 -6844 -6846 -6848 -6836 -6824 -6932
3253 -6932 -6824 -6837 -6850 -6812 -6773 -6856 -6724 -6679 -6633 -6683 -6732 -6769 -6805 -6855 -6905 -6741 -6793 -6832 -6870 -6782 -6694 -6713 -6733 -6712 -6692 -6792 -6677 -6686 -6694 -6689 -6684 -6766 -6849 -6716
3246 -6716 -6798 -6639 -6695 -6522 -6565 -6684 -6804 -6707 -6827 -6789 -6752 -6714 -6677 -6774 -6656 -6767 -6878 -6892 -6907 -6921 -6935 -6907 -6878 -6715 -6767 -6857 -6731 -6619 -6723
3239 -6723 -6725 -6727 -6743 -6759 -6736 -6714 -6646 -6363 -6424 -6701 -6735 -6768 -6801 -6833 -6622 -6627 -6678 -6512 -6603 -6694 -6567 -6656 -6610 -6780 -6731 -6681 -6754 -6826 -6803 -6781 -6812 -6843 -6794
3232 -6794 -6744 -6749 -6753 -6767 -6781 -6795 -6809 -6846 -6882 -6811 -6739 -6734 -6729 -6899 -6853 -6805 -6757 -6749 -6742 -6689 -6636 -6691 -6746 -6772 -6799 -6704 -6826 -6726 -6625 -6791 -6956 -6870 -6785 -6753
3224 -6753 -6721 -6869 -7017 -7034 -6836 -6787 -6738 -6797 -6856 -6675 -6710 -6719 -6727 -6803 -6663 -6630 -6814 -6764 -6713 -6784 -6854 -6881 -6908 -6895 -6881 -6708 -6751 -6672 -6809 -6808 -7023
3217 -7023 -6756 -6706 -6683 -6661 -6652 -6643 -6739 -6835 -6836 -6837 -6766 -6911 -6880 -6850 -6795 -6741 -6795 -6849 -6841 -6833 -6825 -6816 -6815 -6814 -6812 -6811 -6802 -6793 -6784 -6775 -6793 -6811 -6721 -6631 -6692 -6753 -6598 -6659 -6538 -6634
3208 -6634 -6676 -6717 -6773 -6829 -6764 -6698 -6828 -6743 -6846 -6733 -6792 -6851 -6788 -6725 -6666 -6607 -6777 -6731 -6788 -6845 -6780 -6716 -6590 -6465 -6533 -6601 -6538 -6691 -6746 -6800 -6550
3200 -6550 -6660 -6798 -6719 -6783 -6848 -6805 -6761 -6613 -6681 -6614 -6763 -6780 -6796 -6758 -6720 -6774 -6611 -6799 -6772 -6714 -6657 -6586 -6731 -6606 -6697 -6681 -6664 -6683 -6702 -6708 -6713
3193 -6713 -6766 -6603 -6791 -6763 -6746 -6729 -6698 -6668 -6725 -6782 -6731 -6681 -6744 -6807 -6763 -6718 -6720 -6721 -6669 -6616 -6750 -6883 -6836 -6789 -6838 -6887 -6851 -6814 -6643 -6833 -6820 -6807
3186 -6807 -6769 -6731 -6815 -6683 -6716 -6749 -6660 -6787 -6756 -6941 -6909 -6878 -6883 -6887 -6838 -6789 -6810 -6832 -6746 -6875 -6661 -6663 -6867 -6711 -6760 -6809 -6768 -6943 -6877 -6811 -6609
3179 -6609 -6768 -6803 -6838 -6787 -6737 -6727 -6716 -6908 -6741 -6768 -6796 -6802 -6807 -6785 -6763 -6741 -6719 -6759 -6800 -6841 -6882 -6865 -6848 -6723 -6814 -6679 -6760 -6842 -6923 -6927 -6932 -6760 -6805
3171 -6805 -6773 -6740 -6721 -6702 -6663 -6624 -6693 -6762 -6760 -6758 -6891 -6808 -6667 -6743 -6837 -6714 -6963 -6852 -6836 -6819 -6665 -6728 -6723 -6718 -6746 -6775 -6696 -6616 -6669 -6722 -6721 -6720 -6715 -6711 -6706 -6702
3163 -6702 -6708 -6714 -6719 -6725 -6829 -6932 -6856 -6780 -6790 -6800 -6743 -6686 -6759 -6616 -6784 -6736 -6577 -6634 -6664 -6694 -6748 -6802 -6761 -6720 -6596 -6689 -6768 -6847 -6741 -6634 -6707 -6781
3156 -6781 -6833 -6885 -6882 -6880 -6807 -6734 -6769 -6804 -6851 -6898 -6837 -6776 -6755 -6734 -6768 -6801 -6772 -6742 -6767 -6791 -6816 -6840 -6865 -6889 -6873 -6856 -6840 -6823 -6788 -6752 -6824 -6897 -6867 -6838 -6754
3148 -6754 -6671 -6696 -6722 -6694 -6665 -6716 -6767 -6764 -6761 -6725 -6688 -6759 -6830 -6816 -6801 -6764 -6727 -6915 -6742 -6665 -6587 -6611 -6634 -6658 -6682 -6699 -6715 -6732 -6749 -6754 -6759 -6764 -6768 -6792 -6816 -6732
3140 -6732 -6648 -6641 -6635 -6683 -6730 -6707 -6683 -6714 -6745 -6725 -6705 -6631 -6557 -6609 -6661 -6713 -6766 -6646 -6525 -6585 -6645 -6692 -6738 -6677 -6615 -6628 -6641 -6654 -6667 -6697 -6727 -6703 -6679 -6727
3132 -6727 -6776 -6716 -6657 -6704 -6751 -6691 -6630 -6725 -6819 -6734 -6648 -6630 -6612 -6648 -6684 -6695 -6706 -6770 -6835 -6853 -6870 -6888 -6905 -6848 -6791 -6819 -6848 -7018 -6828 -6841 -6854 -6838 -6822
3124 -6822 -6806 -6790 -6778 -6767 -6958 -6789 -6806 -6822 -6817 -6811 -6767 -6724 -6680 -6636 -6572 -6508 -6552 -6595 -6696 -6796 -6788 -6780 -6690 -6600 -6690 -6780 -6766 -6751 -6683 -6614 -6662 -6711 -6759 -6808
3116 -6808 -6718 -6628 -6718 -6808 -6853 -6898 -6835 -6772 -6834 -6896 -6778 -6660 -6693 -6726 -6706 -6685 -6737 -6790 -6734 -6678 -6784 -6889 -6886 -6883 -6810 -6736 -6843 -6949 -6876 -6804 -6605 -6767
3109 -6767 -6554 -6701 -6789 -6661 -6666 -6671 -6662 -6654 -6699 -6744 -6681 -6619 -6691 -6763 -6728 -6692 -6710 -6728 -6747 -6765 -6750 -6735 -6720 -6705 -6735 -6766 -6796 -6826 -6796 -6766 -6735 -6705 -6720 -6735 -6750
3101 -6750 -6765 -6772 -6779 -6786 -6793 -6766 -6739 -6820 -6901 -6899 -6896 -6894 -6891 -6831 -6771 -6819 -6867 -6869 -6871 -6962 -6838 -6711 -6943 -6852 -6760 -6733 -6705 -6786 -6867 -6849 -6832 -6869 -6906 -6846 -6786 -6727 -6667 -6725
3092 -6725 -6784 -6842 -6901 -6757 -6614 -6722 -6831 -6824 -6818 -6812 -6805 -6765 -6725 -6685 -6645 -6680 -6714 -6748 -6782 -6704 -6626 -6728 -6829 -6800 -6770 -6740 -6710 -6699 -6688 -6866 -6612 -6494
3085 -6494 -6376 -6155 -6366 -6530 -6479 -6576 -6673 -6726 -6780 -6725 -6670 -6620 -6570 -6466 -6362 -6336 -6311 -6466 -6621 -6575 -6530 -6511 -6493 -6647 -6370 -6390 -6409 -6422 -6434
3079 -6434 -6554 -6675 -6686 -6697 -6708 -6719 -6746 -6773 -6692 -6611 -6395 -6179 -6359 -6539 -6592 -6646 -6699 -6752 -6792 -6832 -6764 -6696 -6747 -6799 -6851 -6903 -6916 -6929 -6835 -6740 -6717
3071 -6717 -6693 -6778 -6862 -6879 -6896 -6913 -6930 -6899 -6868 -6836 -6805 -6774 -6742 -6711 -6679 -6697 -6715 -6733 -6751 -6796 -6842 -6778 -6715 -6745 -6775 -6697 -6619 -6649 -6678 -6762 -6846 -6823 -6800 -6831
3064 -6831 -6861 -6791 -6721 -6650 -6796 -6686 -6792 -6791 -6789 -6814 -6839 -6730 -6836 -6961 -6869 -7007 -6786 -6759 -6733 -6671 -6825 -6871 -6916 -6853 -6791 -6934 -6861 -6923 -6769 -6793
3057 -6793 -6816 -6794 -6772 -6599 -6785 -6715 -6645 -6648 -6652 -6601 -6551 -6585 -6618 -6598 -6578 -6596 -6614 -6767 -6704 -6634 -6780 -6737 -6695 -6751 -6807 -6755 -6703 -6668 -6633 -6693 -6753 -6886 -6803
3049 -6803 -6719 -6636 -6813 -6774 -6748 -6723 -6751 -6779 -6754 -6728 -6790 -6852 -6806 -6760 -6731 -6702 -6726 -6751 -6684 -6618 -6659 -6701 -6676 -6651 -6734 -6817 -6741 -6664 -6709 -6754 -6623 -6708 -6672
3042 -6672 -6636 -6677 -6717 -6757 -6798 -6824 -6851 -6649 -6662 -6727 -6792 -6677 -6562 -6604 -6429 -6147 -5864 -5835 -6166 -6118 -6287 -6274 -6262 -5952 -5643 -5543 -5660 -6052
3035 -6052 -6443 -6565 -6688 -6616 -6545 -6720 -6679 -6584 -6705 -6695 -6684 -6687 -6690 -6690 -6689 -6702 -6715 -6633 -6768 -6659 -6766 -6778 -6791 -6695 -6816 -6779 -6743 -6720 -6697 -6738 -6779 -6726
3028 -6726 -6673 -6528 -6600 -6482 -6581 -6651 -6722 -6819 -6700 -6794 -6888 -6924 -6743 -6597 -6666 -6708 -6750 -6705 -6660 -6615 -6569 -6497 -6425 -6353 -6281 -6233 -6185 -6172 -5944 -5806 -6028
3021 -6028 -6336 -6427 -6349 -6270 -6177 -6085 -6115 -6146 -6406 -6449 -6502 -6554 -6539 -6523 -6545 -6567 -6602 -6638 -6522 -6622 -6722 -6606 -6600 -6595 -6440 -6502 -6598 -6477 -6312 -6146
3014 -6146 -6140 -6133 -5919 -5921 -5881 -6201 -6459 -6356 -6510 -6305 -6113 -5922 -5710 -5714 -5934 -6154 -6234 -6531 -6647 -6548 -6591 -6635 -6556 -6478 -6456 -6435 -6413 -6391 -6307 -6222
3007 -6222 -6246 -6270 -6451 -6632 -6633 -6634 -6553 -6471 -6390 -6308 -6404 -6501 -6597 -6693 -6677 -6661 -6646 -6630 -6655 -6679 -6596 -6513 -6371 -6229 -5966 -5487 -5069 -5948 -6435 -6490 -6562
3000 -6562 -6633 -6624 -6614 -6740 -6865 -6811 -6756 -6779 -6801 -6770 -6739 -6669 -6599 -6638 -6676 -6665 -6654 -6697 -6740 -6695 -6650 -6713 -6776 -6773 -6770 -6713 -6655 -6693 -6730 -6659 -6588 -6648 -6707 -6712 -6717 -6621
2992 -6621 -6525 -6609 -6693 -6650 -6606 -6617 -6627 -6551 -6475 -6507 -6539 -6499 -6460 -6312 -6165 -6364 -6563 -6510 -6457 -6302 -6148 -6317 -6486 -6575 -6663 -6572 -6480 -6621 -6761
2985 -6761 -6721 -6681 -6695 -6710 -6670 -6630 -6692 -6754 -6762 -6769 -6734 -6700 -6665 -6630 -6611 -6591 -6464 -6337 -6113 -5889 -6205 -6521 -6384 -6247 -6151 -5838 -5843 -6280 -6582 -6667
2978 -6667 -6634 -6600 -6661 -6722 -6686 -6649 -6666 -6683 -6707 -6731 -6782 -6618 -6551 -6700 -6646 -6593 -6665 -6522 -6554 -6586 -6521 -6457 -6644 -6831 -6714 -6596 -6659 -6721 -6658 -6594 -6463
2971 -6463 -6548 -6556 -6564 -6625 -6687 -6799 -6694 -6616 -6539 -6479 -6635 -6561 -6487 -6596 -6704 -6512 -6535 -6571 -6607 -6643 -6679 -6682 -6470 -6365 -6476 -6505 -6533 -6507 -6697 -6661 -6625
2964 -6625 -6589 -6553 -6686 -6603 -6641 -6679 -6665 -6650 -6582 -6513 -6601 -6690 -6684 -6678 -6563 -6663 -6643 -6622 -6592 -6563 -6533 -6503 -6493 -6482 -6364 -6245 -6069 -5893 -5568 -5603 -5581
2957 -5581 -5559 -5379 -5200 -4996 -4792 -4489 -4403 -3917 -3792 -3946 -4100 -4013 -3926 -3744 -3563 -3264 -3182 -3063 -2944 -3729 -4153 -4181 -4569 -4647 -4725 -4933
2951 -4933 -5141 -5289 -5437 -5693 -5948 -6029 -6109 -6059 -5792 -5548 -5305 -4962 -4619 -4485 -4712 -4736 -4760 -4491 -4222 -3629 -3035 -3004 -2972 -2616 -2693 -3241
2945 -3241 -3356 -3319 -3714 -3454 -3194 -3573 -3952 -4285 -4618 -4898 -5177 -5419 -5661 -5903 -6145 -6065 -5984 -6084 -6184 -6243 -6302 -6253 -6205 -6105 -6006 -5813
2939 -5813 -5835 -5466 -5529 -5749 -5753 -5613 -5689 -5630 -5571 -5248 -4926 -4378 -3830 -3277 -3155 -3321 -3272 -3526 -3996 -4331 -4666 -4593 -4520 -4501 -4913 -5452 -5559
2933 -5559 -5756 -5953 -5980 -6007 -6035 -6062 -6074 -6085 -5989 -5892 -5713 -5533 -5029 -4525 -4544 -4562 -4819 -5076 -5027 -4762 -4466 -3737 -2626 -1515 -1016 -1237
2927 -1237 -2303 -3370 -4256 -4710 -5014 -5319 -5416 -5514 -5572 -5630 -5634 -5638 -5774 -5910 -5938 -5966 -6116 -6266 -6237 -6207 -6083 -5959 -5727 -5495 -5453 -5412 -5235
2921 -5235 -5059 -4935 -4380 -4153 -4141 -4145 -4581 -4854 -4912 -4989 -5065 -5102 -5138 -5366 -5161 -5200 -5239 -5446 -5654 -5753 -5853 -5847 -5840 -5834 -5828 -5599 -5370 -5015 -4228
2914 -4228 -3269 -2742 -2701 -2660 -3335 -4009 -4288 -4567 -4807 -5048 -4852 -5088 -5160 -5017 -4901 -5001 -5112 -5223 -5401 -5580 -5507 -5435 -5268 -5101 -4972
2909 -4972 -5059 -5507 -5522 -5558 -5377 -5093 -4377 -3336 -1575 330 1227 1492 1037 -480 -2429 -3855 -4560 -4797 -5034 -5078 -5123 -5114 -5104 -5095
2903 -5095 -5087 -4970 -4853 -4715 -4577 -4493 -4409 -4241 -4074 -3853 -3631 -3489 -3346 -2834 -1890 -775 340 2383 6010 11433 19593 36502
2898 36502 81498 199628 255969 89801 37850 19219 9661 4911 2033 -52 -1418 -2271 -2691 -3001 -3310 -3412
2894 -3412 -3515 -3661 -3807 -4250 -4262 -4353 -4444 -4499 -4122 -4059 -3996 -3726 -3457 -3236 -3016 -3264 -3511 -3713 -3915 -3864 -3814 -3898 -3983 -3960 -3936 -4070 -4205
2888 -4205 -4087 -3969 -3856 -3742 -3764 -3354 -3171 -2988 -2886 -2784 -2551 -2318 -2086 -1853 -1519 -1185 -850 -516 86 688 1290 1892 2554
2883 2554 3216 3891 4783 5600 6849 8724 10167 12347 14527 15186 16853 18812 21492 27197 38230 56526 71221 83089
2879 83089 106912 106156 94885 98575 96360 100331 123457 178289 296926 489995 614938 782981 1020304 914434
2876 914434 838089 769595 554909 430922 371605 329661 311483 345199 325193 252723 218709 168222 115574
2873 115574 87177 73904 66163 64328 66670 69443 74945 86063 101016 132533 188893 247125 284581 354732 389474
2869 389474 346584 356624 397632 475762 612224 843404 1018557 1090462 1261316 1085741 814097 683596
2867 683596 442623 258128 174598 137329 128723 133168 128252 140908 148811 112532 95121 77445 50983 36278
2863 36278 28053 23948 21427 19171 17923 14916 11693 9266 6407 4303 2920 1860 1233 736 671 467 -169 -734 -1083
2859 -1083 -1473 -1862 -2243 -2624 -2910 -3196 -3157 -3334 -3484 -3633 -3887 -3924 -3903 -3882 -3663 -3443 -3476 -3509 -3712 -3916 -3940 -3963 -3935 -3907 -3757 -3247
2853 -3247 -2585 -1922 -1403 -1677 -2462 -3247 -3776 -4089 -4357 -4121 -4006 -3891 -3853 -4319 -4731 -4926 -4708 -4490 -4533 -4791 -4960 -5129 -5203 -5277
2848 -5277 -5021 -4764 -4193 -4125 -4599 -4569 -4349 -4346 -4277 -4424 -4365 -3945 -3071 -2557 -2390 -2223 -2496 -3274 -4007 -4740 -5182 -5407 -5439 -5687 -5730 -5557
2842 -5557 -5722 -5526 -5559 -5593 -5495 -5398 -5519 -5640 -5788 -5720 -5654 -5805 -5712 -5619 -5472 -5326 -5215 -4744 -4685 -4841 -4908 -4614 -4384 -4658 -5165 -5673
2836 -5673 -5806 -5939 -5964 -5989 -6057 -6124 -6192 -6260 -6238 -6216 -6086 -5956 -6017 -6078 -6004 -6147 -6144 -5925 -5841 -5757 -5700 -5643 -5766 -5890 -5916 -5942 -5789 -5635 -5360
2829 -5360 -5085 -4940 -5011 -5211 -5411 -5516 -5621 -5759 -5896 -5769 -5641 -5731 -5604 -5653 -5702 -5620 -5537 -5396 -5039 -4725 -4410 -3748 -3447 -3362 -2916
2823 -2916 -2421 -1926 -1876 -1466 -1128 -1726 -2121 -2515 -2527 -3187 -3629 -3711 -4036 -4361 -4438 -4515 -4578 -4641 -4545 -4234 -3558 -3242 -2617 -1487 -2266
2818 -2266 -2541 -2144 -2683 -3078 -2681 -2340 -2358 -1881 -1764 -1684 -1819 -2166 -1865 -2071 -2277 -2367 -2456 -2644 -3337 -3669 -4001 -4465 -4569 -4385
2812 -4385 -4201 -4094 -3627 -3629 -3630 -3504 -3593 -3218 -2484 -1413 -1422 -761 -100 -1422 -2097 -2281 -2968 -3062 -2652 -2327 -2506 -3031 -3555 -3850 -3929
2806 -3929 -3998 -4283 -4289 -4079 -4022 -3749 -3620 -3274 -3240 -3565 -3552 -3540 -3449 -3142 -2943 -2743 -2877 -2795 -2772 -2388 -2182 -1760 -1207 -871 -717 -562
2800 -562 118 799 1390 1981 2801 3838 4867 5177 5266 5355 5800 6965 8373 10501 13261 17318 22870 30582 39941 51172
2796 51172 70613 108634 157977 184706 157406 120456 102423 105275 120478 150515 208836 326352 573677 1000895
2793 1000895 1448948 1579702 1333205 947718 612327 401235 300921 287456 347416 442664 480137 388126
2790 388126 260277 168291 121044 97851 84524 74797 68780 65498 61350 60226 62000 65647 74623 94690 134993
2786 134993 213463 327432 414466 387681 305156 252274 266366 357964 543903 813866 1104714 1286585 1172761
2784 1172761 779748 433833 248205 162391 118797 94070 80290 77888 90794 117671 135942 117773 81522
2781 81522 52904 37717 28148 19924 14149 10543 8233 6906 5579 4513 3446 2589 1733 876 19 -538 -1096 -1329
2776 -1329 -1563 -1820 -2077 -2280 -2483 -2677 -2871 -3064 -3258 -3348 -3438 -3582 -3726 -3952 -4178 -4296 -4414 -4389 -4364 -4339 -4314 -4377 -4440 -4503 -4565 -4682
2770 -4682 -4799 -4808 -4817 -4828 -4839 -4959 -5078 -5042 -5006 -5078 -5150 -5139 -5128 -5117 -5106 -5193 -5281 -5369 -5457 -5556 -5655 -5646 -5637 -5525 -5412 -5300 -5187 -5008 -4828 -4482 -4136
2763 -4136 -3641 -3362 -3205 -2616 -2771 -2927 -2592 -2041 -1317 -1024 369 756 -359 109 -335 -996 -1090 -752 -428 -1111 -578 -46 -638
2758 -638 -511 -1355 -1768 -2126 -2052 -2269 -3205 -3529 -3854 -3899 -3944 -4169 -4395 -4486 -4577 -4547 -4949 -4982 -5231 -5385 -5540 -5638 -5737 -5836 -5934 -5932 -5929 -5926 -5924 -5830
2751 -5830 -5736 -5319 -4901 -4323 -3746 -3708 -3671 -3693 -3716 -3280 -3851 -4169 -4487 -4597 -4275 -4159 -4474 -4546 -4618 -4531 -4875 -5301 -5726 -6043 -6359 -6279
2745 -6279 -6199 -6227 -6255 -6283 -6311 -6320 -6330 -6339 -6349 -6352 -6354 -6357 -6360 -6373 -6386 -6292 -6197 -6226 -6255 -6284 -6313 -6348 -6384 -6419 -6454 -6312 -6169 -6135 -6100 -6150 -6199 -6249 -6298 -6341 -6384 -6319
2737 -6319 -6254 -6370 -6486 -6422 -6358 -6445 -6532 -6619 -6706 -6601 -6496 -6571 -6645 -6639 -6633 -6627 -6620 -6566 -6511 -6564 -6618 -6631 -6644 -6656 -6669 -6687 -6704 -6613 -6523 -6439 -6355 -6379 -6403 -6497
2729 -6497 -6590 -6576 -6562 -6545 -6528 -6512 -6495 -6518 -6541 -6456 -6371 -6500 -6629 -6578 -6526 -6644 -6762 -6700 -6638 -6585 -6532 -6478 -6425 -6442 -6459 -6477 -6494 -6524 -6555 -6586 -6616 -6580
2722 -6580 -6544 -6508 -6472 -6524 -6576 -6520 -6463 -6353 -6242 -6131 -6020 -5973 -5925 -6057 -6189 -6246 -6302 -6358 -6415 -6498 -6581 -6557 -6532 -6507 -6482 -6456 -6431 -6406 -6381 -6355 -6330
2715 -6330 -6186 -6042 -6006 -5970 -6042 -6114 -5907 -5701 -5175 -4218 -3234 -2682 -3026 -2939 -2906 -3304 -4101 -4466 -4345 -3504 -2619 -2165 -2468 -3492 -4619
2709 -4619 -5314 -5685 -6056 -5995 -5934 -5765 -5596 -5458 -5319 -5577 -5834 -5921 -6007 -5985 -5964 -5912 -5861 -5598 -4902 -3901 -3116 -2965 -2815 -2237 -2092
2703 -2092 -3152 -4213 -5040 -5435 -5676 -5486 -5429 -4940 -4239 -3323 -2573 -2831 -3498 -4598 -5258 -5485 -5658 -5831 -5437 -5044 -5334 -5624
2698 -5624 -5988 -6352 -6248 -6144 -6219 -6295 -6425 -6555 -6492 -6428 -6419 -6410 -6418 -6427 -6436 -6444 -6454 -6463 -6473 -6482 -6515 -6549 -6541 -6534 -6495 -6672 -6660 -6216 -5938 -5875 -5993 -5894 -5898 -5181
2691 -5181 -5032 -5099 -5602 -5673 -5290 -4187 -2567 -948 -940 -2229 -3637 -4612 -5300 -5555 -5622 -5256 -4864 -4903 -5318 -5734 -5996 -6258 -6320 -6382
2685 -6382 -6336 -6290 -6480 -6670 -6609 -6547 -6400 -6253 -6308 -6004 -5603 -5202 -5034 -5371 -5599 -5827 -5654 -5121 -4570 -3659 -2352 -1694 -2600 -4155
2680 -4155 -5413 -6023 -6299 -6358 -6512 -6450 -6456 -6462 -6400 -6338 -6321 -6304 -6516 -6513 -6620 -6727 -6632 -6753 -6806 -6643 -6669 -6695 -6714 -6732 -6678 -6408 -6470 -6317 -6419
2673 -6419 -6162 -6135 -6107 -6125 -6143 -6099 -6270 -6280 -6290 -6199 -6323 -6326 -6330 -6392 -6455 -6639 -6607 -6651 -6694 -6746 -6798 -6614 -6790 -6763 -6736 -6799 -6862 -6817 -6771 -6787 -6803 -6818
2666 -6818 -6834 -6804 -6773 -6757 -6740 -6705 -6885 -6836 -6786 -6806 -6826 -6792 -6758 -6748 -6737 -6673 -6609 -6641 -6674 -6653 -6632 -6706 -6779 -6672 -6566 -6659 -6753 -6739 -6724 -6746 -6768 -6573
2658 -6573 -6595 -6587 -6796 -6774 -6753 -6770 -6571 -6547 -6524 -6579 -6634 -6757 -6663 -6683 -6702 -6586 -6686 -6670 -6654 -6759 -6865 -6869 -6873 -6697 -6521 -6613 -6704 -6688 -6672 -6732 -6793
2651 -6793 -6745 -6697 -6770 -6843 -6807 -6772 -6770 -6769 -6767 -6766 -6703 -6639 -6684 -6729 -6669 -6609 -6658 -6706 -6699 -6693 -6740 -6788 -6770 -6752 -6788 -6825 -6898 -6972 -6865 -6759 -6703 -6648 -6700 -6752 -6704 -6656
2643 -6656 -6716 -6775 -6761 -6747 -6732 -6718 -6645 -6573 -6582 -6590 -6950 -6878 -6796 -6715 -6742 -6769 -6795 -6822 -6831 -6840 -6741 -6641 -6661 -6682 -6702 -6722 -6708 -6694 -6789 -6883 -6790 -6697 -6713 -6728 -6698
2635 -6698 -6668 -6747 -6825 -6925 -7024 -6944 -6864 -6726 -6588 -6702 -6817 -6803 -6788 -6828 -6868 -6806 -6743 -6789 -6834 -6799 -6763 -6728 -6692 -6705 -6718 -6731 -6744 -6744 -6744 -6691 -6637 -6731 -6824
2628 -6824 -6810 -6796 -6830 -6864 -6790 -6716 -6711 -6706 -6755 -6803 -6756 -6709 -6661 -6614 -6561 -6508 -6104 -5700 -5522 -6064 -6382 -6699 -6663 -6627 -6591 -6555 -6043 -5531 -5434 -5768 -6444
2620 -6444 -6687 -6733 -6778 -6719 -6659 -6654 -6649 -6701 -6753 -6805 -6857 -6831 -6804 -6777 -6750 -6754 -6758 -6761 -6765 -6732 -6700 -6721 -6742 -6683 -6623 -6672 -6720 -6783 -6845 -6854 -6863 -6845 -6828 -6811 -6794 -6774 -6755 -6735
2612 -6735 -6716 -6717 -6717 -6718 -6719 -6690 -6660 -6739 -6818 -6791 -6764 -6737 -6710 -6769 -6827 -6885 -6944 -6896 -6849 -6801 -6754 -6831 -6908 -6877 -6845 -6826 -6806 -6894 -6982 -6826 -6671 -6695 -6719 -6746 -6773
2604 -6773 -6745 -6718 -6714 -6710 -6760 -6810 -6783 -6755 -6782 -6808 -6819 -6830 -6841 -6852 -6865 -6877 -6781 -6685 -6733 -6781 -6829 -6877 -6855 -6833 -6811 -6789 -6731 -6673 -6616 -6558 -6284 -6010 -6348 -6686
2596 -6686 -6735 -6783 -6724 -6664 -6636 -6608 -6256 -5904 -6326 -6748 -6774 -6800 -6865 -6929 -6885 -6842 -6853 -6865 -6877 -6889 -6850 -6810 -6770 -6730 -6740 -6750 -6759 -6769 -6713 -6658 -6575 -6493 -6425
2588 -6425 -5926 -5966 -6439 -6522 -6606 -6779 -6520 -6518 -6516 -6379 -6241 -6325 -6408 -6491 -6575 -6619 -6664 -6709 -6753 -6753 -6753 -6752 -6752 -6786 -6820 -6854 -6888 -6877 -6866 -6963 -7060 -6932 -6804
2581 -6804 -6928 -7052 -6954 -6855 -6864 -6874 -6873 -6872 -6871 -6870 -6762 -6653 -6724 -6795 -6783 -6771 -6759 -6747 -6760 -6773 -6785 -6798 -6795 -6792 -6788 -6785 -6795 -6805 -6816 -6826 -6836 -6847 -6857 -6868 -6689 -6511
2573 -6511 -6656 -6802 -6833 -6864 -6787 -6711 -6668 -6625 -6690 -6755 -6792 -6828 -6865 -6902 -6883 -6863 -6844 -6824 -6843 -6862 -6881 -6900 -6881 -6862 -6843 -6823 -6763 -6703 -6750 -6798 -6879 -6960 -6933
2565 -6933 -6907 -6826 -6745 -6773 -6800 -6834 -6868 -6794 -6720 -6728 -6735 -6743 -6750 -6780 -6811 -6841 -6871 -6746 -6622 -6750 -6878 -6870 -6863 -6856 -6848 -6793 -6739 -6792 -6845 -6784 -6722 -6769 -6815 -6826 -6837 -6739
2557 -6739 -6642 -6682 -6722 -6762 -6802 -6862 -6922 -6801 -6681 -6725 -6769 -6813 -6857 -6852 -6847 -6842 -6837 -6832 -6827 -6822 -6817 -6791 -6764 -6738 -6712 -6756 -6799 -6843 -6887 -6786 -6685 -6692 -6699 -6701 -6704 -6706 -6709 -6777 -6846
2548 -6846 -6806 -6767 -6761 -6755 -6749 -6744 -6754 -6765 -6775 -6786 -6796 -6807 -6817 -6828 -6811 -6794 -6777 -6760 -6746 -6731 -6824 -6917 -6872 -6827 -6782 -6737 -6755 -6773 -6791 -6809 -6842 -6875 -6800 -6725 -6726 -6728 -6540
2539 -6540 -6713 -6720 -6944 -6758 -6932 -6855 -6777 -6721 -6666 -6755 -6843 -6702 -6778 -6808 -6838 -6774 -6709 -6685 -6660 -6839 -6657 -6709 -6761 -6926 -6874 -6719 -6781 -6815 -6850 -6837
2533 -6837 -6824 -6798 -6771 -6841 -6695 -6792 -6672 -6745 -6817 -6754 -6907 -6881 -6855 -6950 -7045 -6959 -6872 -6965 -7058 -6984 -6909 -6929 -6949 -6990 -6814 -6760 -6705 -6797 -6889 -6859 -6829 -6887
2525 -6887 -6729 -6814 -6683 -6714 -6746 -6777 -6809 -6685 -6777 -6748 -6719 -6776 -6834 -6783 -6732 -6796 -6861 -6938 -6800 -6749 -6699 -6742 -6786 -6796 -6807 -6709 -6611 -6632 -6652 -6659 -6667 -6788 -6694
2518 -6694 -6722 -6749 -6792 -6834 -6877 -6920 -6814 -6708 -6732 -6973 -6852 -6730 -6744 -6757 -6649 -6757 -6744 -6730 -6739 -6747 -6755 -6764 -6813 -6862 -6681 -6717 -6764 -6811 -6777 -6743 -6641 -6756
2510 -6756 -6749 -6742 -6763 -6783 -6804 -6824 -6791 -6758 -6832 -6907 -6843 -6779 -6823 -6868 -6858 -6848 -6838 -6829 -6807 -6785 -6764 -6742 -6705 -6668 -6738 -6809 -6794 -6779 -6765 -6750 -6749 -6748 -6746 -6745 -6695 -6644 -6701 -6759
2502 -6759 -6748 -6738 -6728 -6718 -6792 -6866 -6833 -6799 -6781 -6763 -6745 -6727 -6728 -6730 -6731 -6732 -6760 -6788 -6817 -6845 -6823 -6801 -6779 -6757 -6736 -6714 -6692 -6670 -6663 -6657 -6650 -6643 -6724 -6805 -6778 -6751 -6748 -6745 -6742 -6739
2493 -6739 -6695 -6652 -6716 -6780 -6794 -6808 -6822 -6835 -6829 -6822 -6816 -6809 -6828 -6847 -6866 -6884 -6858 -6832 -6806 -6779 -6735 -6691 -6647 -6603 -6664 -6726 -6787 -6849 -6900 -6951 -6921 -6676 -6878 -6719 -6737
2485 -6737 -6970 -6876 -6781 -6808 -6835 -6797 -6759 -6721 -6682 -6829 -6975 -6942 -6908 -6789 -6670 -6804 -6937 -6931 -6925 -6919 -6913 -6921 -6928 -6841 -6754 -6673 -6808 -6713 -6834 -6692 -6765 -6745
2477 -6745 -6724 -6640 -6772 -6782 -6792 -6715 -6637 -6790 -6726 -6730 -6735 -6870 -6789 -6580 -6731 -6774 -6817 -6743 -6669 -6703 -6737 -6730 -6724 -6595 -6683 -6708 -6732 -6914 -6879 -6676 -6833 -6896
2470 -6896 -6742 -6717 -6692 -6776 -6859 -6699 -6755 -6798 -6841 -6823 -6805 -6787 -6769 -6751 -6733 -6715 -6697 -6776 -6856 -6827 -6798 -6830 -6862 -6881 -6899 -6973 -6830 -6709 -6805 -6680 -6915
2463 -6915 -6961 -7007 -6997 -6987 -6977 -6966 -6956 -6946 -6936 -6926 -6909 -6893 -6755 -6833 -6834 -6836 -6851 -6866 -6830 -6794 -6759 -6723 -6732 -6742 -6738 -6733 -6807 -6664 -6846 -6667 -6678 -6688 -6676 -6664 -6679
2455 -6679 -6694 -6831 -6751 -6712 -6673 -6594 -6730 -6890 -6834 -6819 -6803 -6706 -6826 -6945 -6849 -6838 -6827 -6816 -6805 -6717 -6846 -6853 -6860 -6846 -6832 -6819 -6805 -6792 -6778 -6764 -6751 -6749 -6746
2447 -6746 -6744 -6742 -6746 -6751 -6755 -6759 -6712 -6665 -6726 -6787 -6712 -6638 -6744 -6850 -6794 -6738 -6681 -6625 -6729 -6832 -6828 -6823 -6775 -6726 -6785 -6844 -6842 -6841 -6839 -6838 -6772 -6706 -6748 -6791 -6772 -6754 -6735 -6717
2439 -6717 -6693 -6670 -6647 -6623 -6681 -6739 -6797 -6854 -6808 -6761 -6714 -6667 -6647 -6627 -6715 -6803 -6728 -6653 -6685 -6718 -6697 -6675 -6654 -6633 -6638 -6644 -6650 -6656 -6634 -6613 -6592 -6570 -6576 -6581 -6587 -6593 -6598 -6604 -6609 -6615
2429 -6615 -6647 -6679 -6711 -6743 -6730 -6717 -6704 -6691 -6740 -6790 -6840 -6889 -6808 -6728 -6755 -6782 -6829 -6876 -6814 -6753 -6708 -6662 -6617 -6571 -6642 -6713 -6676 -6638 -6601 -6564 -6635 -6705 -6693 -6681
2422 -6681 -6669 -6658 -6697 -6737 -6777 -6817 -6791 -6765 -6739 -6713 -6815 -6918 -6840 -6762 -6813 -6863 -6914 -6964 -6899 -6834 -6822 -6811 -6767 -6724 -6788 -6852 -6856 -6860 -6917 -6975 -6919 -6863 -6807 -6751
2414 -6751 -6797 -6843 -6890 -6936 -6876 -6815 -6755 -6694 -6696 -6697 -6752 -6808 -6854 -6901 -6839 -6777 -6834 -6890 -6893 -6896 -6878 -6861 -6790 -6719 -6744 -6770 -6796 -6821 -6741 -6661 -6689 -6717 -6765 -6813 -6753 -6693
2406 -6693 -6765 -6838 -6802 -6767 -6694 -6622 -6657 -6692 -6717 -6742 -6712 -6683 -6680 -6676 -6673 -6669 -6722 -6774 -6646 -6518 -6560 -6603 -6591 -6579 -6635 -6691 -6639 -6587 -6654 -6720 -6678 -6637 -6652 -6667 -6682
2398 -6682 -6698 -6710 -6722 -6733 -6745 -6729 -6713 -6751 -6788 -6733 -6677 -6801 -6926 -6848 -6770 -6872 -6973 -6863 -6752 -6695 -6638 -6741 -6844 -6767 -6690 -6715 -6739 -6709 -6679 -6719
2391 -6719 -6759 -6691 -6622 -6714 -6805 -6789 -6772 -6834 -6896 -6903 -6911 -6875 -6839 -6910 -6982 -6946 -6910 -6766 -6622 -6693 -6763 -6780 -6797 -6738 -6679 -6620 -6560 -6601 -6642 -6575 -6508 -6410 -6311 -6464
2383 -6464 -6618 -6604 -6591 -6434 -6061 -5412 -3394 -252 -2654 -5037 -5907 -6318 -6513 -6628 -6528 -6414 -6516 -6629 -6742 -6761 -6780 -6749 -6718 -6795
2378 -6795 -6872 -6859 -6845 -6885 -6925 -6849 -6774 -6806 -6839 -6868 -6897 -6819 -6740 -6816 -6893 -6861 -6829 -6791 -6753 -6768 -6784 -6840 -6896 -6899 -6901 -6861 -6822 -6837 -6851 -6843 -6834 -6826 -6817 -6812 -6807 -6802 -6796 -6822 -6847
2369 -6847 -6841 -6835 -7086 -6832 -6862 -6892 -6897 -6901 -6906 -6911 -6888 -6866 -6844 -6821 -6848 -6875 -6902 -6929 -6893 -6856 -6820 -6784 -6767 -6750 -6733 -6716 -6726 -6736 -6746 -6756 -6825 -6894 -6963 -7031 -6990 -6949
2360 -6949 -6907 -6866 -6927 -6989 -6870 -6752 -6822 -6893 -6855 -6818 -6811 -6805 -6798 -6792 -6801 -6810 -6617 -6784 -6805 -6826 -6869 -6913 -6758 -6604 -6701 -6799 -6755 -6711 -6774 -6838 -6819 -6800 -6780 -6761
2353 -6761 -6772 -6783 -6902 -7021 -7017 -7012 -7007 -7002 -7006 -7009 -7012 -7015 -6980 -6945 -6910 -6875 -6933 -6991 -6870 -6748 -6790 -6833 -6875 -6918 -6860 -6803 -6745 -6688 -6705 -6721 -6738 -6755 -6813 -6870 -6820 -6770
2344 -6770 -6781 -6791 -6802 -6812 -6852 -6891 -6930 -6970 -6840 -6711 -6964 -6857 -6854 -6852 -6826 -6801 -6832 -6863 -6894 -6925 -6907 -6888 -6870 -6852 -6872 -6892 -6913 -6933 -6972 -7012 -6944 -6876 -6913
2337 -6913 -6951 -6988 -7026 -7008 -6989 -6971 -6953 -6935 -6916 -6898 -6880 -6907 -6934 -6962 -6989 -7032 -7075 -7010 -6945 -6924 -6903 -6882 -6860 -6956 -7052 -7040 -7028 -7033 -7038 -7044 -7049 -7014 -6978 -6943 -6908 -6939
2329 -6939 -6969 -6892 -6815 -6900 -6984 -6889 -6794 -6832 -6870 -6908 -6946 -6849 -6752 -6763 -6774 -6823 -6873 -6733 -6954 -6816 -6895 -6996 -6881 -6883 -6885 -6874 -6863 -6840 -6818 -6795 -6772 -6855 -6937
2321 -6937 -6840 -6742 -6739 -6736 -6733 -6730 -6788 -6845 -6795 -6745 -6782 -6819 -6857 -6894 -6893 -6891 -6989 -6870 -7024 -6818 -6801 -6784 -6837 -6890 -6835 -6780 -6846 -6913 -6872 -6830 -6876 -6922 -6968 -7015 -6991 -6967
2313 -6967 -6943 -6920 -6917 -6915 -6913 -6910 -6908 -6906 -6917 -6928 -6789 -6866 -7024 -6822 -6851 -6881 -6888 -6895 -6988 -7081 -6993 -6906 -6893 -6880 -6866 -6853 -6853 -6853 -6853 -6853 -6913 -6974 -6926 -6879 -6905 -6931 -6958 -6984 -6923
2304 -6923 -6861 -6813 -6765 -6630 -6710 -6777 -6629 -6840 -6835 -6952 -6852 -6748 -6643 -6692 -6741 -6877 -6797 -6839 -6881 -6787 -6694 -6781 -6867 -6839 -6811 -6891 -6754 -6886 -6803 -6705
2297 -6705 -6824 -6810 -6796 -6808 -6605 -6678 -6752 -6811 -6871 -6886 -6900 -6807 -6714 -6756 -6798 -6841 -6883 -6878 -6873 -6989 -6890 -6885 -6880 -6862 -6844 -6887 -6929 -6841 -6753 -6931 -6749 -6783 -6818 -6773
2289 -6773 -6944 -6873 -6801 -6830 -6643 -6758 -6873 -6852 -6832 -6933 -6818 -6814 -6810 -6901 -6775 -6900 -6808 -6802 -6795 -6952 -6749 -6735 -6936 -6852 -6768 -6698 -6843 -6797 -6967 -6920
2282 -6920 -6874 -6882 -6889 -6910 -6932 -6793 -6871 -6827 -6784 -6805 -6827 -6848 -6870 -6804 -6738 -6781 -6823 -6845 -6867 -6903 -6722 -6794 -6866 -6614 -6722 -6799 -6875 -6988 -7100 -6983 -7082 -6938
2275 -6938 -7010 -6961 -6911 -6983 -6839 -6960 -6864 -6876 -6888 -6842 -6796 -6930 -7064 -6949 -6835 -6766 -6913 -7044 -6959 -7009 -7059 -7068 -7078 -6980 -6881 -6857 -6833 -6930 -7028 -6952 -7093
2268 -7093 -7004 -6915 -7009 -7102 -7002 -6902 -7034 -6950 -6987 -7025 -6981 -6937 -6894 -6850 -6784 -6718 -6773 -6828 -6701 -6790 -6772 -6753 -6652 -6767 -6761 -6755 -6821 -6887 -6831 -6992 -6950 -6909
2261 -6909 -6867 -6825 -6946 -6850 -6777 -6920 -6730 -6900 -6880 -6861 -6909 -6957 -6884 -6811 -6828 -6630 -6720 -6810 -6920 -6814 -6708 -6818 -6761 -6704 -6769 -6834 -6838 -6842 -6859 -6877 -6791
2254 -6791 -6921 -6808 -6911 -6951 -6991 -6878 -6765 -6644 -6738 -6819 -6900 -6909 -6918 -6806 -6910 -6884 -6859 -6861 -6863 -6727 -6808 -6875 -6942 -6929 -6916 -6903 -6890 -6934 -6977 -6899 -6821 -6992
2246 -6992 -6947 -6965 -6767 -6776 -6785 -6889 -6992 -6772 -6551 -6668 -6786 -6698 -6826 -6941 -6840 -6896 -6736 -6806 -6876 -6777 -6894 -6782 -6669 -6759 -6850 -6832 -6814 -6744
2240 -6744 -6674 -6726 -6778 -6734 -6905 -6955 -7006 -6905 -6804 -6812 -6819 -6938 -7057 -6875 -6908 -6908 -6908 -7043 -6961 -6945 -6928 -6912 -6679 -6782 -6885 -6852 -6820 -6818 -6599 -6574 -6765
2233 -6765 -6655 -6760 -6758 -6755 -6772 -6789 -6792 -6795 -6920 -6828 -6845 -6862 -6961 -6845 -6850 -6856 -6863 -6870 -6675 -6840 -6877 -6914 -6878 -6843 -6673 -6719 -6809 -6900 -6986 -6857 -6849 -6840 -6796 -6752 -6816
2225 -6816 -6880 -6882 -6884 -6899 -6915 -6788 -6878 -6846 -6814 -6840 -6865 -6890 -6915 -6882 -6849 -6937 -6809 -6804 -6800 -6916 -6817 -6711 -6822 -6918 -6799 -6764 -6730 -6803 -6876 -6788 -6915 -6935 -6738
2217 -6738 -6801 -6865 -6928 -6991 -6802 -6830 -6843 -6857 -6849 -6841 -6833 -6825 -6810 -6795 -6888 -6765 -6883 -6786 -6810 -6834 -6763 -6908 -6838 -6767 -6686 -6820 -6820 -7035 -6962 -6890 -6952 -6799 -6807 -6814
2209 -6814 -6809 -6803 -6852 -6900 -6840 -6781 -6879 -6977 -6967 -6957 -6956 -6954 -6940 -6925 -7039 -6937 -6956 -6975 -6893 -6811 -6823 -6836 -6935 -6817 -6808 -6799 -6905 -6794 -6819 -6843 -6766 -6906 -6924 -6941
2202 -6941 -6856 -6770 -6815 -7076 -6924 -6772 -6692 -6829 -6814 -6800 -6920 -6825 -6783 -6742 -6795 -6848 -6833 -6819 -6804 -6790 -6840 -6889 -6831 -6773 -6809 -6845 -6760 -6891 -6928 -6965 -6907
2195 -6907 -6849 -6864 -6878 -6892 -6907 -6799 -6692 -6886 -6863 -6848 -6833 -6925 -6802 -6833 -6865 -6883 -6901 -6817 -6734 -6880 -6810 -6800 -6789 -6765 -6741 -6731 -6721 -6710 -6700 -6709 -6718 -6728 -6953
2187 -6953 -6782 -6827 -6751 -6891 -6901 -6912 -6913 -6915 -7010 -6745 -6803 -6646 -6745 -6843 -6738 -6850 -6900 -6734 -6676 -6834 -6921 -6793 -6679 -6780 -6798 -6816 -6834 -6852 -6926 -6784
2180 -6784 -6763 -6742 -6813 -6883 -6899 -6916 -6943 -6969 -6888 -6807 -6800 -6793 -6678 -6780 -6698 -6832 -6899 -6966 -6952 -6721 -6599 -6693 -6749 -6805 -6821 -6836 -6790 -6744 -6698 -6651 -6651 -6652 -6652 -6652 -6684
2172 -6684 -6715 -6639 -6562 -6688 -6814 -6710 -6606 -6401 -6555 -6616 -6676 -6652 -6627 -6495 -6579 -6565 -6766 -6559 -6567 -6607 -6648 -6661 -6674 -6501 -6544 -6573 -6602 -6573 -6545 -6557
2165 -6557 -6569 -6618 -6451 -6459 -6468 -6504 -6540 -6523 -6505 -6571 -6638 -6583 -6528 -6560 -6376 -6489 -6386 -6421 -6457 -6371 -6285 -6202 -6120 -6145 -6171 -6095 -6019 -5997 -5976 -5999 -6022 -5991 -5961
2158 -5961 -5871 -5782 -5693 -5604 -5630 -5657 -5791 -5926 -5821 -5717 -5721 -5509 -5504 -5282 -5006 -5235 -5129 -5239 -5030 -4821 -4774 -5087 -5239 -5390 -5486 -5366 -5368 -5370
2151 -5370 -5409 -5448 -5488 -5527 -5426 -5325 -5277 -5230 -5188 -5146 -5213 -5279 -5360 -5440 -5467 -5494 -5576 -5658 -5821 -5768 -5598 -5644 -5568 -5276 -5171 -5066 -5186 -5306 -5655
2145 -5655 -5789 -5900 -5794 -5671 -5332 -5078 -5185 -5316 -5447 -5493 -5538 -5608 -5678 -5726 -5773 -5859 -5585 -5378 -4667 -3973 -4071 -3949 -4330 -4811 -5292 -5480
2139 -5480 -5668 -5771 -5875 -5812 -5749 -5616 -5699 -5782 -5649 -5647 -5645 -5809 -5973 -6086 -6198 -6130 -6063 -5869 -5675 -5675 -5674 -5708 -5957 -6072 -6186 -6445 -6489 -6581 -6458
2132 -6458 -6600 -6527 -6493 -6460 -6574 -6471 -6342 -6573 -6584 -6595 -6467 -6555 -6440 -6540 -6533 -6525 -6591 -6656 -6722 -6787 -6775 -6762 -6750 -6737 -6706 -6676 -6753 -6830 -6692 -6553
2125 -6553 -6666 -6780 -6735 -6691 -6755 -6819 -6682 -6546 -6616 -6687 -6455 -6654 -6719 -6784 -6779 -6774 -6715 -6656 -6713 -6770 -6773 -6776 -6761 -6745 -6784 -6822 -6807 -6791 -6776 -6760 -6732 -6704 -6783
2118 -6783 -6863 -6848 -6833 -6818 -6803 -6856 -6910 -6855 -6800 -6772 -6744 -6959 -6742 -6780 -6818 -6721 -6624 -6723 -6822 -6741 -6659 -6638 -6617 -6704 -6791 -6697 -6603 -6617 -6631 -6711 -6791 -6817 -6843
2110 -6843 -6865 -6887 -7098 -6876 -6861 -6845 -6802 -6760 -6800 -6841 -6827 -6814 -6728 -6642 -6737 -6831 -6773 -6716 -6766 -6817 -6811 -6805 -6800 -6794 -6822 -6851 -6771 -6691 -6751 -6811 -6763 -6715 -6772 -6829 -6778
2102 -6778 -6727 -6773 -6820 -6921 -7022 -6974 -6926 -6905 -6884 -7070 -6824 -6821 -6818 -6865 -6913 -6960 -7008 -7012 -7016 -6912 -6808 -6719 -6631 -6723 -6814 -6740 -6666 -6772 -6878 -6917 -6956 -6942
2095 -6942 -6927 -6924 -6922 -6811 -6701 -6716 -6732 -6801 -6871 -6865 -6859 -6853 -6847 -6803 -6759 -6769 -6778 -6858 -6937 -6836 -6735 -6784 -6833 -6882 -6930 -6913 -6896 -6879 -6862 -6849 -6835 -6875 -6916 -6834 -6752 -6779
2087 -6779 -6805 -6913 -7022 -6950 -6879 -6900 -6921 -6834 -6748 -6819 -6891 -6855 -6819 -6784 -6750 -6769 -6789 -6835 -6881 -6820 -6758 -6787 -6816 -6899 -6982 -6923 -6865 -6752 -6639 -6682 -6726 -6769
2079 -6769 -6812 -6868 -6924 -6871 -6819 -6854 -6889 -6924 -6959 -6938 -6918 -6898 -6878 -6875 -6872 -6815 -6758 -6792 -6826 -6752 -6678 -6729 -6779 -6830 -6880 -6786 -6691 -6704 -6718 -6713 -6709 -6759 -6808 -6839 -6869 -6792
2071 -6792 -6714 -6777 -6840 -6722 -6605 -6613 -6622 -6738 -6855 -6780 -6704 -6809 -6913 -6869 -6825 -6889 -6953 -6886 -6818 -6859 -6899 -6832 -6764 -6804 -6845 -6765 -6684 -6712 -6740 -6836 -6933 -6975
2064 -6975 -7018 -6880 -6742 -6785 -6827 -6846 -6865 -6883 -6902 -6876 -6850 -6824 -6797 -6808 -6819 -6776 -6733 -6709 -6686 -6771 -6855 -6880 -6905 -6822 -6739 -6712 -6685 -6766 -6847 -6824 -6802 -6725 -6649
2056 -6649 -6725 -6801 -6824 -6846 -6882 -6918 -6846 -6774 -6748 -6721 -6803 -6884 -6817 -6750 -6683 -6616 -6692 -6768 -6844 -6920 -6861 -6802 -6743 -6683 -6734 -6784 -6834 -6885 -6922 -6958 -6887 -6816 -6784 -6752
2048 -6752 -6828 -6905 -6813 -6722 -6684 -6647 -6702 -6757 -6704 -6651 -6683 -6714 -6746 -6777 -6867 -6957 -6939 -6921 -6837 -6753 -6776 -6800 -6836 -6872 -6855 -6837 -6860 -6883 -6959 -7036 -6935 -6834 -6841 -6848
2041 -6848 -6879 -6910 -6940 -6971 -6961 -6952 -6942 -6933 -6942 -6952 -6854 -6755 -6744 -6733 -6776 -6818 -6763 -6708 -6761 -6814 -6850 -6887 -6923 -6959 -6857 -6755 -6761 -6767 -6802 -6837 -6819 -6800 -6818 -6836 -6855 -6873
2032 -6873 -6877 -6880 -6884 -6888 -6865 -6841 -6818 -6795 -6799 -6802 -6806 -6810 -6813 -6817 -6821 -6825 -6860 -6896 -6932 -6968 -6846 -6724 -6783 -6841 -6805 -6770 -6842 -6914 -6813 -6713 -6720 -6727 -6717 -6708 -6699 -6690 -6647 -6604 -6668 -6733 -6797
2023 -6797 -6860 -6815 -6771 -6770 -6769 -6822 -6875 -6849 -6822 -6904 -6986 -6929 -6872 -6923 -6974 -6911 -6848 -6893 -6938 -6953 -6968 -6928 -6889 -6933 -6976 -6912 -6848 -6817 -6787 -6810 -6834 -6814 -6795 -6884 -6973
2015 -6973 -6896 -6819 -6797 -6774 -6785 -6796 -6861 -6926 -6849 -6772 -6750 -6727 -6779 -6832 -6831 -6829 -6801 -6772 -6852 -6932 -6927 -6922 -6809 -6912 -6755 -6815 -6820 -6825 -6793 -6761 -6824 -6887 -6897 -6690 -6736
2007 -6736 -6782 -6546 -6671 -6823 -6759 -6852 -6945 -6845 -6744 -6751 -6757 -6534 -6527 -6560 -6592 -6692 -6792 -6698 -6604 -6740 -6660 -6698 -6735 -6706 -6676 -6728 -6780 -6778 -6776 -6777 -6778 -6833 -6889
2000 -6889 -6792 -6696 -6843 -6773 -6728 -6898 -6825 -6753 -6822 -6892 -6853 -6815 -6773 -6732 -6757 -6783 -6680 -6794 -6583 -6732 -6820 -6907 -6923 -6938 -6833 -6943 -6919 -6894 -7045 -6980
1993 -6980 -7051 -6905 -6859 -6813 -6753 -6694 -6760 -6825 -6877 -6929 -7083 -7020 -7025 -7029 -6928 -6827 -6956 -6869 -6889 -6910 -6850 -6789 -6911 -6817 -6777 -6737 -6914 -6875 -6849 -6823 -6820 -6818 -6694
1985 -6694 -6786 -6866 -6946 -6810 -6890 -6833 -6777 -6775 -6772 -6891 -6794 -6818 -6842 -6819 -6796 -6948 -6884 -6825 -6766 -6814 -6863 -6713 -6778 -6722 -6667 -6631 -6595 -6654 -6713 -6839 -6750 -6782 -6813
1978 -6813 -6703 -6593 -6591 -6589 -6653 -6717 -6660 -6818 -6808 -6797 -6746 -6695 -6657 -6620 -6555 -6706 -6813 -6704 -6784 -6864 -6837 -6810 -6918 -6810 -6677 -6759 -6815 -6871 -6832 -6793 -6876
1970 -6876 -6742 -6813 -6884 -6834 -6783 -6830 -6878 -6871 -6864 -6807 -6750 -6923 -6880 -6807 -6735 -6703 -6670 -6655 -6640 -6733 -6825 -6782 -6739 -6749 -6760 -6760 -6760 -6827 -6679 -6716 -6753 -6736 -6719 -6651 -6799
1962 -6799 -6826 -6853 -6802 -6751 -6822 -6893 -6735 -6793 -6865 -6721 -6581 -6657 -6707 -6756 -6726 -6696 -6667 -6637 -6600 -6564 -6649 -6518 -6552 -6586 -6741 -6680 -6514 -6563 -6600 -6420 -6379
1955 -6379 -6338 -6284 -6446 -6281 -6331 -6274 -6216 -6112 -6007 -5956 -5906 -5827 -5748 -5777 -5806 -5709 -5612 -5516 -5419 -5457 -5495 -5533 -5571 -5494 -5418 -5521 -5625 -5757 -5890 -5914
1949 -5914 -5939 -5971 -6003 -6143 -6283 -6274 -6266 -6365 -6465 -6491 -6518 -6653 -6788 -6734 -6680 -6734 -6787 -6712 -6636 -6668 -6700 -6690 -6679 -6669 -6658 -6588 -6517 -6627 -6736 -6731 -6726 -6721 -6715 -6733
1941 -6733 -6750 -6767 -6784 -6728 -6672 -6670 -6668 -6805 -6943 -6828 -6713 -6710 -6706 -6703 -6700 -6769 -6838 -6799 -6760 -6785 -6811 -6782 -6753 -6776 -6799 -6822 -6845 -6794 -6743 -6871 -7000 -6966 -6933 -6953
1933 -6953 -6973 -6954 -6934 -6915 -6896 -6831 -6766 -6809 -6852 -6832 -6812 -6792 -6772 -6738 -6705 -6851 -6998 -6944 -6890 -6837 -6783 -6809 -6835 -6861 -6887 -6909 -6932 -6900 -6869 -6890 -6911 -6824 -6737
1925 -6737 -6785 -6832 -6771 -6710 -6796 -6883 -6789 -6696 -6788 -6880 -6851 -6821 -6893 -6748 -6779 -6810 -6848 -6885 -6869 -6853 -6928 -7004 -7080 -7155 -7111 -7066 -7021 -6977 -6961 -6945 -6929 -6914 -6887 -6860
1918 -6860 -6711 -6778 -6860 -6942 -6857 -6772 -6839 -6906 -6905 -6905 -7077 -7034 -6883 -6948 -6971 -6994 -6828 -7022 -6981 -6940 -6921 -6902 -6928 -6954 -7075 -6836 -6917 -6999 -6950 -6901 -6919 -6938
1910 -6938 -6956 -6975 -6933 -6891 -6872 -6853 -6694 -6896 -6894 -6893 -6891 -6888 -6886 -6884 -6881 -6879 -6876 -6874 -6865 -6857 -7051 -6884 -6894 -6903 -6890 -6877 -6888 -6899 -7032 -6949 -6929 -6908 -6996 -6868 -6881 -6895 -6895 -6895 -6962
1901 -6962 -7029 -6894 -7119 -7072 -7025 -6879 -6948 -6829 -6710 -6771 -6831 -6912 -6776 -6857 -6937 -7022 -6891 -6989 -7088 -6971 -6854 -6859 -6864 -6791 -6934 -7037 -6924 -6813 -6919
1895 -6919 -7079 -6879 -7046 -6998 -6941 -6883 -6881 -6878 -6862 -6846 -6959 -6855 -6873 -6891 -6836 -6781 -6848 -6699 -6770 -6841 -6899 -6957 -6952 -6947 -6820 -6910 -6851 -6792 -6868 -6728 -6770 -6811
1887 -6811 -6718 -6840 -6800 -6761 -6829 -6898 -7026 -6938 -6864 -6790 -6855 -6920 -6999 -6862 -6918 -6974 -6922 -6870 -6750 -6847 -6822 -6796 -6779 -6761 -6878 -6780 -6681 -6798 -6902 -6790
1881 -6790 -6798 -6807 -6788 -6769 -6940 -6894 -6984 -6857 -6900 -6943 -6865 -6786 -6825 -6863 -6915 -6968 -6843 -6934 -6903 -6873 -6845 -6817 -6775 -6733 -6934 -6919 -6845 -6772 -6813 -6854 -6760 -6882 -6947
1873 -6947 -6796 -6780 -6764 -6768 -6772 -6777 -6781 -6913 -7046 -6876 -6923 -6984 -7044 -7010 -6976 -6977 -6978 -6979 -6980 -6938 -6897 -7058 -6858 -6863 -6868 -6850 -6832 -6866 -6900 -6813 -6941 -6971 -7002 -6938 -6873 -6870
1865 -6870 -6866 -6863 -6860 -6881 -6902 -6910 -6918 -7047 -6960 -6995 -7030 -7019 -7008 -6983 -6959 -7103 -7031 -7094 -6942 -6958 -6974 -6977 -6980 -6962 -6945 -6927 -6910 -6933 -6957 -6981 -7005 -7038 -7071 -6982 -6893 -7037
1857 -7037 -6964 -6783 -6819 -6836 -6853 -6907 -6960 -6776 -6951 -6924 -6897 -6892 -6888 -6870 -6852 -6943 -6818 -6694 -6785 -6847 -6909 -6877 -6844 -6901 -6958 -6880 -7018 -7051 -6867 -6913 -6959 -7034
1849 -7034 -6894 -6961 -7028 -7097 -6806 -6776 -6962 -6904 -6846 -6923 -6783 -6828 -6874 -6905 -6937 -6908 -6880 -6959 -7038 -7050 -7062 -7060 -7058 -7092 -6909 -6956 -7003 -7002 -7002 -7015 -7028 -6918 -7024
1842 -7024 -7143 -7047 -6919 -7007 -6960 -6912 -6920 -6928 -6922 -6916 -7052 -6972 -7014 -7055 -6982 -6908 -6943 -6977 -6917 -6857 -6905 -6953 -6929 -6906 -7004 -6886 -7011 -7136 -7068 -6999 -6987 -6975 -6963
1834 -6963 -6951 -6867 -6783 -6807 -6831 -6836 -6841 -6846 -6851 -6852 -6852 -6853 -6853 -6938 -7024 -6929 -6834 -6813 -6792 -6772 -6751 -6780 -6808 -6836 -6864 -6839 -6813 -6895 -6978 -6916 -6854 -6900 -6946 -6945 -6944 -6943 -6942 -6902 -6862 -6931
1825 -6931 -6999 -6972 -6946 -6920 -6893 -6954 -7014 -6966 -6919 -6925 -6932 -6938 -6944 -6978 -7012 -6938 -6864 -6968 -7072 -7198 -6964 -6890 -6816 -6900 -6983 -6982 -6980 -6978 -6976 -6956 -6937 -6918 -6898 -6906 -6913 -6921 -6929 -6924 -6919
1816 -6919 -7117 -6955 -6853 -6752 -6880 -7008 -6975 -6943 -6911 -6878 -6862 -6845 -6829 -6812 -6810 -6808 -6806 -6804 -6904 -7003 -6922 -6842 -6855 -6868 -6881 -6894 -6896 -6898 -6900 -6902 -6877 -6851 -6825 -6799 -6787
1808 -6787 -6775 -6871 -6966 -6825 -6684 -6723 -6762 -6781 -6800 -6818 -6837 -6781 -6725 -6849 -6973 -6933 -6893 -6839 -6786 -6872 -6743 -6735 -6726 -6691 -6656 -6743 -6613 -6705 -6797 -6687 -6936
1801 -6936 -6743 -6765 -6918 -6854 -6890 -6926 -6948 -6971 -6883 -6795 -6815 -6835 -6786 -6738 -6784 -6830 -6950 -6854 -6893 -6933 -6769 -6822 -6983 -6928 -6933 -6939 -7052 -6950 -6955 -6960 -6749 -6898
1794 -6898 -6840 -6782 -6989 -6981 -6816 -6866 -6876 -6887 -6991 -6880 -6768 -6873 -6865 -6858 -6877 -6897 -6795 -6909 -6915 -6921 -6817 -6929 -6920 -6911 -6915 -6920 -6924 -6928 -6954 -6980 -6884 -7005 -7038 -7070
1786 -7070 -6995 -6920 -7046 -6956 -6987 -7019 -7006 -6992 -7100 -6992 -7109 -7225 -7148 -7070 -7056 -7042 -7028 -7014 -6960 -6905 -6959 -7013 -6959 -6905 -6972 -6823 -6886 -6949 -7011 -6858 -6846
1779 -6846 -6834 -6931 -6811 -6856 -6900 -6918 -6935 -7014 -6876 -6968 -7060 -7032 -7005 -6978 -6950 -6929 -6909 -6888 -6867 -6913 -6958 -7003 -7048 -6947 -6846 -6925 -7004 -6982 -6960 -6939 -6917 -6839
1772 -6839 -6761 -6791 -6821 -6917 -7012 -6999 -6987 -6911 -6835 -6868 -6900 -6815 -6731 -6826 -6921 -6922 -6923 -6923 -6924 -6924 -6925 -6925 -6925 -6979 -7033 -6980 -6926 -6971 -7017 -6954 -6891 -6883 -6874 -6865 -6857 -6863 -6870 -6876 -6883 -6883 -6882 -6882 -6882 -6935
1761 -6935 -6988 -6933 -6878 -6911 -6943 -6976 -7009 -6994 -6980 -6965 -6951 -6936 -6922 -6907 -6893 -6949 -7005 -7061 -7116 -7037 -6958 -6987 -7016 -6960 -6903 -6955 -7006 -6976 -6947 -6917 -6888 -6884 -6880 -6877 -6873 -6930
1753 -6930 -6988 -6937 -6886 -6846 -6806 -6765 -6725 -6759 -6794 -6828 -6862 -6871 -6880 -6889 -6897 -6936 -6974 -6760 -6762 -6924 -6726 -6960 -6834 -6775 -6933 -6838 -6744 -6751 -6758 -6766 -6773 -6801 -6828 -6748 -6667 -6759
1745 -6759 -6851 -6835 -6818 -6856 -6894 -6932 -6969 -6940 -6911 -6882 -6852 -6693 -6533 -6625 -6717 -6668 -6618 -6749 -6880 -6844 -6808 -6772 -6736 -6785 -6834 -6884 -6933 -6962 -6991 -6912 -6833 -6849
1738 -6849 -6865 -6881 -6897 -6806 -6714 -6802 -6890 -6866 -6842 -6819 -6795 -6726 -6658 -6769 -6880 -6865 -6850 -6835 -6819 -6815 -6811 -6807 -6803 -6826 -6849 -6872 -6896 -6874 -6852 -6695 -6970 -7052 -7134 -7063
1730 -7063 -6992 -6888 -6783 -6786 -6790 -6797 -6804 -6812 -6819 -6840 -6861 -6881 -6902 -6807 -6712 -6725 -6738 -6872 -7007 -6961 -6916 -6906 -6895 -6979 -6848 -7062 -6845 -6857 -6870 -6890 -6911 -6824 -6736 -6838
1722 -6838 -6940 -6861 -6783 -6826 -6869 -6912 -6955 -6913 -6870 -6828 -6785 -6913 -7040 -6988 -6935 -6826 -6717 -6788 -6860 -6819 -6778 -6846 -6914 -6835 -6756 -6754 -6751 -6626 -6861 -6839 -6817 -6817
1715 -6817 -6818 -6818 -6819 -6745 -6671 -6778 -6884 -6828 -6772 -6824 -6876 -6836 -6795 -6754 -6714 -6704 -6693 -6791 -6889 -6881 -6873 -6919 -6965 -6859 -6753 -6850 -6946 -6781 -6976 -6847 -6934 -6927 -6919 -6925 -6932
1707 -6932 -6968 -7005 -6933 -6862 -6763 -6665 -6674 -6684 -6673 -6663 -6652 -6641 -6826 -7011 -6872 -6733 -6771 -6809 -6954 -7100 -6972 -6844 -6825 -6805 -6812 -6819 -6881 -6942 -6915 -6889 -6916 -6944
1699 -6944 -6841 -6738 -6815 -6892 -6961 -7030 -6919 -6808 -6889 -6969 -6869 -6770 -6824 -6879 -6825 -6772 -6713 -6654 -6649 -6644 -6720 -6797 -6621 -6445 -6488 -6531 -6628 -6725 -6754 -6784 -6759 -6735
1692 -6735 -6810 -6886 -6853 -6821 -6862 -6902 -6835 -6768 -6744 -6721 -6698 -6674 -6578 -6481 -6344 -6207 -5929 -5867 -5994 -6121 -6508 -6679 -6855 -6814 -6645 -6692 -6905 -6902 -6925 -6948
1685 -6948 -6715 -6697 -6811 -6708 -6687 -6665 -6670 -6676 -6748 -6605 -6542 -6480 -6404 -6327 -6389 -6452 -6514 -6576 -6740 -6905 -6889 -6874 -6842 -6811 -6780 -6749 -6749 -6749 -6763 -6776 -6716 -6871 -6770
1678 -6770 -6885 -6912 -6723 -6643 -6778 -6891 -6787 -6819 -6851 -6795 -6739 -6926 -6896 -6756 -6832 -6705 -6794 -6746 -6699 -6859 -7019 -6872 -6940 -6888 -6835 -6895 -6955 -6908 -6860
1671 -6860 -6768 -6677 -6751 -6826 -6936 -6830 -6805 -6779 -6675 -6787 -6818 -6849 -6920 -6774 -6953 -6771 -6805 -6840 -6798 -6755 -6850 -6944 -6930 -6916 -6908 -6900 -6892 -6884 -6789 -6694 -6672 -6865
1664 -6865 -6710 -6772 -6780 -6787 -6806 -6826 -6723 -6837 -6836 -6835 -6833 -6832 -6911 -6773 -6810 -6848 -6858 -6867 -6769 -6670 -6721 -6772 -6823 -6874 -6880 -6886 -6892 -6898 -6863 -6829 -6915 -7002 -6898 -7010 -7013 -6801 -6751
1655 -6751 -6700 -6744 -6788 -6821 -6854 -6886 -6919 -6784 -6648 -6801 -6737 -6829 -6705 -6567 -6646 -6670 -6694 -6609 -6741 -6683 -6625 -6621 -6616 -6822 -6811 -6741 -6672 -6727 -6782 -6797 -6812 -6634
1648 -6634 -6672 -6642 -6613 -6644 -6675 -6706 -6737 -6732 -6728 -6724 -6719 -6715 -6711 -6706 -6702 -6714 -6725 -6737 -6749 -6774 -6799 -6703 -6823 -6827 -6831 -6848 -6865 -6792 -6718 -6752 -6786 -6805 -6823 -6810 -6797 -6712 -6987 -7006
1639 -7006 -7024 -7000 -6975 -6950 -6925 -6961 -6997 -6902 -6808 -7015 -6863 -7075 -7071 -7101 -6914 -6998 -6866 -7028 -6974 -6919 -6865 -6855 -6845 -6956 -6852 -6808 -6764 -6815 -6866 -6886 -6907
1632 -6907 -6873 -6840 -6825 -6811 -6810 -6809 -6619 -6645 -6658 -6670 -6707 -6743 -6725 -6708 -6697 -6686 -6729 -6772 -6791 -6811 -6830 -6849 -6827 -6805 -6891 -6977 -7001 -7026 -6871 -6715 -6808 -6900 -6812 -6724
1624 -6724 -6760 -6796 -6724 -6652 -6718 -6783 -6740 -6697 -6630 -6562 -6495 -6427 -6470 -6513 -6556 -6598 -6621 -6643 -6666 -6688 -6735 -6781 -6773 -6765 -6812 -6858 -6797 -6736 -6796 -6856 -6808 -6760 -6768 -6775 -6836 -6898
1616 -6898 -6805 -6712 -6799 -6887 -6757 -6627 -6677 -6727 -6836 -6944 -6945 -6946 -6873 -6801 -6836 -6872 -6896 -6920 -6944 -6969 -7014 -7060 -6997 -6935 -6875 -6816 -6811 -6806 -6837 -6868 -6899 -6930 -6847 -6764
1608 -6764 -6681 -6598 -6649 -6700 -6750 -6801 -6770 -6740 -6709 -6679 -6683 -6687 -6691 -6694 -6756 -6817 -6770 -6723 -6742 -6761 -6727 -6692 -6725 -6759 -6793 -6826 -6790 -6754 -6718 -6682 -6686 -6691 -6587 -6484 -6737 -6990
1600 -6990 -6919 -6849 -6807 -6765 -6724 -6682 -6601 -6519 -6546 -6572 -6635 -6697 -6706 -6714 -6751 -6787 -6878 -6968 -6926 -6884 -6842 -6799 -6783 -6767 -6750 -6734 -6703 -6672 -6695 -6718 -6740 -6763 -6606 -6448
1592 -6448 -6431 -6415 -6452 -6489 -6510 -6530 -6604 -6679 -6654 -6629 -6659 -6688 -6641 -6593 -6599 -6605 -6641 -6677 -6712 -6748 -6798 -6848 -6790 -6732 -6751 -6770 -6789 -6807 -6674 -6541 -6227 -5914 -5635
1585 -5635 -5357 -5762 -6168 -6298 -6429 -6613 -6797 -6738 -6679 -6675 -6670 -6693 -6716 -6739 -6762 -6860 -6957 -6946 -6935 -6930 -6924 -6864 -6804 -6788 -6772 -6756 -6740 -6685 -6630 -6684 -6737 -6626
1578 -6626 -6515 -6584 -6653 -6544 -6435 -6505 -6576 -6602 -6628 -6653 -6679 -6711 -6743 -6774 -6806 -6775 -6743 -6712 -6680 -6657 -6634 -6610 -6587 -6519 -6452 -6331 -6209 -6228 -6248 -6375 -6502
1570 -6502 -6456 -6410 -6472 -6534 -6587 -6641 -6640 -6640 -6639 -6639 -6692 -6746 -6771 -6795 -6712 -6629 -6639 -6649 -6902 -6723 -6545 -6368 -6344 -6320 -6289 -6258 -6407 -6556 -6671 -6786 -6721 -6656
1563 -6656 -6716 -6776 -6728 -6680 -6674 -6668 -6609 -6549 -6374 -6199 -6277 -6354 -6338 -6323 -6361 -6399 -6443 -6487 -6638 -6790 -6768 -6745 -6723 -6700 -6711 -6722 -6734 -6745 -6751 -6756 -6762 -6768 -6763 -6757 -6725 -6692
1555 -6692 -7005 -6886 -6829 -6773 -6742 -6710 -6786 -6863 -6754 -6645 -6716 -6787 -6709 -6630 -6606 -6581 -6438 -6295 -5945 -5595 -5057 -4087 -1947 192 363 -1627
1549 -1627 -3927 -5220 -5781 -6126 -6278 -6430 -6442 -6454 -6466 -6478 -6508 -6538 -6568 -6598 -6563 -6528 -6601 -6674 -6656 -6637 -6619 -6601 -6633 -6665 -6644 -6622 -6759 -6896 -6867
1542 -6867 -6837 -6674 -6727 -6671 -6616 -6480 -6560 -6653 -6530 -6336 -6357 -6473 -6373 -6216 -6060 -5908 -5396 -4275 -1931 394 56 -2635 -4535 -5337
1537 -5337 -5635 -5916 -5981 -5956 -5931 -5775 -5620 -5361 -5606 -5618 -5631 -5481 -5331 -4615 -3682 -4144 -4967 -4739 -4512 -5000 -5704 -5971 -6023 -6070 -6117 -6266
1531 -6266 -5910 -5541 -4668 -3537 -4063 -5322 -5933 -6154 -6375 -6380 -6601 -6601 -6600 -6734 -6869 -6713 -6773 -6928 -6722 -6632 -6757 -6725 -6693 -6814 -6718 -6866
1525 -6866 -6798 -6779 -6760 -6849 -6722 -6725 -6728 -6718 -6708 -6589 -6471 -6604 -6738 -6647 -6555 -6428 -6084 -6061 -6399 -6452 -6506 -6563 -6403 -5982 -5562 -4685 -4025 -3504
1519 -3504 -3199 -3779 -5295 -5888 -6121 -6226 -6330 -6246 -6162 -6136 -6325 -6407 -6489 -6306 -6339 -6305 -6271 -6262 -6252 -5977 -5702 -5172 -4425 -3886 -3563 -3721
1513 -3721 -4311 -4932 -5770 -6193 -6399 -6489 -6578 -6591 -6604 -6563 -6522 -6522 -6523 -6523 -6524 -6553 -6583 -6369 -6588 -6651 -6714 -6696 -6679 -6714 -6749 -6784 -6819 -6821 -6822 -6823 -6825 -6809 -6793 -6777 -6762
1505 -6762 -6773 -6784 -6768 -6753 -6980 -6775 -6786 -6798 -6974 -6719 -6760 -6802 -6870 -6937 -6897 -6856 -6897 -6937 -6924 -6910 -6861 -6812 -6763 -6714 -6743 -6772 -6800 -6829 -6852 -6876 -6899 -6922
1497 -6922 -6878 -6834 -6898 -6962 -6989 -7017 -6937 -6857 -6814 -6771 -6782 -6793 -6795 -6798 -6800 -6803 -6804 -6805 -6915 -7024 -6893 -6762 -6812 -6861 -6891 -6921 -6897 -6873 -6867 -6861 -6855 -6849 -6831 -6813 -6975 -7136
1489 -7136 -6986 -6836 -6867 -6897 -6939 -6982 -6930 -6878 -6769 -6876 -7051 -6793 -6842 -6890 -6966 -7042 -7100 -7158 -7108 -7058 -6997 -6937 -6985 -7033 -7015 -6998 -6981 -6964 -7068 -7172
1482 -7172 -7024 -6876 -6957 -7038 -7119 -7200 -7148 -7096 -7044 -6992 -6978 -6963 -6948 -6933 -6979 -7025 -6963 -6901 -6899 -6896 -6894 -6892 -6943 -6995 -6938 -6882 -6857 -6833 -6808 -6783 -6772 -6761 -6750 -6739 -6575
1474 -6575 -6411 -6140 -5868 -5562 -5257 -5564 -5870 -6180 -6491 -6621 -6751 -6777 -6804 -6830 -6857 -6851 -6846 -6840 -6834 -6813 -6792 -6879 -6965 -6962 -6959 -6956 -6953 -6956 -6960 -6964 -6967 -6987 -7007 -7027 -7047
1466 -7047 -6997 -6948 -6898 -6848 -6860 -6872 -6775 -6679 -6538 -6397 -6255 -6114 -6336 -6558 -6671 -6785 -6842 -6900 -6957 -7014 -7022 -7029 -7036 -7043 -7044 -7045 -7045 -7046 -7061 -7077 -6985 -6893 -6906 -6920
1458 -6920 -6933 -6947 -6938 -6929 -6920 -6911 -6875 -6840 -6912 -6984 -7030 -7076 -6943 -6809 -6871 -6933 -6995 -7057 -6961 -6866 -6878 -6890 -6869 -6847 -6826 -6805 -6816 -6827 -6838 -6849 -6834 -6818 -6910 -7002 -7064
1450 -7064 -7126 -7007 -6889 -6924 -6958 -6993 -7028 -6957 -6887 -6816 -6746 -6781 -6816 -6851 -6887 -6830 -6774 -6826 -6878 -6869 -6860 -6851 -6843 -6846 -6849 -6851 -6854 -6873 -6892 -6803 -6713 -6790 -6867 -6943 -7020 -6955 -6890
1442 -6890 -6825 -6760 -6758 -6756 -6754 -6752 -6833 -6914 -6662 -6771 -6935 -6739 -6769 -6798 -6738 -6677 -6724 -6772 -6771 -6771 -6770 -6770 -6770 -6769 -6769 -6768 -6792 -6816 -6732 -6648 -6652 -6656 -6659 -6663 -6681 -6699 -6717 -6734 -6707 -6680
1433 -6680 -6833 -6986 -6828 -6671 -6693 -6716 -6747 -6779 -6702 -6626 -6692 -6758 -6716 -6674 -6685 -6697 -6709 -6721 -6723 -6724 -6726 -6727 -6713 -6698 -6792 -6886 -6876 -6865 -6855 -6845 -6909 -6972 -6928 -6884
1425 -6884 -6867 -6850 -6820 -7005 -7002 -6998 -7008 -7018 -6967 -6915 -6864 -6813 -6813 -6814 -6801 -6787 -6871 -6739 -6823 -6906 -6970 -6817 -6894 -6971 -7030 -7089 -7040 -6991 -7070 -7149 -7120 -7091 -7045 -6999 -6954
1417 -6954 -6908 -6931 -6955 -6858 -6976 -6970 -6964 -6972 -6979 -6942 -6904 -6867 -6829 -6873 -6917 -6839 -6977 -6870 -6763 -6778 -6793 -6812 -6831 -6971 -6896 -6904 -6911 -6906 -6900 -6869 -6839 -6673 -6723 -6855 -6770
1409 -6770 -6834 -6898 -6753 -6825 -6897 -6753 -6878 -7004 -7008 -7013 -6956 -6899 -7023 -7146 -7130 -7114 -6977 -7055 -7034 -7013 -7006 -6998 -6963 -6929 -6894 -6860 -6872 -6884 -6897 -6909 -6921 -6934 -6946
1401 -6946 -6959 -6894 -6830 -6910 -6774 -6721 -7028 -7146 -7049 -6948 -7064 -7045 -7026 -6966 -6907 -6847 -7004 -6901 -7014 -7019 -7024 -6946 -6867 -6776 -6900 -6995 -7089 -7018 -6946 -7016 -7086
1394 -7086 -7048 -7010 -7010 -7010 -6875 -6957 -7112 -7052 -7126 -7200 -7173 -7146 -7133 -7119 -6944 -6984 -7132 -7065 -6969 -6873 -6859 -6844 -6978 -6896 -6935 -6974 -6979 -6984 -6989 -6993 -6991 -6989 -7001 -7013 -6761
1386 -6761 -6725 -6905 -7086 -6953 -7037 -7215 -7033 -6932 -7047 -7019 -6990 -6961 -6933 -7025 -6902 -6914 -6926 -7046 -6950 -6914 -6879 -6938 -6997 -6988 -6980 -6971 -6962 -7046 -7130 -6984 -7054
1379 -7054 -6948 -6841 -6942 -7042 -7019 -7212 -7175 -7139 -7086 -7034 -6968 -6903 -7044 -6969 -7016 -7063 -7148 -7233 -7075 -7133 -7220 -7091 -6976 -7077 -7052 -7027 -7029 -7031 -6938 -7061
1372 -7061 -7063 -7065 -7059 -7052 -7033 -7013 -7069 -6910 -6872 -6834 -6846 -6858 -6870 -6882 -6901 -6920 -6953 -6985 -6832 -6895 -6741 -6948 -6898 -6849 -6821 -6794 -6893 -6992 -6982 -6973 -6986 -7000 -7013 -7026 -6997
1364 -6997 -6968 -7047 -7126 -6998 -6870 -6922 -6974 -6985 -6996 -7007 -7018 -6931 -6844 -6865 -6887 -6877 -6868 -6805 -6741 -6814 -6887 -6960 -7033 -7045 -7058 -7071 -7083 -7119 -7156 -7012 -6868 -6873 -6877 -6936
1357 -6936 -6995 -7086 -7178 -7089 -7000 -7014 -7027 -7040 -7054 -6944 -6833 -6831 -6829 -6919 -7010 -6992 -6975 -6955 -6935 -6915 -6896 -6931 -6967 -6894 -6822 -6780 -6738 -6750 -6762 -6793 -6824 -6855 -6886 -6869
1349 -6869 -6851 -6834 -6817 -6749 -6680 -6792 -6904 -6921 -6939 -6956 -6973 -6868 -6764 -6767 -6770 -6836 -6903 -6969 -7035 -6944 -6854 -6871 -6889 -6885 -6881 -6931 -6981 -6950 -6918 -6995 -7071 -7036 -7001 -6912
1341 -6912 -6823 -6875 -6926 -6924 -6921 -6904 -6887 -6924 -6961 -7039 -7118 -7016 -6915 -6894 -6874 -6907 -6941 -6889 -6837 -7096 -6995 -6983 -6971 -6922 -6874 -6958 -6826 -6788 -6967 -7078 -6973
1334 -6973 -7003 -7033 -6957 -6881 -6913 -6944 -6851 -6759 -6774 -6789 -6821 -6852 -6830 -6808 -6756 -6703 -6759 -6814 -6869 -6923 -6870 -6816 -6786 -6756 -6699 -6858 -6858 -6641 -6600 -6559 -6665 -6555 -6567
1326 -6567 -6578 -6622 -6666 -6733 -6799 -6643 -6847 -6848 -6849 -6834 -6818 -6789 -6976 -6932 -6888 -6858 -6828 -6823 -6818 -6746 -6674 -6722 -6554 -6494 -6650 -6685 -6720 -6588 -6457 -6539 -6622 -6704 -6786
1319 -6786 -6864 -6942 -6839 -6737 -6766 -6795 -6770 -6745 -6741 -6737 -6747 -6756 -6753 -6967 -6950 -6934 -6984 -7034 -6926 -6819 -6540 -6622 -6802 -6767 -6718 -6669 -6714 -6760 -6759 -6758 -6789 -6820 -7062
1311 -7062 -6944 -6727 -6725 -6771 -6817 -6958 -6739 -6829 -6704 -6609 -6732 -6841 -6951 -6966 -6981 -6976 -6970 -6965 -6959 -6880 -6800 -6828 -6857 -6922 -6987 -6943 -6900 -6898 -6895 -6892 -6890 -6818 -6746 -6674 -6602
1303 -6602 -6777 -6953 -6948 -6944 -6858 -6773 -6867 -6962 -6944 -6926 -6908 -6890 -6905 -6920 -6935 -6951 -7020 -7089 -7050 -7011 -7055 -7098 -7033 -6969 -6992 -7015 -7038 -7061 -6978 -6895 -6921 -6946 -6991 -7037
1296 -7037 -7082 -7128 -7125 -7122 -7119 -7116 -7113 -7111 -7108 -7105 -7118 -7131 -7144 -7157 -7163 -7169 -7176 -7182 -7184 -7185 -7079 -6973 -7015 -7057 -7019 -6980 -6727 -6907 -6843 -6780 -6800 -6819 -6839 -6859 -6872 -6885 -7141 -6965
1287 -6965 -6883 -6802 -6801 -6801 -6927 -7054 -7072 -7090 -7012 -6933 -6855 -6776 -6903 -7029 -6975 -6921 -6989 -7057 -6945 -6833 -6822 -6811 -6800 -6790 -6784 -6777 -6771 -6765 -6853 -6942 -6850 -6758 -6831 -6903
1279 -6903 -6976 -7049 -7024 -7000 -6976 -6951 -6943 -6934 -6912 -6890 -7091 -7076 -7003 -6930 -6944 -6959 -6973 -6988 -6970 -6952 -6934 -6916 -6954 -6992 -7152 -7096 -7194 -7292 -7196 -7100 -7128 -7157 -6982 -7168
1271 -7168 -7135 -7102 -7092 -7082 -7038 -6994 -7072 -7149 -7014 -7095 -7176 -7041 -7041 -7041 -7027 -7014 -7074 -7135 -7210 -7068 -7075 -7082 -7075 -7068 -7076 -7084 -6984 -6884 -6896 -6909 -6908 -6907 -6969 -6816 -7000 -6968
1263 -6968 -7125 -7065 -6993 -7136 -7070 -7005 -7060 -7116 -7091 -7065 -7027 -6988 -7040 -6877 -6957 -7036 -6906 -6993 -7079 -6950 -6986 -7023 -6925 -7043 -7078 -7112 -7255 -7037 -7023 -7009
1256 -7009 -6973 -6937 -6896 -6855 -6922 -6989 -7009 -7030 -7050 -7070 -7035 -6999 -6963 -6927 -6931 -6936 -6963 -6989 -6859 -7088 -7093 -7097 -7244 -7031 -6913 -7011 -6863 -6932 -7014 -6880 -6982 -7085
1249 -7085 -6993 -6902 -6882 -6862 -6949 -7037 -6996 -6955 -6968 -6981 -7022 -7063 -7104 -7145 -7087 -7029 -7078 -7128 -7178 -7228 -7169 -7111 -7067 -7023 -6979 -6934 -7082 -7229 -7124 -7019 -7065 -7112
1242 -7112 -7051 -6989 -6970 -6950 -6984 -7019 -7011 -7004 -6997 -6989 -6986 -6982 -6978 -6974 -6970 -6965 -6961 -6957 -6953 -6949 -6945 -6941 -6880 -6820 -6759 -6699 -6821 -6943 -6884 -6826 -6861 -6896 -6932 -6967 -6939 -6911 -6883 -6855 -6912 -6969 -6918
1232 -6918 -6867 -6911 -6954 -6944 -6933 -6939 -6945 -7005 -7065 -7047 -7028 -7009 -6991 -6992 -6994 -6995 -6997 -7022 -7047 -7072 -7097 -7123 -7148 -7120 -7091 -7025 -6960 -7002 -7044 -7075 -7106 -7029 -6952 -6875 -6798 -6829 -6860
1224 -6860 -6889 -6918 -6838 -6759 -6783 -6808 -6886 -6964 -6876 -6789 -6755 -6721 -6675 -6629 -6637 -6645 -6630 -6614 -6599 -6583 -6585 -6586 -6709 -6616 -6685 -6754 -6810 -6865 -6786 -6706 -6613 -6520 -6664 -6591 -6640
1216 -6640 -6689 -6659 -6629 -6721 -6597 -6708 -6820 -6810 -6800 -6812 -6825 -6837 -6849 -6776 -6703 -6846 -6773 -6884 -6780 -6661 -6759 -6844 -6928 -6860 -6791 -6665 -6755 -6899 -6827 -6770
1209 -6770 -6713 -6764 -6816 -6791 -6983 -6959 -6935 -6713 -6708 -6833 -6957 -6853 -6748 -6765 -6782 -6736 -6905 -6724 -6759 -6733 -6707 -6695 -6682 -6648 -6614 -6688 -6763 -6695 -6627 -6546 -6681
1202 -6681 -6706 -6732 -6662 -6593 -6718 -6844 -6861 -6878 -6837 -6796 -6687 -6795 -6808 -6820 -6739 -6657 -6625 -6593 -6736 -6664 -6581 -6498 -6569 -6639 -6714 -6574 -6541 -6724 -6795 -6866 -6865
1195 -6865 -6864 -6654 -6805 -6811 -7034 -7038 -7042 -7006 -6970 -6932 -6894 -6923 -6953 -6813 -6888 -6788 -6688 -6765 -6841 -6918 -6994 -6932 -6870 -6808 -6746 -6761 -6777 -6793 -6808 -6845 -6882 -6973 -7064
1187 -7064 -6972 -6879 -6894 -6909 -6955 -7001 -6938 -6876 -6870 -6865 -6859 -6854 -6841 -6829 -6817 -6804 -6842 -6879 -6917 -6955 -6962 -6969 -6976 -6983 -6948 -6913 -6824 -6735 -6841 -6946 -6872 -6798 -6814 -6830 -6847 -6863 -6828
1179 -6828 -6792 -6865 -6938 -6971 -7004 -6902 -6801 -7055 -6876 -6941 -7006 -7002 -6999 -6995 -6992 -6947 -6902 -6857 -6812 -6780 -6747 -6769 -6791 -6892 -6992 -6985 -6978 -6969 -6961 -7007 -7052 -7067 -7083 -7098 -7113
1171 -7113 -6978 -6843 -6816 -6789 -6830 -6871 -6911 -6952 -7045 -7138 -7123 -7108 -7033 -6958 -6992 -7025 -7014 -7004 -7047 -7091 -7093 -7094 -6988 -6882 -6974 -7066 -6933 -6799 -6646 -6924 -6852
1164 -6852 -6780 -6837 -6895 -6952 -7010 -7015 -7021 -7027 -7033 -7046 -7060 -7074 -7087 -7101 -7115 -7142 -7169 -7058 -7164 -7026 -7104 -7183 -7261 -7150 -7040 -7142 -6885 -7059 -7018 -6996 -6975 -7075
1156 -7075 -6960 -6824 -6905 -6837 -6985 -6980 -6975 -6984 -6992 -6875 -6758 -6892 -7027 -7029 -7031 -6723 -6774 -6869 -6964 -6901 -6838 -6846 -6854 -6917 -6979 -6886 -6794 -6931 -6852 -6810 -6768 -6753 -6738 -6811
1149 -6811 -6669 -6670 -6672 -7011 -6845 -6842 -6839 -6907 -6758 -6839 -6921 -6883 -6846 -6863 -6880 -6909 -6938 -6859 -6779 -6870 -6961 -6943 -6926 -6903 -6881 -6859 -6836 -6870 -6904 -6578 -6467 -6354 -6456
1141 -6456 -6559 -6661 -6684 -6706 -6661 -6833 -6823 -6813 -6682 -6766 -6868 -6754 -6653 -6768 -6774 -6781 -6787 -6794 -6895 -6780 -6787 -6793 -6766 -6738 -6710 -6683 -6719 -6756 -6685 -6613 -6571 -6529
1134 -6529 -6541 -6552 -6520 -6488 -6456 -6424 -6458 -6492 -6418 -6344 -6280 -6215 -6150 -6085 -6101 -6118 -6027 -5935 -5705 -5474 -5243 -5012 -4879 -4747 -5010 -5273 -5510 -5746 -5861
1127 -5861 -5976 -5920 -5648 -5497 -5347 -5351 -5356 -5482 -5392 -5502 -5611 -5694 -5776 -5910 -5829 -5882 -5935 -5811 -5902 -5764 -5626 -5099 -4571 -3733 -2895 -2103 -1528
1121 -1528 -1384 -1600 -2298 -2996 -3595 -4194 -4259 -4107 -3848 -3588 -3362 -3497 -3752 -4008 -4402 -4796 -5392 -5629 -5676 -5723 -5870 -5800 -5737 -5674 -5683 -5692
1115 -5692 -5672 -5292 -4525 -3757 -2720 -2042 -1243 -804 -932 -1564 -2237 -2909 -3403 -3537 -3396 -3039 -2477 -2132 -2011 -2107 -2603 -3316 -4042
1110 -4042 -4552 -4785 -5018 -5238 -5458 -5471 -5483 -5496 -5509 -5447 -5386 -5023 -4876 -4416 -3957 -3525 -3092 -2928 -2980 -3378 -3776 -4054 -4333 -4445 -4557
1104 -4557 -4473 -4606 -4495 -4600 -4671 -4742 -4812 -5099 -5251 -5403 -5460 -5517 -5497 -5477 -5457 -5437 -5491 -5545 -5599 -5653 -5757 -5860 -5963 -6067 -6006 -5945 -5871 -5796 -5941
1097 -5941 -5870 -5741 -5611 -5308 -5005 -4905 -4805 -4559 -4673 -4751 -4830 -5212 -5378 -5557 -5737 -5800 -5864 -5927 -5991 -5935 -5879 -5945 -5795 -5714 -5632 -5538 -5443 -5274
1091 -5274 -5105 -5116 -5127 -5148 -5169 -5190 -5211 -5223 -5235 -4946 -4872 -4950 -5028 -5119 -5210 -5335 -5460 -5585 -5710 -5747 -5784 -5822 -5859 -5754 -5650 -5545 -5441 -5311 -5181
1084 -5181 -4930 -4679 -4264 -3632 -2758 -1883 -1695 -2011 -2692 -3156 -3504 -3635 -3694 -3754 -3799 -3843 -3694 -3545 -3374 -2987 -2689 -2896 -3272 -3649
1079 -3649 -4071 -4276 -4191 -4107 -3995 -3883 -3788 -3476 -3083 -2690 -2075 -1099 29 1157 2085 2364 1797 1014 442 -128 -304 -119 315
1074 315 750 1388 2026 2542 3059 3494 3497 2807 2117 1594 1071 1105 1356 1594 2263 3050 4269 5799 7760 10330 13115 16130
1068 16130 19865 24038 28931 35480 45918 65579 100075 149279 203813 255317 295155 310129 291832 251413 201343
1065 201343 149024 102897 71489 52900 41908 35381 31100 28691 27336 25981 25065 25158 26465 29069 33064 38644
1061 38644 45303 52971 61069 69888 81245 97932 126487 178232 271601 414948 580499 740720 876510 948782
1058 948782 919598 806445 652837 485546 327781 211640 146684 111542 91924 79364 70981 64758 58753
1055 58753 52316 47175 44195 43186 44626 48389 54023 60697 68090 76384 86550 101298 125984 170744 253096 387836
1052 387836 554694 721768 868246 963899 963771 862238 709861 539783 369706 234673 155379 113124
1049 113124 90025 75883 66206 59068 51931 44082 36953 31657 27945 25474 24589 24945 26310 27855 30120 32749 36675
1045 36675 43837 56904 81119 122690 177489 234664 286600 323773 330583 301889 252583 195427 136877 87904
1042 87904 56529 39486 30014 24214 20325 17516 14886 11897 9250 7107 5594 4441 3511 2941 2444 1946 1358 770
1038 770 240 -72 -205 -337 -222 108 601 1598 3792 7211 7483 3651 1556 397 -302 -1218 -1832 -2086 -2363 -2641 -2742 -2628
1033 -2628 -2590 -2192 -1704 -856 -210 652 1127 1243 1124 646 248 -509 -965 -1060 -1035 -1009 -802 -235 -51 133 480 828 1419 1649
1027 1649 1779 1694 1397 1460 1538 1617 1921 2225 2781 3697 4762 6187 8019 10067 12223 14739 17390 20257 23575 26532 29795
1022 29795 34570 40488 47055 54512 63770 76764 98184 134063 194931 298666 464695 672258 797076 713157
1019 713157 506597 332062 222845 157927 119150 95181 79782 70072 63171 58100 54974 53469 54051 57128 62580
1016 62580 69856 78212 88613 99013 106961 116493 130022 149168 175480 210865 264760 353654 502968 740862
1012 740862 1040193 1274855 1322601 1174898 924354 690373 497728 353334 259770 201204 164621 143450
1010 143450 132695 123812 107458 89519 77157 70124 66440 64340 62976 62045 62914 65943 70305 75099 81171 90267
1006 90267 105581 131697 175906 251371 380356 582652 808858 887433 727017 488106 311721 205480
1003 205480 142690 104818 80719 65117 54253 45549 38232 31346 25559 21644 19098 17271 15475 12959 10379 8520
1000 8520 7295 6070 4999 3927 3123 2319 1768 1216 671 126 -418 -963 -1205 -1447 -1568 -1688 -1730 -1556 -1206 -424 278 981
995 981 1459 1505 1092 247 -777 -1803 -2396 -2989 -3488 -3555 -3616 -3461 -3702 -3727 -3877 -4027 -4109 -4192 -4237 -4282 -4327 -4373 -4550 -4727 -4625 -4522
989 -4522 -4576 -4197 -4124 -3619 -2791 -1963 -1315 -667 -299 -362 -911 -1893 -2741 -3590 -4272 -4594 -4628 -4662 -4727 -4792 -4795 -4797 -4651 -4865 -4903 -4942 -4895 -4848
982 -4848 -4734 -4621 -4831 -5042 -5153 -5265 -5322 -5380 -5221 -5063 -4850 -4638 -4519 -4399 -4460 -4521 -4846 -5171 -5442 -5713 -5764 -5816 -5759 -5703 -5766 -5829 -5785
976 -5785 -5740 -5776 -5812 -5795 -5777 -5704 -5631 -5706 -5421 -5599 -5777 -5752 -5727 -5861 -5996 -6076 -6157 -6098 -6040 -6162 -6285 -6199 -6113 -6135 -6157 -6120 -6084 -6156 -6227 -6239 -6251
969 -6251 -6083 -5915 -5965 -6015 -6066 -6116 -6131 -6146 -6054 -5961 -5949 -5938 -5926 -5914 -6046 -6177 -6200 -6223 -6239 -6254 -6215 -6176 -6141 -6105 -6070 -6034 -6118 -6202 -6232 -6261 -6281 -6301 -6212
961 -6212 -6124 -6137 -6150 -6217 -6283 -6254 -6224 -6086 -5948 -6041 -6134 -6119 -6103 -6009 -5914 -5928 -5941 -5881 -5820 -5759 -5698 -5707 -5715 -5616 -5516 -5315 -5115 -4635 -3795 -2859 -2860 -3491
954 -3491 -4482 -5207 -5572 -5888 -5987 -6094 -6201 -6172 -6144 -6253 -6146 -6282 -6202 -6118 -6034 -5828 -5623 -5498 -5373 -5249 -5124 -5112 -5100 -5071 -4825 -4648
948 -4648 -3968 -3126 -1923 -586 -40 -485 -1578 -2595 -3395 -4164 -4933 -5381 -5612 -5713 -5814 -5820 -5826 -6013 -6199 -6133 -6068 -6096 -6125 -6141 -5940
942 -5940 -5847 -5971 -5921 -5872 -5944 -6016 -5819 -5621 -5292 -4964 -4321 -3317 -2417 -2309 -3099 -4250 -5215 -5533 -5746 -5959 -6132 -6304 -6306 -6308 -6165 -6239
937 -6239 -6504 -6409 -6422 -6434 -6384 -6334 -6487 -6639 -6468 -6658 -6523 -6605 -6583 -6560 -6552 -6543 -6615 -6687 -6507 -6327 -6257 -6187 -6369 -6551 -6636 -6721 -6509 -6658 -6619 -6796
930 -6796 -6753 -6710 -6807 -6688 -6704 -6719 -6567 -6630 -6571 -6513 -6520 -6528 -6522 -6516 -6598 -6464 -6451 -6438 -6437 -6435 -6326 -6216 -6188 -6159 -6216 -6273 -6415 -6197 -6168 -6139 -5986 -5617 -5046
922 -5046 -4691 -3728 -3557 -4043 -3737 -4057 -4881 -5250 -5619 -5982 -6129 -6266 -6188 -6157 -6126 -6167 -6207 -6369 -6171 -6175 -6180 -6213 -6247 -6280 -6314 -6327 -6340 -6353 -6366
915 -6366 -6440 -6513 -6466 -6418 -6488 -6343 -6318 -6294 -6338 -6381 -6425 -6468 -6547 -6626 -6525 -6424 -6424 -6424 -6411 -6398 -6548 -6482 -6660 -6621 -6634 -6648 -6661 -6674 -6663 -6868 -6771 -6675 -6706
908 -6706 -6738 -6891 -6829 -6725 -6621 -6719 -6458 -6406 -6570 -6698 -6826 -6799 -6772 -6853 -6718 -6833 -6732 -6738 -6745 -6721 -6697 -6659 -6622 -6751 -6664 -6698 -6732 -6691 -6649 -6485
901 -6485 -6538 -6444 -6351 -6523 -6695 -6719 -6744 -6890 -6820 -6835 -6851 -6866 -6666 -6722 -6778 -6821 -6863 -6816 -6768 -6626 -6844 -6868 -6891 -6937 -6983 -7009 -7034 -7060 -7086 -7013 -6941 -6855
894 -6855 -6770 -6909 -6832 -6661 -6850 -6905 -6744 -6848 -6737 -6760 -6783 -6793 -6803 -6839 -6875 -6924 -6973 -6880 -7004 -7006 -7007 -6965 -6922 -6865 -7025 -7003 -6980 -7079 -6962 -7052 -6927
887 -6927 -6923 -6919 -6773 -6843 -6806 -6768 -6753 -6955 -7035 -6899 -7024 -6933 -6842 -6751 -6742 -6733 -6724 -6715 -6739 -6764 -6991 -6858 -6859 -6860 -6838 -6816 -6835 -6854 -6752 -6865 -6860 -6854 -6961 -6852 -7005
879 -7005 -6797 -6764 -6732 -6807 -6667 -6770 -6656 -6716 -6776 -6917 -6697 -6693 -6689 -6797 -6689 -6678 -6883 -7075 -7050 -7011 -6971 -7039 -6891 -6890 -6888 -6995 -6885 -6946 -7006 -6959
872 -6959 -6912 -6803 -6911 -6911 -6911 -6798 -6901 -6897 -6892 -6799 -6923 -6803 -6900 -6914 -6929 -6943 -7173 -7118 -7062 -6912 -6978 -6842 -6922 -6773 -6840 -6872 -6905 -6952 -6782 -6824 -6650
865 -6650 -6561 -6472 -6239 -5647 -5999 -6351 -6460 -6352 -6366 -6379 -6321 -6263 -6312 -6362 -6405 -6449 -6357 -6481 -6599 -6501 -6416 -6547 -6538 -6530 -6332 -6495 -6338 -6181 -6033
858 -6033 -6101 -6177 -6253 -6235 -6216 -6267 -6319 -6491 -6448 -6514 -6580 -6452 -6325 -6440 -6556 -6563 -6570 -6552 -6533 -6515 -6496 -6552 -6607 -6614 -6260 -6347 -6434 -6440 -6229 -6240 -6250 -6261 -6271
851 -6271 -6164 -6273 -6381 -6274 -6246 -6217 -6067 -5917 -6016 -6115 -6079 -6259 -6365 -6254 -6180 -6322 -6174 -6387 -6410 -6434 -6442 -6449 -6336 -6438 -6471 -6503 -6441 -6379 -6338
844 -6338 -6296 -6011 -5942 -6156 -6153 -6155 -5941 -6064 -6187 -6162 -6353 -6491 -6413 -6267 -6482 -6429 -6375 -6223 -6287 -6192 -6097 -6146 -6411 -6457 -6504 -6564 -6624 -6704 -6783 -6741
837 -6741 -6915 -6872 -6830 -7031 -7016 -6922 -6829 -6843 -6858 -6636 -6630 -6575 -6736 -6499 -6479 -6364 -6249 -6157 -6280 -6174 -6285 -6084 -6100 -5994 -6105 -6078 -6051 -6172
831 -6172 -6078 -6040 -6219 -6141 -6279 -6356 -6433 -6281 -6344 -6402 -6244 -6221 -6198 -6215 -6233 -6142 -6052 -5961 -5870 -5901 -5716 -5632 -5549 -5573 -5381 -5466 -5551 -5622 -5694 -5691 -5688 -5865
823 -5865 -6043 -6111 -6179 -6044 -6270 -6216 -6163 -6132 -6101 -6130 -6159 -6094 -6028 -5888 -5964 -6041 -5901 -5859 -5818 -5628 -5654 -5615 -5360 -5371 -5597 -5535 -5474 -5426 -5378 -5419 -5461
816 -5461 -5517 -5356 -5263 -5170 -4766 -4867 -5030 -4978 -4970 -4962 -4854 -4746 -4760 -4557 -4431 -4305 -4166 -4026 -4100 -4173 -4476 -4563 -4564 -4566 -4554 -4542 -4511 -4481 -4559 -4637 -4600
809 -4600 -4563 -4634 -4705 -4740 -4775 -4702 -4628 -4679 -4730 -4780 -4831 -4964 -5097 -5122 -5148 -5128 -5108 -5088 -5069 -5068 -5067 -4959 -4850 -4847 -4844 -4841 -4839 -4875 -4911 -4947 -4983 -5235 -5487 -5487 -5487 -5564
801 -5564 -5641 -5611 -5580 -5675 -5771 -5758 -5746 -5695 -5644 -5701 -5758 -5702 -5647 -5592 -5536 -5411 -5286 -5162 -5037 -5074 -5111 -5391 -5239 -5313 -5387 -5434 -5481 -5483 -5485 -5487 -5490 -5409 -5329 -5249
793 -5249 -5169 -5015 -4860 -4679 -4498 -4056 -3183 -1202 4666 10911 1745 -2009 -3317 -3732 -4147 -4229 -4311 -4390 -4470 -4442 -4413 -4485 -4558 -4873
788 -4873 -4756 -4747 -4739 -4703 -4667 -4686 -4706 -4833 -4960 -4946 -4932 -4917 -4903 -4903 -4904 -4905 -4905 -4994 -5082 -5170 -5259 -5332 -5406 -5299 -5193 -5268 -5344 -5312 -5280 -5226 -5172 -5226 -5280 -5336 -5391
780 -5391 -5406 -5420 -5277 -5349 -5588 -5611 -5604 -5380 -5458 -5536 -5412 -5503 -5473 -5443 -5373 -5304 -5275 -5246 -5475 -5487 -5513 -5540 -5621 -5702 -5675 -5649 -5616 -5583 -5658 -5733 -5822 -5910 -5891
772 -5891 -5872 -5884 -5896 -5678 -5677 -5692 -5708 -5629 -5550 -5442 -5334 -5172 -5011 -4940 -4870 -4497 -4341 -4288 -4235 -4435 -4634 -4804 -4758 -4833 -4908 -4964 -5019 -4894 -4770
765 -4770 -4850 -4930 -5154 -5162 -5003 -5204 -5176 -5147 -5275 -5187 -5099 -5011 -4936 -4644 -4421 -4197 -3982 -3767 -3629 -3491 -3301 -3470 -3689 -3908 -4088 -4268 -4204
759 -4204 -4357 -4529 -4484 -4409 -4333 -4218 -4318 -4478 -4637 -4733 -4828 -4964 -5100 -5125 -4933 -4958 -4983 -5014 -4830 -4744 -4659 -4693 -4367 -4351 -4336 -4261 -4187 -4280 -4372
753 -4372 -4750 -4913 -4944 -4976 -4986 -4996 -5019 -5043 -4908 -4989 -4916 -4844 -4881 -5278 -5378 -5478 -5456 -5649 -5613 -5577 -5563 -5550 -5429 -5307 -5367 -5427 -5379 -5330 -5339 -5349 -5412
746 -5412 -5475 -5564 -5653 -5720 -5786 -5876 -5606 -5552 -5498 -5304 -5327 -5214 -5318 -5387 -5456 -5646 -5837 -5879 -5920 -5962 -5788 -5960 -5916 -5872 -5828 -5783 -5739 -5803 -5867 -5786 -5704
738 -5704 -5745 -5785 -5699 -5829 -5730 -5631 -5641 -5650 -5615 -5364 -5252 -5356 -5339 -5106 -4976 -4845 -4881 -4918 -4948 -4979 -4982 -5202 -5272 -5127 -5048 -4970 -4986 -4786 -4762 -4738 -4708
731 -4708 -4679 -4528 -4376 -4508 -4423 -4392 -4578 -4564 -4551 -4510 -4470 -4242 -4231 -4206 -4181 -4139 -4096 -3959 -4183 -4302 -4422 -4262 -4319 -4336 -4353 -4289 -4225 -4133 -4257
725 -4257 -4219 -4181 -4057 -4148 -4117 -4087 -3974 -3862 -3641 -3421 -3263 -3106 -3191 -2845 -2762 -2679 -2568 -2458 -2355 -2251 -2148 -2044 -1986 -1927 -1869 -1811 -1597
719 -1597 -1383 -1020 -874 -799 -292 159 828 1288 1749 2416 3084 3850 4833 6306 8211 10474 13170 15973 19209 23165 28705
714 28705 37108 49687 68096 92121 114364 122060 112779 95864 79633 67002 57804 51053 46067 42090 39003 36925
710 36925 35513 35109 35726 37064 39644 43521 48860 56072 64814 75428 88456 102492 116241 130997 149021 171222
706 171222 198158 228695 261283 295167 325937 344464 343015 320395 286180 253549 226817 204839 186209 169452
703 169452 154837 142959 132971 123991 117082 111757 108539 107769 110064 116248 125565 138194 154163 171428 189323 210532
700 210532 238041 272896 315709 364714 414856 460244 495334 513285 510333 486785 442928 388269 337491 298380
696 298380 269315 245003 222014 199746 180466 164499 150246 137578 126278 116563 109120 104415 103309 106093 111982
693 111982 118880 125849 135555 150730 172097 200991 238382 283056 329314 365094 382870 391631 396215 387170 348599
690 348599 286281 229291 189568 161223 138931 120529 105840 94175 83631 73304 63727 55160 47708 41264 36207
686 36207 32446 30152 28865 28857 29569 31397 33945 37646 43219 51875 65284 85102 112266 144107 169466 169908 141400
682 141400 102245 70436 49141 35480 26796 21138 17325 14520 12166 9812 7557 5735 4306 3309 2299 1505 1106
678 1106 708 323 -61 -391 -722 -873 -1023 -1234 -1444 -1384 -1757 -2134 -2079 -2293 -2508 -2648 -2788 -2748 -2708 -2819 -2930 -2887 -2845 -2621 -2829
673 -2829 -2974 -3119 -3186 -3252 -3318 -3385 -3244 -3102 -3069 -3036 -3048 -3060 -3071 -3083 -3018 -2953 -3022 -3092 -2881 -3101 -3259 -3416 -3457 -3498 -3648 -3797 -3826 -3856 -3886 -3916
666 -3916 -3830 -3744 -3689 -3851 -4053 -3822 -3849 -3875 -3862 -3849 -3728 -3607 -3646 -3685 -3724 -3762 -3672 -3581 -3490 -3400 -3491 -3583 -3675 -3766 -3670 -3574 -3658 -3742 -3734 -3726 -3898 -4069
658 -4069 -4156 -4242 -4220 -4199 -4289 -4380 -4363 -4346 -4269 -4192 -4345 -4282 -4239 -4196 -4126 -4056 -4038 -3805 -3872 -3940 -3999 -4058 -4009 -3960 -3878 -3796 -3835 -3658 -3565 -3472 -3270 -3429
651 -3429 -3357 -3284 -3342 -3400 -3343 -3287 -3352 -3416 -3302 -3403 -3405 -3408 -3160 -3273 -3291 -3309 -3463 -3618 -3678 -3738 -3699 -3876 -3751 -3627 -3564 -3501 -3424 -3563 -3534 -3505 -3489
644 -3489 -3473 -3413 -3353 -3460 -3566 -3659 -3536 -3355 -3173 -3115 -3056 -2998 -2940 -2908 -2877 -2846 -2814 -2958 -3103 -3260 -3202 -3177 -3153 -3223 -3293 -3116 -2939 -2943 -2946 -2828
637 -2828 -2710 -2713 -2716 -2668 -2836 -2837 -2622 -2333 -2260 -2173 -1870 -1525 -1179 -929 -678 -512 -347 -290 -232 -414 -595 -776 -957 -1004 -1050 -916 -782 -746
631 -746 -711 -675 -639 -509 -379 -249 -119 -247 -374 -178 17 245 473 593 712 1057 1403 1748 2093 2438 2783 2885 3419 3713 4006
625 4006 4219 4432 4734 5037 5591 6146 6904 7662 8419 9177 10293 11408 12704 14432 16511 19022 21965 25628 30295 36258
620 36258 43679 53261 65363 81066 100442 123131 146368 163413 168088 157641 137385 114104 92353 74492 60312
617 60312 49157 40414 33543 28324 24113 20550 17707 15332 13390 11618 10279 9136 7993 7130 6266 5639 5012 4384
613 4384 3757 3304 2851 2263 2108 1862 1616 1397 1178 1036 894 859 825 872 918 857 796 717 638 558 479 367 254 249 244 138 31 32 34
606 34 -119 -273 -247 -221 -209 -197 -185 -173 -105 -37 30 98 99 101 102 104 -40 -185 -150 -115 -57 0 57 115 287 460 452 445 632 820 828 836 914 991 1069 1147
598 1147 1241 1336 1539 1742 2007 2273 2431 2589 2904 3219 3548 3877 4361 5061 5739 6776 7697 8258 8018 7129 6047 5181 4766
593 4766 4350 4099 3849 3994 3780 3820 4076 4210 4345 4457 4929 5090 5252 5395 5539 5682 5826 5661 5496 5584 5671 5734 5796 5967 6137
587 6137 6217 6297 6485 6673 6802 6932 7458 7983 8349 8715 9260 9806 10244 10682 11300 11917 12438 12959 13587 14216 14534 14852 15170 15488
582 15488 15952 16416 16881 17345 17944 18544 19539 20535 22098 23662 25523 27599 29910 32581 36341 41758 48206 54870 59716
577 59716 61754 61590 60922 61159 62477 64802 67127 68899 69662 69858 70055 70656 71978 73705 76153 79159 82597 86499 91121
573 91121 96607 103389 111322 120263 129230 138198 146995 155360 163481 171171 178679 185467 191733 196991 200656 202160 201864 200847
569 200847 200540 201242 202961 204679 206380 207072 207720 207935 207406 206444 205968 206213 208433 212814 220346 230902 244828 262355 283482
564 283482 307058 329648 345469 350505 348196 344160 340555 337050 333545 329459 323789 316201 307605 299833 291628 280939
561 280939 272699 268505 267335 268200 270073 271840 272599 272368 270841 267095 260900 254417 248942 244925 242492 241697 241623 241342 240340
556 240340 238960 238589 240680 244933 250823 257146 262852 268125 273399 279105 285290 292772 297805 287138 272673 260080 247901
553 247901 236154 224898 214650 206275 200348 197279 195506 190583 186956 186264 187733 191020 195891 202217 209550 217153 223461
549 223461 227997 230948 232784 233035 231535 228163 223459 217170 210112 203485 199002 197254 193504 187882 185230 185314 187305 190592
545 190592 194852 199543 205630 213013 221314 228319 235159 243007 251494 259550 264391 269233 273832 277422 280455 283057 284524
541 284524 284982 284320 282938 280746 278338 275413 272273 269582 268188 268405 270206 273506 277527 281983 286656 291266 296092 301269
537 301269 306879 313447 320735 328082 337302 347278 356533 363593 368780 372364 374653 374913 373013 369997 368278 368372 370050 372165
532 372165 374280 376187 377878 379835 382512 386418 391620 396461 398855 403897 411099 420174 431410 444558 459291 474510
529 474510 488720 500160 507998 512848 514674 513488 511294 509532 510218 514302 521122 530247 541532 554767 569873 585718
525 585718 602571 620962 639786 658070 675057 690311 703693 715617 726244 735642 744608 753015 758110 764672 774258
522 774258 785663 795772 802252 803115 799801 794038 787349 781379 777921 777776 780166 782556 781804 777451 774390 775795 781988
518 781988 791782 804659 819985 838174 859387 882878 907377 931120 951550 967926 983581 1002748 1027243 1056141
515 1056141 1087487 1119247 1149135 1175624 1197649 1217081 1236081 1255904 1277889 1302897 1331507 1364310 1402730 1447326
511 1447326 1498979 1557550 1623179 1696243 1776941 1864022 1954991 2045483 2131799 2213874 2295950 2384101 2482191 2593165
508 2593165 2719262 2863831 3031301 3227959 3459617 3734268 4060338 4446060 4898180 5420461 6022103
506 6022103 6719602 7537654 8513851 9698173 11142595 12876086 14858046 16895171 18496756 18871058
503 18871058 17658126 15411489 12892386 10560090 8603335 7039064 5810825 4853507 4099380 3495765
501 3495765 3019389 2635336 2321228 2058538 1844801 1680467 1569874 1539218 1672166 2155830 2943721 2887738
498 2887738 2064118 1537344 1243396 1057326 930572 836225 761251 701111 655734 619432 578988 538977 505953
495 505953 479123 456866 437922 423726 417452 423493 425932 406630 403892 400199 397802 391076 399185 436495 519176
492 519176 685100 1053964 1949060 3702147 4230492 2540912 1498264 997602 725299 570093 473363
489 473363 405871 359111 333236 324697 295851 257156 231568 213974 201421 191618 183975 180419 183345 191324 190517
486 190517 186289 185086 184387 185273 191109 209765 249218 324535 480168 829521 1522207 2043064 1405106 783712
483 783712 498218 350274 267899 218795 185728 162887 149895 145688 138689 122328 109711 101271 95177 90667
480 90667 86967 83987 83339 86293 92577 85754 76150 71011 67456 64621 62637 61085 59397 58430 57792 57153 57262 54922 52772
475 52772 51919 51632 51778 51910 52042 51706 51371 50568 49334 47231 44913 42904 41328 39977 38842 37990 38147 39730 42610 42109
471 42109 37144 34735 33910 34417 35357 33478 32320 31571 30823 29795 28767 28377 27986 27473 27393 27060 26942 26784 26627 26454 26282
466 26282 25799 25316 25003 24906 24917 24496 24428 24144 24207 24270 24152 24033 23690 23347 23035 23156 23088 23020 22990 22959 22748 22537 22330 22124 21918 21711
460 21711 21512 21312 21391 21471 21246 21453 21525 21598 21414 21231 21300 21369 21213 21057 20954 20852 20815 20778 20795 20812 20841 20870 20503 20136 19986 19836 20082
454 20082 20328 20473 20618 20870 21123 21526 21928 22151 22373 22834 23294 23809 24323 24711 25098 25378 25657 25872 26088 26123 26158 26229 26301 26480
448 26480 27091 27736 27660 27477 27293 27031 26768 26686 26604 26633 26662 26691 26720 26972 27223 27538 27421 27682 27943 27926 27908 27863 27818 27665 27512 27202 26891
442 26891 26689 26486 26454 26422 26416 26411 26442 26041 25703 25365 24951 24538 24124 23711 23249 22788 22326 21864 21609 21355 21100 20845 20536 20227 19918
436 19918 19609 19471 19333 19520 20138 21516 24478 26828 23849 19897 17530 16253 15407 14707 14007 13586 13165 12929 12692 12348 12004
432 12004 11773 11542 11131 10720 10480 10239 10052 9865 9582 9299 9381 9030 8942 9070 9189 9524 10706 13184 19358 27692 23180 14780
427 14780 10826 8457 6930 5835 5207 4580 4281 3983 3684 3385 3361 3337 3313 3289 3337 3385 3541 3696 3764 3831 4150 4469 4901 5333
421 5333 5944 6556 7080 7604 8866 11425 15131 15236 11219 8786 7277 6201 5543 5102 4815 4529 4436 4343 4242 4141 4041 3940
416 3940 4003 4067 4306 4761 5623 7206 9747 12721 12483 9508 7416 6620 6700 7501 7599 6113 4477 3848 3319 3006 2805 2388
411 2388 2215 2041 1985 1928 1872 1815 1845 1875 1905 1935 2029 2122 2467 2812 3363 3914 3853 3792 3479 3166 3105 3044 3021 2997 2505 2013 1701 1389 1185
404 1185 981 715 449 291 133 45 -42 -131 -219 -383 -546 -602 -657 -693 -728 -764 -799 -792 -785 -779 -772 -760 -749 -607 -465 -283 258 549 479 -4
397 -4 -487 -859 -870 -971 -857 -949 -1042 -1186 -1330 -1294 -1259 -1268 -1277 -1273 -1268 -1453 -1422 -1310 -1557 -1577 -1596 -1530 -1464 -1486 -1508 -1516 -1524 -1081 -422 582 796 -180
390 -180 -797 -1032 -1050 -1104 -1159 -1199 -1240 -1243 -1246 -1343 -1440 -1608 -1560 -1251 -1302 -1422 -1543 -1686 -1830 -1872 -1914 -1776 -1638 -1487 -1336 -1184 -1033 -777 -521
384 -521 -157 422 678 574 -33 -425 -647 -653 -889 -908 -878 -848 -804 -761 -571 -381 -83 214 -54 -324 -413 -502 -388 -274 -160 -46 276
377 276 599 1418 2020 2685 2990 2922 2638 2461 2285 2491 2697 2721 2746 2662 2578 2699 2820 2941 3062 3457 3853 3996 4140 4160 4179 4451
371 4451 4723 5172 5621 5990 6358 6695 7464 8314 9596 10669 11021 11194 11799 12606 13845 15067 15280 15494 16141 16991 17408 17083
366 17083 16973 17220 17682 18546 19626 20805 21984 23605 25657 28132 31328 34426 37956 42243 47249 53512 61358 70141
362 70141 78204 86480 97780 110466 127329 149846 181148 227159 294343 390621 517001 642391 701671 666161
359 666161 593923 530741 482106 444937 416266 394239 375812 356953 337662 319596 303689 290899 281422 275528
356 275528 273810 277498 285651 296288 307934 327216 353557 391509 449482 547851 719243 1035548 1604915 2284876
353 2284876 2180592 1465619 988728 712291 539412 427296 351620 298661 263130 243262 233045 218569
350 218569 201645 183407 170497 163530 160451 160883 164915 171874 181280 192703 207727 228398 256702 298779 363469
346 363469 460912 603148 777432 887622 823620 653756 480957 347190 254977 194305 153493 124922 104605
344 104605 90480 81955 76742 70580 61969 52958 45531 39438 34858 31471 28731 26469 24855 23399 22302 21191 20080
340 20080 19401 18722 18219 17932 17433 16430 15349 14628 13372 12332 11441 10549 9657 8982 8578 8175 7556 7153 6662 6171 5815 5459
335 5459 5117 4992 4745 4498 4409 4321 4408 4279 4314 4348 4346 4705 4988 5271 5486 5486 5086 4181 3669 3516 3603 3689 3554 2916 2222 1744 1510
328 1510 1275 994 713 541 368 340 312 244 175 87 216 277 338 604 871 1183 1279 1188 737 403 429 492 916 1456 1637 1322 791
322 791 252 -287 -580 -874 -937 -1217 -1222 -1227 -1354 -1481 -1574 -1668 -1775 -1666 -1485 -1304 -1217 -770 -381 -208 -309 -627 -846 -1066 -1353 -1640
316 -1640 -1653 -1666 -1679 -1692 -1649 -1607 -1687 -1550 -1515 -1479 -1066 -1301 -1380 -1459 -1255 -1051 -989 -928 -1046 -805 -57 1050 2073 2736 2619 2502 1607
310 1607 495 -534 -1205 -1465 -1726 -2003 -2064 -2139 -2213 -2101 -1989 -1908 -1827 -1587 -1852 -2134 -2200 -2203 -2206 -2317 -2788 -2891 -2993 -3104 -3215 -3423
304 -3423 -3415 -3515 -3615 -3712 -3592 -3593 -3595 -3481 -3368 -3421 -3475 -3582 -3472 -3484 -3497 -3426 -3355 -3297 -3240 -3059 -3094 -2994 -2895 -2912 -2713 -2731 -2748 -2560 -2155 -1549
297 -1549 -942 -7 928 1071 422 -354 -771 -1189 -1606 -1926 -2247 -2436 -2410 -2496 -2581 -2653 -2725 -2809 -2892 -2867 -2842 -2819 -2795 -2663 -2532 -2328 -2125
291 -2125 -1822 -1303 -383 1183 4362 8334 8965 4916 1667 -68 -915 -1547 -2003 -2243 -2476 -2709 -2834 -2959 -2878 -3013 -3229 -3085
286 -3085 -3137 -3189 -3326 -3247 -3223 -2983 -2851 -2719 -2584 -2450 -2171 -1677 -924 44 1458 1864 562 -955 -2032 -2677 -2993 -3094 -3302
281 -3302 -3294 -3444 -3594 -3730 -3866 -3879 -3892 -3905 -3918 -4054 -4191 -4219 -4248 -4269 -4289 -4310 -4331 -4389 -4448 -4300 -4152 -4415 -4245 -4138 -4031 -4032 -4034 -4035 -4036 -4032 -4029 -4025 -4021
273 -4021 -3950 -3878 -3987 -4096 -4060 -4024 -4096 -4169 -4184 -4200 -4216 -4232 -4286 -4340 -4287 -4233 -4201 -4170 -4139 -4107 -4063 -4018 -4081 -4145 -4141 -4137 -4133 -4129 -4184 -4239 -4186 -4132 -4095 -4058 -4021 -3983
265 -3983 -4017 -4051 -3937 -4038 -4295 -4119 -4092 -4066 -4063 -4061 -4059 -4057 -3992 -3927 -3862 -3797 -3710 -3622 -3328 -3034 -2418 -1370 -601 -264 -123 -414 -984 -1122 -1224
258 -1224 -1326 -1869 -2413 -2903 -3394 -3633 -3871 -3995 -4119 -4243 -4367 -4443 -4519 -4487 -4455 -4424 -4392 -4468 -4544 -4586 -4628 -4671 -4713 -4706 -4699 -4692 -4684 -4651 -4617 -4692 -4766
251 -4766 -4728 -4690 -4652 -4614 -4711 -4809 -4799 -4789 -4794 -4799 -4697 -4594 -4686 -4778 -4761 -4745 -4793 -4842 -4891 -4940 -4838 -4736 -4815 -4893 -4881 -4869 -4858 -4846 -4913 -4980 -4795 -4610 -4677
244 -4677 -4744 -4811 -4878 -4952 -5027 -4993 -4959 -4892 -4824 -4937 -5050 -5046 -5042 -5146 -5250 -5242 -5233 -5225 -5217 -5197 -5178 -5159 -5140 -5082 -5025 -4967 -4909 -5039 -5169 -5119 -5069 -4967 -4865 -4943
236 -4943 -5021 -5071 -5121 -5063 -5005 -5080 -5155 -5122 -5088 -5136 -5183 -5230 -5277 -5284 -5291 -5298 -5304 -5164 -5025 -5065 -5105 -5046 -4987 -5036 -5085 -5137 -5190 -5242 -5295 -5352 -5409 -5358 -5307 -5336 -5366 -5395
228 -5395 -5425 -5396 -5367 -5338 -5309 -5364 -5420 -5367 -5315 -5278 -5241 -5204 -5167 -5211 -5254 -5297 -5341 -5332 -5324 -5315 -5307 -5342 -5377 -5304 -5230 -5238 -5246 -5254 -5262 -5277 -5292 -5443 -5161 -5244 -5326 -5274 -5222 -5224
219 -5224 -5227 -5230 -5233 -5202 -5171 -5140 -5109 -5128 -5146 -5165 -5183 -5202 -5221 -5239 -5258 -5218 -5179 -5140 -5100 -5203 -5305 -5299 -5294 -5246 -5199 -5151 -5104 -5166 -5229 -5292 -5355 -5361 -5367 -5374 -5380 -5286 -5191 -5276
210 -5276 -5361 -5338 -5315 -5291 -5268 -5301 -5334 -5259 -5183 -5315 -5447 -5327 -5207 -5134 -5061 -5096 -5131 -5130 -5129 -5127 -5126 -5115 -5105 -5203 -5300 -5290 -5280 -5271 -5261 -5312 -5362 -5305 -5248 -5314 -5381
202 -5381 -5339 -5297 -5276 -5254 -5233 -5212 -5307 -5402 -5402 -5403 -5277 -5368 -5094 -5252 -5202 -5152 -5237 -5322 -5320 -5317 -5314 -5312 -5342 -5373 -5404 -5434 -5465 -5495 -5526 -5556 -5513 -5470 -5427 -5383 -5428 -5472
194 -5472 -5409 -5345 -5362 -5379 -5396 -5412 -5393 -5374 -5355 -5336 -5190 -5044 -5151 -5257 -5165 -5074 -5162 -5250 -5271 -5292 -5313 -5334 -5393 -5452 -5403 -5354 -5377 -5399 -5314 -5228 -5267 -5305 -5343
187 -5343 -5382 -5322 -5262 -5311 -5359 -5336 -5312 -5289 -5265 -5390 -5515 -5460 -5405 -5451 -5497 -5543 -5590 -5588 -5586 -5585 -5583 -5543 -5503 -5464 -5424 -5515 -5607 -5519 -5430 -5437 -5443 -5449 -5455 -5461 -5466 -5364 -5262 -5283
178 -5283 -5304 -5326 -5347 -5345 -5343 -5341 -5339 -5376 -5412 -5448 -5484 -5514 -5544 -5465 -5387 -5475 -5563 -5543 -5523 -5494 -5466 -5437 -5409 -5400 -5392 -5384 -5375 -5367 -5359 -5350 -5342 -5379 -5416 -5452 -5489 -5538 -5587 -5635 -5684 -5652 -5620
169 -5620 -5588 -5555 -5574 -5593 -5612 -5631 -5587 -5543 -5693 -5842 -5623 -5619 -5674 -5728 -5707 -5685 -5663 -5641 -5611 -5580 -5563 -5546 -5420 -5511 -5336 -5378 -5551 -5364 -5394 -5423 -5486 -5549
161 -5549 -5302 -5414 -5386 -5358 -5330 -5302 -5470 -5277 -5274 -5271 -5397 -5307 -5339 -5371 -5337 -5303 -5247 -5551 -5493 -5434 -5384 -5334 -5498 -5446 -5515 -5585 -5570 -5555 -5541 -5526 -5588 -5650
154 -5650 -5618 -5585 -5592 -5815 -5723 -5630 -5705 -5563 -5543 -5523 -5564 -5604 -5524 -5659 -5652 -5646 -5531 -5633 -5642 -5650 -5565 -5479 -5589 -5699 -5557 -5415 -5489 -5563 -5529 -5495 -5546 -5598 -5528
146 -5528 -5674 -5664 -5654 -5644 -5634 -5651 -5452 -5470 -5487 -5502 -5301 -5280 -5475 -5485 -5496 -5426 -5355 -5154 -5169 -5243 -5316 -5316 -5315 -5422 -5529 -5479 -5429 -5379 -5329 -5247 -5165 -5263
139 -5263 -5362 -5435 -5509 -5596 -5683 -5543 -5619 -5573 -5527 -5517 -5506 -5496 -5485 -5581 -5676 -5663 -5650 -5637 -5623 -5609 -5595 -5595 -5594 -5594 -5594 -5688 -5783 -5769 -5756 -5758 -5761 -5763 -5765 -5795 -5825 -5855 -5885 -5834
130 -5834 -5783 -5731 -5680 -5685 -5689 -5693 -5698 -5702 -5706 -5711 -5715 -5677 -5639 -5602 -5564 -5632 -5700 -5660 -5619 -5654 -5689 -5723 -5758 -5716 -5674 -5632 -5590 -5497 -5404 -5491 -5578 -5555 -5531 -5593 -5656 -5792 -5568 -5533
122 -5533 -5714 -5704 -5694 -5697 -5701 -5649 -5597 -5653 -5710 -5705 -5701 -5696 -5692 -5686 -5681 -5676 -5671 -5718 -5765 -5811 -5858 -5813 -5768 -5831 -5894 -5971 -6047 -5944 -5840 -5851 -5862 -5873 -5884 -5868 -5852 -5633 -5775
113 -5775 -5700 -5625 -5680 -5735 -5730 -5725 -5719 -5714 -5678 -5641 -5821 -5641 -5573 -5721 -5847 -5757 -5799 -5841 -5869 -5897 -5912 -5927 -5834 -5741 -5796 -5851 -5726 -5600 -5639 -5679 -5718 -5757 -5800 -5844
105 -5844 -5708 -5571 -5612 -5654 -5587 -5520 -5652 -5783 -5735 -5686 -5747 -5809 -5763 -5716 -5726 -5735 -5744 -5753 -5817 -5880 -5835 -5791 -5737 -5683 -5630 -5576 -5626 -5676 -5726 -5776 -5683 -5590 -5677 -5764
98 -5764 -5750 -5736 -5721 -5707 -5739 -5771 -5803 -5835 -5856 -5876 -5897 -5918 -5835 -5752 -5921 -6090 -5976 -5862 -5855 -5849 -5861 -5873 -5884 -5896 -5975 -6055 -6026 -5997 -6017 -6036 -6056 -6075 -6012 -5948
90 -5948 -5993 -6037 -5952 -5867 -5963 -6058 -6059 -6060 -6060 -6061 -6007 -5952 -5898 -5844 -5787 -5730 -5854 -5977 -5976 -5974 -5972 -5971 -5913 -5855 -5905 -5955 -6011 -6066 -6013 -5960 -5914 -5868 -5822 -5776 -5925 -6074 -5971
81 -5971 -5868 -5886 -5905 -5923 -5942 -5881 -5820 -5867 -5915 -5928 -5941 -5955 -5968 -5974 -5980 -5986 -5993 -6005 -6018 -6031 -6044 -5990 -5935 -5989 -6043 -6046 -6050 -5999 -5948 -5929 -5910 -5999 -6088 -6020 -5951 -5937 -5922 -5944
73 -5944 -5965 -5987 -6008 -5951 -5894 -5891 -5887 -5974 -6062 -6041 -6020 -6007 -5994 -5981 -5968 -6052 -6135 -6039 -5943 -5927 -5912 -5897 -5882 -5876 -5871 -5973 -6075 -6018 -5961 -5904 -5846 -5841 -5835 -5830 -5824 -5875 -5925 -5976
64 -5976 -6027 -6074 -6121 -6060 -5999 -6014 -6030 -5937 -5845 -5861 -5877 -5893 -5909 -5918 -5927 -5937 -5946 -5901 -5857 -5812 -5768 -5804 -5841 -5877 -5914 -5893 -5873 -5853 -5832 -5863 -5893 -5869 -5846 -5871 -5897 -5815 -5733
56 -5733 -5912 -6092 -6020 -5948 -5954 -5959 -5965 -5970 -5990 -6010 -6030 -6050 -5989 -5927 -5919 -5912 -5983 -6054 -6017 -5980 -5974 -5968 -6016 -6064 -6136 -6208 -6171 -6135 -6086 -6037 -5988 -5939 -6014 -6090 -5855 -5981 -5986 -5991
47 -5991 -6072 -6153 -6159 -6166 -6172 -6178 -6115 -6051 -6083 -6114 -6257 -6184 -6246 -6092 -6071 -6051 -6071 -6091 -6095 -6098 -5980 -6077 -6013 -5948 -6005 -6062 -6068 -6075 -6027 -5979 -5957 -5934 -6020 -6105 -6028 -5950 -5981 -6011
38 -6011 -5953 -5894 -5944 -5993 -5962 -5930 -5885 -5840 -5985 -5914 -5843 -5989 -5891 -5793 -5888 -5984 -6030 -6077 -6015 -5954 -5951 -5948 -5863 -5995 -6012 -5814 -5817 -5821 -5789 -5972 -5854 -5737 -5735 -5734 -5449
30 -5449 -5164 -4844 -5172 -5388 -5604 -5648 -5692 -5790 -5888 -5848 -5808 -5889 -5755 -5768 -5782 -5782 -5998 -5856 -5930 -6018 -6106 -5995 -6101 -6180 -6259 -6277 -6079 -6110 -6142 -6136 -6130
23 -6130 -6124 -6118 -6096 -6074 -6255 -6076 -6065 -6054 -6034 -6014 -5899 -6001 -5994 -5987 -5874 -5977 -5944 -5912 -6048 -5969 -6011 -6053 -6003 -5954 -6000 -6045 -6171 -6081 -5992 -6118 -6024 -5931 -5959
16 -5959 -5987 -5930 -5874 -5872 -5869 -5811 -5753 -5803 -5853 -5766 -5678 -5483 -5648 -5761 -5658 -5753 -5848 -5863 -5877 -5878 -6094 -6117 -6140 -6230 -6320 -6303 -6286 -6202 -6118 -6221 -6107 -6156 -6205
8 -6205 -6355 -6289 -6223 -6157 -6275 -6178 -6094 -6010 -6087 -6163 -6132 -6101 -6174 -6246 -6143 -6256 -6150 -6043 -6072 -6101 -6105 -6325 -6159 -5992 -6109 -6010 -6033 -6055 -6017 -5978 -5953
1 -5953 -5929 -5813 -5913 -5891 -5870 -5849 -5828 -5983 -5921 -5968 -6015 -6061 -5892 -6000 -6108 -6135 -6162 -6283 -6188 -6161 -6134 -6057 -5979 -6036 -5877 -5786 -5911 -5955 -5999 -6136 -6274
-6 -6274 -6159 -6045 -6041 -6038 -6035 -6032 -5933 -5833 -5914 -5994 -5998 -6001 -6071 -5926 -5944 -5962 -6075 -6187 -6246 -6305 -6310 -6314 -6203 -6092 -6089 -6086 -6108 -6131 -6262 -6393 -6187 -5981 -6027 -6073
-14 -6073 -6132 -6192 -5999 -5807 -5801 -5794 -5896 -5998 -5962 -5927 -5999 -6072 -6064 -6056 -6049 -6041 -6077 -6113 -6095 -6077 -5966 -5855 -6095 -5902 -5952 -6002 -6024 -6047 -6012 -5977 -5942 -5908 -5918 -5928
-22 -5928 -6046 -6164 -6050 -5937 -5931 -5926 -5913 -5901 -5942 -5984 -5950 -5917 -5829 -5741 -5853 -5964 -6022 -6079 -6021 -5962 -5904 -5845 -5912 -5978 -6045 -6111 -6123 -6135 -6039 -5943 -6078 -6214
-29 -6214 -6170 -6125 -6056 -5986 -6024 -6063 -6085 -6108 -6130 -6153 -6049 -5945 -6021 -6098 -6145 -6192 -6131 -6070 -5967 -5865 -5943 -6021 -5919 -5817 -5967 -6117 -5980 -5844 -6058
-36 -6058 -5841 -5932 -6024 -6035 -6046 -6019 -5992 -5965 -5939 -5996 -6054 -6003 -5953 -5957 -5962 -5966 -5971 -5975 -5980 -5985 -5989 -5968 -5948 -6035 -6122 -6122 -6121 -6121 -6120 -6144 -6168 -6192 -6215 -6088 -5961 -6217 -6112 -6150
-44 -6150 -6187 -6202 -6216 -6182 -6147 -6315 -6122 -6043 -5963 -5969 -5975 -6001 -6027 -6053 -6079 -6124 -6170 -6215 -6260 -6226 -6193 -6159 -6126 -6276 -6425 -6323 -6221 -6191 -6160 -6130 -6100 -6199 -6298
-52 -6298 -6289 -6281 -6281 -6281 -6281 -6281 -6315 -6349 -6275 -6201 -6232 -6264 -6296 -6327 -6297 -6267 -6237 -6206 -6163 -6119 -6255 -6391 -6348 -6304 -6369 -6434 -6386 -6338 -6290 -6242 -6252 -6263 -6273 -6284 -6362 -6440 -6266
-60 -6266 -6092 -6094 -6096 -6205 -6315 -6310 -6305 -6300 -6295 -6268 -6240 -6321 -6401 -6376 -6351 -6326 -6300 -6290 -6280 -6270 -6260 -6277 -6294 -6311 -6328 -6257 -6186 -6115 -6045 -6073 -6101 -6116 -6130 -6186 -6025 -6107
-69 -6107 -5973 -6107 -6241 -6240 -6239 -6332 -6210 -6209 -6208 -6173 -6138 -6225 -6095 -6134 -6172 -6076 -6195 -6186 -6177 -6182 -6187 -6245 -6304 -6268 -6232 -6237 -6458 -6440 -6206 -6119 -6248 -6431 -6254 -6347
-76 -6347 -6224 -6308 -6176 -6257 -6121 -6202 -6283 -6329 -6376 -6302 -6443 -6394 -6344 -6309 -6273 -6271 -6268 -6266 -6264 -6257 -6249 -6349 -6449 -6365 -6281 -6305 -6328 -6326 -6323 -6455 -6372 -6270 -6384 -6242
-84 -6242 -6316 -6293 -6269 -6246 -6438 -6381 -6324 -6482 -6281 -6283 -6285 -6467 -6288 -6313 -6337 -6352 -6368 -6275 -6397 -6412 -6427 -6334 -6456 -6458 -6459 -6426 -6394 -6375 -6356 -6215 -6291 -6244 -6198
-92 -6198 -6223 -6247 -6271 -6295 -6272 -6249 -6213 -6393 -6381 -6370 -6386 -6402 -6276 -6366 -6335 -6303 -6318 -6332 -6325 -6317 -6503 -6328 -6370 -6196 -6166 -6136 -6200 -6265 -6269 -6273 -6277 -6281 -6230 -6180 -6238
-100 -6238 -6296 -6255 -6214 -6173 -6131 -6200 -6269 -6158 -6047 -6175 -6304 -6180 -6057 -6120 -6183 -6192 -6202 -6168 -6134 -6209 -6283 -6270 -6257 -6298 -6339 -6300 -6262 -6223 -6184 -6143 -6102 -6182
-107 -6182 -6262 -6175 -6304 -6460 -6255 -6180 -6105 -6116 -6127 -6155 -6184 -6159 -6133 -6098 -6062 -6135 -6207 -6239 -6271 -6249 -6227 -6246 -6265 -6176 -6087 -6166 -6245 -6125 -6222 -6345 -6107
-114 -6107 -6140 -6172 -6142 -6111 -6081 -6050 -6152 -6254 -6248 -6241 -6171 -6100 -6210 -6319 -6283 -6246 -6263 -6281 -6225 -6169 -6221 -6273 -6263 -6253 -6350 -6448 -6414 -6380 -6347 -6313 -6328 -6343 -6412
-122 -6412 -6481 -6388 -6295 -6382 -6469 -6462 -6455 -6394 -6333 -6384 -6434 -6484 -6535 -6484 -6433 -6490 -6548 -6506 -6464 -6422 -6380 -6305 -6229 -6262 -6295 -6232 -6169 -6286 -6403 -6371 -6340 -6362 -6385 -6417
-129 -6417 -6450 -6226 -6362 -6290 -6218 -6223 -6228 -6205 -6183 -6066 -6309 -6313 -6316 -6153 -6350 -6278 -6423 -6468 -6513 -6468 -6424 -6433 -6442 -6327 -6211 -6204 -6196 -6230 -6265 -6191 -6117 -6104 -6091 -6077
-137 -6077 -6064 -6120 -6176 -6124 -6072 -6142 -6212 -6173 -6135 -6187 -6240 -6293 -6345 -6271 -6197 -6230 -6264 -6238 -6212 -6240 -6268 -6300 -6331 -6363 -6394 -6363 -6332 -6301 -6270 -6286 -6301 -6262 -6223 -6149
-145 -6149 -6074 -6252 -6429 -6434 -6440 -6337 -6234 -6303 -6372 -6333 -6294 -6275 -6256 -6238 -6219 -6283 -6347 -6303 -6259 -6182 -6104 -6148 -6192 -6117 -6258 -5953 -6008 -6227 -6231 -6198 -6166 -6151
-152 -6151 -6136 -6121 -6107 -6163 -6219 -6221 -6223 -6345 -6467 -6409 -6351 -6334 -6316 -6407 -6497 -6464 -6430 -6451 -6471 -6490 -6510 -6435 -6359 -6131 -6118 -6281 -6083 -6266 -6233 -6313 -6176 -6173
-160 -6173 -6169 -6151 -6134 -6189 -6243 -6298 -6353 -6212 -6071 -6182 -6293 -6310 -6327 -6235 -6144 -6146 -6148 -6151 -6153 -6179 -6205 -6230 -6256 -6249 -6242 -6289 -6336 -6371 -6405 -6332 -6259 -6381 -6503 -6373
-167 -6373 -6243 -6263 -6282 -6248 -6214 -6195 -6176 -6337 -6498 -6473 -6447 -6476 -6504 -6547 -6590 -6525 -6460 -6442 -6425 -6407 -6389 -6370 -6351 -6278 -6205 -6153 -6101 -6157 -6214 -6179 -6144 -6217 -6291
-175 -6291 -6246 -6201 -6264 -6327 -6273 -6218 -6110 -6002 -6008 -6014 -6129 -6243 -6243 -6244 -6298 -6353 -6278 -6203 -6236 -6269 -6274 -6280 -6285 -6291 -6235 -6180 -6305 -6430 -6357 -6284 -6320 -6355 -6395 -6434 -6366
-183 -6366 -6298 -6355 -6412 -6361 -6310 -6326 -6343 -6359 -6376 -6352 -6329 -6306 -6283 -6304 -6326 -6348 -6369 -6378 -6386 -6395 -6404 -6385 -6367 -6348 -6330 -6315 -6300 -6285 -6271 -6285 -6300 -6314 -6329 -6423 -6518 -6360
-191 -6360 -6203 -6187 -6171 -6209 -6247 -6234 -6221 -6262 -6302 -6275 -6249 -6330 -6411 -6490 -6568 -6539 -6510 -6417 -6325 -6341 -6357 -6393 -6430 -6359 -6288 -6213 -6138 -6172 -6205 -6169 -6132 -6150 -6168 -6128
-199 -6128 -6088 -6157 -6225 -6240 -6254 -6269 -6284 -6231 -6178 -6233 -6288 -6322 -6355 -6388 -6422 -6374 -6326 -6386 -6447 -6440 -6434 -6428 -6422 -6381 -6341 -6409 -6477 -6416 -6354 -6400 -6447 -6453 -6459 -6356 -6254 -6473
-207 -6473 -6692 -6587 -6482 -6435 -6388 -6342 -6295 -6308 -6320 -6333 -6345 -6391 -6437 -6376 -6314 -6316 -6318 -6320 -6322 -6317 -6313 -6308 -6303 -6287 -6271 -6255 -6239 -6223 -6207 -6191 -6175 -6162 -6148 -6135 -6121 -6135 -6148
-216 -6148 -6162 -6175 -6198 -6221 -6244 -6267 -6244 -6222 -6200 -6178 -6210 -6243 -6275 -6308 -6266 -6224 -6290 -6357 -6330 -6303 -6276 -6249 -6265 -6281 -6540 -6367 -6358 -6349 -6069 -6222 -6315 -6407 -6346
-223 -6346 -6285 -6299 -6312 -6325 -6339 -6260 -6181 -6282 -6384 -6416 -6448 -6372 -6296 -6326 -6356 -6278 -6200 -6238 -6277 -6316 -6355 -6349 -6343 -6337 -6331 -6309 -6287 -6346 -6405 -6576 -6316 -6271 -6227 -6456
-231 -6456 -6253 -6186 -6118 -6208 -6298 -6280 -6262 -6278 -6294 -6310 -6326 -6336 -6345 -6354 -6364 -6353 -6342 -6331 -6320 -6276 -6231 -6294 -6358 -6351 -6344 -6337 -6330 -6329 -6329 -6329 -6328 -6355 -6381 -6407 -6433 -6288 -6143 -6178
-240 -6178 -6214 -6326 -6439 -6443 -6448 -6425 -6403 -6380 -6358 -6361 -6365 -6369 -6372 -6362 -6353 -6343 -6333 -6334 -6336 -6338 -6339 -6401 -6464 -6526 -6588 -6443 -6298 -6405 -6512 -6421 -6330 -6419 -6508 -6454 -6399 -6344 -6290
-248 -6290 -6309 -6329 -6348 -6368 -6367 -6366 -6365 -6364 -6370 -6375 -6381 -6387 -6351 -6314 -6386 -6458 -6482 -6507 -6531 -6556 -6496 -6436 -6377 -6317 -6314 -6310 -6307 -6304 -6240 -6177 -6294 -6411 -6399 -6387 -6376 -6364 -6353 -6341 -6330
-257 -6330 -6318 -6334 -6349 -6365 -6380 -6360 -6340 -6320 -6301 -6319 -6337 -6356 -6374 -6291 -6208 -6305 -6402 -6385 -6367 -6349 -6332 -6342 -6353 -6363 -6374 -6377 -6381 -6385 -6389 -6348 -6307 -6374 -6442 -6509 -6576 -6549
-265 -6549 -6522 -6409 -6511 -6290 -6429 -6452 -6476 -6523 -6569 -6524 -6480 -6435 -6390 -6447 -6503 -6380 -6256 -6325 -6394 -6462 -6531 -6478 -6425 -6575 -6364 -6414 -6465 -6384 -6304 -6396
-272 -6396 -6489 -6488 -6486 -6302 -6335 -6232 -6345 -6346 -6347 -6361 -6376 -6380 -6385 -6376 -6368 -6553 -6521 -6495 -6252 -6283 -6529 -6461 -6393 -6500 -6607 -6417 -6587 -6475 -6579 -6490 -6400 -6248
-279 -6248 -6312 -6456 -6241 -6292 -6344 -6374 -6403 -6297 -6192 -6252 -6313 -6453 -6376 -6313 -6250 -6246 -6242 -6359 -6260 -6252 -6244 -6209 -6175 -6288 -6186 -6313 -6440 -6349 -6258 -6396 -6318
-287 -6318 -6305 -6293 -6253 -6430 -6414 -6398 -6396 -6394 -6398 -6403 -6407 -6412 -6429 -6447 -6464 -6481 -6411 -6341 -6365 -6389 -6537 -6469 -6522 -6576 -6542 -6507 -6473 -6439 -6437 -6435 -6434 -6432 -6423 -6415 -6407 -6398 -6440 -6482 -6416 -6350
-296 -6350 -6406 -6461 -6422 -6383 -6303 -6439 -6333 -6442 -6375 -6309 -6486 -6447 -6459 -6471 -6470 -6469 -6447 -6426 -6404 -6383 -6371 -6359 -6346 -6334 -6356 -6377 -6399 -6421 -6351 -6281 -6320 -6358 -6356 -6354
-303 -6354 -6352 -6350 -6405 -6459 -6405 -6352 -6413 -6474 -6428 -6381 -6326 -6272 -6326 -6379 -6325 -6270 -6324 -6378 -6408 -6439 -6362 -6285 -6302 -6320 -6337 -6354 -6339 -6323 -6307 -6291 -6363 -6435 -6399 -6363 -6371 -6379
-312 -6379 -6387 -6395 -6369 -6343 -6317 -6291 -6334 -6378 -6421 -6464 -6462 -6460 -6459 -6457 -6412 -6367 -6323 -6278 -6297 -6315 -6334 -6352 -6383 -6413 -6444 -6474 -6539 -6603 -6559 -6515 -6535 -6555 -6575 -6595 -6527 -6459 -6499
-320 -6499 -6539 -6477 -6415 -6461 -6506 -6491 -6476 -6461 -6446 -6537 -6628 -6611 -6594 -6496 -6398 -6408 -6418 -6426 -6434 -6442 -6449 -6450 -6451 -6452 -6453 -6411 -6369 -6327 -6285 -6281 -6277 -6274 -6270 -6334 -6399 -6356 -6312 -6329 -6347 -6364
-329 -6364 -6381 -6368 -6356 -6343 -6330 -6331 -6331 -6332 -6333 -6337 -6340 -6344 -6348 -6325 -6301 -6386 -6471 -6416 -6362 -6429 -6496 -6372 -6463 -6447 -6431 -6269 -6323 -6422 -6521 -6609 -6481 -6474 -6467 -6444 -6420 -6275 -6346
-338 -6346 -6359 -6371 -6397 -6423 -6456 -6490 -6523 -6556 -6515 -6474 -6334 -6411 -6281 -6512 -6545 -6362 -6590 -6459 -6408 -6358 -6280 -6202 -6435 -6308 -6376 -6445 -6383 -6321 -6363 -6405
-345 -6405 -6447 -6489 -6459 -6429 -6520 -6396 -6456 -6517 -6577 -6421 -6374 -6326 -6143 -6176 -6255 -6333 -6114 -6255 -6267 -6280 -6316 -6351 -6349 -6347 -6466 -6369 -6480 -6590 -6485 -6379
-351 -6379 -6464 -6188 -6295 -6402 -6388 -6373 -6359 -6344 -6310 -6276 -6364 -6236 -6366 -6497 -6384 -6488 -6470 -6453 -6449 -6445 -6474 -6504 -6426 -6348 -6463 -6579 -6586 -6594 -6558 -6523 -6366
-359 -6366 -6426 -6502 -6579 -6489 -6400 -6422 -6445 -6468 -6490 -6417 -6344 -6450 -6557 -6522 -6486 -6438 -6605 -6616 -6628 -6652 -6461 -6560 -6443 -6326 -6209 -6272 -6334 -6396 -6459 -6463 -6467 -6471
-366 -6471 -6475 -6472 -6469 -6358 -6247 -6292 -6336 -6273 -6209 -6294 -6379 -6284 -6189 -6222 -6256 -6289 -6538 -6432 -6542 -6531 -6519 -6501 -6267 -6442 -6402 -6569 -6520 -6268 -6376 -6456 -6535
-373 -6535 -6457 -6378 -6383 -6387 -6270 -6369 -6362 -6356 -6349 -6342 -6449 -6340 -6365 -6391 -6363 -6551 -6437 -6323 -6367 -6412 -6348 -6284 -6411 -6538 -6414 -6289 -6304 -6319 -6334 -6348 -6341 -6333 -6447
-381 -6447 -6345 -6293 -6240 -6283 -6325 -6368 -6410 -6345 -6279 -6314 -6348 -6504 -6445 -6396 -6347 -6272 -6412 -6378 -6343 -6444 -6544 -6348 -6367 -6517 -6667 -6682 -6697 -6617 -6537 -6356
-387 -6356 -6392 -6485 -6579 -6507 -6435 -6579 -6364 -6292 -6436 -6436 -6436 -6437 -6437 -6545 -6653 -6595 -6537 -6478 -6420 -6481 -6541 -6493 -6446 -6371 -6296 -6330 -6363 -6380 -6396 -6412 -6429 -6391 -6354 -6424
-395 -6424 -6494 -6501 -6507 -6513 -6519 -6472 -6424 -6484 -6544 -6551 -6557 -6563 -6569 -6555 -6541 -6527 -6513 -6519 -6526 -6533 -6540 -6573 -6607 -6533 -6458 -6541 -6625 -6600 -6575 -6620 -6664 -6601 -6538 -6524 -6511 -6497 -6483 -6490 -6496 -6503 -6510 -6502 -6494
-405 -6494 -6486 -6478 -6515 -6552 -6589 -6626 -6598 -6570 -6541 -6513 -6523 -6533 -6543 -6553 -6583 -6613 -6535 -6456 -6441 -6426 -6519 -6611 -6553 -6495 -6437 -6379 -6373 -6367 -6469 -6570 -6677 -6783 -6710 -6636
-413 -6636 -6625 -6615 -6604 -6594 -6629 -6665 -6700 -6736 -6607 -6478 -6530 -6581 -6595 -6610 -6624 -6639 -6638 -6636 -6635 -6634 -6676 -6719 -6761 -6804 -6748 -6691 -6635 -6578 -6590 -6602 -6614 -6625 -6664 -6703 -6742
-421 -6742 -6781 -6730 -6678 -6627 -6576 -6606 -6636 -6665 -6695 -6672 -6649 -6625 -6602 -6538 -6474 -6518 -6562 -6610 -6658 -6597 -6537 -6476 -6416 -6535 -6655 -6572 -6489 -6514 -6540 -6542 -6545 -6548 -6550 -6538 -6527
-429 -6527 -6515 -6503 -6529 -6555 -6582 -6608 -6660 -6712 -6656 -6600 -6553 -6506 -6459 -6413 -6452 -6492 -6424 -6355 -6399 -6444 -6488 -6532 -6434 -6336 -6346 -6356 -6325 -6295 -6372 -6450 -6450 -6450 -6449 -6449 -6436 -6422
-437 -6422 -6408 -6395 -6335 -6275 -6323 -6371 -6522 -6674 -6645 -6616 -6593 -6569 -6546 -6522 -6488 -6453 -6418 -6384 -6340 -6297 -6254 -6210 -6291 -6371 -6344 -6316 -6386 -6456 -6526 -6595 -6447 -6299
-444 -6299 -6330 -6362 -6349 -6336 -6431 -6526 -6484 -6442 -6400 -6357 -6397 -6437 -6369 -6301 -6332 -6363 -6394 -6425 -6462 -6499 -6427 -6356 -6407 -6457 -6453 -6449 -6410 -6370 -6384 -6398 -6349 -6299 -6303 -6307 -6327 -6347
-453 -6347 -6366 -6386 -6409 -6432 -6455 -6479 -6488 -6498 -6508 -6517 -6464 -6410 -6357 -6304 -6334 -6365 -6395 -6426 -6365 -6305 -6352 -6400 -6396 -6392 -6335 -6277 -6308 -6339 -6370 -6402 -6357 -6313 -6377 -6441 -6444 -6447 -6450 -6453
-461 -6453 -6461 -6470 -6479 -6487 -6496 -6505 -6513 -6522 -6494 -6466 -6438 -6410 -6427 -6444 -6461 -6477 -6480 -6482 -6484 -6487 -6422 -6356 -6399 -6442 -6498 -6554 -6502 -6450 -6515 -6579 -6464 -6349 -6406 -6462 -6168 -6305 -6360 -6416
-470 -6416 -6444 -6472 -6449 -6426 -6403 -6380 -6405 -6429 -6399 -6369 -6446 -6523 -6491 -6460 -6456 -6453 -6450 -6447 -6308 -6170 -6526 -6451 -6544 -6637 -6596 -6554 -6538 -6521 -6613 -6705 -6659 -6613 -6568 -6522 -6520
-478 -6520 -6519 -6612 -6344 -6428 -6512 -6466 -6419 -6454 -6490 -6526 -6561 -6559 -6558 -6556 -6555 -6586 -6617 -6594 -6572 -6647 -6722 -6617 -6512 -6544 -6576 -6500 -6424 -6463 -6503 -6543 -6583 -6563 -6543 -6578 -6612
-486 -6612 -6552 -6492 -6540 -6588 -6598 -6608 -6564 -6521 -6510 -6500 -6544 -6588 -6607 -6626 -6622 -6618 -6680 -6383 -6468 -6553 -6506 -6459 -6519 -6580 -6578 -6576 -6718 -6643 -6500 -6717 -6596 -6691 -6624 -6557
-494 -6557 -6504 -6450 -6474 -6498 -6522 -6545 -6535 -6525 -6515 -6505 -6575 -6645 -6607 -6568 -6546 -6523 -6501 -6479 -6493 -6508 -6523 -6537 -6552 -6567 -6582 -6596 -6610 -6623 -6637 -6650 -6664 -6677 -6691 -6704
-502 -6704 -6629 -6553 -6478 -6403 -6450 -6497 -6490 -6484 -6531 -6579 -6518 -6458 -6518 -6578 -6638 -6697 -6640 -6583 -6526 -6469 -6493 -6517 -6541 -6565 -6585 -6605 -6626 -6646 -6639 -6633 -6626 -6619 -6608 -6596 -6584 -6572 -6635
-510 -6635 -6697 -6580 -6462 -6468 -6474 -6480 -6486 -6542 -6597 -6545 -6492 -6504 -6516 -6529 -6541 -6465 -6390 -6314 -6238 -6249 -6259 -6269 -6279 -6317 -6354 -6283 -6212 -6269 -6325 -6274 -6222 -6197 -6173 -6256 -6340
-518 -6340 -6432 -6525 -6438 -6350 -6405 -6459 -6406 -6352 -6389 -6426 -6463 -6500 -6476 -6452 -6537 -6621 -6600 -6579 -6666 -6753 -6735 -6716 -6698 -6679 -6588 -6498 -6587 -6676 -6676 -6675 -6674 -6674 -6580 -6487 -6573 -6660
-526 -6660 -6618 -6577 -6535 -6493 -6525 -6556 -6588 -6619 -6522 -6425 -6509 -6592 -6576 -6561 -6545 -6530 -6525 -6521 -6517 -6512 -6541 -6569 -6597 -6626 -6663 -6700 -6630 -6559 -6620 -6681 -6634 -6586 -6532 -6478 -6533 -6587
-534 -6587 -6546 -6505 -6464 -6423 -6469 -6516 -6563 -6610 -6559 -6508 -6457 -6406 -6537 -6668 -6620 -6571 -6572 -6572 -6573 -6574 -6597 -6621 -6644 -6667 -6582 -6497 -6520 -6543 -6508 -6472 -6545 -6617 -6610 -6603 -6597 -6590 -6529
-543 -6529 -6468 -6515 -6562 -6540 -6518 -6496 -6474 -6479 -6484 -6489 -6494 -6571 -6649 -6618 -6588 -6517 -6446 -6555 -6664 -6657 -6651 -6644 -6638 -6643 -6647 -6652 -6657 -6647 -6637 -6627 -6618 -6610 -6602 -6703 -6803 -6786 -6768 -6751 -6733 -6696
-552 -6696 -6658 -6620 -6583 -6548 -6514 -6493 -6472 -6353 -6449 -6626 -6443 -6489 -6535 -6559 -6583 -6573 -6562 -6552 -6542 -6596 -6649 -6595 -6540 -6600 -6660 -6613 -6565 -6582 -6599 -6508 -6417 -6437 -6456
-560 -6456 -6584 -6711 -6706 -6700 -6695 -6690 -6691 -6692 -6694 -6695 -6726 -6757 -6788 -6819 -6751 -6683 -6615 -6547 -6552 -6558 -6564 -6569 -6514 -6459 -6512 -6565 -6548 -6531 -6500 -6470 -6628 -6571 -6527 -6483 -6472 -6461 -6464 -6466 -6386 -6521
-569 -6521 -6535 -6549 -6526 -6503 -6601 -6483 -6548 -6612 -6555 -6498 -6547 -6595 -6621 -6646 -6794 -6581 -6584 -6587 -6400 -6428 -6565 -6486 -6586 -6687 -6666 -6645 -6580 -6514 -6463 -6411 -6361 -6528
-576 -6528 -6451 -6591 -6583 -6576 -6559 -6543 -6682 -6461 -6429 -6613 -6599 -6585 -6585 -6585 -6565 -6545 -6524 -6504 -6559 -6615 -6571 -6744 -6542 -6701 -6550 -6614 -6599 -6584 -6583 -6582 -6560 -6538 -6530 -6522
-584 -6522 -6369 -6431 -6494 -6557 -6437 -6534 -6617 -6484 -6619 -6538 -6566 -6593 -6627 -6661 -6708 -6756 -6622 -6703 -6569 -6434 -6345 -6471 -6463 -6454 -6657 -6643 -6522 -6616 -6628 -6639
-591 -6639 -6556 -6472 -6514 -6555 -6610 -6449 -6537 -6626 -6472 -6533 -6548 -6563 -6578 -6593 -6723 -6636 -6671 -6706 -6678 -6650 -6622 -6594 -6667 -6740 -6633 -6526 -6573 -6619 -6665 -6711 -6633 -6556
-598 -6556 -6586 -6616 -6549 -6481 -6594 -6706 -6648 -6589 -6639 -6688 -6593 -6497 -6582 -6666 -6568 -6470 -6480 -6490 -6471 -6451 -6432 -6412 -6487 -6562 -6529 -6495 -6500 -6504 -6508 -6512 -6498 -6484 -6470 -6456 -6555
-606 -6555 -6655 -6574 -6494 -6609 -6725 -6660 -6596 -6623 -6651 -6571 -6490 -6504 -6518 -6533 -6547 -6587 -6627 -6667 -6706 -6677 -6647 -6617 -6587 -6643 -6700 -6648 -6596 -6605 -6614 -6623 -6632 -6609 -6585 -6561 -6538
-614 -6538 -6498 -6459 -6528 -6596 -6546 -6495 -6444 -6394 -6516 -6639 -6654 -6668 -6595 -6521 -6556 -6590 -6557 -6524 -6491 -6458 -6472 -6485 -6498 -6511 -6470 -6429 -6496 -6564 -6508 -6451 -6503 -6555 -6580
-622 -6580 -6605 -6630 -6655 -6640 -6624 -6609 -6593 -6578 -6562 -6546 -6531 -6557 -6584 -6610 -6637 -6611 -6586 -6561 -6535 -6607 -6679 -6643 -6607 -6615 -6623 -6546 -6468 -6281 -6454 -6601 -6531 -6553 -6576 -6531
-629 -6531 -6486 -6531 -6576 -6621 -6666 -6677 -6688 -6646 -6603 -6737 -6871 -6754 -6636 -6775 -6913 -6800 -6687 -6677 -6667 -6711 -6756 -6743 -6729 -6662 -6595 -6594 -6592 -6645 -6698 -6575 -6452
-636 -6452 -6608 -6548 -6788 -6667 -6614 -6777 -6701 -6626 -6672 -6718 -6732 -6746 -6760 -6775 -6660 -6546 -6540 -6534 -6531 -6527 -6631 -6735 -6614 -6494 -6481 -6468 -6557 -6647 -6556 -6465 -6561
-644 -6561 -6657 -6699 -6741 -6644 -6546 -6503 -6459 -6493 -6526 -6559 -6592 -6490 -6387 -6465 -6543 -6596 -6649 -6594 -6539 -6595 -6651 -6527 -6403 -6449 -6495 -6486 -6478 -6491 -6504 -6518 -6531 -6547 -6564
-651 -6564 -6580 -6597 -6591 -6585 -6687 -6789 -6738 -6687 -6636 -6585 -6522 -6459 -6504 -6549 -6476 -6403 -6438 -6472 -6473 -6474 -6528 -6583 -6497 -6411 -6432 -6454 -6405 -6357 -6416 -6475 -6459 -6444 -6429 -6414 -6426
-659 -6426 -6438 -6557 -6677 -6637 -6597 -6557 -6517 -6519 -6522 -6524 -6526 -6507 -6489 -6471 -6453 -6398 -6343 -6396 -6450 -6503 -6556 -6555 -6555 -6531 -6507 -6538 -6568 -6565 -6562 -6558 -6555 -6538 -6522 -6505 -6488 -6516 -6544 -6573
-668 -6573 -6601 -6580 -6559 -6538 -6517 -6492 -6468 -6443 -6419 -6474 -6530 -6531 -6533 -6507 -6482 -6564 -6647 -6606 -6565 -6579 -6592 -6559 -6526 -6601 -6677 -6550 -6423 -6476 -6530 -6522 -6514 -6507 -6499 -6479 -6459 -6547
-676 -6547 -6635 -6601 -6568 -6588 -6609 -6603 -6598 -6538 -6479 -6489 -6499 -6563 -6628 -6603 -6577 -6606 -6635 -6603 -6571 -6539 -6507 -6578 -6648 -6611 -6573 -6594 -6615 -6514 -6414 -6550 -6470 -6511 -6552 -6535
-684 -6535 -6518 -6501 -6483 -6432 -6381 -6452 -6523 -6516 -6725 -6569 -6629 -6660 -6475 -6479 -6483 -6532 -6581 -6630 -6463 -6586 -6494 -6442 -6606 -6538 -6469 -6522 -6575 -6547 -6519 -6478 -6437 -6540
-691 -6540 -6427 -6435 -6443 -6561 -6678 -6615 -6553 -6534 -6515 -6605 -6694 -6620 -6545 -6539 -6532 -6430 -6545 -6592 -6640 -6641 -6642 -6764 -6671 -6682 -6693 -6677 -6661 -6717 -6557 -6505 -6669 -6667 -6666 -6624
-699 -6624 -6582 -6588 -6593 -6599 -6605 -6600 -6594 -6535 -6475 -6579 -6683 -6607 -6531 -6544 -6558 -6518 -6478 -6447 -6415 -6492 -6569 -6528 -6486 -6553 -6620 -6561 -6502 -6551 -6600 -6548 -6495 -6430 -6580 -6558 -6536 -6649
-707 -6649 -6546 -6484 -6422 -6467 -6513 -6415 -6533 -6530 -6526 -6462 -6398 -6429 -6459 -6510 -6345 -6518 -6475 -6604 -6516 -6537 -6558 -6541 -6524 -6454 -6383 -6484 -6585 -6579 -6572 -6580 -6588 -6785 -6622
-715 -6622 -6724 -6611 -6596 -6582 -6635 -6688 -6633 -6578 -6540 -6502 -6662 -6606 -6449 -6652 -6640 -6627 -6640 -6653 -6666 -6679 -6664 -6648 -6655 -6661 -6452 -6603 -6672 -6526 -6515 -6504 -6480
-722 -6480 -6456 -6549 -6641 -6626 -6611 -6660 -6709 -6649 -6590 -6653 -6715 -6669 -6624 -6584 -6545 -6613 -6682 -6646 -6610 -6682 -6754 -6751 -6748 -6691 -6634 -6587 -6540 -6601 -6663 -6567 -6471 -6483 -6495 -6544 -6592
-730 -6592 -6586 -6580 -6594 -6608 -6568 -6528 -6515 -6502 -6489 -6476 -6495 -6515 -6534 -6554 -6574 -6593 -6613 -6632 -6615 -6599 -6582 -6565 -6522 -6478 -6434 -6390 -6404 -6419 -6433 -6447 -6482 -6516 -6550 -6585 -6618
-738 -6618 -6652 -6577 -6502 -6579 -6657 -6626 -6595 -6534 -6474 -6467 -6461 -6451 -6441 -6431 -6421 -6367 -6314 -6491 -6451 -6476 -6500 -6511 -6522 -6485 -6448 -6465 -6483 -6503 -6524 -6436 -6349 -6400 -6450 -6501 -6552
-746 -6552 -6515 -6479 -6428 -6378 -6488 -6382 -6397 -6413 -6408 -6403 -6533 -6448 -6318 -6405 -6465 -6525 -6422 -6320 -6457 -6593 -6672 -6535 -6397 -6476 -6524 -6571 -6502 -6432 -6622 -6452
-753 -6452 -6350 -6464 -6528 -6376 -6481 -6370 -6457 -6545 -6511 -6476 -6478 -6480 -6374 -6484 -6358 -6449 -6540 -6630 -6546 -6463 -6487 -6511 -6545 -6578 -6544 -6509 -6547 -6369 -6623 -6516
-759 -6516 -6556 -6596 -6546 -6496 -6531 -6349 -6518 -6472 -6483 -6495 -6492 -6490 -6563 -6637 -6656 -6675 -6699 -6722 -6638 -6553 -6585 -6616 -6674 -6517 -6378 -6455 -6577 -6699 -6585 -6470 -6671
-767 -6671 -6656 -6554 -6669 -6662 -6654 -6459 -6480 -6488 -6495 -6553 -6610 -6590 -6571 -6705 -6480 -6444 -6623 -6594 -6565 -6658 -6750 -6662 -6573 -6593 -6612 -6624 -6636 -6594 -6552 -6578 -6604 -6575 -6547
-774 -6547 -6570 -6593 -6616 -6639 -6564 -6489 -6522 -6556 -6622 -6688 -6647 -6605 -6537 -6468 -6507 -6547 -6574 -6601 -6520 -6440 -6532 -6624 -6609 -6593 -6607 -6621 -6635 -6648 -6628 -6608 -6588 -6568 -6592 -6617
-782 -6617 -6641 -6666 -6666 -6667 -6668 -6669 -6646 -6624 -6656 -6688 -6628 -6569 -6617 -6666 -6679 -6693 -6706 -6720 -6605 -6490 -6556 -6621 -6672 -6723 -6667 -6610 -6625 -6640 -6655 -6670 -6673 -6676 -6678 -6681 -6664 -6647 -6685
-790 -6685 -6722 -6588 -6454 -6500 -6546 -6562 -6579 -6564 -6549 -6440 -6691 -6523 -6571 -6514 -6673 -6615 -6558 -6618 -6678 -6685 -6691 -6664 -6638 -6611 -6585 -6545 -6504 -6572 -6640 -6681 -6722 -6762
-798 -6762 -6803 -6690 -6577 -6571 -6566 -6587 -6609 -6631 -6652 -6582 -6512 -6573 -6633 -6432 -6590 -6721 -6637 -6587 -6537 -6595 -6438 -6384 -6331 -6467 -6603 -6422 -6601 -6713 -6609
-804 -6609 -6410 -6427 -6489 -6551 -6536 -6521 -6493 -6465 -6554 -6428 -6477 -6526 -6408 -6290 -6424 -6558 -6587 -6616 -6538 -6459 -6496 -6533 -6462 -6607 -6361 -6331 -6471 -6396 -6601
-811 -6601 -6446 -6467 -6487 -6618 -6533 -6555 -6578 -6661 -6527 -6515 -6503 -6617 -6731 -6665 -6598 -6505 -6412 -6499 -6586 -6523 -6460 -6437 -6415 -6534 -6437 -6488 -6323 -6326 -6545 -6656
-818 -6656 -6551 -6438 -6541 -6617 -6694 -6591 -6488 -6579 -6669 -6531 -6609 -6619 -6629 -6570 -6510 -6559 -6607 -6595 -6582 -6637 -6476 -6444 -6412 -6596 -6564 -6535 -6505 -6462 -6419 -6445
-825 -6445 -6472 -6283 -6309 -6337 -6581 -6537 -6492 -6474 -6456 -6478 -6500 -6623 -6530 -6572 -6397 -6400 -6402 -6607 -6452 -6439 -6641 -6700 -6758 -6713 -6668 -6636 -6605 -6503 -6617 -6609 -6602 -6595
-832 -6595 -6587 -6679 -6555 -6712 -6509 -6509 -6508 -6403 -6514 -6571 -6628 -6430 -6448 -6474 -6501 -6331 -6520 -6440 -6576 -6514 -6453 -6567 -6465 -6595 -6510 -6614 -6502 -6451 -6616
-839 -6616 -6646 -6676 -6647 -6617 -6601 -6585 -6357 -6346 -6406 -6467 -6362 -6473 -6328 -6542 -6416 -6506 -6604 -6703 -6598 -6493 -6519 -6544 -6359 -6534 -6507 -6479 -6514 -6550 -6608
-845 -6608 -6665 -6425 -6544 -6447 -6566 -6557 -6548 -6660 -6773 -6643 -6513 -6577 -6641 -6579 -6732 -6562 -6392 -6668 -6584 -6630 -6460 -6594 -6513 -6660 -6592 -6545 -6498 -6411
-852 -6411 -6540 -6669 -6582 -6522 -6461 -6455 -6448 -6441 -6435 -6466 -6498 -6543 -6588 -6469 -6567 -6543 -6519 -6509 -6499 -6488 -6478 -6507 -6536 -6443 -6567 -6508 -6449 -6512 -6575 -6528 -6482 -6435 -6389 -6498
-859 -6498 -6606 -6607 -6608 -6554 -6501 -6555 -6610 -6644 -6678 -6605 -6531 -6544 -6557 -6570 -6582 -6616 -6649 -6682 -6715 -6684 -6652 -6621 -6590 -6531 -6473 -6595 -6717 -6731 -6745 -6651 -6557 -6562 -6567 -6545 -6523
-867 -6523 -6740 -6525 -6553 -6581 -6582 -6583 -6584 -6586 -6584 -6582 -6580 -6577 -6603 -6627 -6653 -6678 -6633 -6589 -6545 -6501 -6544 -6588 -6631 -6675 -6612 -6549 -6593 -6638 -6588 -6539 -6489 -6439 -6512 -6586 -6551 -6516 -6474
-876 -6474 -6433 -6742 -6620 -6668 -6716 -6628 -6541 -6636 -6732 -6647 -6562 -6580 -6597 -6615 -6633 -6595 -6556 -6518 -6479 -6480 -6481 -6482 -6483 -6484 -6486 -6487 -6488 -6473 -6459 -6445 -6431 -6444 -6457 -6470 -6483 -6513 -6543
-884 -6543 -6574 -6604 -6572 -6539 -6507 -6474 -6447 -6420 -6393 -6366 -6434 -6502 -6461 -6421 -6372 -6324 -6397 -6470 -6382 -6509 -6515 -6520 -6519 -6518 -6517 -6516 -6542 -6568 -6594 -6620 -6582 -6543 -6707 -6512 -6545 -6579
-893 -6579 -6590 -6601 -6572 -6543 -6513 -6484 -6500 -6515 -6531 -6547 -6557 -6567 -6555 -6543 -6706 -6510 -6538 -6566 -6412 -6619 -6514 -6626 -6551 -6691 -6603 -6514 -6621 -6513 -6525 -6538
-899 -6538 -6515 -6491 -6576 -6661 -6635 -6610 -6598 -6586 -6490 -6611 -6746 -6664 -6544 -6640 -6601 -6563 -6535 -6508 -6467 -6641 -6597 -6553 -6522 -6491 -6554 -6618 -6587 -6556 -6487 -6635 -6863
-907 -6863 -6731 -6671 -6611 -6758 -6689 -6638 -6586 -6522 -6457 -6511 -6565 -6498 -6647 -6640 -6633 -6518 -6619 -6599 -6579 -6572 -6565 -6577 -6589 -6479 -6586 -6584 -6583 -6473 -6580 -6564 -6549 -6682
-914 -6682 -6599 -6509 -6636 -6627 -6618 -6586 -6553 -6507 -6677 -6613 -6549 -6498 -6448 -6542 -6635 -6621 -6607 -6602 -6597 -6592 -6586 -6616 -6645 -6567 -6488 -6545 -6601 -6549 -6498 -6533 -6569 -6605 -6640 -6624 -6608 -6592
-922 -6592 -6576 -6591 -6607 -6623 -6638 -6652 -6665 -6570 -6476 -6519 -6562 -6604 -6647 -6638 -6629 -6621 -6612 -6563 -6514 -6465 -6416 -6467 -6517 -6459 -6401 -6460 -6519 -6471 -6422 -6481 -6540 -6491 -6442 -6538 -6634 -6622
-930 -6622 -6609 -6563 -6517 -6471 -6425 -6521 -6616 -6604 -6591 -6594 -6598 -6623 -6649 -6450 -6611 -6569 -6527 -6553 -6578 -6604 -6630 -6652 -6674 -6696 -6718 -6670 -6622 -6574 -6526 -6593 -6660 -6619 -6578 -6614
-938 -6614 -6649 -6577 -6504 -6538 -6573 -6607 -6641 -6624 -6607 -6589 -6572 -6579 -6587 -6594 -6602 -6636 -6670 -6705 -6739 -6683 -6626 -6570 -6513 -6556 -6598 -6641 -6683 -6702 -6721 -6740 -6759 -6679 -6599 -6627 -6655 -6583
-946 -6583 -6511 -6547 -6583 -6538 -6493 -6448 -6403 -6413 -6422 -6431 -6441 -6463 -6486 -6509 -6532 -6525 -6518 -6510 -6503 -6550 -6597 -6535 -6474 -6532 -6591 -6541 -6491 -6489 -6486 -6484 -6481 -6574 -6667 -6651 -6636 -6636 -6636 -6605 -6574 -6816
-955 -6816 -6555 -6577 -6598 -6501 -6404 -6486 -6569 -6597 -6625 -6653 -6681 -6615 -6548 -6590 -6631 -6610 -6590 -6569 -6548 -6534 -6521 -6507 -6493 -6519 -6545 -6571 -6597 -6585 -6572 -6560 -6548 -6542 -6537 -6639
-963 -6639 -6742 -6745 -6749 -6644 -6540 -6546 -6552 -6558 -6564 -6570 -6576 -6582 -6588 -6561 -6534 -6615 -6696 -6684 -6673 -6554 -6434 -6550 -6666 -6602 -6538 -6595 -6652 -6710 -6767 -6746 -6724 -6702 -6681 -6672 -6664 -6656 -6648 -6637
-972 -6637 -6626 -6615 -6604 -6566 -6528 -6490 -6452 -6496 -6540 -6584 -6628 -6591 -6553 -6516 -6479 -6482 -6484 -6487 -6489 -6491 -6494 -6496 -6499 -6486 -6472 -6459 -6446 -6439 -6433 -6426 -6420 -6407 -6394 -6489 -6585 -6593 -6602 -6557 -6511 -6460 -6409
-981 -6409 -6466 -6523 -6509 -6496 -6482 -6468 -6508 -6547 -6479 -6411 -6380 -6350 -6428 -6506 -6573 -6640 -6598 -6557 -6590 -6623 -6656 -6688 -6583 -6477 -6480 -6483 -6505 -6528 -6551 -6574 -6577 -6581 -6585 -6588 -6592 -6596 -6599 -6603
-990 -6603 -6574 -6546 -6517 -6488 -6522 -6557 -6591 -6625 -6610 -6594 -6578 -6562 -6584 -6605 -6573 -6540 -6495 -6451 -6515 -6578 -6611 -6645 -6624 -6603 -6586 -6569 -6606 -6643 -6539 -6434 -6510 -6585 -6643
-998 -6643 -6702 -6652 -6603 -6603
-998 -6603
##$OBSERVED INTEGRALS=	(X Y Z)
(7.1423690254950837897, 7.2228864466274771416, 0.11197146188712049641)
(6.9335723603928238745, 7.0136289350035019297, 0.11139223477724782829)
(2.5862929655497390868, 2.6882903522808456742, 0.11260431729007318313)
(2.4894832120518008978, 2.5721415934911622259, 0.11282800740724285848)
(1.6849034741780037905, 1.7861685176479085158, 0.11001486565378713889)
(1.3575007249029098499, 1.4658782495171085447, 0.15212793523403381202)
(1.1862551424209570872, 1.3575007249029098499, 2.1138765290703500632)
(0.84181463504819720178, 0.92084479452033263236, 0.17518464868014432811)
##$OBSERVED MULTIPLETS=	
(1, 7.1423690254950837897, 7.2228864466274771416, 7.1808754851101070926, 2.0874252055712063658, 2, m, 1a&comma;3a&comma;4a&comma;6a)
(2, 6.9335723603928238745, 7.0136289350035019297, 6.9754493398585646347, 2.0239897203123380365, 2, m, B)
(3, 2.5862929655497390868, 2.6882903522808456742, 2.6373187302640479501, 2.0302952550776320884, 2, q, 7a&comma;7b, 7.57513 7.57513 7.5968)
(4, 2.4894832120518008978, 2.5721415934911622259, 2.5308467109784573701, 2.0728073983734440766, 2, t, D, 7.52261 7.52261)
(5, 1.6849034741780037905, 1.7861685176479085158, 1.735635024047215591, 1.97415454340879859, 2, q, 12a&comma;12b, 7.48935 7.48935 7.56854)
(6, 1.3324592162050499233, 1.4658782495171085447, 1.3949745566820781484, 2.0495000305192117018, 2, m, 14b&comma;15b&comma;16b&comma;17b&comma;18b&comma;19b&comma;20b&comma;21b&comma;22b&comma;23b&comma;24b&comma;25b&comma;26b&comma;27b&comma;28b&comma;29b&comma;30b)
(7, 1.1862551424209570872, 1.3570572097290103386, 1.2576746261360398638, 11.195777440334188313, 11, dt, 8a&comma;8b&comma;8c&comma;13a&comma;13b&comma;14a&comma;15a&comma;16a&comma;17a&comma;18a&comma;19a&comma;20a&comma;21a&comma;22a&comma;23a&comma;24a&comma;25a&comma;26a&comma;27a&comma;28a&comma;29a&comma;30a&comma;31a&comma;31b, 8.1581 8.1581 24.9844)
(8, 1.2370475668274927283, 1.2820730665985469177, 1.259560316713019823, 25.861925678198939949, 26, s, H)
(9, 0.84181463504819720178, 0.92084479452033263236, 0.88157014712516801325, 2.7041247282042455424, 3, t, 32a&comma;32b&comma;32c, 6.79733 6.79733)
##$OBSERVED MULTIPLETS PEAKS=	
(1, 7.200373696741950269, 0.0053819201662034217917)
(1, 7.1932116631249121141, 0.089823290677573816576)
(1, 7.1881650152101501661, 0.021573230724747972237)
(1, 7.1774022228374452226, 0.023518594761608918597)
(1, 7.1720125693679621648, 0.098390408209589899635)
(1, 7.1648817753806106623, 0.0078916793212746166875)
(2, 6.991116185117975057, 0.013228711226713388283)
(2, 6.9842287572284948993, 0.13846268128843192136)
(2, 6.9791068966274485419, 0.036804663163884115962)
(2, 6.968127942881790382, 0.030414666196638431156)
(2, 6.9630123657197495746, 0.11111610519233564021)
(2, 6.9560851102783507471, 0.0084563755690491518996)
(3, 2.6657776023953183575, 0.027335614142317717773)
(3, 2.6468839970320634514, 0.082081384830142767317)
(3, 2.6278076061935444763, 0.08585241934534315611)
$$ [...]
Impurity,Artifact|Weak,,1,-0.11344514366703983832,0,0
Impurity,Artifact|Weak,,1,-5.5511151231257827021e-17,0,0
Artifact,Artifact|Weak,,1,-0.69271846337828502094,0,0
Impurity,Artifact|Weak,,1,0.11187798766603068712,0,0
Impurity,Artifact|Weak,,1,-0.51257957839227541452,0,0
Artifact,Artifact|Weak,,1,1.999999999999999778,0,0
Compound,None,,1,0.81216556519648441803,0,0
Compound,None,,1,0.393586731108496235,0,0
Compound,None,,1,0.54783205843997806461,0,0
Compound,None,,1,0.034863976628706973282,0,0
Compound,None,,1,0.89615245652609698546,0,0
Compound,None,,1,0.10909532776397613818,0,0
Artifact,Artifact|Weak,,1,1.2825743422915230063,0,0
Artifact,Artifact|Weak,,1,1.1354348890510770342,0,0
Artifact,Artifact|Weak,,1,-1,0,0
Artifact,Artifact|Weak,,1,-0.28605267925187749523,0,0
Artifact,Artifact|Weak,,1,-0.8239206579188056434,0,0
Artifact,Artifact|Weak,,1,1.4559036766553783426,0,0
Impurity,Artifact|Weak,,1,-0.5275717181210720641,0,0
Impurity,Artifact|Weak,,1,0.40000000000000007772,0,0
Artifact,Artifact|Weak,,1,0.18922724443365251945,0,0
Artifact,Artifact|Weak,,1,-0.8971886610778050386,0,0
Artifact,Artifact|Weak,,1,0.18117093853263535608,0,0
Artifact,Artifact|Weak,,1,1.999999999999999778,0,0
Artifact,Artifact|Weak,,1,1.5999999999999998668,0,0
Artifact,Artifact|Weak,,1,0.098702796017923727367,0,0
Artifact,Artifact|Weak,,1,0.19408126887242271863,0,0
Artifact,Artifact|Weak,,1,1.1722061236633205539,0,0
Compound,Artifact|Impurity|Weak|13C Sat.,,1,0.22988259825709886353,0,0
Compound,None,,1,0.60000000000000008882,0,0
Compound,None,,1,0.95683667014667550532,0,0
Compound,None,,1,0.58620798315410493906,0,0
Compound,None,,1,-0.9484826088156639301,0,0
Compound,None,,1,0.71056266278798452252,0,0
Compound,Artifact|Weak,,1,-0.088467099972598134405,0,0
Artifact,Artifact|Weak,,1,-0.46063162903289112116,0,0
Solvent,None,,1,-0.2000000000000000111,0,0
Impurity,Artifact|Weak,,1,1.1538536049391705518,0,0
Artifact,Artifact|Weak,,1,-0.82225564862696698398,0,0
Impurity,Artifact|Weak,,1,1,0,0
Impurity,Artifact|Weak,,1,-1,0,0
Impurity,Artifact|Weak,,1,0.16033448228817098746,0,0
Impurity,Artifact|Weak,,1,0.50153717317244073115,0,0
Impurity,Artifact|Weak,,1,-0.18672671827935141686,0,0
Impurity,Artifact|Weak,,1,-0.17277759519644844688,0,0
Impurity,Artifact|Weak,,1,0.035311066182528411117,0,0
Impurity,Artifact|Weak,,1,0.7665780619348957492,0,0
Impurity,Artifact|Weak,,1,1.0080750937860269989,0,0
Impurity,Artifact|Weak,,1,1.6842576785682852325,0,0
Impurity,Artifact|Weak,,1,1.999999999999999778,0,0
Artifact,Artifact|Weak,,1,1.1999999999999999556,0,0
Solvent,Artifact|Impurity|Weak|13C Sat.,,1,0.66259625501952357229,0,0
Impurity,Artifact|Weak,,1,0.70453385838748594505,0,0
Impurity,Artifact|Weak,,1,0.36507767351258368915,0,0
Impurity,Artifact|Weak,,1,-1,0,0
Impurity,Artifact|Weak,,1,-0.40000000000000007772,0,0
Artifact,Artifact|Weak,,1,1.725531466302832051,0,0
Impurity,Artifact|Weak,,1,-0.59654632490696979374,0,0
Impurity,Artifact|Weak,,1,0.72890087718989970966,0,0
##END=	
##END=	
