##TITLE=	Sep27-2021.40.fid
KJO-CR2 H
##JCAMP-DX=	6.0	$$ MestReNova 14.1.0-24037
##DATA TYPE=	LINK
##BLOCK_ID=	1
##BLOCKS=	2    
##ORIGIN=	Mestrelab Research S.L.
##OWNER=	Chris
##$MNOVA/LINK_BLOCK_TYPE=	ITEM	$$ NMR Spectrum
##$MNOVA/ITEM/POLYGON=	(XY..XY)
5321,5835
8722,5835
8722,8208
5321,8208
5321,5835
##$MNOVA/ITEM/Z=	0
##$MNOVA/ITEM/ANGLE=	0
##TITLE=	Sep27-2021.40.fid
##JCAMP-DX=	6.0	$$ MestReNova 14.1.0-24037
##BLOCK_ID=	2
##DATA TYPE=	NMR SPECTRUM
##DATA CLASS=	XYDATA
##NUMDIM=	1
##ORIGIN=	Bruker BioSpin GmbH
##OWNER=	nmr
##.OBSERVE FREQUENCY=	400.4124024600000098
##.OBSERVE NUCLEUS=	^1H
##.SOLVENT NAME=	CDCl3
##.PULSE SEQUENCE=	zg30
##LONGDATE=	2021/09/27 18:08:00.000
##.ACQUISITIONMODE=	SIMULTANEOUS (DQD)
##$ORIGINAL FORMAT=	Bruker XWIN-NMR
##$MNOVA/SCALES_VERSION=	8
##$PARAMETER FILE=	(acqus, ASCII, //ch-nmrserv2.ch.ic.ac.uk/Av400A/brad/nmr/Sep27-2021/40/acqus, 0)
$$ ##TITLE= Parameter file, TOPSPIN		Version 3.2
$$ ##JCAMPDX= 5.0
$$ ##DATATYPE= Parameter Values
$$ ##NPOINTS= 11	$$ modification sequence number
$$ ##ORIGIN= Bruker BioSpin GmbH
$$ ##OWNER= nmr
$$ $$ 2021-09-27 18:08:22.059 +0100  nmr@CZC10666PP
$$ $$ /opt/topspin/data/brad/nmr/Sep27-2021/40/acqus
$$ $$ process /opt/topspin3.2/prog/mod/shimcntl
$$ ##$ACQT0= -2.36344537815126
$$ ##$AMP= (0..31)
$$ 100 100 100 100 100 100 100 100 100 100 100 100 100 100 100 100 100 100
$$ 100 100 100 100 100 100 100 100 100 100 100 100 100 100
$$ ##$AMPCOIL= (0..19)
$$ 0 0 0 0 0 0 0 0 0 0 0 0 0 0 0 0 0 0 0 0
$$ ##$ANAVPT= -1
$$ ##$AQSEQ= 0
$$ ##$AQ_mod= 3
$$ ##$AUNM= <au_zg>
$$ ##$AUTOPOS= <35 >
$$ ##$BF1= 400.41
$$ ##$BF2= 400.41
$$ ##$BF3= 400.41
$$ ##$BF4= 400.41
$$ ##$BF5= 400.41
$$ ##$BF6= 400.41
$$ ##$BF7= 400.41
$$ ##$BF8= 400.41
$$ ##$BYTORDA= 0
$$ ##$CAGPARS= (0..11)
$$ 0 0 0 0 0 0 0 0 0 0 0 0
$$ ##$CFDGTYP= 0
$$ ##$CFRGTYP= 9
$$ ##$CHEMSTR= <none>
$$ ##$CNST= (0..63)
$$ 1 1 145 1 1 1 1 1 1 1 1 1 1 1 1 1 1 1 1 1 1 1 1 1 1 1 1 1 1 1 1 1 1 1 1
$$ 1 1 1 1 1 1 1 1 1 1 1 1 1 1 1 1 1 1 1 1 1 1 1 1 1 1 1 1 1
$$ ##$CPDPRG= (0..8)
$$ <> <> <> <> <mlev> <mlev> <mlev> <mlev> <mlev>
$$ ##$D= (0..63)
$$ 0 1 0 0 0 0 0 0 0 0.06 0 0 0 0 0 0 0.0002 0 0 0 0 0 0 0 0 0 0 0 0 0 0 0
$$ 0 0 0 0 0 0 0 0 0 0 0 0 0 0 0 0 0 0 0 0 0 0 0 0 0 0 0 0 0 0 0 0
$$ ##$DATE= 1632762501
$$ ##$DE= 6.5
$$ ##$DECBNUC= <off>
$$ ##$DECIM= 2496
$$ ##$DECNUC= <off>
$$ ##$DECSTAT= 4
$$ ##$DIGMOD= 1
$$ ##$DIGTYP= 12
$$ ##$DQDMODE= 0
$$ ##$DR= 22
$$ ##$DS= 2
$$ ##$DSPFIRM= 0
$$ ##$DSPFVS= 20
$$ ##$DTYPA= 0
$$ ##$EXP= <proton>
$$ ##$F1LIST= <111111111111111>
$$ ##$F2LIST= <222222222222222>
$$ ##$F3LIST= <333333333333333>
$$ ##$FCUCHAN= (0..9)
$$ 0 2 0 0 0 0 0 0 0 0
$$ ##$FL1= 90
$$ ##$FL2= 90
$$ ##$FL3= 90
$$ ##$FL4= 90
$$ ##$FOV= 20
$$ ##$FQ1LIST= <freqlist>
$$ ##$FQ2LIST= <freqlist>
$$ ##$FQ3LIST= <freqlist>
$$ ##$FQ4LIST= <freqlist>
$$ ##$FQ5LIST= <freqlist>
$$ ##$FQ6LIST= <freqlist>
$$ ##$FQ7LIST= <freqlist>
$$ ##$FQ8LIST= <freqlist>
$$ ##$FRQLO3= 17285.0399999619
$$ ##$FRQLO3N= 2
$$ ##$FS= (0..7)
$$ 83 83 83 83 83 83 83 83
$$ [...]
$$ 90 74 58 42 26 10 0 0
$$ ##$Sgu3PowerLevels= (0..7)
$$ 0 0 0 0 0 0 0 0
$$ ##$Sgu4PowerLevels= (0..7)
$$ 0 0 0 0 0 0 0 0
$$ ##$Sgu5PowerLevels= (0..7)
$$ 0 0 0 0 0 0 0 0
$$ ##$Sgu6PowerLevels= (0..7)
$$ 0 0 0 0 0 0 0 0
$$ ##$Sgu7PowerLevels= (0..7)
$$ 0 0 0 0 0 0 0 0
$$ ##$Sgu8PowerLevels= (0..7)
$$ 0 0 0 0 0 0 0 0
$$ ##$SguType= 3
$$ ##$ShimPowMaxUA= (0..63)
$$ 130000 130000 130000 130000 130000 130000 130000 130000 130000 130000 130000
$$ 130000 130000 130000 130000 130000 130000 130000 130000 130000 0 0 0 0
$$ 0 0 0 0 0 0 0 0 0 0 0 0 0 0 0 0 0 0 0 0 0 0 0 0 0 0 0 0 0 0 0 0 0 0 0 0
$$ 0 0 0 0
$$ ##$ShimPowMaxUC= (0..63)
$$ 130000 130000 130000 130000 130000 130000 130000 130000 130000 130000 130000
$$ 130000 130000 130000 130000 130000 130000 130000 130000 130000 0 0 0 0
$$ 0 0 0 0 0 0 0 0 0 0 0 0 0 0 0 0 0 0 0 0 0 0 0 0 0 0 0 0 0 0 0 0 0 0 0 0
$$ 0 0 0 0
$$ ##$ShimPowMaxUG= (0..63)
$$ 524287 524287 524287 524287 524287 524287 524287 524287 524287 524287 524287
$$ 524287 524287 524287 524287 524287 524287 524287 524287 524287 0 0 0 0
$$ 0 0 0 0 0 0 0 0 0 0 0 0 0 0 0 0 0 0 0 0 0 0 0 0 0 0 0 0 0 0 0 0 0 0 0 0
$$ 0 0 0 0
$$ ##$ShimPowRcbType= 3
$$ ##$ShimPowRes= (0..63)
$$ 1e-20 1e-20 1e-20 1e-20 1e-20 1e-20 1e-20 1e-20 1e-20 1e-20 1e-20 1e-20
$$ 1e-20 1e-20 1e-20 1e-20 1e-20 1e-20 1e-20 1e-20 0 0 0 0 0 0 0 0 0 0 0 0
$$ 0 0 0 0 0 0 0 0 0 0 0 0 0 0 0 0 0 0 0 0 0 0 0 0 0 0 0 0 0 0 0 0
$$ ##$ShimPowRng0= (0..63)
$$ 1 1 1 1 1 1 1 1 1 1 1 1 1 1 1 1 1 1 1 1 0 0 0 0 0 0 0 0 0 0 0 0 0 0 0 0
$$ 0 0 0 0 0 0 0 0 0 0 0 0 0 0 0 0 0 0 0 0 0 0 0 0 0 0 0 0
$$ ##$ShimPowRng1= (0..63)
$$ 1 1 1 1 1 1 1 1 1 1 1 1 1 1 1 1 1 1 1 1 0 0 0 0 0 0 0 0 0 0 0 0 0 0 0 0
$$ 0 0 0 0 0 0 0 0 0 0 0 0 0 0 0 0 0 0 0 0 0 0 0 0 0 0 0 0
$$ ##$ShimPowRng2= (0..63)
$$ 1 1 1 1 1 1 1 1 1 1 1 1 1 1 1 1 1 1 1 1 0 0 0 0 0 0 0 0 0 0 0 0 0 0 0 0
$$ 0 0 0 0 0 0 0 0 0 0 0 0 0 0 0 0 0 0 0 0 0 0 0 0 0 0 0 0
$$ ##$ShimPowRng3= (0..63)
$$ 1 1 1 1 1 1 1 1 1 1 1 1 1 1 1 1 1 1 1 1 0 0 0 0 0 0 0 0 0 0 0 0 0 0 0 0
$$ 0 0 0 0 0 0 0 0 0 0 0 0 0 0 0 0 0 0 0 0 0 0 0 0 0 0 0 0
$$ ##$ShimSysFunc= (0..63)
$$ 1 2 3 4 5 7 9 11 15 16 8 10 12 14 6 17 13 18 19 20 0 0 0 0 0 0 0 0 0 0
$$ 0 0 0 0 0 0 0 0 0 0 0 0 0 0 0 0 0 0 0 0 0 0 0 0 0 0 0 0 0 0 0 0 0 0
$$ ##$ShimSysMatrix= 0
$$ ##$ShimSysType= 1
$$ ##$TFXNUM= 0
$$ ##$TRIPLO2= 0
$$ ##$VTU= 2
$$ ##$VTUETH= <149.236.99.20>
$$ ##$VTUTY= <no>
$$ ##$WBREFAM= (0..15)
$$ 135 116 100 100 100 100 100 100 100 100 100 100 100 100 100 100
$$ ##$WBREFLM= (0..15)
$$ 0 0 0 0 0 0 0 0 0 0 0 0 0 0 0 0
$$ ##$WBREFPH= (0..15)
$$ 71.66 -68.25 0 0 0 0 0 0 0 0 0 0 0 0 0 0
$$ ##$WBSGU= (0..15)
$$ 0 0 0 0 0 0 0 0 0 0 0 0 0 0 0 0
$$ ##$XFAC= 2
$$ ##END=
$$ 
##$DECIM=	2496
##$DSPFVS=	20
##XUNITS=	HZ
##YUNITS=	ARBITRARY UNITS
##FIRSTX=	6396.6177993478777353
##LASTX=	-1616.2027134726320128
##DELTAX=	-0.1222678036594264106
##XFACTOR=	1
##YFACTOR=	0.0034395988232252977003
##FIRSTY=	10.270229339599609375
##MINY=	-3.1112935543060302734
##MAXY=	21290.40234375
##NPOINTS=	65536
##XYDATA=	(X++(Y..Y))
$$ [...]
1634D43m3J6O3O4L8Kj2j3J0J0J0J0LMMLnnJ6j8l7kJ1J2kjL6P1M8J2k8o4n6n6k0J6K3K3M4J0
$$ 443 400 416 479 543 581 583 571 558 568 578 588 598 601 605 609 612 607 602 618 600 563 561 572 584 582 581 617 688 736 748 720 656 600 544 524 540 563 586 630 640
1629F40m2m2pK9M9J4JJj9j9j9j9QQQQL8L7L5L6jl6j6j7k0k1k1k1pom1m0j0K4O2O2L8Kj0j1
$$ 640 598 556 549 578 627 641 642 643 624 605 586 567 575 583 591 599 637 674 709 745 744 708 692 675 655 634 613 592 585 579 538 498 488 512 574 636 674 676 666 655
1624F55L0O5O6L0l8l7m0l9k2k2k2k1onnnl9l8K1K0J7J7J7J7J9J8J8J9O7O6L2L1j3j4p3p3n4
$$ 655 685 750 816 846 808 771 731 692 670 648 626 605 599 594 589 584 545 507 528 548 565 582 599 616 635 653 671 690 757 823 855 886 873 859 786 713 659
1619F59n4j9j9j3j3j3j3pppqppppL2L1L2L2k2k1k2k1J0J1J0J1j0rj0rK7K7rqj3j3M6M6L5L4
$$ 659 605 586 567 554 541 528 515 508 501 494 486 479 472 465 458 490 521 553 585 563 542 520 499 509 520 530 541 531 522 512 503 530 557 548 540 527 514 560 606 641 675
1614F75L5L5j5j5j5j5n3n3n3n3%%%%L7L6L7L7nnpol6p1q3k3L1O7P1L5l0l0l2l2lkllK2K2K2
$$ 675 710 745 730 715 700 685 632 579 526 473 473 473 473 473 510 546 583 620 615 610 603 597 561 490 407 384 415 482 553 588 558 528 496 464 461 459 456 453 475 497 519
1609E19K2n4n5n5n4j6j6j6j6L7L7L7L7l2l1l2l2kklkM3M3M3M3M4M3M3M3NNMNNNNNJ9J9K0J9
$$ 519 541 487 432 377 323 307 291 275 259 296 333 370 407 375 344 312 280 278 276 273 271 314 357 400 443 487 530 573 616 621 626 630 635 640 645 650 655 674 693 713 732
1604G32QRK8pk8k8l0l0m5m4m4m4j7j8K0N6N6K1Nl1o1o0l6K2M6M5J4J3RJ0m8m8j5K0LKJL5P1
$$ 732 740 749 777 770 742 714 684 654 609 565 521 477 460 442 462 518 574 595 600 569 508 448 412 434 480 525 539 552 561 571 523 475 460 480 483 485 486 521 592
1599E92P1K0l9o2o3j9J6L2L2J3J3qK9K7K7K9L0j4j4Ol0k8k8n1j4L9M0O2K7j3j3Nl0n6n6k3
$$ 592 663 683 644 582 519 500 516 548 580 593 606 598 627 654 681 710 740 726 712 718 688 660 632 581 567 606 646 708 735 722 709 714 684 628 572 549
1595E49k3j7j6M2M3M4M5Nl0k6k7POLLl0l0kL4L4jj2j1j3j3qqqpqqqpqppqM4M3Pk9l2LJ7J6
$$ 549 526 509 493 535 578 622 667 672 642 616 589 596 602 605 608 578 548 546 580 614 613 601 590 577 564 556 548 540 533 525 517 509 502 494 487 480 472 516 559 566 537 505 508 525 541
1590E41l8l8kL5M0Nqqk6k7RRK3K3j3j2J%JJONOOk2k1m2orqnmJ6N3L2L3oooommlmLMJ6N2O1
$$ 541 503 465 463 498 538 543 535 527 501 474 483 492 515 538 525 513 514 514 515 516 522 527 533 539 517 496 454 448 439 431 426 422 438 491 523 556 550 544 538 532 528 524 521 517 520 524 540 592 653
1584F53K6j6n0n9n8k6k5JJj9J7R1R2P0J1oL0L9L9l2o7q1q0l6%J6J5PPPPRRRRJJK1j5m7m8n0
$$ 653 679 663 613 554 496 470 445 446 447 428 445 536 628 698 709 703 733 772 811 779 712 631 551 515 515 531 546 553 560 567 574 583 592 601 610 611 612 633 618 571 523 473
1578D73n0j1j0j0j1L1L1K9K8J5k0j%k0k1j8j8K6O2M1M2K6K6K7K6j8j8j8j8J1J2J1J1POOOl7
$$ 473 423 412 402 392 381 412 443 472 500 515 495 494 494 474 453 435 417 443 505 546 588 614 640 667 693 675 657 639 621 632 644 655 666 673 679 685 691 654
1574F54l8kN7J07P1ml8n1n1n3n3j9j9j9k0jkkjl2l1k9l0j2K3P2P2M1OK6K6k6k5k5k5k4k3k4
$$ 654 616 614 671 778 849 845 807 756 705 652 599 580 561 542 522 521 519 517 516 484 453 424 394 382 405 477 549 590 596 622 648 622 597 572 547 523 500 476
1569D76k4K5K6K5K5N1N2k0j9l2l3l3l2PQNOk8o3m1m1jL4J3J2L7Km7m6m6j1K0N6L5L5L7L7K
$$ 476 452 477 503 528 553 604 656 636 617 585 552 519 487 494 502 507 513 485 422 381 340 339 373 386 398 435 437 390 344 298 287 307 363 398 433 470 507 509
1564E09KLMnL1L0nk9k8J7N3J4k3%%J2J2J2J2L2L2j9n5k6k7k9k9l4l3l1l2K2N7L5L5K3j2PQ
$$ 509 511 514 518 513 544 574 569 540 512 529 582 596 573 573 573 585 597 609 621 653 685 666 611 585 558 529 500 466 433 402 370 392 449 484 519 542 530 537 545
1560E45K7K8m2m1j2K3NNJ3M8M8J3j8j8k1k0l2l2l2l2k3k3k3k3JJJJO2O1N9O0M8J2j9n4k6k6
$$ 545 572 600 558 517 505 528 533 538 551 599 647 660 642 624 603 583 551 519 487 455 432 409 386 363 364 365 366 367 429 490 549 609 657 669 650 596 570 544
1555E44k8k8NMMNmnmnMMLMn2n2jL5O6O6O6O6Kl3j2j1qK8QQm5m6ML9pm2k0j9k0k0m0mL4L3j5
$$ 544 516 488 493 497 501 506 502 497 493 488 492 496 499 503 451 399 398 433 499 565 631 697 699 666 654 643 635 663 671 679 634 588 592 631 624 582 562 543 523 503 463 459 493 526 511
1550E11n1rrj1j0KLLLj5j5j4j5J6J7J6J7M4M4O3K9J3J4J1J1M1M1L9L8k4o0l8l8pK9RQJ0J0
$$ 511 460 451 442 431 421 423 426 429 432 417 402 388 373 389 406 422 439 483 527 590 619 632 646 657 668 709 750 789 827 803 743 705 667 660 689 698 706 716 726
1545G26RJ0l2l1l2l2mlmmM9M9N0M9jjjjl2l2L9L9LKKLkkkkk8k8k8k8J3J3J4J3n4n5n4n5o4
$$ 726 735 745 713 682 650 618 614 611 607 603 652 701 751 800 799 798 797 796 764 732 771 810 813 815 817 820 818 816 814 812 784 756 728 700 713 726 740 753 699 644 590 535 471
1540D71o5OOJ8J8J9J8%%J%q1q0nO6L3kK2K2J4J4J3J4NNNNonooN5N5N5N5O0O1j1j0MMMNj9j9
$$ 471 406 412 418 436 454 473 491 491 491 492 492 411 331 326 392 425 423 445 467 481 495 508 522 527 532 537 542 536 531 525 519 574 629 684 739 799 860 849 839 843 847 851 856 837 818
1534H18N1N2O1O1J00L0J3J2QRj0rj0rkkmlr7j31q1j0L2L2L6L6p2p1p2p2m5m5m5m5L2L1L2L2
$$ 818 869 921 982 1043 1143 1173 1186 1198 1206 1215 1205 1196 1186 1177 1175 1173 1169 1166 1069 938 857 847 879 911 947 983 911 840 768 696 651 606 561 516 548 579 611 643
1529F43nnnmnnmnPPPPP7P6ONJ4J3J3J4o8o8o4o3KP4P3Lm9m9n0m9k2M9Q0Q0nmnmk8k7M3M3K1
$$ 643 638 633 628 624 619 614 610 605 612 619 626 633 710 786 792 797 811 824 837 851 783 715 651 588 590 664 737 740 691 642 592 543 521 570 650 730 725 721 716 712 684 657 700 743 764
1524G64K2K1K1L9L9L9M0lkkkM5M5M5M6l9l9j3N9P4Mp0o9m8m8K3K3M6M5J4n6j01j01l4l5j1
$$ 764 786 807 828 867 906 945 985 982 980 978 976 1021 1066 1111 1157 1118 1079 1066 1125 1199 1203 1133 1064 1016 968 991 1014 1060 1105 1119 1063 962 861 827 792 781
1519G81j2j2j1k9l0k9k9K6K5m5m5k3k3k3k3NNMNL5L4L4L5K2K3K3K2l0l0l1l0qqpqj2j2j2j3
$$ 781 769 757 746 717 687 658 629 655 680 635 590 567 544 521 498 503 508 512 517 552 586 620 655 677 700 723 745 715 685 654 624 616 608 601 593 581 569 557 544
1515E44m3m2K7K8J8J8J7J8L9M0L9L9M0L9M0L9o6o6o6o6k5k5k5k4K4K5K4K5P5P6R2N6po6n5
$$ 544 501 459 486 514 532 550 567 585 624 664 703 742 782 821 861 900 834 768 702 636 611 586 561 537 561 586 610 635 710 786 878 934 927 861 806
1510H06j9j3j4j1j1nonnk3k3k4k3J7J6J7J6k6k6RRM1M1ro7q6q5ooM2M2M2M2K6K5K6K6L4L4
$$ 806 787 774 760 749 738 733 727 722 717 694 671 647 624 641 657 674 690 664 638 647 656 697 738 729 662 576 491 485 479 521 563 605 647 673 698 724 750 784 818
1506H18k5k5l4l3l3l3J2J2J2J2K0K1K1K1k2k2k2k2QPQPRRRQl2l3l2l3n5n5n5n5kjkkj0rrr
$$ 818 793 768 734 701 668 635 647 659 671 683 703 724 745 766 744 722 700 678 686 693 701 708 717 726 735 743 711 678 646 613 558 503 448 393 391 390 388 386 376 367 358 349
1501C49N5N6N6N5llmllmllK9K9K9K9l6l5l6l6L4L3L4L4MMl2l1j0rM9M9J9K0J9J9K3K3l6l5
$$ 349 404 460 516 571 568 565 561 558 555 551 548 545 574 603 632 661 625 590 554 518 552 585 619 653 657 661 629 598 588 579 628 677 696 716 735 754 777 800 764 729
1496G29k1k0k0k1mmnmo2o1j4M5P7M1j8j8J3J4J4J4l9l8l9l8J4J5J5J4N3N2N3N2J1J1J1J1m3
$$ 729 708 688 668 647 643 639 634 630 568 507 493 538 615 656 638 620 633 647 661 675 636 598 559 521 535 550 565 579 632 684 737 789 800 811 822 833 790
1491G90m3m3m3p6p7j7j7K4K4K4K4K6K5K6K5K5K4j2j1M0M1J4m4o7o7l5l5POMMn2q8r9l9J7N2
$$ 790 747 704 661 585 508 491 474 498 522 546 570 596 621 647 672 697 721 709 698 738 779 793 749 682 615 580 545 552 558 562 566 514 426 327 288 305 357
1487C57L6L7L2L2L2L2L2L2L2L2K7K8K7K8l8l7l7l8j0j0j1j0P1P1L5L6K1K2l7l8LKLKj2j2j3
$$ 357 393 430 462 494 526 558 590 622 654 686 713 741 768 796 758 721 684 646 636 626 615 605 676 747 782 818 839 861 824 786 789 791 794 796 784 772 759
1482G59j2n1n2m9m9rK7M2M2M2M1Kl3o7o8l1NRRJ1J2K6K6j1m6m7j1K4K4%l5j6j5L7L6%l5j8
$$ 759 747 696 644 595 546 537 564 606 648 690 731 733 700 633 565 534 539 548 557 568 580 606 632 621 575 528 517 541 565 565 530 514 499 536 572 572 537 519
1477E19J8L0L1J6J6J6J6qqm2m1l4KM4M3M1P6P5L8Qk7m6m5r0q9n0j5J0J0M8M8J3J2J3J2J1J1
$$ 519 537 567 598 614 630 646 662 654 646 604 563 529 531 575 618 659 735 810 848 856 829 783 738 648 559 509 494 504 514 562 610 623 635 648 660 671 682
1473F82J1J1J4J4k3n8o0k5j2j2J4J3M9M9KKj%l4o9o9l3j0j0o3o3l1K9N7N6L3O9J04J04N1r
$$ 682 693 704 718 732 709 651 591 566 554 542 556 569 618 667 669 671 670 670 636 567 498 465 455 445 382 319 288 317 374 430 463 532 636 740 791 782
1468G82j2j3j4m9l0l0qroom2pL1L1Qk7k7RK0J9K2K2OPOOk0j9J7N3M6J1k7k6K7K6K6K6nnno
$$ 782 770 757 743 694 664 634 626 617 611 605 563 556 587 618 626 599 572 581 601 620 642 664 670 677 683 689 669 650 667 720 766 777 750 724 751 777 803 829 824 819 814 808
1463H08J3J2J3J2j8j8j9j8j8j8j9j8qqrqk6k6k6k6K6K6K6K6K3K4K2K1J7j8n3j8J3J3k4n9m7
$$ 808 821 833 846 858 840 822 803 785 767 749 730 712 704 696 687 679 653 627 601 575 601 627 653 679 702 726 748 769 786 768 715 697 710 723 699 640 593
1459E93m6j4j3J6J6J7J6J0J0L0nllnnRRPQl6p1p2l5K7K8L0L0j1j2j1j2J5J4L4jj8j7J9N5N9
$$ 593 547 533 520 536 552 569 585 595 605 635 630 627 624 619 614 623 632 639 647 611 540 468 433 460 488 518 548 537 525 514 502 517 531 565 564 546 529 548 603 662
1454F62N9jl7l2l2MM0M3M2ko2p2l7kkl0k9l0l0l9l9%L5LMNO%J%%PPPPk3k2k3k3L0L0L0L0J2
$$ 662 721 720 683 651 619 623 663 706 748 746 684 612 575 573 571 541 512 482 452 413 374 374 409 412 416 421 427 427 428 428 428 435 442 449 456 433 411 388 365 395 425 455 485 497
1449D97J2J2J3LLLLm6m6m6m5l8l8%N9R0R1K3K4KLLLkkjkooK7l1j16j15m8m8L3L2L2L2M6M6
$$ 497 509 521 534 537 540 543 546 500 454 408 363 325 287 287 346 436 527 550 574 576 579 582 585 583 581 580 578 572 566 593 562 446 331 283 235 268 300 332 364 410 456
1444D56M5M6QQPQk1k2M9N0P8P9m0l9l4l3l4l4j7j7j7j7NNNNj3j2N9N8M8M9M8M8k5k4k4k5k
$$ 456 501 547 555 563 570 578 557 535 584 634 712 791 751 712 678 645 611 577 560 543 526 509 514 519 524 529 516 504 563 621 669 718 766 814 789 765 741 716 714
1439G14klko6o5NNL1L0L1L0k8k9k8k8l7l7l7l7k8k7k5k5O4R9J12N4j3j2j7j6k5k5k5k5j6j5
$$ 714 712 709 707 641 576 581 586 617 647 678 708 680 651 623 595 558 521 484 447 419 392 367 342 406 505 617 671 658 646 629 613 588 563 538 513 497 482
1434D82j5j6j5j5j4j3M1P6N6N7NNMLo9j04r8o4RR2J36J00L5kJ5J4ll8l8lK3K2%L6M4j6r6r6
$$ 482 467 451 436 421 407 394 435 511 567 624 629 634 638 641 572 468 370 306 315 407 543 643 678 676 691 705 702 664 626 623 646 668 668 704 748 732 636 540
1430E40o1k6OM1N7N7j2j1onJ5k1k3k3k5k6J9J8J6J6nm1j8j9L2O7M6M5rm5k5k5j8j7j8j8J%
$$ 540 479 453 459 500 557 614 602 591 585 580 595 574 551 528 503 477 496 514 530 546 541 500 482 463 495 562 608 653 644 599 574 549 531 514 496 478 479 479
1425D79%%j5j5l5%N5N5P7M2j6j5j8j8K4K4K1K1rm5k5k5j8j9j8j8J8J9J9J8K2K2m6m5l6K3N9
$$ 479 479 479 464 449 414 414 469 524 601 643 627 612 594 576 600 624 645 666 657 612 587 562 544 525 507 489 507 526 545 563 585 607 561 516 480 503 562
1420E62N9J8j7k0J6L6Jm8m8l0l0NNJ3J3J6J6L9P4N3N2J9j7LMJ1J2o0n9j8j8j7j8QPQPrj0r
$$ 562 621 639 622 602 618 654 655 607 559 529 499 504 509 522 535 551 567 606 680 733 785 804 787 790 794 805 817 757 698 680 662 645 627 635 642 650 657 648 638 629
1416F29rj7j6l6%N4N4N4N5M8J3lllmn4r0p5p4k6J0J9J8k8o3m1oM3M3K1K1K2K1J0J0J1J0j7
$$ 629 620 603 587 551 551 605 659 713 768 816 829 826 823 820 816 762 672 597 523 497 507 526 544 516 453 412 406 449 492 513 534 556 577 587 597 608 618 601
1411F01j7J6J6J9j6o4o4k5L4P0O9Q9N3KLk9k8k8k8k4k3k4k4j6j6j6j6M9M9M8M9N3N3N0M9l
$$ 601 584 600 616 635 619 555 491 466 500 570 639 728 781 783 786 757 729 701 673 649 626 602 578 562 546 530 514 563 612 660 709 762 815 865 914 911
1407I11o3l0k9j5j5J9J8L3kn1n1j2K4P4P4M1M1OOj4j3m9m9J3J3Q4Q4R0Q9J8J9kklkM4M3M4
$$ 911 848 818 789 774 759 778 796 829 827 776 725 713 737 811 885 926 967 973 979 965 952 903 854 867 880 964 1048 1138 1227 1245 1264 1262 1260 1257 1255 1299 1342 1386
1402A386M3K6K6K6K5J27J27J26J27J51J52J56J56J43K13K72L07L42L42M00N19N92O62O69P39
$$ 1386 1429 1455 1481 1507 1532 1659 1786 1912 2039 2190 2342 2498 2654 2797 3010 3282 3589 3931 4273 4673 5192 5784 6446 7115 7854
1399G854Q57R76J088J160J181J217J196J030P42K93j70n72p99r65j030r95r22q51p59o88o53
$$ 7854 8711 9687 10775 11935 13116 14333 15529 16559 17301 17594 17424 16852 16053 15088 14058 13063 12141 11290 10531 9843 9190
1396I190n82n62n26m47l76l58l23k35j64j00o4o3PR6J66K41K42K53K54L11M29N13O31P35Q06
$$ 9190 8608 8046 7520 7073 6697 6339 6016 5781 5617 5517 5453 5390 5397 5493 5659 5900 6142 6395 6649 6960 7389 7902 8533 9268 10074
1393A0074Q56R27J005J076J142J143R87P27L07j89o17r25j092j163j139j068r82r11q37p67
$$ 10074 10930 11857 12862 13938 15080 16223 17210 17937 18244 18055 17438 16513 15421 14258 13119 12051 11069 10158 9321 8554
1391H554o77o05n28n27m93m21m13m13m09l38k52j82j67j31p6p5j09j09j11j11j11j11o3o3
$$ 8554 7877 7272 6744 6217 5724 5303 4890 4477 4068 3730 3478 3296 3129 2998 2922 2847 2738 2629 2518 2407 2296 2185 2122 2059
1388B059o3o3l9l9l8l9l0l0l0l0m3m4m3m3q2q1q2q2j0j0j0j0nnn0j10r6l6L2L3L1L1O7O6l8
$$ 2059 1996 1933 1894 1855 1817 1778 1748 1718 1688 1658 1615 1571 1528 1485 1403 1322 1240 1158 1148 1138 1128 1118 1113 1108 1058 948 852 816 848 881 912 943 1010 1076 1038
1384A038l8l8l9j5j5j6j5O1O1N5N6N5k8q3q4l4K6K7K8m0l9m0l9%%%%m8m7m8m8L4L3O9P0L9
$$ 1038 1000 962 923 908 893 877 862 923 984 1039 1095 1150 1122 1039 955 921 947 974 1002 962 923 883 844 844 844 844 844 796 749 701 653 687 720 789 859 898
1379H98M0j0o9j11j11q6k8J7N2O9O9Q1M5oo5p6m0mnRQQQJ2J2J2J2nmmmK6K6K6K6l4l5p0p0
$$ 898 938 928 859 748 637 551 523 540 592 661 730 811 856 850 785 709 669 665 660 669 677 685 693 705 717 729 741 736 732 728 724 750 776 802 828 794 759 689 619
1374F19n2n3OOO7O8L2L1j8j8j8j9jjkjj0j1j0j0qqqqJ0J1L2lj6J9llL2L1L0K9j0m5m6j0k3
$$ 619 567 514 520 526 593 661 693 724 706 688 670 651 650 649 647 646 636 625 615 605 597 589 581 573 583 594 626 623 607 626 623 620 652 683 713 742 732 687 641 631 608
1369F08k3k2k1j7j8l7kL4L3K0j5m1m1J6N2J8m1k5J0J3J4mL1P0O9J2k4k5J2O9P0M0Ol4l4%%
$$ 608 585 563 542 525 507 470 468 502 535 555 540 499 458 474 526 544 503 478 488 501 515 511 542 612 681 693 669 644 656 725 795 835 841 807 773 773 773
1365G73K0j5m3m4m5m6LLLLLLLKRRRR%%%%K0K1J8J8J2k4mmJ6J6J6J6NMl4p0p9p9m3m4k5J1N0
$$ 773 793 778 735 691 646 600 603 606 609 612 615 618 621 623 632 641 650 659 659 659 659 659 679 700 718 736 748 724 720 716 732 748 764 780 785 789 755 685 606 527 484 440 415 426 476
1359D76Q6R3L5l8p3m9j4M7M8M5M6j0j1NM1M1Nj9k0k2k1ppppJ7J7J6J7j6j6j6j6k2k3k2k3j3
$$ 476 562 655 690 652 579 530 516 563 611 656 702 692 681 686 727 768 773 754 734 712 691 684 677 670 663 680 697 713 730 714 698 682 666 644 621 599 576 563
1355E63j4j4j3MNMNj2j2j2j2l9l9L2L2L6L6L6L6onooL2L3L2L3K8K9K9K8k0k0k0k0K5K4m6m6
$$ 563 549 535 522 526 531 535 540 528 516 504 492 453 414 446 478 514 550 586 622 616 611 605 599 631 664 696 729 757 786 815 843 823 803 783 763 788 812 766 720
1350G20l3l3KLOOM2M1k0k0k1k0j6j5j6j5M0M1M0M1j7j7j7j6o3o2o3o2j6j6N6N5L3L3l8l8n0
$$ 720 687 654 656 659 665 671 713 754 734 714 693 673 657 642 626 611 651 692 732 773 756 739 722 706 643 581 518 456 440 424 480 535 568 601 563 525 475
1345D75n1K0K0O4O3K9K8j6j6j5j6K1K0K1K0j4j4j4j4J2J3J2J3k1k1k0k1j2j2j2j2j2j2j2j2
$$ 475 424 444 464 528 591 620 648 632 616 601 585 606 626 647 667 653 639 625 611 623 636 648 661 640 619 599 578 566 554 542 530 518 506 494 482
1341D82J9J9n0n0rK7K6qk7k6M2M2L2L2j8n4p6p5PO6P0P0N8K3M4M3L9L9Ml1j1j1k8k8k8k8K0
$$ 482 501 520 470 420 411 438 464 456 429 403 445 487 519 551 533 479 403 328 335 401 471 541 599 622 666 709 748 787 791 760 749 738 710 682 654 626 646
1337F46K1K0K1K0K1K0K1m4m5m1m2%L5J6J6lllkk8k8M3M3ppqpm5m4ML9M2Om2m2m0m0RM4M7J2
$$ 646 667 687 708 728 749 769 790 746 701 660 618 618 653 669 685 682 679 676 674 646 618 661 704 697 690 682 675 630 586 590 629 671 677 635 593 553 513 522 566 613 625
1332F25kjK7K8M7J2m6m6m6m6n2j6L2L3L3jj7j7J4J4J4J4LMKKJ3k3klPOPPm1m0nN3O5L0J6J5
$$ 625 623 622 649 677 724 736 690 644 598 552 500 484 516 549 582 581 564 547 561 575 589 603 606 610 612 614 627 604 602 599 606 612 619 626 585 545 540 593 658 688 704 719
1326G19N3J8l1l1j2K3K1j4l7p2p4l9%Jj7J8M7M6O9L3j8j9m0nM3M3M5M6j5j4j4j4K5K6M6J0
$$ 719 772 790 759 728 716 739 760 746 709 637 563 524 524 525 508 526 573 619 688 721 703 684 644 639 682 725 770 816 801 787 773 759 784 810 856 866
1322H66j4j3k9o4o7l1j4K1N5N6N5N6M0Ml8p3n5n4k1k1j2j1ML9N6N6J9j7l0l0m5q1o7l2K9K9
$$ 866 852 839 810 746 679 648 634 655 710 766 821 877 917 921 883 810 755 701 680 659 647 636 640 679 735 791 810 793 763 733 688 607 540 508 537 566
1318E66M9M8jo1p5p5m2m1k8PM6M7N5N5N5N5L3L4ml8j8J7J5k1l3l3K4K4j8j8oL0K2l6q3q4m5
$$ 566 615 663 662 601 526 451 409 368 340 347 393 440 495 550 605 660 693 727 723 685 667 684 699 678 645 612 636 660 642 624 618 648 670 634 551 467 422
1313D22m4m2m3k9OM6M5K9K8nmJ9N5R2R2O0K5RJ0j0rm4m5o3o2k7k8RRRRl1l1j5K0P1P0L4jj7
$$ 422 378 336 293 264 270 316 361 390 418 413 409 428 483 575 667 727 752 761 771 761 752 708 663 600 538 511 483 492 501 510 519 488 457 442 462 533 603 637 636 619
1308F19j8L8L7K1j5NNMMLKjl6j6j7J7J6Jl5m8m9j1K3N9N8K6K5kjjkopopj5j6j5j6K7K6K6K6
$$ 619 601 639 676 697 682 687 692 696 700 703 705 704 668 652 635 652 668 669 634 586 537 526 549 608 666 692 717 715 714 713 711 705 698 692 685 670 654 639 623 650 676 702 728
1303G28L0K9k8k7m1nJ1J0k5k6k5k6j1j0k9PN5R0P0J2k8k8ML9J5m3q9q8m7j1MMQQM3M3M5M5
$$ 728 758 787 759 732 691 686 697 707 682 656 631 605 594 584 555 562 617 707 777 789 761 733 737 776 791 748 659 571 524 513 517 521 529 537 580 623 668 713
1298G13j4j4k3k4k3k3ppppj6j6j6j6onnoM5M5M4M5J5J5J5J4L7L7N5J9n0q6j21q6l7jM2P7P5
$$ 713 699 685 662 638 615 592 585 578 571 564 548 532 516 500 494 489 484 478 523 568 612 657 672 687 702 716 753 790 845 864 814 728 607 521 484 483 525 602 677
1294F77L9jl7l8l7l8l7j4K1O1O1M8M8Rk6o0n9m6j1J8J7j7n3k7RK2K1j7j7kL4K4K4K7K6jkj
$$ 677 716 715 678 640 603 565 528 514 535 596 657 705 753 762 736 676 617 571 560 578 595 578 525 498 507 529 550 533 516 514 548 572 596 623 649 648 646 645
1289F45km1m2k6J0M7M7j0j0klj%J4N0L0K9j5j6j5j6oppoj4j3j3j3l4l4l2l2J8N4L1L2Rk6p
$$ 645 643 602 560 534 544 591 638 628 618 616 613 612 612 626 676 706 735 720 704 689 673 667 660 653 647 633 620 607 594 560 526 494 462 480 534 565 597 606 580 573
1284E73ommmmJ6J7J7J6k3k4k4k3rrrrK5K6K2K3k5o0m1m0j9j8j9j8M3M4M3M4K3K3K3K3K3K3
$$ 573 567 563 559 555 551 567 584 601 617 594 570 546 523 514 505 496 487 512 538 560 583 558 498 457 417 398 380 361 343 386 430 473 517 540 563 586 609 632 655
1279F55K3K3k8k8k7k8j9j9j9j9L3L3L2L3mlmmJ8J7M8M9N8%n0n0n3n2n2n3jkjjK3K4K3K4rr
$$ 655 678 701 673 645 618 590 571 552 533 514 547 580 612 645 641 638 634 630 648 665 713 762 820 820 770 720 667 615 563 510 509 507 506 505 528 552 575 599 590 581
1274E81rrN8N7N8N8o3o3o0n9lN6N7ll3l4l7l8nnnnRJ0RJ0K4K4K3K4RRRRooooN6N6N6N6m2m3
$$ 581 572 563 621 678 736 794 731 668 608 549 546 602 659 656 623 589 552 514 509 504 499 494 503 513 522 532 556 580 603 627 636 645 654 663 657 651 645 639 695 751 807 863 821 778
1269G78m2m2KKKKm5m4m5m4L5L5L6L5n2n1n2n1ppqpM4M4M4M4l2l2l2l2ooN4N3M0M0NNlkklK8
$$ 778 736 694 696 698 700 702 657 613 568 524 559 594 630 665 613 562 510 459 452 445 437 430 474 518 562 606 574 542 510 478 472 466 520 573 613 653 658 663 660 658 656 653 681
1264F81K8K6K6j3m8k8k9jj%jnnlkNM0M2PlL2PQLl3l6Jmm0j7j8kkkkMLLLj8j8lL3N3N2mmJ4
$$ 681 709 735 761 748 700 672 643 642 641 641 640 635 630 627 625 630 670 712 719 716 748 755 763 766 733 697 698 694 654 637 619 617 615 613 611 615 618 621 624 606 588 585 618 671 723 719 715 729
1258G29J3J4J3m0m0n8k3K6O2M4M4%%J%k9l0k9k9JJ%Jjkjjj1j1m7m6m2m2lL2N8N7M4Qjjlmk6
$$ 729 742 756 769 729 689 631 608 634 696 740 784 784 784 785 785 756 726 697 668 669 670 670 671 670 668 667 666 655 644 597 551 509 467 464 496 554 611 655 663 662 661 658 654 628
1252F28k7m6j1L4L4L6L6l9l8l7l6k7Rj2j1J0Rj0K5M7M6M9M9lmllJ4J5J4J5j1j2Rk7o5o4l1
$$ 628 601 555 544 578 612 648 684 645 607 570 534 507 516 504 493 503 512 502 527 574 620 669 718 715 711 708 705 719 734 748 763 752 740 749 722 657 593 562
1248E62l2k1k1J6N1O7L2j0m4p2p2n8k4K1K0K3K3PQPQJ7J6J6J7J1J0J1J1k7k7k7k7k3k4J5M9
$$ 562 530 509 488 504 555 622 654 644 600 528 456 398 374 395 415 438 461 468 476 483 491 508 524 540 557 568 578 589 600 573 546 519 492 469 445 460 509
1243E09O5M6K4K3L0L0l0k9J1J0J1J1K0K1K0K1j0rqql3j6om1o2o2o4o3k0j9k0j9L4L4N3J9k3
$$ 509 574 620 644 667 697 727 697 668 679 689 700 711 731 752 772 793 783 774 766 758 725 709 703 662 600 538 474 411 391 372 352 333 367 401 454 473 450
1239D50k2rK6P1P1M8j2l2l3kjj6j6j6j6j0j1j0j1QPPPJ3J2J2J3J7J8J7J8M6M5Rk6lL2J8%k0
$$ 450 428 419 445 516 587 635 623 591 558 556 555 539 523 507 491 481 470 460 449 457 464 471 478 491 503 515 528 545 563 580 598 644 689 698 672 669 701 719 719 699
1234F99n6n7k2OOQQK1K1j6n1l8lJ1J1POPPJ9J9k8o3k3L7N6K1rj0j1j2j8j8j8j8j1j2j1j2K
$$ 699 643 586 564 570 576 584 592 613 634 618 567 529 526 537 548 555 561 568 575 594 613 585 522 499 536 592 613 604 594 583 571 553 535 517 499 488 476 465 453 455
1229D55Jl4l4j3j3N8N8J6J5J6J5LKKKj3j4j4j3J5J6J6J6l3l4l3l3M3M4M3M3K3K2K3K2j9j9
$$ 455 456 422 388 375 362 420 478 494 509 525 540 543 545 547 549 536 522 508 495 510 526 542 558 525 491 458 425 468 512 555 598 621 643 666 688 669 650
1224F50j9j9ONNNj2j2j3j2o9o9o9o9l2l2L9L9M6M7M7M6K2K1K2K2poopLKLLrqrql0l1M0M1M1
$$ 650 631 612 618 623 628 633 621 609 596 584 515 446 377 308 276 244 283 322 368 415 462 508 530 551 573 595 588 582 576 569 572 574 577 580 571 563 554 546 516 485 525 566 607
1219F07M1M0M1l1l1l2l1m2m2m1m2J1J2J1J2N0N0N0N0j7j7j7j7J2J1k5k4k8k9K0N5M0Mk2n8
$$ 607 648 688 729 698 667 635 604 562 520 479 437 448 460 471 483 533 583 633 683 666 649 632 615 627 638 613 589 561 532 552 607 647 651 629 571
1215E71n3j8QM4L2mkL4N6N6j3j2kjjkJ7J6J5J4M2On8j17j23j22p3l8K3N8O0K5qrN7N7K7l1
$$ 571 518 500 508 552 584 580 578 612 668 724 711 699 697 696 695 693 710 726 741 755 797 803 745 628 505 383 310 272 295 353 413 438 430 421 478 535 562 531
1210E31l4l3mmkkOM1M2Njkmlm3m2o2k7L0L0L2L2NMMNK2K2K3K2K2K2K3K2pqppj1j1j1j1j1j1
$$ 531 497 464 460 456 454 452 458 499 541 546 545 543 539 536 493 451 389 362 392 422 454 486 491 495 499 504 526 548 571 593 615 637 660 682 675 667 660 653 642 631 620 609 598 587
1205E87Rk6k9k8NNk3k3K8O3L8L9L8L9j4m9l0k9j7j8j7j7j5j5l5%N0N0P2L7j6j6j8j8m5m4q
$$ 587 596 570 541 513 518 523 500 477 505 568 606 645 683 722 708 659 629 600 583 565 548 531 516 501 466 466 516 566 638 675 659 643 625 607 562 518 510
1200E10N2R6R5K8K9l9l8l8l8q7q7L1L1M0L9n5r1p0j0K4K5J%JJJ0J0J0J0j6j5N6N6J6J6J6J5
$$ 510 562 658 753 781 810 771 733 695 657 570 483 514 545 585 624 569 478 408 398 422 447 448 448 449 450 460 470 480 490 474 459 515 571 587 603 619 634
1196F34K8K9K8K8l7l7l7l7pqqqJ0J0J0J0nnnoN3N2j8j9lmmlRJ0RJ0K3K4K3K3n4n4j9M0K7r
$$ 634 662 691 719 747 710 673 636 599 592 584 576 568 578 588 598 608 603 598 593 587 640 692 674 655 652 648 644 641 650 660 669 679 702 726 749 772 718 664 645 685 712 703
1191G03J5J5k5k4k4k5KJJJj6j7j6j7M5M5M4M5MLMLJ8J8J8J8RRJ0Rj5j4j5j4K6K7K7K7k7k7
$$ 703 718 733 708 684 660 635 637 638 639 640 624 607 591 574 619 664 708 753 757 760 764 767 785 803 821 839 848 857 867 876 861 847 832 818 844 871 898 925 898 871
1186H71k7k7m9m9K1K2j4j4j5j4j1j1p9p8rN0J6J7J6J6J6J6k5k6k6k5J6J5J6J6k7k8k7k7n8
$$ 871 844 817 768 719 740 762 748 734 719 705 694 683 604 526 517 567 583 600 616 632 648 664 639 613 587 562 578 593 609 625 598 570 543 516 458
1182D58n9J3J3O6O7O7O6k9k9k9k9K2K2K2K3l9l8l8l8l3l3L8L8K7K8K4K4j9p9o2k8KL6R0R0
$$ 458 399 412 425 491 558 625 691 662 633 604 575 597 619 641 664 625 587 549 511 478 445 483 521 548 576 600 624 605 526 464 436 438 474 564 654
1177F54O3O3O2O3l8l7l8l8M6M6k4k5n7n8n3n4n2QM5M5N0N0N1N0m5m5m5m5j6j5j6j5j4j3j4
$$ 654 717 780 842 905 867 830 792 754 800 846 822 797 740 682 629 575 523 531 576 621 671 721 772 822 777 732 687 642 626 611 595 580 566 553 539
1173E39j4j3j4j4j3K2K3K3K3K3K3K3K3m4m3m3m3K2K2K2K2K6K7K6K6j5j5j5j5k2k3k3k2OPP
$$ 539 525 512 498 484 471 493 516 539 562 585 608 631 654 610 567 524 481 503 525 547 569 595 622 648 674 659 644 629 614 592 569 546 524 530 537 544
1169E44PRRRRM2M3j7j7l1l0l1l1RRRRl1l1MNK6K7k8k8K2R3P3L8j7j7n4n4o8o7J6J5M1M2j8
$$ 544 551 560 569 578 587 629 672 655 638 607 577 546 515 524 533 542 551 520 489 493 498 524 551 523 495 517 610 683 721 704 687 633 579 511 444 460 475 516 558 540
1164E40j8K2K1K2K2l6l5l5l5RRJ0RK7K8K7K7J8J7J8J8j2j1j2j2KKKJJ1J1QQn4q9j10l8N5N5
$$ 540 522 544 565 587 609 573 538 503 468 477 486 496 505 532 560 587 614 632 649 667 685 673 662 650 638 640 642 644 645 656 667 675 683 629 540 430 392 447 502
1159E02O0N9mmmmk2k2n3n2n8J3L2L2llJ4Q4Q8N2po%%%%LMLLl6l6l6l5LLL9L8N2N2ppj7j7j7
$$ 502 562 621 617 613 609 605 583 561 508 456 398 411 443 475 472 469 483 567 655 707 700 694 694 694 694 694 697 701 704 707 671 635 599 564 567 570 609 647 699 751 744 737 720 703 686
1153F86j7p1p2m5J3N8N7L6k4n2n2k1k1M3M3QPn7n7LKO0N9O0O0k5k5k5k5J2J2J2J2j2j3J8J9
$$ 686 669 598 526 481 494 552 609 645 621 569 517 496 475 518 561 569 576 519 462 465 467 527 586 646 706 681 656 631 606 618 630 642 654 642 629 647 666
1149F66L0k9p9p8j2j3K4K3L8L8L8L9j3j3j3j3KJKJJ0J1J0J0L2L2L1L2j0rj0rLMLLo1o1o2o1
$$ 666 696 667 588 510 498 485 509 532 570 608 646 685 672 659 646 633 635 636 638 639 649 660 670 680 712 744 775 807 797 788 778 769 772 776 779 782 721 660 598 537
1144E37l3l3l3l3QRQRL3L3L3L4LMMLqrrqRRRRJ6J6J6J6kjkkk6k7k7k6K2K3K3K3J8J8m2m1J0
$$ 537 504 471 438 405 413 422 430 439 472 505 538 572 575 579 583 586 578 569 560 552 561 570 579 588 604 620 636 652 650 649 647 645 619 592 565 539 561 584 607 630 648 666 624 583 593
1138E93J0M5M6M0L9j9j9j3j3j3j3QQQRk2k1k1k2jkkkkkkkJ1J1J1J1J8J8J8J7J5J4k0k1KLn6
$$ 593 603 648 694 734 773 754 735 722 709 696 683 691 699 707 716 694 673 652 630 629 627 625 623 621 619 617 615 626 637 648 659 677 695 713 730 745 759 739 718 720 723 667
1133F67n7k6k6k7k6k5k6N7N7O2O2K6K7L3L3n0m9k3k3k3k2n3n2POj6j7j7j6K8K8K9K8j7j8j8
$$ 667 610 584 558 531 505 480 454 511 568 630 692 718 745 778 811 761 712 689 666 643 621 568 516 523 529 513 496 479 463 491 519 548 576 559 541 523
1129E23j7K0K0K0K0N9N9%%m3m4m3m3RRRJ0k0k1k0k0K2K1K2K2k0k0j9k0J2J3J2J3j7j7j7j7
$$ 523 506 526 546 566 586 645 704 704 704 661 617 574 531 540 549 558 568 548 527 507 487 509 530 552 574 554 534 515 495 507 520 532 545 528 511 494 477
1124D77L1L2L2L2KLKKL7L6L7L7j7j6j7j6l4l3l3l3j8j8j8j7K3K4J0k6m5j0K7K8MML8L8K2j4
$$ 477 508 540 572 604 606 609 611 613 650 686 723 760 743 727 710 694 660 627 594 561 543 525 507 490 513 537 547 521 476 466 493 521 525 529 567 605 627 613
1120F13k8k9k0k1J6J5J5J6k0k1j8j8J8J7M5M4K9ok7k7OPJ3J4J4J3j1j1j0j1J8J9J8J9nmnn
$$ 613 585 556 536 515 531 546 561 577 557 536 518 500 518 535 580 624 653 647 620 593 599 606 619 633 647 660 649 638 628 617 635 654 672 691 686 682 677 672
1115F72K5K5K5K5K8K8M8J3n6n5n6n6l3LLl2j9j9k2k1J8J8J8J9M7M8M8M8j2j1Rk6p0o9r2n6
$$ 672 697 722 747 772 800 828 876 889 833 778 722 666 633 636 639 607 588 569 547 526 544 562 580 599 646 694 742 790 778 767 776 750 680 611 519 463
1111D63kk%%K7K6K6K6M3M4j6j6j2j3k8o4p3p3j2K3L1L1L4L3N8N7N5N6kl7j7j7j9j9j9k0l1
$$ 463 461 459 459 459 486 512 538 564 607 651 635 619 607 594 566 502 429 356 344 367 398 429 463 496 554 611 666 722 720 683 666 649 630 611 592 572 541
1106E41l2j6J9M9M9J4k1oL0K7ql6l6l8l9nnnnl3l3pN2P1P2J2k3l7l8l7l7k5J1N2Q7Q0M5j7
$$ 541 509 493 512 561 610 624 603 597 627 654 646 610 574 536 497 492 487 482 477 444 411 404 456 527 599 611 588 551 513 476 439 414 425 477 564 644 689 672
1102F72n2m0nK9L0J5k0jjJ8J8j9n4l9mL3L3l7l7k2J4L9L9M2M1L5L6J9j5n3n2j8J8Kl3m7m7
$$ 672 620 580 575 604 634 649 629 628 627 645 663 644 590 551 547 580 613 576 539 517 531 570 609 651 692 727 763 782 767 714 662 644 662 664 631 584 537
1097E37k6k6k7k6L5L6%l5k5L5N9N8j2j3LL9K8K8nnk5k6m5j1K9K9rm3m3m3oK9M3M3Ok9l4l4
$$ 537 511 485 458 432 467 503 503 468 443 478 537 595 583 570 573 612 640 668 663 658 633 607 562 551 580 609 600 557 514 471 465 494 537 580 586 557 523 489
1092D89%jL1L1K9K9ll7j8j8K2K2K1K2L0L1L0L1J0J0J0J1qpqqk5k6k6k6j7j7j7j7mmmmm5m6
$$ 489 489 488 519 550 579 608 605 568 550 532 554 576 597 619 649 680 710 741 751 761 771 782 774 767 759 751 726 700 674 648 631 614 597 580 576 572 568 564 519 473
1088D73m5m6O3O2O2O3j5j4j4j5n3n3n3n3%%%%PPOPM8M8M8M8J9J8J9J8j4j4J8J7J4m4q9n3o
$$ 473 428 382 445 507 569 632 617 603 589 574 521 468 415 362 362 362 362 362 369 376 382 389 437 485 533 581 600 618 637 655 641 627 645 662 676 632 543 490 484
1083D84K9M6M7L4L5jjrqrql0k9k9k9%JKLjL5M8j1k9k9l2l3L1L2L1L1KJKKj%j%J4J3J4J4L9
$$ 484 513 559 606 640 675 674 673 664 656 647 639 609 580 551 522 522 523 525 528 527 562 610 599 570 541 509 476 507 539 570 601 603 604 606 608 607 607 606 606 620 633 647 661 700
1077G00L8k0k0QQQQj7j6L9L9mo4n0j5L4L3j5n1l3l3J3M9P3L8j1j1L0L1oo4o6l1J6J6J6J5J3
$$ 700 738 718 698 706 714 722 730 713 697 736 775 771 707 657 642 676 709 694 643 610 577 590 639 712 750 739 728 758 789 783 719 653 622 638 654 670 685 698
1073F98J3j4n0o5oQk8jkK5O0M0M0M6M7M4M5J6j9p0o9o4o3QPj0rj0j0j9j8l9lJ6J6J8P7J02
$$ 698 711 697 647 582 576 584 556 555 553 578 638 678 718 764 811 855 900 916 897 827 758 694 631 639 646 636 627 617 607 588 570 531 528 544 560 578 655 757
1068G57O6k8k8j0rrrJ3J3J3J2MMMLk5k5n8n8n1j6L6L5M7M6mm0n2n1nL0Rk7k5J0K7K7O2O2O1
$$ 757 823 795 767 757 748 739 730 743 756 769 781 785 789 793 796 771 746 688 630 579 563 599 634 681 727 723 683 631 580 575 605 614 587 562 572 599 626 688 750 811
1063H11K5k6k5k8k8k7k8k3k3k2k1K0N5N5J9J0RMn4p9p8m5J4M9N0J8J8rrOM2L8L7NMK0J9J7
$$ 811 836 810 785 757 729 702 674 651 628 606 585 605 660 715 734 744 753 757 703 624 546 501 515 564 614 632 650 641 632 638 680 718 755 760 764 784 803 820
1059H20J8M9J5l5l4kL4Q3Q3Q3M7mlJJK1j4m0m1m2m2m3m3m3m3K1K2K2K2J8J8L8Km0m1o2k8L6
$$ 820 838 887 902 867 833 831 865 948 1031 1114 1161 1157 1154 1155 1156 1177 1163 1123 1082 1040 998 955 912 869 826 847 869 891 913 931 949 987 989 949 908 846 818 854
1054H54L5N7K2j2j2K1K1M0M0j2m6o8o9k1J4L4kn0n0l1l0NNJ7J6Jl5m6m6m4m4L1R0P7M1J2J2
$$ 854 889 946 968 956 944 965 986 1026 1066 1054 1008 940 871 850 864 898 896 846 796 765 735 740 745 762 778 779 744 698 652 608 564 595 685 762 803 815 827
1049H27RJ0k3k3k3k4nnonM0M1L8L8Ol0m5m5m5m4QM4O1R7J13J12N9K4k8k7nnonk4k5k4k4J7
$$ 827 836 846 823 800 777 753 748 743 737 732 772 813 851 889 895 865 820 775 730 686 694 738 799 896 1009 1121 1180 1204 1176 1149 1144 1139 1133 1128 1104 1079 1055 1031 1048
1045A048J6J7J7K2K2K2K2K2K2K2K2JJJKJJJJjkjjPQPPM2M2M1M2j2j1j2j1k7k7m6j2RRo0o0
$$ 1048 1064 1081 1098 1120 1142 1164 1186 1208 1230 1252 1274 1275 1276 1277 1279 1280 1281 1282 1283 1282 1280 1279 1278 1285 1293 1300 1307 1349 1391 1432 1474 1462 1451 1439 1428 1401 1374 1328 1316 1325 1334 1274 1214
1039A214k6k6k4k4j6K0O9O8O1K5k6k5k8k7p8j13j32j31l6%lk%%O0O0N8N8J3k3klJ2J2J2J2
$$ 1214 1188 1162 1138 1114 1098 1118 1187 1255 1316 1341 1315 1290 1262 1235 1157 1044 912 781 745 745 742 740 740 740 800 860 918 976 989 966 964 961 973 985 997 1009
1035A009K9L0K9L0J0J0J0J0pqqpL5L4L3L3L9Mm7m8m9n0n0n0jkjjJ1J1J0J1N7N8Ok9k9k9l2
$$ 1009 1038 1068 1097 1127 1137 1147 1157 1167 1160 1152 1144 1137 1172 1206 1239 1272 1311 1315 1268 1220 1171 1121 1071 1021 1020 1018 1017 1016 1027 1038 1048 1059 1116 1174 1180 1151 1122 1093 1061
1030A061l1J7J8J7J8J6J6J5J4Pk9k8PL9L9O1K6llp3p4j9J6mlm7m7m8m7m2m3m2m3m2m3m0m0
$$ 1061 1030 1047 1065 1082 1100 1116 1132 1147 1161 1168 1139 1111 1118 1157 1196 1257 1283 1280 1277 1204 1130 1111 1127 1123 1120 1073 1026 978 931 889 846 804 761 719 676 636 596
1026E96K1N6L7L6J0RRRJ8J7J7J8j%%jk6k6k3k4n4j9L3L2K8K7K8K8K3K3K3K4kkkjkkjkJ7J6
$$ 596 617 673 710 746 756 765 774 783 801 818 835 853 852 852 852 851 825 799 776 752 698 679 712 744 772 799 827 855 878 901 924 948 946 944 942 941 939 937 936 934 951 967
1021I67J5J4Nl0j1j1J4J4J1J2Kl4j3j4n7n7n3n3%N9M3Qm1p6n5n5l0K9O7O7N0N1M8M8k6o1o1
$$ 967 982 996 1001 971 960 949 963 977 988 1000 1002 968 955 941 884 827 774 721 721 780 823 831 790 714 659 604 574 603 670 737 787 838 886 934 908 847 786
1016G86k5jjJKK6K6K7K6L3L4j8n3k3k3k5k5L1L2L0K9N3J7l4l4m4m4OM0L8Lm6m5onL0L0M3M3
$$ 786 761 760 759 760 762 788 814 841 867 900 934 916 863 840 817 792 767 798 830 860 889 942 959 925 891 847 803 809 849 887 890 844 799 793 788 818 848 891 934
1011I34QQqpqqj9j9j6j7K2N7L7L7kkkkJ%JJj2j3j2j3j1j1L7P3O4K9k0k0J1J2J1J2K5K5K5K5
$$ 934 942 950 942 935 927 919 900 881 865 848 870 927 964 1001 999 997 995 993 994 994 995 996 984 971 959 946 935 924 961 1034 1098 1127 1107 1087 1098 1110 1121 1133 1158 1183 1208 1233
1006A233onllJ6N2N2J6k5k5k5k5lL1J2J2J9J9J9J9K7K8K8K7L5L4J5N0P1P1P4P3O6O5Q6N0N2
$$ 1233 1227 1222 1219 1216 1232 1284 1336 1352 1327 1302 1277 1252 1249 1280 1292 1304 1323 1342 1361 1380 1407 1435 1463 1490 1525 1559 1574 1624 1695 1766 1840 1913 1979 2044 2130 2180 2232
1002B232N3N0N0J9J9J9J9J9J9K0J9K6K6M8J3J1M7N5lo3r8o4k9NM1R3R4R1R0P1J06J04J04J06
$$ 2232 2285 2335 2385 2404 2423 2442 2461 2480 2499 2519 2538 2564 2590 2638 2651 2662 2709 2764 2761 2698 2600 2536 2507 2512 2553 2646 2740 2831 2921 2992 3098 3202 3306 3412
997C412J06J21J21J92J92J31J31R5R6J12J12J12J12J04J04J35K06K47K46K51K51L09L10K78
$$ 3412 3518 3639 3760 3952 4144 4275 4406 4501 4597 4709 4821 4933 5045 5149 5253 5388 5594 5841 6087 6338 6589 6898 7208 7486
994G486K78L39M10M45M46M96N67O26P45Q22Q22Q92J010J167J333J472J637J825J990K159K371
$$ 7486 7764 8103 8513 8958 9404 9900 10467 11093 11838 12660 13482 14374 15384 16551 17884 19356 20993 22818 24808 26967 29338
992B9338K598K858L112L324L495L659L774L773L660L353K864K132J273L53n51j378j991k346
$$ 29338 31936 34794 37906 41230 44725 48384 52158 55931 59591 62944 65808 67940 69213 69566 69015 67637 65646 63300
990F3300k549k620k590k424k224k011j737j477j237r78o68l15N8M12P70J123J434J740K138
$$ 63300 60751 58131 55541 53117 50893 48882 47145 45668 44431 43453 42785 42470 42528 42940 43710 44833 46267 48007 50145
987E0145K492K858L118L337L455L522L452L116K478J573M62o95j757k602l239l599l717l673
$$ 50145 52637 55495 58613 61950 65405 68927 72379 75495 77973 79546 80008 79313 77556 74954 71715 68116 64399 60726
985F0726l555l392l180k946k734k496k236k000j835j684j472j238j026p85n73l63j98j20l
$$ 60726 57171 53779 50599 47653 44919 42423 40187 38187 36352 34668 33196 31958 30932 30147 29574 29211 29013 28893 28890
983B8890R4K13L17M35O04P69J002J214J451J663J936K195K523K877L255L610L963M271M583
$$ 28890 28984 29197 29514 29949 30553 31322 32324 33538 34989 36652 38588 40783 43306 46183 49438 53048 57011 61282 65865
981F5865M890N168N333N286M978M377L408K184R32k31j105j563j680j530j176p79k83L19J004
$$ 65865 70755 75923 81256 86542 91520 95897 99305 101489 102421 102190 101085 99522 97842 96312 95136 94357 94074 94393 95397
978I5397J686K323K908L404L898M253M439M368L987L350K576J703R44L53M4k7J13K79M12M13
$$ 95397 97083 99406 102314 105718 109616 113869 118308 122676 126663 130013 132589 134292 135236 135589 135633 135606 135719 135998 136410 136823
976A36823J94k55r98j871k762l495l991m156m052l698l138k546j895j257n98L9O97J334J848
$$ 136823 137017 136762 135764 133893 131131 127636 123645 119489 115437 111739 108601 106055 104160 102903 102305 102344 103041 104375 106223
973A06223K250K483K412J978J152p7j518k919m124m995n443n597n526n353n092m748m440m104
$$ 106223 108473 110956 113368 115346 116498 116421 114903 111984 107860 102865 97422 91825 86299 80946 75854 71106 66666 62562
971F2562l749l422l162k918k659k351k044j800j492j209r97p72n60m16k97j97l2J75L88N74
$$ 62562 58813 55391 52229 49311 46652 44301 42257 40457 38965 37756 36759 35987 35427 35011 34714 34517 34485 34660 35048 35622
969C5622P39R60J174J409J716J997K303K599K954L325L679M004M311M580M792M870M798M539
$$ 35622 36361 37321 38495 39904 41620 43617 45920 48519 51473 54798 58477 62481 66792 71372 76164 81034 85832 90371
967I0371L995L131J926N80q13k031k952l549l856l950l879l661l401l118k765k413k012j610
$$ 90371 94366 97497 99423 100003 99190 97159 94207 90658 86802 82852 78973 75312 71911 68793 66028 63615 61603 59993
964E9993j162p39k91J66O15J132J580K032K433K829L183L479L691L873L873L656L207K414
$$ 59993 58831 58092 57801 57967 58582 59714 61294 63326 65759 68588 71771 75250 78941 82814 86687 90343 93550 95964
962I5964J399J74j126k304l319m089m586m815m887m797m631m413m154l893l681l422l161k901
$$ 95964 97363 97537 96411 94107 90788 86699 82113 77298 72411 67614 62983 58570 54416 50523 46842 43420 40259 37358
960C7358k689k446k234j980j720j558j440j357j239j101r83q83q13p67o97n76n76n71n72n35
$$ 37358 34669 32223 29989 28009 26289 24731 23291 21934 20695 19594 18611 17728 16915 16148 15451 14875 14299 13728 13156 12621
958A2621n34m64m64m41m40l70l70l19l18l19l19k41k40k76k76k43k43j72j72j54j53j54j54
$$ 12621 12087 11623 11159 10718 10278 9908 9538 9219 8901 8582 8263 8022 7782 7506 7230 6987 6744 6572 6400 6246 6093 5939 5785
955E785j67j67j68j67r3r3r4r3j23j23j23j23p0o9p0p0p9p9p9p8n8n8n7n8l8l8l7l8n3n2j8
$$ 5785 5618 5451 5283 5116 5023 4930 4836 4743 4620 4497 4374 4251 4181 4112 4042 3972 3893 3814 3735 3657 3599 3541 3484 3426 3388 3350 3313 3275 3222 3170 3152
951C152j7LLo9o8n5n6n6n5l5l5l5l5ppn8r3q7q7j8j8m8m8KL9M9N0Jl4l2l2l4l4l9l9l8l9m9
$$ 3152 3135 3138 3141 3072 3004 2949 2893 2837 2782 2747 2712 2677 2642 2635 2628 2570 2477 2390 2303 2285 2267 2219 2171 2173 2212 2261 2311 2312 2278 2246 2214 2180 2146 2107 2068 2030 1991 1942
946A942m9o8l4%%KKL6L6L4L4j1m7k7k6j%j%m2m1m2m2mmmmkkk2J4K9L0L0L0j6n0l1l1l2l1j0
$$ 1942 1893 1825 1791 1791 1791 1793 1795 1831 1867 1901 1935 1924 1877 1850 1824 1823 1823 1822 1822 1780 1739 1697 1655 1651 1647 1643 1639 1637 1635 1613 1627 1656 1686 1716 1746 1730 1680 1649 1618 1586 1555 1545
941A545m4k8Rj4j4J9J9J8J9j1j1j0j1k1k1k0k1K0K1K0K1L3L3L1L1ll7j8j8k1k1j9j9J4M9K8
$$ 1545 1501 1473 1482 1468 1454 1473 1492 1510 1529 1518 1507 1497 1486 1465 1444 1424 1403 1423 1444 1464 1485 1518 1551 1582 1613 1610 1573 1555 1537 1516 1495 1476 1457 1471 1520 1548
937A548K7nm2m1oJ3J4J3J3l4p0p1l4k0k0j8j7K4K4np6q4m9K2N8O1K6k3k3NMMNopoopoooll
$$ 1548 1575 1570 1528 1487 1481 1494 1508 1521 1534 1500 1430 1359 1325 1305 1285 1267 1250 1274 1298 1293 1217 1133 1084 1106 1164 1225 1251 1228 1205 1210 1214 1218 1223 1217 1210 1204 1198 1191 1185 1179 1173 1170 1167
931A167llL8L8L9L8K5K4K5K5K0K0O0j1n3n2n8n7k8k8k7k8J6J6J7J6j3j4j3j3JKJKMLMMk7k7
$$ 1167 1164 1161 1199 1237 1276 1314 1339 1363 1388 1413 1433 1453 1513 1502 1449 1397 1339 1282 1254 1226 1199 1171 1187 1203 1220 1236 1223 1209 1196 1183 1184 1186 1187 1189 1193 1196 1200 1204 1177 1150
927A150QQJJp0o9k5k5J0J1MMMMMNMNj4j3j3j3L1L1L1L1l8l9L3L3K1K2K2K2K6K6K6K6J6J7J6
$$ 1150 1158 1166 1167 1168 1098 1029 1004 979 989 1000 1004 1008 1012 1016 1020 1025 1029 1034 1020 1007 994 981 1012 1043 1074 1105 1067 1028 1061 1094 1115 1137 1159 1181 1207 1233 1259 1285 1301 1318 1334
922A334J6k5k5k5k5j5j5j5j5j5j5j4j5N8N8N4N4Po4m3rL2L2N3J9k5k4m7j1K0K0K0K1l5p0p0
$$ 1334 1350 1325 1300 1275 1250 1235 1220 1205 1190 1175 1160 1146 1131 1189 1247 1301 1355 1362 1298 1255 1246 1278 1310 1363 1382 1357 1333 1286 1275 1295 1315 1335 1356 1321 1251 1181
917A181l4nnj%j5K1N8N7M8J1lmkkL0K9mo3n0j5LLLLpm2p7m2M2M2Qk8k9PK0K0J7J6J7J6J8J8
$$ 1181 1147 1142 1137 1136 1136 1121 1142 1200 1257 1305 1316 1313 1309 1307 1305 1335 1364 1360 1297 1247 1232 1235 1238 1241 1244 1237 1195 1118 1076 1118 1160 1168 1140 1111 1118 1138 1158 1175 1191 1208 1224 1242 1260
912A260J7J8M3M4M3M3L5L4nm1o1o2q1m4K7Q7N6N6O0N9O0O0J5J4J5J5J5J5J5J5K6K5K6K6oo
$$ 1260 1277 1295 1338 1382 1425 1468 1503 1537 1532 1491 1430 1368 1287 1243 1270 1357 1413 1469 1529 1588 1648 1708 1723 1737 1752 1767 1782 1797 1812 1827 1853 1878 1904 1930 1924 1918
908A918pojkl7l7l3l3PM1K7K7pojj%jl2l3l2l3RRPOm4q0n8n8j5K0%JK3K3K3K3K5K5j5n0m4
$$ 1918 1911 1905 1904 1902 1865 1828 1795 1762 1769 1810 1837 1864 1857 1851 1850 1849 1849 1848 1816 1783 1751 1718 1727 1736 1743 1749 1705 1625 1567 1509 1494 1514 1514 1515 1538 1561 1584 1607 1632 1657 1642 1592 1548
902A548m3m3m2pN1J00R9Q6N0Qk8j2j1j4j4j6j7j6j7l4l4n4j8K7K8ooRRk6o2n1PN5N5QROOk7
$$ 1548 1505 1462 1420 1413 1464 1564 1663 1749 1799 1807 1779 1767 1756 1742 1728 1712 1695 1679 1662 1628 1594 1540 1522 1549 1577 1571 1565 1574 1583 1557 1495 1444 1451 1506 1561 1569 1578 1584 1590 1563
897A563o2m0m0LL8J8J8J9K0J9J9K0J9K1K2Q0J16R6R6O6O7Q6N1j2j1Ok9m7m7m9m9n5n6MMj2
$$ 1563 1501 1461 1421 1424 1462 1480 1498 1517 1537 1556 1575 1595 1614 1635 1657 1737 1853 1949 2045 2111 2178 2264 2315 2303 2292 2298 2269 2222 2175 2126 2077 2022 1966 1970 1974 1962
893A962j1m7m7n3n2q6q6p0l5MMj4j5k8o3q6n1J0RLLLKQQQQK5K5NM1N0N0N3N2kjkjj0ro9o9
$$ 1962 1951 1904 1857 1804 1752 1666 1580 1510 1475 1479 1483 1469 1454 1426 1363 1277 1226 1236 1245 1248 1251 1254 1256 1264 1272 1280 1288 1313 1338 1343 1384 1434 1484 1537 1589 1587 1586 1584 1583 1573 1564 1495 1426
888A426l9l9l7l7j1K4L7k1n7n6o0o1J7J6J7J6N2N2N2N2N0N1k1k0m3m3m3m3K4K5K5K5N1N0k0
$$ 1426 1387 1348 1311 1274 1263 1287 1324 1303 1246 1190 1130 1069 1086 1102 1119 1135 1187 1239 1291 1343 1393 1444 1423 1403 1360 1317 1274 1231 1255 1280 1305 1330 1381 1431 1411
883A411k0rqK6K7k9l0k9k9L8L7P3P3J8J8n3n3J8J9J9J8l1l0l1l1J8J8J8J8L7L8%n9q6q6j9
$$ 1411 1391 1382 1374 1400 1427 1398 1368 1339 1310 1348 1385 1458 1531 1549 1567 1514 1461 1479 1498 1517 1535 1504 1474 1443 1412 1430 1448 1466 1484 1521 1559 1559 1500 1414 1328 1309
879A309j9MMP1P2N8%o3r8q3m8l5l4l5l4L6L7N8N9N9N9K3K2j2j3m3m3K8K8O3O3O2O3N3N3N2
$$ 1309 1290 1294 1298 1369 1441 1499 1499 1436 1338 1255 1207 1172 1138 1103 1069 1105 1142 1200 1259 1318 1377 1400 1422 1410 1397 1354 1311 1339 1367 1430 1493 1555 1618 1671 1724 1776
875A776N3R2R2R2R1M2M1ONl2l2L9L9O8O8O7O8O3O3O3O3P8P8P8P8L0K9K9L0k2k3M9M9L8L9M0
$$ 1776 1829 1921 2013 2105 2196 2238 2279 2285 2290 2258 2226 2265 2304 2372 2440 2507 2575 2638 2701 2764 2827 2905 2983 3061 3139 3169 3198 3227 3257 3235 3212 3261 3310 3348 3387 3427
870C427M1O2R7J17M6K3K4J9J9M0L9M0M0O2O3O2O2M9N0R6J32R6K5llK7K8pqm5m5m5m5m7m7m7
$$ 3427 3468 3530 3627 3744 3790 3813 3837 3856 3875 3915 3954 3994 4034 4096 4159 4221 4283 4332 4382 4478 4610 4706 4731 4728 4725 4752 4780 4773 4765 4720 4675 4630 4585 4538 4491 4444
866D444m7N2N1O7L1n4j26j08p2n5n6n3n3l5l6l3l3L0O7Q4J3o4j00q5q4r1r1r1r1n1n0K1K0
$$ 4444 4397 4449 4500 4567 4598 4544 4418 4310 4238 4183 4127 4074 4021 3986 3950 3917 3884 3914 3981 4065 4078 4014 3914 3829 3745 3654 3563 3472 3381 3330 3280 3301 3321
862C321K6K6j0j0n8n8j29j29o8o8l3l2j2j3K3K3m8m8m7m8j8j8j8j8p1p1p1p1m5m5m4m5m5m6
$$ 3321 3347 3373 3363 3353 3295 3237 3108 2979 2911 2843 2810 2778 2766 2753 2776 2799 2751 2703 2656 2608 2590 2572 2554 2536 2465 2394 2323 2252 2207 2162 2118 2073 2028 1982
858A982K6K5qqm3m4K2K3K2K2J6J5J6J6L3L3L4L3L5L4L5L4J7J7J6J7qrrrn0n0n0n0mmmmk1k2
$$ 1982 2008 2033 2025 2017 1974 1930 1952 1975 1997 2019 2035 2050 2066 2082 2115 2148 2182 2215 2250 2284 2319 2353 2370 2387 2403 2420 2412 2403 2394 2385 2335 2285 2235 2185 2181 2177 2173 2169 2148 2126
853B126k2k1M4M4M4M4LKLLM8M8M8M8K3K3m7m8K7K7K7K8J0J0N7R2J02L0KKN0N1J21J22J14J15
$$ 2126 2104 2083 2127 2171 2215 2259 2262 2264 2267 2270 2318 2366 2414 2462 2485 2508 2461 2413 2440 2467 2494 2522 2532 2542 2599 2691 2793 2823 2825 2827 2877 2928 3049 3171 3285 3400
848C400M3M4J6J5J6J5M5M5J16J15J17J17J18J17L4L5L5L5R2R2R2R3J00J01J72J71K68K68K67
$$ 3400 3443 3487 3503 3518 3534 3549 3594 3639 3755 3870 3987 4104 4222 4339 4373 4408 4443 4478 4570 4662 4754 4847 4947 5048 5220 5391 5659 5927 6194
845F194K68K53K54K54K54L07L07L80L80L90M26M42N12N85O56P23P58P90Q62R09R80J095J213
$$ 6194 6462 6715 6969 7223 7477 7784 8091 8471 8851 9241 9667 10109 10621 11206 11862 12585 13343 14133 14995 15904 16884 17979 19192
842A9192J335J405J511J676J951K211K406K618K875L134L345L510L646L716L658L540L300
$$ 19192 20527 21932 23443 25119 27070 29281 31687 34305 37180 40314 43659 47169 50815 54531 58189 61729 65029
840F5029K899K318J680R93K60m87j124j590j945k194k359k433k362k229k016j766j506j238
$$ 65029 67928 70246 71926 72919 73179 72692 71568 69978 68033 65839 63480 61047 58685 56456 54440 52674 51168 49930
838D9930r79p16m09j25K29O24J026J370J725K106K460K814L168L485L745L913L948L862L649
$$ 49930 48951 48235 47826 47701 47930 48554 49580 50950 52675 54781 57241 60055 63223 66708 70453 74366 78314 82176 85825
835H5825L207K617J834R61M9q73j719k499l112l512l680l680l593l427l202k942k665k405
$$ 85825 89032 91649 93483 94444 94493 93620 91901 89402 86290 82778 79098 75418 71825 68398 65196 62254 59589 57184
833E7184k074j720j336r82o49k95O3M64Q60J309J711K114K491K892L324L678L979M191M385
$$ 57184 55110 53390 52054 51072 50423 50128 50191 50655 51515 52824 54535 56649 59140 62032 65356 69034 73013 77204 81589
831H1589M456M317L963L375K549J589N74m60j429k187k730l061l227l167l002k736k381j966
$$ 81589 86045 90362 94325 97700 100249 101838 102412 101952 100523 98336 95606 92545 89318 86151 83149 80413 78032 76066
829G6066j516j030n33l8N05J094J685K298K889L479M117M740N330N846O248O584O750O731
$$ 76066 74550 73520 72987 72949 73454 74548 76233 78531 81420 84899 89016 93756 99086 104932 111180 117764 124514 131245
826A31245O425N908N129M142K936J523Q2j379k819m062n031n730o179o393o357o166n906n583
$$ 131245 137670 143578 148707 152849 155785 157308 157390 156011 153192 149130 144099 138369 132190 125797 119440 113274 107368 101785
824A01785n135m552m009l510l014k398j759j134n44J8N61J030J479J874K229K498K662K722
$$ 101785 96650 92098 88089 84579 81565 79167 77408 76274 75730 75748 76309 77339 78818 80692 82921 85419 88081 90803
822I0803K557K155J565Q06j14j021j848k506l048l424l683l769l699l550l338l100k841k536
$$ 90803 93360 95515 97080 97886 97772 96751 94903 92397 89349 85925 82242 78473 74774 71224 67886 64786 61945 59409
820E9409k229j902j594j261r54o53k98RL16N96R50J302J609J906K214K464K724K940L058L096
$$ 59409 57180 55278 53684 52423 51469 50816 50518 50527 50843 51439 52389 53691 55300 57206 59420 61884 64608 67548 70606 73702
817G3702L025K792K437J997J408P22j0p18j309j706k059k272k306k227k108j903j642j326
$$ 73702 76727 79519 81956 83953 85361 86083 86073 85355 84046 82340 80281 78009 75703 73476 71368 69465 67823 66497
815F6497j018p38m32j18J89N46R00J298J699K095K543K971L373L772M125M458M719M918N037
$$ 66497 65479 64741 64309 64191 64380 64926 65826 67124 68823 70918 73461 76432 79805 83577 87702 92160 96879 101797 106834
813A06834N031M866M512M015L390K611J790J011L06k85p49r61j018r00o99m39j38K63O56J104
$$ 106834 111865 116731 121243 125258 128648 131259 133049 134060 134366 134081 133332 132371 131353 130453 129754 129315 129177 129440 130096 131200
810A31200J547J996K421K869L333L782M159M514M839N194N544N852O162O422O613O779O954
$$ 131200 132747 134743 137164 140033 143366 147148 151307 155821 160660 165854 171398 177250 183412 189834 196447 203226 210180
808B10180P119P288P405P515P681P842Q055Q275Q487Q746R007R251R512R785J0046J0232J0350
$$ 210180 217299 224587 231992 239507 247188 255030 263085 271360 279847 288593 297600 306851 316363 326148 336194 346426 356776
806C56776J0446J0564J0636J0637J0575J0458J0317J0057R762R455R154Q894Q587Q281P970
$$ 356776 367222 377786 388422 399059 409634 420092 430409 440466 450228 459683 468837 477731 486318 494599 502569
804E02569P711P480P221P020O902O822O752O690O620O522O357O203N991N743N436N015M472
$$ 502569 510280 517760 524981 532001 538903 545725 552477 559167 565787 572309 578666 584869 590860 596603 602039 607054 611526
802F11526L866L229K533J800J053L22l56j040j669k213k702l056l346l606l832l998m146m310
$$ 611526 615392 618621 621154 622954 624007 624329 623973 622933 621264 619051 616349 613293 609947 606341 602509 598511 594365 590055
800E90055m485m651m848n013n256n563n912o266o661p063p503p951q330q685q994r302r573
$$ 590055 585570 580919 576071 571058 565802 560239 554327 548061 541400 534337 526834 518883 510553 501868 492874 483572 473999
798D73999r833j0038j0157j0201j0165j0065r900r760r643r474r309r148q983q845q679q549
$$ 473999 464166 454128 443971 433770 423605 413540 403640 393880 384237 374763 365454 356306 347323 338478 329799 321250
796C21250q431q307q236q143q024p977p859p703p537p322p109o828o520o211n857n360m865
$$ 321250 312819 304512 296276 288133 280109 272132 264273 256570 249033 241711 234602 227774 221254 215043 209186 203826 198961
794A98961m354l858l389k892k403j859j367r18n78l66k65l83p14j304k089l011l931m805n468
$$ 198961 194607 190749 187360 184468 182065 180206 178839 177921 177343 176977 176712 176329 175615 174311 172222 169211 165280 160475 155007
792A55007n917o209o280o206n994n728n421n063m757m490m137l717l269k826k424k065j663
$$ 155007 149090 142881 136601 130395 124401 118673 113252 108189 103432 98942 94805 91088 87819 84993 82569 80504 78841
790G8841j238q37m44m3L08O63J009J317J549J762J947K064K085J873J364O32j98j071j891
$$ 78841 77603 76766 76322 76279 76587 77250 78259 79576 81125 82887 84834 86898 88983 90856 92220 92852 92654 91583 89692
787H9692k575l088l394l526l525l412l247l068k856k622k410k187j975j742j529j361j196
$$ 89692 87117 84029 80635 77109 73584 70172 66925 63857 61001 58379 55969 53782 51807 50065 48536 47175 45979
785D5979j030q18n84m18k91j74k5J87L96N62P40R53J209J470J676J936K195K503K799L107
$$ 45979 44949 44131 43547 43129 42838 42664 42639 42826 43222 43784 44524 45477 46686 48156 49832 51768 53963 56466 59265 62372
783F2372L414L767M105M458M722M886M891M726M327L642K780J812R18K33k29l95l38p8L97
$$ 62372 65786 69553 73658 78116 82838 87724 92615 97341 101668 105310 108090 109902 110820 111053 110824 110429 110091 110013 110410
780A10410R40J554K145K647L143L517L778L825L565L057K231J237Q0j018j939k527k833k902
$$ 110410 111350 112904 115049 117696 120839 124356 128134 131959 135524 138581 140812 142049 142129 141111 139172 136645 133812 130910
778A30910k736k407j958j513j064o82l74j84j85l43o50j045j445j759j971j986j868j591j142
$$ 130910 128174 125767 123809 122296 121232 120550 120176 119992 119807 119464 118814 117769 116324 114565 112594 110608 108740 107149 106007
776A06007o43j00M52R95J541J991K286K404K292J844J014m9j309k561l647m521n061n320n374
$$ 106007 105364 105264 105716 106711 108252 110243 112529 114933 117225 119069 120083 120034 118725 116164 112517 107996 102935 97615 92241
774I2241n209m976m668m335m029l697l391l137k829k523k263k016j756j428j168r59p46n54
$$ 92241 87032 82056 77388 73053 69024 65327 61936 58799 55970 53447 51184 49168 47412 45984 44816 43857 43111 42557
771D2557l42j52O1K97N09P58R70J233J492J783K089K373K680L002L356L722M077M366M580
$$ 42557 42215 42063 42124 42421 42930 43688 44658 45891 47383 49166 51255 53628 56308 59310 62666 66388 70465 74831 79411
769G9411M663M663M420L924L140K078Q64l88j547k563l368l863m084m083l968l756l534l226
$$ 79411 84074 88737 93157 97081 100221 102299 103163 102775 101228 98665 95297 91434 87350 83267 79299 75543 72009 68783
767F8783k910k603k317k010j725j370r92o38k49J53N22R24J297J604J935K242K567K779K939
$$ 68783 65873 63270 60953 58943 57218 55848 54856 54218 53969 54122 54644 55568 56865 58469 60404 62646 65213 67992 70931
765G0931L009L000K882K540K043J309M35m95j416k234k919l429l737l869l799l683l519l377
$$ 70931 73940 76940 79822 82362 84405 85714 86149 85654 84238 82004 79085 75656 71919 68050 64251 60568 57049 53672
762E3672l259l115k902k687k474k288k076j906j741j599j434j269j151j013q95q20q19p81
$$ 53672 50413 47298 44396 41709 39235 36947 34871 32965 31224 29625 28191 26922 25771 24758 23863 23043 22224 21443
760B1443p10o50o50o41o41n40m69n09n09m44m45m44m44m38m38l20l19k74k75k74k74k20k21
$$ 21443 20733 20083 19433 18792 18151 17611 17142 16633 16124 15680 15235 14791 14347 13909 13471 13151 12832 12558 12283 12009 11735 11515 11294
757A1294k20k21j79j79j80j79j33j34j33j34j04j04j04j04j26j26j27j26j26j26j22j21o1
$$ 11294 11074 10853 10674 10495 10315 10136 10003 9869 9736 9602 9498 9394 9290 9186 9060 8934 8807 8681 8555 8429 8307 8186 8125
755H125J1k9k9r0q9r0r0j04j05j04j04q7q7q6q7o4o4o4o4k2k3k3k2m8m8m8m8K8K9K9K8P4P3
$$ 8125 8136 8107 8078 7988 7899 7809 7719 7615 7510 7406 7302 7215 7128 7042 6955 6891 6827 6763 6699 6677 6654 6631 6609 6561 6513 6465 6417 6445 6474 6503 6531 6605 6678
751F678P3P3N6N5N6N5N5N5N0N0P3KM1M1j2j2j2j2j2j2j2j2k9k9k8k9j9k0k0j9K6K6K5K6l9
$$ 6678 6751 6824 6880 6935 6991 7046 7101 7156 7206 7256 7329 7331 7372 7413 7401 7389 7377 7365 7353 7341 7329 7317 7288 7259 7231 7202 7183 7163 7143 7124 7150 7176 7201 7227 7188
746G188l9l9l9j6j6j6j7K2K1N4mo0o1o4o4q1q2q1q2n5n5n4n5k5k5k6k5kkoom5j05j05m5k5
$$ 7188 7149 7110 7071 7055 7039 7023 7006 7028 7049 7103 7099 7039 6978 6914 6850 6769 6687 6606 6524 6469 6414 6360 6305 6280 6255 6229 6204 6202 6200 6194 6188 6143 6038 5933 5888 5863
742E863k5k1k2j7j8n1RM0M0M4M4l3l3l3l3j3j2j3j3J6J7J6J7k7k6k7k7L9L8L8L9J2J3J2J3
$$ 5863 5838 5817 5795 5778 5760 5709 5718 5758 5798 5842 5886 5853 5820 5787 5754 5741 5729 5716 5703 5719 5736 5752 5769 5742 5716 5689 5662 5701 5739 5777 5816 5828 5841 5853 5866
738E866J3J2J3J3PQQPJ7J6J7J6J5J4J5J4Q0P9Q0P9j2j2j1j2j2j2j2j1k7k7k7k7k7k7k7k7n
$$ 5866 5879 5891 5904 5917 5924 5932 5940 5947 5964 5980 5997 6013 6028 6042 6057 6071 6151 6230 6310 6389 6377 6365 6354 6342 6330 6318 6306 6295 6268 6241 6214 6187 6160 6133 6106 6079 6074
733F074nonr4r4r4r4pqqpJ0J0J0J0n1n1n1n2o9o9o9o9j9j9j9j9o1o0o1o0o5o5o5o5k3k4k3
$$ 6074 6069 6063 6058 5964 5870 5776 5682 5675 5667 5659 5652 5662 5672 5682 5692 5641 5590 5539 5487 5418 5349 5280 5211 5192 5173 5154 5135 5074 5014 4953 4893 4828 4763 4698 4633 4610 4586 4563
728D563k4k5k4k1k2RO7N2J7pm2m4rm0m0l8l7RRRR%%%JL7L8L7L8M6M7M6M7J3J3J4J3N5N4N5
$$ 4563 4539 4514 4490 4469 4447 4456 4523 4575 4592 4585 4543 4499 4490 4450 4410 4372 4335 4344 4353 4362 4371 4371 4371 4371 4372 4409 4447 4484 4522 4568 4615 4661 4708 4721 4734 4748 4761 4816 4870 4925
724D925N4R9R9R8R9O9O9O9O9P3P4P3P3L2L2L1L2P0P0P0P0M0M1M0M0O1O1O0O1L3L4L3L3L2L1
$$ 4925 4979 5078 5177 5275 5374 5443 5512 5581 5650 5723 5797 5870 5943 5975 6007 6038 6070 6140 6210 6280 6350 6390 6431 6471 6511 6572 6633 6693 6754 6787 6821 6854 6887 6919 6950
719F950O7O7J05J04L4L4nnnnn1n1n1n1p1p2p1p2opopM7M7M7M7K9K9K9L0k7k7k7k6L8L8L8L9
$$ 6950 7017 7084 7189 7293 7327 7361 7356 7351 7346 7341 7290 7239 7188 7137 7066 6994 6923 6851 6845 6838 6832 6825 6872 6919 6966 7013 7042 7071 7100 7130 7103 7076 7049 7023 7061 7099 7137 7176
715G176K1K2K1K2N6N5N6N5Q2Q2J53J53K14K14J79J78J39J38K09K10K18K18K18K18J96J96J60
$$ 7176 7197 7219 7240 7262 7318 7373 7429 7484 7566 7648 7801 7954 8168 8382 8561 8739 8878 9016 9225 9435 9653 9871 10089 10307 10503 10699 10859
711A0859J60J68J68K38K39K66K66K31K31K73K73K73K73K80K80K81K80K87K87K52K51K46K47
$$ 10859 11019 11187 11355 11593 11832 12098 12364 12595 12826 13099 13372 13645 13918 14198 14478 14759 15039 15326 15613 15865 16116 16362 16609
708A6609L17L17K75K76K75K75K58K59K58K59K17K17K17K17K26K26K26K26L14L15L14L15L32
$$ 16609 16926 17243 17518 17794 18069 18344 18602 18861 19119 19378 19595 19812 20029 20246 20472 20698 20924 21150 21464 21779 22093 22408 22740
706B2740L33L32L32L53L52M08M43M63N35N50N85O19O54P20P90Q94R65J014J086J177J295J387
$$ 22740 23073 23405 23737 24090 24442 24850 25293 25756 26291 26841 27426 28045 28699 29419 30209 31103 32068 33082 34168 35345 36640 38027
703C8027J504J622J740J884K003K138K304K489K655K825K991L200L412L596L760L977M189
$$ 38027 39531 41153 42893 44777 46780 48918 51222 53711 56366 59191 62182 65382 68794 72390 76150 80127 84316
701H4316M384M598M827N040N182N300N468N634N799N918O038O110O153O225O317O387O442
$$ 84316 88700 93298 98125 103165 108347 113647 119115 124749 130548 136466 142504 148614 154767 160992 167309 173696 180138
699A80138O478O512O548O591O590O561O562O591O661O678O712O744O815O859O931O997P069
$$ 180138 186616 193128 199676 206267 212857 219418 225980 232571 239232 245910 252622 259366 266181 273040 279971 286968 294037
697B94037P112P182P223P222P129O964O692O291N809N219M446L477K415J258J12j044k134
$$ 294037 301149 308331 315554 322776 329905 336869 343561 349852 355661 360880 365326 368803 371218 372476 372588 371544 369410
695C69410l149l993m678n224n578n767n837n814n744n608n443n165m811m460m106l746l345
$$ 369410 366261 362268 357590 352366 346788 341021 335184 329370 323626 318018 312575 307410 302599 298139 294033 290287 286942
693B86942k872k376j889j441j030o30l34j69q6j57l25o33j115j706k287k878l359l713l943
$$ 286942 284070 281694 279805 278364 277334 276704 276370 276201 276115 275958 275633 275000 273885 272179 269892 267014 263655 259942 255999
690B55999m014l913l652l237k693k091j359o39J41R46J725K528L308M108M886N687O467P262
$$ 255999 251985 248072 244420 241183 238490 236399 235040 234401 234542 235488 237213 239741 243049 247157 252043 257730 264197 271459
688B71459P995Q659R297R931J0569J1200J1791J2364J2860J3279J3586J3863J3980J3989J3823
$$ 271459 279454 288113 297410 307341 317910 329110 340901 353265 366125 379404 392990 406853 420833 434822 448645
686D48645J3461J2870J2132J1258J0268R252Q242P322O543N952N498N144M891M773M692M621
$$ 448645 462106 474976 487108 498366 508634 517886 526128 533450 539993 545945 551443 556587 561478 566251 570943 575564
684E75564M590M591M586M586M621M622M586M515M451M380M227L968L654L205K622J889R58
$$ 575564 580154 584745 589331 593917 598538 603160 607746 612261 616712 621092 625319 629287 632941 636146 638768 640657 641615
682F41615k46j642l225m854o577q273r854j1310j2561j3591j4371j4907j5215j5280j5209
$$ 641615 641369 639727 636502 631648 625071 616798 606944 595634 583073 569482 555111 540204 524989 509709 494500
680D94500j5039j4779j4430j4029j3587j3090j2530j1939j1354j0763j0108r517q925q429
$$ 494500 479461 464682 450252 436223 422636 409546 397016 385077 373723 362960 352852 343335 334410 325981
679C25981p989p635p371p253p265p431p745q147q549q950r298r559r681r680r512r251q910
$$ 325981 317992 310357 302986 295733 288468 281037 273292 265145 256596 247646 238348 228789 219108 209428 199916 190665 181755
677A81755q509q095p646p153o657o176n680n184m735m284l836l457l009k519k070j672j270
$$ 181755 173246 165151 157505 150352 143695 137519 131839 126655 121920 117636 113800 110343 107334 104815 102745 101073 99803
674I9803r16n61j84J70M95Q01J103J362J508J626J611J446J173Q18M01j41p41j331j857k306
$$ 99803 98887 98326 98142 98312 98807 99608 100711 102073 103581 105207 106818 108264 109437 110255 110656 110515 109774 108443 106586 104280
672A04280k602k815k878k878k811k646k441k229j971j712j387j033o93l85n2K55N80Q86J209
$$ 104280 101678 98863 95985 93107 90296 87650 85209 82980 81009 79297 77910 76877 76184 75799 75747 76002 76582 77468 78677
670G8677J515J721J887K001K120K149K078J821J515J142O93J89l54q29j277j693k047k259
$$ 78677 80192 81913 83800 85801 87921 90070 92148 93969 95484 96626 97319 97508 97154 96325 95048 93355 91308 89049
668H9049k377k362k291k175k010j867j703j512j253j046q33o09l96j61N2K31M43O76Q89J057
$$ 89049 86672 84310 82019 79844 77834 75967 74264 72752 71499 70453 69620 69011 68615 68454 68506 68737 69180 69856 70745 71802
665G1802J222J414J674J921K180K373K632K901L208L515L774M063M370M748N149N530N978
$$ 71802 73024 74438 76112 78033 80213 82586 85218 88119 91327 94842 98616 102679 107049 111797 116946 122476 128454
663A28454O495O944P386P834Q324Q820R296R697J0125J0526J0975J1329J1635J1943J2241
$$ 128454 134949 141893 149279 157113 165437 174257 183553 193250 203375 213901 224876 236205 247840 259783 272024
661B72024J2501J2761J2973J3103J3267J3401J3471J3448J3330J3173J3008J2827J2614J2334
$$ 272024 284525 297286 310259 323362 336629 350030 363501 376949 390279 403452 416460 429287 441901 454235
659D54235J2122J1941J1728J1496J1188J0933J0673J0408J0100R776R421R041Q592Q064P520
$$ 454235 466357 478298 490026 501522 512710 523643 534316 544724 554824 564600 574021 583062 591654 599718 607238
658F07238O928O337N684M953M206L473K789K056J298N65k14r93j814k640l443m223m979n663
$$ 607238 614166 620503 626187 631140 635346 638819 641608 643664 644962 645527 645313 644320 642506 639866 636423 632200 627221 621558
655F21558o357o995p579q076q485q840r095r308r430r430r431r430r282r069q896q684q508
$$ 621558 615201 608206 600627 592551 584066 575226 566131 556823 547393 537963 528532 519102 509820 500751 491855 483171 474663
653D74663q343q165p953p686p332o956o508n992n448m881m244l544k811k003j082o6J043K195
$$ 474663 466320 458155 450202 442516 435184 428228 421720 415728 410280 405399 401155 397611 394800 392797 391715 391649 392692 394887
651C94887L446M789O135P529Q921J0392J1880J3385J4872J6304J7791J9229K0669K2069K3461
$$ 394887 398333 403122 409257 416786 425707 436099 447979 461364 476236 492540 510331 529560 550229 572298 595759
649E95759K4850K6195K7490K8694K9852L0914L1956L2878L3724L4457L5029L5573L5980L6287
$$ 595759 620609 646804 674294 702988 732840 763754 795710 828588 862312 896769 931798 967371 1003351 1039638
648A039638L6529L6742L6932L7049L7114L7148L7128L6962L6650L6154L5419L4498L3330L2031
$$ 1039638 1076167 1112909 1149841 1186890 1224004 1261152 1298280 1335242 1371892 1408046 1443465 1477963 1511293 1543324
646A543324L0551K8922K7149K5282K3346K1292J9127J6836J4484J2004R474O900M315J740
$$ 1543324 1573875 1602797 1629946 1655228 1678574 1699866 1718993 1735829 1750313 1762317 1771791 1778691 1783006 1784746
644A784746q32l312n638p786r798j1662j3390j5019j6562j7954j9195k0163k0883k1426k1866
$$ 1784746 1783914 1780602 1774964 1767178 1757380 1745718 1732328 1717309 1700747 1682793 1663598 1643435 1622552 1601126 1579260
642A579260k2268k2689k3279k4306k6077k8817l2477l6705m0743m3898m5670m6113m5711m4935
$$ 1579260 1556992 1534303 1511024 1486718 1460641 1431824 1399347 1362642 1321899 1278001 1232331 1186218 1140507 1095572
641A095572m4061m3164m2243m1292m0277l9262l8199l7104l5946l4657l3263l1873l0528k9187
$$ 1095572 1051511 1008347 966104 924812 884535 845273 807074 769970 734024 699367 666104 634231 603703 574516
639E74516k7888k6722k5565k4446k3337k2230k1121k0010j8948j7835j6772j5784j4815j3929
$$ 574516 546628 519906 494341 469895 446558 424328 403207 383197 364249 346414 329642 313858 299043 285114
637B85114j3008j2111j1284j0503r722r020q336p766p224o633o043n535n086m656m206l786
$$ 285114 272106 259995 248711 238208 228486 219466 211130 203364 196140 189507 183464 177929 172843 168187 163981 160195
635A60195l383l030k675k292j984j725j465j266j053q40o75n16l97k77k05j25n3l8kK0K0K3
$$ 160195 156812 153782 151107 148815 146831 145106 143641 142375 141322 140482 139807 139291 138894 138617 138412 138287 138234 138196 138194 138214 138234 138257
633A38257K3PQK3j3p5j46k36l07l94m29m69n05n58o29o94p30p93q64r57j027j089j161j254
$$ 138257 138280 138287 138295 138318 138305 138230 138084 137848 137541 137147 136718 136249 135744 135186 134557 133863 133133 132340 131476 130519 129492 128403 127242 125988
630A25988j326j383j453j549j619j684j755j802j873j932k003k054k124k197k316k399k434
$$ 125988 124662 123279 121826 120277 118658 116974 115219 113417 111544 109612 107609 105555 103431 101234 98918 96519 94085
628I4085k452k452k455k454k498k498k462k463k406k406k370k300k250k180k129k059j941
$$ 94085 91633 89181 86726 84272 81774 79276 76814 74351 71945 69539 67169 64869 62619 60439 58310 56251 54310
625E4310j824j752j682j555j437j322j251j196j126j079j007r39q69q01p65p45o75o31n61
$$ 54310 52486 50734 49052 47497 46060 44738 43487 42291 41165 40086 39079 38140 37271 36470 35705 34960 34285 33654 33093
623C3093n16m80m45m09l93l92l56l55l39l40l06l07k91l26l39l40k98k63k82k83k73k74k73
$$ 33093 32577 32097 31652 31243 30850 30458 30102 29747 29408 29068 28762 28455 28164 27838 27499 27159 26861 26598 26316 26033 25760 25486 25213
620B5213k73k10k10k26k61k71k72k24j88j96j97j94j95j98j98j97j98k40k40k07k06k02k37
$$ 25213 24940 24730 24520 24294 24033 23762 23490 23266 23078 22882 22685 22491 22296 22098 21900 21703 21505 21265 21025 20818 20612 20410 20173
618B0173k68l04l13l14k44k45k17k17k19k19k39k74l24l23k89k53k22j87j52j53j85j86k34
$$ 20173 19905 19601 19288 18974 18730 18485 18268 18051 17832 17613 17374 17100 16776 16453 16164 15911 15689 15502 15350 15197 15012 14826 14592
615A4592k35k32k32k28j91j61j25p9p9p8p9j43j78j58j58j42j42j22j57j55j55j57j57j52
$$ 14592 14357 14125 13893 13665 13474 13313 13188 13109 13030 12952 12873 12730 12552 12394 12236 12094 11952 11830 11673 11518 11363 11206 11049 10897
612A0897j52j52j52j38j39o7o8q3q3q3q3j19j20j20j20j26j27j45j09m8j4l0l1o2o1o2o1j15
$$ 10897 10745 10593 10441 10303 10164 10097 10029 9946 9863 9780 9697 9578 9458 9338 9218 9092 8965 8820 8711 8663 8649 8619 8588 8526 8465 8403 8342 8227
608H227j15j32r7l6jl4p0r7r7m8j3k7k6o0o0p4p3k2J3l8l7l6l5m6m6m7m6n4n4j9j9RRo2o3
$$ 8227 8112 7980 7883 7847 7846 7812 7742 7645 7548 7500 7487 7460 7434 7374 7314 7240 7167 7145 7158 7120 7083 7047 7012 6966 6920 6873 6827 6773 6719 6700 6681 6690 6699 6637 6574
604F574n9o0N8N9M5M5k6k6m9m8m9m9k3k4k3k4k2k3k2k3m0m0m0m0l0l0k9l0J1J2J1J2J%JJm
$$ 6574 6515 6455 6513 6572 6617 6662 6636 6610 6561 6513 6464 6415 6392 6368 6345 6321 6299 6276 6254 6231 6191 6151 6111 6071 6041 6011 5982 5952 5963 5975 5986 5998 5999 5999 6000 6001 5997
600E997mlmK8K9m3m2m5m4K6K6N8N8K3K2M6M5kl7j5M4O4K8rrqqN2J10J64J29O4Nl5l5J6J5N1
$$ 5997 5993 5990 5986 6014 6043 6000 5958 5913 5869 5895 5921 5979 6037 6060 6082 6128 6173 6171 6134 6119 6163 6227 6255 6246 6237 6229 6221 6273 6383 6547 6676 6740 6745 6710 6675 6691 6706 6757
595F757N1llklK9K9K8K9m7m8m8m8L8L8L9L8lmllj4j5j4j5m8m9m8m9l5l5j06j06q6q6n1n1n0
$$ 6757 6808 6805 6802 6800 6797 6826 6855 6883 6912 6865 6817 6769 6721 6759 6797 6836 6874 6871 6867 6864 6861 6847 6832 6818 6803 6755 6706 6658 6609 6574 6539 6433 6327 6241 6155 6104 6053 6003
590F003n0o9l5JJLMqpqpqpqpm2m2m3m2o0o0n9o0J4J5J7J7L8P4N3N4M0L9M2M1P1J06J57J57
$$ 6003 5953 5884 5849 5850 5851 5854 5858 5850 5843 5835 5828 5820 5813 5805 5798 5756 5714 5671 5629 5569 5509 5450 5390 5404 5419 5436 5453 5491 5565 5618 5672 5712 5751 5793 5834 5905 6011 6168 6325
585F325J60J61J61J61J24J24J24J24J16J16J16J16J45J45J46J45J63J64J63J64J23J24J39
$$ 6325 6485 6646 6807 6968 7092 7216 7340 7464 7580 7696 7812 7928 8073 8218 8364 8509 8672 8836 8999 9163 9286 9410 9549
583I549J75J71J71J23Q7J03J03J01J02J08J09N8K3K2K3O9J04Q5N0K0j4o3o2o5o5n2n3k0k1
$$ 9549 9724 9895 10066 10189 10276 10379 10482 10583 10685 10793 10902 10960 10983 11005 11028 11097 11201 11286 11336 11356 11342 11279 11217 11152 11087 11035 10982 10962 10941
579A0941o5j25j60j60j33r7q1q2j03j04j06j06j35j71j50j51j52j53j53j53j64j65j66j67
$$ 10941 10876 10751 10591 10431 10298 10201 10120 10038 9935 9831 9725 9619 9484 9313 9163 9012 8860 8707 8554 8401 8237 8072 7906 7739
576G739j58j93k42k41k24j88j72j73j53j52j37j02q4q5j41j76j47q8o5o4p9p8r4j29j47j46
$$ 7739 7581 7388 7146 6905 6681 6493 6321 6148 5995 5843 5706 5604 5520 5435 5294 5118 4971 4883 4818 4754 4675 4597 4503 4374 4227 4081
573D081j09p4o1o1n8n9p2p3n7k2jkJ%l9l8l9l8n3n3n0n0pK8O8O7O4O4K5j0k9k9MMJ2J3k3k3
$$ 4081 3972 3898 3837 3776 3718 3659 3587 3514 3457 3435 3434 3432 3433 3433 3394 3356 3317 3279 3226 3173 3123 3073 3066 3094 3162 3229 3293 3357 3382 3372 3343 3314 3318 3322 3334 3347 3324 3301
568C301k3k3J1J0K9ok2k2mmmmM3M2QPkkkll2l2l2l2l0l0l0l0POM0M0L1lm3m3j3j3j2j3klk
$$ 3301 3278 3255 3266 3276 3305 3299 3277 3255 3251 3247 3243 3239 3282 3324 3332 3339 3337 3335 3333 3330 3298 3266 3234 3202 3172 3142 3112 3082 3089 3095 3135 3175 3206 3203 3160 3117 3104 3091 3079 3066 3064 3061 3059
563C059kppm5q1q9q8n2j6mnkkj3j3K0K1K0j5n4n4l9l8l9l8mlJ7j9o4o4o6o6k3k4k3k4rj0r
$$ 3059 3057 3050 3043 2998 2917 2828 2740 2688 2672 2668 2663 2661 2659 2646 2633 2653 2674 2694 2679 2625 2571 2532 2494 2455 2417 2413 2410 2427 2408 2344 2280 2214 2148 2125 2101 2078 2054 2045 2035 2026
558B026j0kjo1o1m4m5L8L8L7L7L7L7k1k1k1k0k9k9PPj3j3j3j3PPPPNNMNK0K0j5j6LKL8L8M
$$ 2026 2016 2014 2013 1952 1891 1847 1802 1840 1878 1915 1952 1989 2026 2005 1984 1963 1943 1914 1885 1892 1899 1886 1873 1860 1847 1854 1861 1868 1875 1880 1885 1889 1894 1914 1934 1919 1903 1906 1908 1946 1984 1988
553A988NNNM8M8M8M8j2j2j3j2N0N0N0N1L0L0onN9N9j%J0RM5M5P1P1L5L6K4K4K5K4k7k8QQM4
$$ 1988 1993 1998 2003 2051 2099 2147 2195 2183 2171 2158 2146 2196 2246 2296 2347 2377 2407 2401 2396 2455 2514 2513 2513 2523 2532 2577 2622 2693 2764 2799 2835 2859 2883 2908 2932 2905 2877 2885 2893 2937
548B937M4M4M4P9Q0P9P9M7M8O6J37K08K08J78J77J85J86J85J86K43K43L11L45M09M80N06N05
$$ 2937 2981 3025 3069 3148 3228 3307 3386 3433 3481 3547 3684 3892 4100 4278 4455 4640 4826 5011 5197 5440 5683 5994 6339 6748 7228 7734 8239
545H239N65O36P40Q11Q92J010J093J163J298J415J558J677J676J677J708J637J505J245R00
$$ 8239 8804 9440 10180 10991 11883 12893 13986 15149 16447 17862 19420 21097 22773 24450 26158 27795 29300 30545 31445
543C1445M98N3l96q30j137j368j487j555j555j517j482j419j348j240j171j075j005r40q68
$$ 31445 31943 31996 31600 30770 29633 28265 26778 25223 23668 22151 20669 19250 17902 16662 15491 14416 13411 12471 11603
540A1603p98o80n78m59m48m48l98l98l23l22k63j91k31k31j51j52j51j52j51j51j52j51j20
$$ 11603 10805 10125 9547 9088 8640 8192 7794 7396 7073 6751 6488 6297 6066 5835 5684 5532 5381 5229 5078 4927 4775 4624 4504
537D504j21j20j20qrl9j10j20j21j25j25p2p2p2p2m5m5K6K5K6K6m5m5k1k0k1k0l4l4l1l2J6
$$ 4504 4383 4263 4143 4135 4126 4087 3977 3857 3736 3611 3486 3414 3342 3270 3198 3153 3108 3134 3159 3185 3211 3166 3121 3100 3080 3059 3039 3005 2971 2940 2908 2924
534B924N2P1Jm6m6n0n0o4o3o4o3j0j0j1j0L1L0L1L1M8M9M8M9N3N3N3N3J2J2J2J2JJJJm0m1
$$ 2924 2976 3047 3048 3002 2956 2906 2856 2792 2729 2665 2602 2592 2582 2571 2561 2592 2622 2653 2684 2732 2781 2829 2878 2931 2984 3037 3090 3102 3114 3126 3138 3139 3140 3141 3142 3102 3061
529C061m0m0l7l7l3l2k6M4R6O1L1L2K9L0qpqpkjjjJ6J6J7J6L6L6L6L5J9J8J8J8l7l7l7l7n9
$$ 3061 3021 2981 2944 2907 2874 2842 2816 2860 2956 3017 3048 3080 3109 3139 3131 3124 3116 3109 3107 3106 3105 3104 3120 3136 3153 3169 3205 3241 3277 3312 3331 3349 3367 3385 3348 3311 3274 3237 3178
524C178n9J2J2J8J8J8J8m3m2m3m2p5p6p5p5m6m6m6m5L8L9L8L9P9Q0Q0Q0M4M4M4M4O6O6O6O7
$$ 3178 3119 3131 3143 3161 3179 3197 3215 3172 3130 3087 3045 2970 2894 2819 2744 2698 2652 2606 2561 2599 2638 2676 2715 2794 2874 2954 3034 3078 3122 3166 3210 3276 3342 3408 3475
520C475P0P0qp9m9m9m9n0j5N6N6j5o4o3KLl3l3k9k9n4J7R5R5O7O6O7O7J6J7Q7Q8J41J41J41
$$ 3475 3545 3615 3607 3528 3479 3430 3381 3331 3316 3372 3428 3413 3349 3286 3288 3291 3258 3225 3196 3167 3113 3130 3225 3320 3387 3453 3520 3587 3603 3620 3707 3795 3936 4077 4218
516D218J42J63J63J33O1N2N2M7M7noO5O5P6P6P6P6R8R8R9R8P9P9Q0P9P1P0P1P0K7K7L1L2M8
$$ 4218 4360 4523 4686 4819 4880 4932 4984 5031 5078 5073 5067 5132 5197 5273 5349 5425 5501 5599 5697 5796 5894 5973 6052 6132 6211 6282 6352 6423 6493 6520 6547 6578 6610 6658
512F658J18J50J49J57J57K77K78L09L44M08M78N23N95O28O27N95N59M93L28J43p0k28k99l47
$$ 6658 6776 6926 7075 7232 7389 7666 7944 8253 8597 9005 9483 10006 10601 11229 11856 12451 13010 13503 13831 13974 13904 13676 13377 13030
509A3030l48l52l52m48m49m15l44l06k71k35k00k00k00j27j27r7r8k7k6L7L7J07J08R3R3J66
$$ 13030 12682 12330 11978 11530 11081 10666 10322 10016 9745 9510 9310 9110 8910 8783 8656 8559 8461 8434 8408 8445 8482 8589 8697 8790 8883 9049
505I049J66J86K20K82L52L78M13M69M69N20N21N55N56N16N16N28M93L77K59J46P5np7j44k62
$$ 9049 9215 9401 9621 9903 10255 10633 11046 11515 11984 12504 13025 13580 14136 14652 15168 15696 16189 16566 16825 16971 17046 17041 16964 16820 16558
502A6558l56m28l97l26l33k97k35j64j49j50j26r0p7pQ1J52J20J20J60J59J08J08J55J90J51
$$ 16558 16202 15774 15377 15051 14718 14421 14186 14022 13873 13723 13597 13507 13430 13423 13504 13656 13776 13896 14056 14215 14323 14431 14586 14776 14927
499A4927Q1N3N2M8M8J18J19R2R1L6Jr0j61j23j23j75j75j75j75j53j52n2O6J02J38K07K66
$$ 14927 15008 15061 15113 15161 15209 15327 15446 15538 15629 15665 15666 15576 15415 15292 15169 14994 14819 14644 14469 14316 14164 14112 14178 14280 14418 14625 14891
496A4891K35K00K36K71K76K40K41K75K71K35K81L65M26M27M28M28M12L54L31K95K21J38J27
$$ 14891 15126 15326 15562 15833 16109 16349 16590 16865 17136 17371 17652 18017 18443 18870 19298 19726 20138 20492 20823 21118 21339 21477 21604
493B1604J63J98J97K70K71K88K88L61M45M99N34N91O74P03P03P20P56P42O83O87P47P98Q34
$$ 21604 21767 21965 22162 22432 22703 22991 23279 23640 24085 24584 25118 25709 26383 27086 27789 28509 29265 30007 30690 31377 32124 32922 33756
490C3756Q16Q15P84P49P75Q34Q44R03J049J202J282J317J367J473J540J576J689J843J891
$$ 33756 34572 35387 36171 36920 37695 38529 39373 40276 41325 42527 43809 45126 46493 47966 49506 51082 52771 54614 56505
488E6505J892J960K162K329K435K639K934L188L436L728M071M379M627M889N209N487N759
$$ 56505 58397 60357 62519 64848 67283 69922 72856 76044 79480 83208 87279 91658 96285 101174 106383 111870 117629
486A17629O078O443O783P102P602Q251Q988R850J0968J2230J3467J4682J5988J7416J8851
$$ 117629 123707 130150 136933 144035 151637 159888 168876 178726 189694 201924 215391 230073 246061 263477 282328
484B82328K0327K2055K3979K5928K7971L0258L2750L5252L7816M0672M3967M7589N1709N6672
$$ 282328 302655 324710 348689 374617 402588 432846 465596 500848 538664 579336 623303 670892 722601 779273
482G79273O2516O9045P6519Q5751R7194J10718J26222J43640J62473J82234K03452K27529
$$ 779273 841789 910834 987353 1073104 1170298 1281016 1407238 1550878 1713351 1895585 2099037 2326566
481B326566K55195K85466L16851L48155L77886M03796M22333M26546M03191L36553K20152
$$ 2326566 2581761 2867227 3184078 3532233 3910119 4313915 4736248 5162794 5565985 5902538 6122690
480F122690O7102r3365k31050l28086l80947l96084l85154l61185l33737l06508k79838k54592
$$ 6122690 6189792 6096427 5865377 5537291 5156344 4760260 4375106 4013921 3680184 3373676 3093838 2839246
478B839246k32568k14597j99440j85482j71340j55872j38630j20800j04794r2113q2400p4631
$$ 2839246 2606678 2392081 2192641 2007159 1835819 1679947 1541317 1420517 1315723 1223610 1141210 1066579
477A066579o8178o2676n7604n2763m8382m4628m1202l7921l4992l2559l0543k8584k6697k4973
$$ 1066579 998401 935725 878121 825358 776976 732348 691146 653225 618233 585674 555131 526547 499850 474877
475D74877k3313k1732k0391j9234j8228j7306j6672j6318j6025j5576j4995j4357j3545j2577
$$ 474877 451564 429832 409441 390207 371979 354673 338001 321683 305658 290082 275087 260730 247185 234608
473B34608j1630j0803j0006r179q385p748p199o702o293n938n626n271m938m678m397m091
$$ 234608 222978 212175 202169 192990 184605 176857 169658 162956 156663 150725 145099 139828 134890 130212 125815 121724
471A21724l831l665l530l316l084k965k847k730k587k470k354k237k126k126k080k009j917
$$ 121724 117893 114228 110698 107382 104298 101333 98486 95756 93169 90699 88345 86108 83982 81856 79776 77767 75850
469G5850j845j768j650j529j458j383j218j089j089j030r60q34q34p89p88p17p18p46p46q71
$$ 75850 74005 72237 70587 69058 67600 66217 64999 63910 62821 61791 60831 59997 59163 58374 57586 56869 56151 55405 54659 53788
467E3788r42r31r30r35r34r78r77q47p77p88p17o20n50m66l49k92k92l18l17k78l48m15m16
$$ 53788 52846 51915 50985 50050 49116 48138 47161 46314 45537 44749 44032 43412 42862 42396 42047 41755 41463 41145 40828 40550 40202 39787 39371
464C9371k89k19j88j16q1q1j21j22q7q6j31j32j31j31k40k39k40k39k26k26j56j55j79j79
$$ 39371 39082 38863 38675 38559 38478 38397 38276 38154 38067 37981 37850 37718 37587 37456 37216 36977 36737 36498 36272 36046 35890 35735 35556 35377
461C5377j79j79j52j52j81k52l10k75k23k24k30j59m9P0J45K16K39K75L12L84M91N27N38N37
$$ 35377 35198 35019 34867 34715 34534 34282 33972 33697 33474 33250 33020 32861 32812 32882 33027 33243 33482 33757 34069 34453 34944 35471 36009 36546
458C6546O11O10O39O39O15N81M79L60K75J56R1K0k4r5j06p0k4k5p9p9LP4J12J82K77L48M31
$$ 36546 37157 37767 38406 39045 39660 40241 40720 41080 41355 41511 41602 41622 41598 41503 41397 41327 41303 41278 41199 41120 41123 41197 41309 41491 41768 42116 42547
455D2547N02N46O17O92P27P50Q20Q81R98J090J208J329J447J609J774J884K001K191K403K576
$$ 42547 43049 43595 44212 44904 45631 46381 47201 48082 49080 50170 51378 52707 54154 55763 57537 59421 61422 63613 66016 68592
452F8592K741K916L128L370L678M031M386M772N221N644O091O588P084P677Q315Q952R684
$$ 68592 71333 74249 77377 80747 84425 88456 92842 97614 102835 108479 114570 121158 128242 135919 144234 153186 162870
450A62870J0422J1201J2093J3061J4106J5264J6548J7989J9713K1720K4014K6682K9756L3227
$$ 162870 173292 184493 196586 209647 223753 239017 255565 273554 293267 314987 339001 365683 395439 428666
449D28666L7243M1801M6902N2499N8646O5328P2625Q0537Q8902R7522J05894J13474J19428
$$ 428666 465909 507710 554612 607111 665757 731085 803710 884247 973149 1070671 1176565 1290039 1409467
447A409467J22617J21312J13447R7354P2534M0485M519l0949o1626q4713r9331j06225j07098
$$ 1409467 1532084 1653396 1766843 1864197 1936731 1977216 1981735 1950786 1889160 1804447 1705116 1598891 1491793
445A491793j03840r8101r1164q3772p6439o9379o2731n6473n0374m4306l8129l2013k6074
$$ 1491793 1387953 1289852 1198688 1114916 1038477 969098 906367 849894 799520 755214 717085 685072 658998
444F58998k0525j5426j0774o437k305J825O053J0521J5221K0206K5472L1107L7035M3325N0056
$$ 658998 638473 623047 612273 605836 603531 605356 611409 621930 637151 657357 682829 713936 750971 794296 844352
442H44352N7193O4680P2369P9998Q7232R3538R8161J00215R8749R2773Q1583O5265M4485K0517
$$ 844352 901545 966225 1038594 1118592 1205824 1299362 1397523 1497738 1596487 1689260 1770843 1836108 1880593 1901110
440A901110n027l0225n3123p2134q6316r5454r9998j00683r8471r4339q9088q3301p7359p1526
$$ 1901110 1896083 1865858 1812735 1740601 1654285 1558831 1458833 1358150 1259679 1165340 1076252 992951 915592 844066
439H44066o5865o0456n5234n0251m5567m1197l7165l3457l0083k7084k4474k2183k0227j8502
$$ 844066 778201 717745 662511 612260 566693 525496 488331 454874 424791 397707 373233 351050 330823 312321
437C12321j6986j5640j4451j3388j2440j1614j0849j0117r458q822q301p853p440p085o728
$$ 312321 295335 279695 265244 251856 239416 227802 216953 206836 197378 188556 180255 172402 164962 157877 151149
435A51149o421o173n913n627n367n145m886m585m278m064l853l639l380l192l025k878k713
$$ 151149 144728 138555 132642 127015 121648 116503 111617 107032 102754 98690 94837 91198 87818 84626 81601 78723 76010
433G6010k540k375k209k091j943j826j734j616j499j429j331j260j150j079j043j043j009
$$ 76010 73470 71095 68886 66795 64852 63026 61292 59676 58177 56748 55417 54157 53007 51928 50885 49842 48833
431D8833j009r54r18r07q37p48o78o72o72o67o68n89n90n18n18m82m81m03l32k63k62k59k58
$$ 48833 47824 46870 45952 45045 44208 43460 42782 42110 41438 40771 40103 39514 38924 38406 37888 37406 36925 36522 36190 35927 35665 35406 35148
428C5148k10k10k12k12k47k83k96l67m25m60m81m80m20m19l45l44l21k50j60q9j8N3J47K18
$$ 35148 34938 34728 34516 34304 34057 33774 33478 33111 32686 32226 31745 31265 30845 30426 30081 29737 29416 29166 29006 28917 28899 28952 29099 29317
425B9317K58L28M23M94N97O69P82Q99R81J017J049J013R02P37N06K46p2l78p01r13j094j213
$$ 29317 29575 29903 30326 30820 31417 32086 32868 33767 34748 35765 36814 37827 38729 39466 39972 40218 40146 39768 39067 38154 37060 35847
422C5847j275j275j259j222j160j089r97r25q58q23q05p35o90o18n62m91m01l30k97k97k55
$$ 35847 34572 33297 32038 30816 29656 28567 27570 26645 25787 24964 24159 23424 22734 22116 21554 21063 20662 20332 20035 19738 19483
420A9483k55k30j95j34o3k9OO1O1Q2Q1J59K31K56K57K43K79L31L66M73N55O25P07Q24R30J011
$$ 19483 19228 18998 18803 18669 18606 18577 18583 18644 18705 18787 18868 19027 19258 19514 19771 20014 20293 20624 20990 21463 22018 22643 23350 24174 25104 26115
417B6115J093J201J329J471J576J618J653J648J564J373J125P89L76q8n50r67j286j526j633
$$ 26115 27208 28409 29738 31209 32785 34403 36056 37704 39268 40641 41766 42555 42931 42843 42293 41326 40040 38514 36881
414C6881j694j730j699j593j484j377j291j231j155j026q93p87p45p10o36n77n68n32m44l37
$$ 36881 35187 33457 31758 30165 28681 27304 26013 24782 23627 22601 21708 20921 20176 19466 18830 18253 17685 17153 16709 16372
412A6372k78k79k90k54k02j66j30r6l7jk0j9j%JKjL4J5J5L5L5L5L5J7J8J5J5j5n1l0l1j7j8
$$ 16372 16094 15815 15525 15271 15069 14903 14773 14677 14640 14639 14619 14600 14599 14599 14600 14602 14601 14635 14650 14665 14700 14735 14770 14805 14822 14840 14855 14870 14855 14804 14774 14743 14726 14708
408A4708L4O9Q9R0P4J09J60J96K28K65L24L24L27L26L35L34L86M21M36M36M21M56M90N26N85
$$ 14708 14742 14811 14900 14990 15064 15173 15333 15529 15757 16022 16346 16670 16997 17323 17658 17992 18378 18799 19235 19671 20092 20548 21038 21564 22149
405B2149O68P58Q40R02R38R89J072J184J291J395J455J518J577J658J740J764J763J738J666
$$ 22149 22817 23575 24415 25317 26255 27244 28316 29500 30791 32186 33641 35159 36736 38394 40134 41898 43661 45399 47065
402D7065J529J364J241J076R16P98O95O60O41P11Q56R75J095J261J458J718K019K326K653
$$ 47065 48594 49958 51199 52275 53191 53989 54684 55344 55985 56696 57552 58527 59622 60883 62341 64059 66078 68404 71057
400G1057K961L341L743M173M621N049N499O003O546P112P751Q399R132R960J0835J1773J2789
$$ 71057 74018 77359 81102 85275 89896 94945 100444 106447 112993 120105 127856 136255 145387 155347 166182 177955 190744
398A90744J4008J5354J6885J8609K0587K2925K5608K8607L1996L5798M0068M4720M9715N5123
$$ 190744 204752 220106 236991 255600 276187 299112 324720 353327 385323 421121 461189 505909 555624 610747
396F10747O0894O6963P3251P9603Q5752R1348R5860R8622R8888R5983Q9324P8531O3698M5348
$$ 610747 671641 738604 811855 891458 977210 1068558 1164418 1263040 1361928 1457911 1547235 1625766 1689464 1734812
394A734812K4413K238j9800m0276n8053p2245q2475q8829r1693r1693q9454q5699q0989p5770
$$ 1734812 1759225 1761463 1741663 1701387 1643334 1571089 1488614 1399785 1308092 1216399 1126945 1041246 960257 884487
393H84487p0395o5034n9826n4844n0094m5536m1209l7123l3397l0020k6944k4228k1831j9729
$$ 884487 814092 749058 689232 634388 584294 538758 497549 460426 427029 397009 370065 345837 324006 304277
391C04277j7920j6290j4873j3621j2549j1629j0869j0185r562q972q448p951p458p010o665
$$ 304277 286357 270067 255194 241573 229024 217395 206526 196341 186779 177807 169359 161408 153950 146940 140275
389A40275o357o092n832n610n398n204m990m731m472m241l981l762l550l311l098k897k685
$$ 140275 133918 127826 121994 116384 110986 105782 100792 96061 91589 87348 83367 79605 76055 72744 69646 66749 64064
387F4064k502k290k132k015j893j728j593j474j353j283j211j141j049r78r18q83q68p96p14
$$ 64064 61562 59272 57140 55125 53232 51504 49911 48437 47084 45801 44590 43449 42400 41422 40504 39621 38753 37957 37243
385C7243p13p10p09o06o07o19n84n05l87l49l13k24j53j08l7M6J16J32J67J71J71Q7J7r5k14
$$ 37243 36530 35820 35111 34505 33898 33279 32695 32190 31803 31454 31141 30917 30764 30656 30619 30665 30781 30913 31080 31251 31422 31509 31526 31431 31217
382C1217l69n36o39p10p79q14q18q18p43o71o28o28o39o03n32m62l81l81l26l25k70k35j97
$$ 31217 30848 30312 29673 28963 28184 27370 26552 25734 24991 24320 23692 23064 22425 21822 21290 20828 20447 20066 19740 19415 19145 18910 18713
379A8713j26m6m6n9o0k7M5P8J13J16J51J82K17K71K70L11L10L08L08L01K66J80O2j2j30k69
$$ 18713 18587 18541 18495 18436 18376 18349 18394 18472 18585 18701 18852 19034 19251 19522 19792 20103 20413 20721 21029 21330 21596 21776 21838 21826 21696 21427
376B1427l87m79n49o16o51o63o62n94n94n57n56n21n21m24m24l53l53l26l26l25l26k05k04
$$ 21427 21040 20561 20012 19396 18745 18082 17420 16826 16232 15675 15119 14598 14077 13653 13229 12876 12523 12197 11871 11546 11220 11015 10811
373A0811k05k04j51j52j51j51j13j13j12j13j42j42j40j40q7n1n2q6j07j06j08j08o5o5o5
$$ 10811 10606 10402 10251 10099 9948 9797 9684 9571 9459 9346 9204 9062 8922 8782 8695 8644 8592 8506 8399 8293 8185 8077 8012 7947 7882
370G882o4r5r4r2r2n9k3m3m3m1m1k1n6o5o5l5l4m7q3j32j32n8k4m3m3j6j6j6j6klkkj8j8j8
$$ 7882 7818 7723 7629 7537 7445 7386 7363 7320 7277 7236 7195 7174 7118 7053 6988 6953 6919 6872 6789 6657 6525 6467 6443 6400 6357 6341 6325 6309 6293 6291 6288 6286 6284 6266 6248 6230
366F230j8k9k9NMrm5r1r2m5J4Jl4l3l3l7l8j05j40j18j18j15p9o3o4p5p5ppk4o0m0m0m3m3
$$ 6230 6212 6183 6154 6159 6163 6154 6109 6018 5926 5881 5895 5896 5862 5829 5796 5759 5721 5616 5476 5358 5240 5125 5046 4983 4919 4844 4769 4762 4755 4731 4671 4631 4591 4548 4505
361D505m3m3k6k5k5k6l6l7l4l4K0N6N6K0MNK2j4m3m3p8p9p8m2L3O9P1L7j3j2j8j8j8j8QPP
$$ 4505 4462 4419 4393 4368 4343 4317 4281 4244 4210 4176 4196 4252 4308 4328 4332 4337 4359 4345 4302 4259 4181 4102 4024 3982 4015 4084 4155 4192 4179 4167 4149 4131 4113 4095 4103 4110 4117
357D117Pk0k1k0k1l8l8n8k3J5J5j4j4j7M3Q0Q0K1K1j5j4o4o3k6k5M2P8R2L2J7J6J4J3k8k8
$$ 4117 4124 4104 4083 4063 4042 4004 3966 3908 3885 3900 3915 3901 3887 3870 3913 3993 4073 4094 4115 4100 4086 4022 3959 3933 3908 3950 4028 4120 4152 4169 4185 4199 4212 4184 4156
352D156k7k8o1o1J0J0pqm3m3j8j9j9j8J4J4J4J4k3k2r4r4p3p4o9p0k3L5P4P3J3J4J3J3k3k4
$$ 4156 4129 4101 4040 3979 3989 3999 3992 3984 3941 3898 3880 3861 3842 3824 3838 3852 3866 3880 3857 3835 3741 3647 3574 3500 3431 3361 3338 3373 3447 3520 3533 3547 3560 3573 3550 3526
348C526k4k3l0l0k8k7KL8J9m1m3pM1M0%J%JN6N7N3N4Rm9j6j7n2n2n3n2j1j1j1j1K7K6K7K7
$$ 3526 3502 3479 3449 3419 3391 3364 3366 3404 3423 3382 3339 3332 3373 3413 3413 3414 3414 3415 3471 3528 3581 3635 3644 3595 3579 3562 3510 3458 3405 3353 3342 3331 3320 3309 3336 3362 3389 3416
343C416qppqk6k6r2r1k2O1Q3K4j9k0k3k3j27j28n6K6N5N5j1j1PPM3M3klklm0m0rO1J06J06
$$ 3416 3408 3401 3394 3386 3360 3334 3242 3151 3129 3190 3273 3297 3278 3258 3235 3212 3085 2957 2901 2927 2982 3037 3026 3015 3022 3029 3072 3115 3113 3110 3108 3105 3065 3025 3016 3077 3183 3289
339C289P9Qm3m3m8m8K4K3J9J9l7j08o8o8k4k4M7M6O5O4ooJ0J1J0J1m3m3m2m3M4M4J15J15O5
$$ 3289 3368 3376 3333 3290 3242 3194 3218 3241 3260 3279 3242 3134 3066 2998 2974 2950 2997 3043 3108 3172 3166 3160 3170 3181 3191 3202 3159 3116 3074 3031 3075 3119 3234 3349 3414
334C414O6L0L0L3L2L3L3P4P4P8P9J03J74J69J70J36J37K11K12K77L47L83L84L97M69N43N42
$$ 3414 3480 3510 3540 3573 3605 3638 3671 3745 3819 3897 3976 4079 4253 4422 4592 4728 4865 5076 5288 5565 5912 6295 6679 7076 7545 8088 8630
331H630N56M84M06M07L50L50K92J73K0r7k12k82l83l83m23m23m58m57m58m57l99l99l28l29
$$ 8630 9186 9670 10076 10483 10833 11183 11475 11648 11668 11571 11359 11077 10694 10311 9888 9465 9007 8550 8092 7635 7236 6837 6509 6180
328F180k57k58k58k57k01k00j29j29j79j80j08j08j02j03j02j03q2q3q2q3n3n4j8j9n8n9j26
$$ 6180 5923 5665 5407 5150 4949 4749 4620 4491 4312 4132 4024 3916 3814 3711 3609 3506 3424 3341 3259 3176 3123 3069 3051 3032 2974 2915 2789
325B789j25r8k7MMm7m7m8m9m5p9n8JM4M3j1j2J5J5J4J5J2J2J2J1k9l0k9l0rrk8PM7M7J1k5
$$ 2789 2664 2566 2539 2543 2547 2500 2453 2405 2356 2311 2232 2174 2175 2219 2262 2251 2239 2254 2269 2283 2298 2310 2322 2334 2345 2316 2286 2257 2227 2218 2209 2181 2188 2235 2282 2293 2268
320B268l3l2n5j9J1J0J3J2k1k1k1k0l7l6n7k1K1K1K3K3ONNOk8k7m7j2K5K6qpO3O4L7k1q7q7
$$ 2268 2235 2203 2148 2129 2140 2150 2163 2175 2154 2133 2112 2092 2055 2019 1962 1941 1962 1983 2006 2029 2035 2040 2045 2051 2023 1996 1949 1937 1962 1988 1980 1973 2036 2100 2137 2116 2029 1942
316A942p5m0ppnnJ4J3M7M7N4J9m5m4l5l5%%LMLMl6l6l5l6k0k1k0k1lkllJ9J9J9J9L7L6L7L7
$$ 1942 1867 1827 1820 1813 1808 1803 1817 1830 1877 1924 1978 1997 1952 1908 1873 1838 1838 1838 1841 1845 1848 1852 1816 1780 1745 1709 1689 1668 1648 1627 1624 1622 1619 1616 1635 1654 1673 1692 1729 1765 1802 1839
311A839lknnk4o0p2p2m2J7O6O7O9O8N4J7l7l7l9l9j2j2j0j0QM3K0K1k2n7l7l8k2k3k0k0M8
$$ 1839 1836 1834 1829 1824 1800 1740 1668 1596 1554 1571 1637 1704 1773 1841 1895 1912 1875 1838 1799 1760 1748 1736 1726 1716 1724 1767 1787 1808 1786 1729 1692 1654 1632 1609 1589 1569 1617
306A617Q4O2O2Qk7ppj8j8j9j8l2l2n3j6L6L6L7L6N0J4k4k5m7m7m4m5j3K1%%Ll3l3LM2M3Ol0
$$ 1617 1701 1763 1825 1833 1806 1799 1792 1774 1756 1737 1719 1687 1655 1602 1586 1622 1658 1695 1731 1781 1795 1771 1746 1699 1652 1608 1563 1550 1571 1571 1571 1574 1541 1508 1511 1553 1596 1602 1572
301A572l0l0k9l0OM2K3K2K4K4K5K4J0J1PQjl7j8j7%%%Jrrrrlmmmk1k2k2k1nnk5J1K0K1K2K2
$$ 1572 1542 1512 1483 1453 1459 1501 1524 1546 1570 1594 1619 1643 1653 1664 1671 1679 1678 1641 1623 1606 1606 1606 1606 1607 1598 1589 1580 1571 1568 1564 1560 1556 1535 1513 1491 1470 1465 1460 1435 1446 1466 1487 1509 1531
296A531j0j0k8PN0Q6Q5N0Nl0p0p0n1j7LL8O1O0K4j2l7l8k4J1QPJ0J0m1m1m1m2K7K6K7K6RQ
$$ 1531 1521 1511 1483 1490 1540 1626 1711 1761 1766 1736 1666 1596 1545 1528 1531 1569 1630 1690 1714 1702 1665 1627 1603 1614 1622 1629 1639 1649 1608 1567 1526 1484 1511 1537 1564 1590 1599 1607
291A607RRj1j0j1j0m5m4m1m0q2k3N8N9Rn1l6kJ9K0n0m9j8j9j8j9%%%jO5O5O4O5J2J1J2J2L
$$ 1607 1616 1625 1614 1604 1593 1583 1538 1494 1453 1413 1331 1308 1366 1425 1434 1383 1347 1345 1364 1384 1334 1285 1267 1248 1230 1211 1211 1211 1211 1210 1275 1340 1404 1469 1481 1492 1504 1516 1519
287A519LKLJ9J9J9J9j1j0j1j0m4m4m3m4K1K1K2K1M1M1M0M1k4k4k4k4k8k7k7k7rj0rj0J6J7
$$ 1519 1522 1524 1527 1546 1565 1584 1603 1592 1582 1571 1561 1517 1473 1430 1386 1407 1428 1450 1471 1512 1553 1593 1634 1610 1586 1562 1538 1510 1483 1456 1429 1420 1410 1401 1391 1407 1424
282A424J6J6k6k5k5k6MLLMN6N6N7N6RJ0RRl2l2l2l3j1j1j1j1j2j2m5J4O2O2K8l1n4n4n5n5
$$ 1424 1440 1456 1430 1405 1380 1354 1358 1361 1364 1368 1424 1480 1537 1593 1602 1612 1621 1630 1598 1566 1534 1501 1490 1479 1468 1457 1445 1433 1388 1402 1464 1526 1554 1523 1469 1415 1360 1305
277A305k6J0O1O1J0J0J0J0l7l8kN7M5J0L3L4lkJ8j8n5n6J2J1rm4k4k4mmmmJ6J7J6J7oonoJ9
$$ 1305 1279 1289 1350 1411 1421 1431 1441 1451 1414 1376 1374 1431 1476 1486 1519 1553 1550 1548 1566 1548 1493 1437 1449 1460 1451 1407 1383 1359 1355 1351 1347 1343 1359 1376 1392 1409 1403 1397 1392 1386 1405
272A405J8l2o8m7m7o7l1J6N1N4J8L6L6L2L1Rk7p5p6j6J9jjK4K5M4Rm6m5o8l3J2J2J6J7L7P3
$$ 1405 1423 1391 1323 1276 1229 1162 1131 1147 1198 1252 1270 1306 1342 1374 1405 1414 1387 1312 1236 1220 1239 1238 1237 1261 1286 1330 1339 1293 1248 1180 1147 1159 1171 1187 1204 1241 1314
268A314N1N1J8j7KKJ%%%n0n1m8m8m1nK5O1M7M7M9M9N3N4N1N1l5p1n0n1l5l5l5l5l5l4l2l2
$$ 1314 1365 1416 1434 1417 1419 1421 1422 1422 1422 1422 1372 1321 1273 1225 1184 1179 1204 1265 1312 1359 1408 1457 1510 1564 1615 1666 1631 1560 1510 1459 1424 1389 1354 1319 1284 1250 1218 1186
263A186J3M8K8K9j8j8j7j8qrrrJ4J3J3J3J3J3J4J3RJ0J0RJ7J6l3r2j10j10o2kK6O1O5L0k9
$$ 1186 1199 1247 1275 1304 1286 1268 1251 1233 1225 1216 1207 1198 1212 1225 1238 1251 1264 1277 1291 1304 1313 1323 1333 1342 1359 1375 1342 1250 1140 1030 968 966 992 1053 1118 1148 1119
259A119k9l1l1J0J0J0J0L2L1L2L1J4J4J4J4JKKJk8k7k8k8qqqqL3L4L3L3K1K2K1K1LMLMLLM
$$ 1119 1090 1059 1028 1038 1048 1058 1068 1100 1131 1163 1194 1208 1222 1236 1250 1251 1253 1255 1256 1228 1201 1173 1145 1137 1129 1121 1113 1146 1180 1213 1246 1267 1289 1310 1331 1334 1338 1341 1345 1348 1351 1355
254A355Lk2k2j00j01m7J3O2O2K6K7K6K7j1j0q9r0m9J1ll9qrj1j0N4N4Q9R0L8L8k1k1l5l6J
$$ 1355 1358 1336 1314 1214 1113 1066 1079 1141 1203 1229 1256 1282 1309 1298 1288 1199 1109 1060 1071 1068 1029 1021 1012 1001 991 1045 1099 1188 1278 1316 1354 1333 1312 1277 1241 1242
249A242%J7J7J7J7j1j0j1j0J4J5J4J5l9l9l8l9J5J4J5J4J4J5J4J5K6K7K6K7mmm3p8q6q6m6
$$ 1242 1242 1259 1276 1293 1310 1299 1289 1278 1268 1282 1297 1311 1326 1287 1248 1210 1171 1186 1200 1215 1229 1243 1258 1272 1287 1313 1340 1366 1393 1389 1385 1342 1264 1178 1092 1046
245A046j2LL9P7P7Ml2j2j2j1j0j1j0l4l3l1l1k3J3L0O6P0L5k3k3j3K2L6k3q1q0m5j0LKMNJ3
$$ 1046 1034 1037 1076 1153 1230 1234 1202 1190 1178 1167 1157 1146 1136 1102 1069 1038 1007 984 997 1027 1093 1163 1198 1175 1152 1139 1161 1197 1174 1093 1013 968 958 961 963 967 972 985
240I85J4J1J2qm3m3qN8N8N9N8J3k2kkn6n6n6n6j4j5j4j5M9M9M9M9M7M8J2J2J9K0l7l8k6Rj0
$$ 985 999 1010 1022 1014 971 928 920 978 1036 1095 1153 1166 1144 1142 1140 1084 1028 972 916 902 887 873 858 907 956 1005 1054 1101 1149 1161 1173 1192 1212 1175 1137 1111 1120 1110
235A110j1l3l4l4l3J7J7J8J7K9K9J3k2j4j4M4P9Q7N1J3k2j5K1jjjjj%l1l0l0l1j7j6j7j7l0
$$ 1110 1099 1066 1032 998 965 982 999 1017 1034 1063 1092 1105 1083 1069 1055 1099 1178 1265 1316 1329 1307 1292 1313 1312 1311 1310 1309 1308 1308 1277 1247 1217 1186 1169 1153 1136 1119 1089
231A089l1l1l0l3l3pN2J26J27Q1K1l2l3o9o9q0m4kL4K2K2j1j1kkJ7j7l4l4ML8O9O8L5L5oo
$$ 1089 1058 1027 997 964 931 924 976 1102 1229 1310 1331 1299 1266 1197 1128 1048 1004 1002 1036 1058 1080 1069 1058 1056 1054 1071 1054 1020 986 990 1028 1097 1165 1200 1235 1229 1223
226A223l9l9l3JJ7J8P0O9N3J6k8o4m3m4k1J5P5P5N5J9k2k2n7r2r0n5j2K4OOJ4J3J4J4J4J4
$$ 1223 1184 1145 1112 1113 1130 1148 1218 1287 1340 1356 1328 1264 1221 1177 1156 1171 1246 1321 1376 1395 1373 1351 1294 1202 1112 1057 1045 1069 1075 1081 1095 1108 1122 1136 1150 1164
222A164L4kj1j1K0J9M1Nn6n5m0mL5L5O0N9K0j5n1n1n1n1k2J4ooLLKLJ8J8L8Lj0j0j3j2j2j2
$$ 1164 1198 1196 1185 1174 1194 1213 1254 1259 1203 1148 1108 1104 1139 1174 1234 1293 1313 1298 1247 1196 1145 1094 1072 1086 1080 1074 1077 1080 1082 1085 1103 1121 1159 1162 1152 1142 1129 1117 1105 1093
217A093j2j2J4J5J4J5L2L1nm1m3qK9K9oonoKJKKj6j6j6j6L0L0L0K9M1M1M1M1n6n6k0k0NNn3
$$ 1093 1081 1069 1083 1098 1112 1127 1159 1190 1185 1144 1101 1093 1122 1151 1145 1139 1134 1128 1130 1131 1133 1135 1119 1103 1087 1071 1101 1131 1161 1190 1231 1272 1313 1354 1298 1242 1222 1202 1207 1212 1159
212A159n4k7k7L2L2L3L3llKJKJj%jjl4l4l4l5k5k5k6k5j%LLK1Q0O7L1%Jjko9o9J3J3J1J1m8
$$ 1159 1105 1078 1051 1083 1115 1148 1181 1178 1175 1177 1178 1180 1181 1180 1180 1179 1178 1144 1110 1076 1041 1016 991 965 940 939 939 942 945 966 1046 1113 1144 1144 1145 1144 1142 1073 1004 1017 1030 1041 1052 1004
207A004m8MNMMM2M2J8m1n2j6M2M3K6K7rro0o0j3M7P0L5j%K7K7Kn8n7n7kkK6K6K6K6K3K3K3
$$ 1004 956 960 965 969 973 1015 1057 1075 1034 982 966 1008 1051 1077 1104 1095 1086 1026 966 953 1000 1070 1105 1104 1104 1131 1158 1160 1102 1045 988 986 984 1010 1036 1062 1088 1111 1134 1157
202A157K3l0l0l0l0K5K5K5K5L4L4L4L4j6j7j7j7l4l4l5l4m4m3m4m3K1K1K2K1P4P3R0N4l8r7
$$ 1157 1180 1150 1120 1090 1060 1085 1110 1135 1160 1194 1228 1262 1296 1280 1263 1246 1229 1195 1161 1126 1092 1048 1005 961 918 939 960 982 1003 1077 1150 1240 1294 1256 1159
197A159q6n0j4j3j1j1J8J8J9J8n4n3n4n4K4K3K3K3J0J0J0J0qqpqJ3J2J3J2M0M0M0M0l3l3o8
$$ 1159 1073 1023 1009 996 985 974 992 1010 1029 1047 993 940 886 832 856 879 902 925 935 945 955 965 957 949 942 934 947 959 972 984 1024 1064 1104 1144 1111 1078 1010
193A010o8m9m9K1K2J6J7k0j9l4l5J%M6M6J1J1K5K5j0j0m7m6j1j2k5k6RJ0K4K4j1j1N3N2N3
$$ 1010 942 893 844 865 887 903 920 900 881 847 812 813 813 859 905 916 927 952 977 967 957 910 864 853 841 816 790 799 809 833 857 846 835 888 940 993
188I93N2qrrrK6K7m5m4q5q5m7J2J0J1J5J5K6K6K6K6k3k3k3k3opO3O4K7K7m4m3n1n1K0K0MN
$$ 993 1045 1037 1028 1019 1010 1036 1063 1018 974 889 804 757 769 779 790 805 820 846 872 898 924 901 878 855 832 826 819 882 946 973 1000 956 913 862 811 831 851 855 860
184H60L8L7N8K1k9k9l6l7JKJ9N5O8O8J6k0l5l5JJJJPQPQj6j5j3j3k4J1rrL1L1K8K9J9j7ML
$$ 860 898 935 993 1014 985 956 920 883 884 886 905 960 1028 1096 1112 1092 1057 1022 1023 1024 1025 1026 1033 1041 1048 1056 1040 1025 1012 999 975 986 977 968 999 1030 1058 1087 1106 1089 1093 1096
179A096k0j9k2k2k9o5o5k9klKKK1N7N7K1k2k1k4k4j3j3L6P2O3K8j8j9j6J9N5J9k4k4RRqrj0
$$ 1096 1076 1057 1035 1013 984 919 854 825 823 820 822 824 845 902 959 980 958 937 913 889 876 863 899 971 1034 1062 1044 1025 1009 1028 1083 1102 1078 1054 1063 1072 1064 1055 1045
174A045j1j4m9l0k9NNONL4L4j7n2l9l8l8l9o0k5P0P1M0MK5K4L7L7j3n0l8l8m0m0n9n8k1L9
$$ 1045 1034 1020 971 941 912 917 922 928 933 967 1001 984 932 893 855 817 778 718 693 763 834 874 878 903 927 964 1001 988 938 900 862 822 782 723 665 644 683
169F83Q3Q4P1L6j6j6j8j9j1j2j1j2mmmml4l4l3l4O3O3O3O3K1K2K1K2J2J2J1J2onoom2m2m2
$$ 683 766 850 921 957 941 925 907 888 877 865 854 842 838 834 830 826 792 758 725 691 754 817 880 943 964 986 1007 1029 1041 1053 1064 1076 1070 1065 1059 1053 1011 969 927
165I27m2j6j7N4N4J3J3J3J3RRQRm7m7m3m3J2P1L4L5oo4o5nO6O5O9O9M6M7k5k5l4l5JKl1l1
$$ 927 885 869 852 906 960 973 986 999 1012 1021 1030 1038 1047 1000 953 910 867 879 950 984 1019 1013 949 884 879 945 1010 1079 1148 1194 1241 1216 1191 1157 1122 1123 1125 1094 1063
160A063l0l1k0j9k0j9nnmnK5K5K5K5J2J3J3J2n2n3n2n2K8K9K8K8nonoqrp6p6l5K5O2O2J1J0
$$ 1063 1033 1002 982 963 943 924 919 914 910 905 930 955 980 1005 1017 1030 1043 1055 1003 950 898 846 874 903 931 959 954 948 943 937 929 920 844 768 733 758 820 882 893 903
155I03k4k5rrrrK5K6K5K5PPQPk7k8k7k8j8j9j8j9N8N7N7N8N6N6j5j5ppppk0k0k0k0O7O7O5
$$ 903 879 854 845 836 827 818 843 869 894 919 926 933 941 948 921 893 866 838 820 801 783 764 822 879 936 994 1050 1106 1091 1076 1069 1062 1055 1048 1028 1008 988 968 1035 1102 1167
150A167O6K8pp3j31j09j09p2j4K9O5M8M8O8O8lkj6j5m7m8l9J9N7N7j6j7n2n2k0j9n5n5o1o1
$$ 1167 1233 1261 1254 1181 1050 941 832 760 746 775 840 888 936 1004 1072 1069 1067 1051 1036 989 941 902 921 978 1035 1019 1002 950 898 878 859 804 749 688 627
146F27k7k6QQP9P9O5O6onk0j9J6J6MNNNm9m9K2K1O7O7L2L1m7m8m7m8J2J2M7M7Q4Q5l4l4p5
$$ 627 600 574 582 590 669 748 813 879 873 868 848 829 845 861 865 870 875 880 831 782 804 825 892 959 991 1022 975 927 880 832 844 856 903 950 1034 1119 1085 1051 976
141I76p6m0m1JJl4l5lmmlL6L7L6L7j7j6j7j7k2k2k3k2PQPPmlmlmlmlK0J9K0K0K0J9K0K0l1
$$ 976 900 860 819 820 821 787 752 749 745 741 738 774 811 847 884 867 851 834 817 795 773 750 728 735 743 750 757 753 750 746 743 739 736 732 729 749 768 788 808 828 847 867 887 856
135H56l1l2l1l1l1k9k9K9O4M3M2L5jJ9K0nnllnL1J3J2K3N8N6K1nm1r1r2p6m0J1J1kkkkJ7J8
$$ 856 825 793 762 731 700 671 642 671 735 778 820 855 854 873 893 888 883 880 877 872 903 916 928 951 1009 1065 1086 1081 1040 949 857 781 741 752 763 761 759 757 755 772 790
130G90J5J5M7J2j9n4o4o3j3K3L9P5N4N5J5k0l6K4O6L0j7j8m3m3m3m4qrJ1k4j0j0j2j3K9K9
$$ 790 805 820 867 879 860 806 742 679 666 689 728 803 857 912 927 907 871 895 961 991 974 956 913 870 827 783 775 766 777 753 743 733 721 708 737 766
126G66K9K9j5j6j5j6k4k4k5k4M3M2M0M1P0L5j6j5j3j2j2j2qpqqOONOj0j0k9NRJ0J3J4j7J9
$$ 766 795 824 809 793 778 762 738 714 689 665 708 750 790 831 901 936 920 905 892 880 868 856 848 841 833 825 831 837 842 848 838 828 799 804 813 823 836 850 833 852
121H52O6O6j8p7m3m4k3k2jl6p7m1PPN9N8N8N8J9J8J8J8J8J8J8J8n1n1m9m9n4j8J3M9N1N1N4
$$ 852 918 984 966 889 846 802 779 757 756 720 643 602 609 616 675 733 791 849 868 886 904 922 940 958 976 994 943 892 843 794 740 722 735 784 835 886 940
117I40N4lklkm6m5K5K6J6J7n2n2j1K5K3j3l5p0l1N3R3N9j5n0p6p6k7QK2K3K5K4%%j%k7k7k8
$$ 940 994 991 989 986 984 938 893 918 944 960 977 925 873 862 887 910 897 862 792 761 814 907 966 951 901 825 749 722 730 752 775 800 824 824 824 823 823 796 769 741
112G41k7rj0j2j1j7n2l2l1L0L1K9K8j7n4l3l4j7j8j8j8L4L4L5L4L4L4L4L5JJJ%K9K8M8J3J8
$$ 741 714 705 695 683 672 655 603 571 540 570 601 630 658 641 587 554 520 503 485 467 449 483 517 552 586 620 654 688 723 724 725 726 726 755 783 831 844 862
107H62J7J3J3j3m9m9j4mmM7Q2P3L8j1j0k8k7k7k7j4j4j4j4j0rrj0M2M1j5j5rK6K7rqqj1j0
$$ 862 879 892 905 892 843 794 780 776 772 819 901 974 1012 1001 991 963 936 909 882 868 854 840 826 816 807 798 788 830 871 856 841 832 858 885 876 868 860 849 839
102H39QRQRj0rrrn7n7n5n5m1nL4L4k9k8j4K3JJj7J9P0P0Rk5j2j2K5O1O2O2K6j0m0l9k6RK4
$$ 839 847 856 864 873 863 854 845 836 779 722 667 612 571 566 600 634 605 577 563 586 587 588 571 590 660 730 739 714 702 690 715 776 838 900 926 916 876 837 811 820 844
97H44K5l2l3k6k6k7k6LLKLllL2L3L5L6k3k4qqqpK4K5J0k6p2p2j1K4POj1K4L7L6N9K3l1l1l3
$$ 844 869 837 804 778 752 725 699 702 705 707 710 707 704 736 769 804 840 817 793 785 777 769 762 786 811 821 795 723 651 640 664 671 677 666 690 727 763 822 845 814 783 750
92G50l3mmjkK3N8N8K3J2J3M5M6K6K7j3m9m1m2k2n7q3m8JO0O3K8ppk9k8k8k9k1k2L7L7M8M8
$$ 750 717 713 709 708 706 729 787 845 868 880 893 938 984 1010 1037 1024 975 934 892 870 813 730 682 683 743 806 834 827 820 791 763 735 706 685 663 700 737 785 833
87H33P9Q0M8j1o1r7q5m9jN8Q1M5mo4q5q5n4n4lmN6N6N7N8K2K2KKKKk6k6o1o1n1n0L2L3K6K6
$$ 833 912 992 1040 1029 968 871 786 737 736 794 875 920 916 852 767 682 628 574 571 567 623 679 736 794 816 838 840 842 844 846 820 794 733 672 621 571 603 636 662 688
82F88l3l3k0j9M0M0N9N9N9N9j7j6j6j7K1K0j5j5m2m2J7J6N0N0l3l3k4k4k5k4J2J1J2J1m9n0
$$ 688 655 622 602 583 623 663 722 781 840 899 882 866 850 833 854 874 859 844 802 760 777 793 843 893 860 827 803 779 754 730 742 753 765 776 727 677
78F77n0n0j3j4M6M6L0L0L0L0L6L7L6L6j6j7j7j7l1l1l1l2j3j4j3j4MMMMl4l4l4l3j1j1M9M8
$$ 677 627 577 564 550 596 642 672 702 732 762 798 835 871 907 891 874 857 840 809 778 747 715 702 688 675 661 665 669 673 677 643 609 575 542 531 520 569 617
73F17L3L3k6k6k7k7QRK0K1l9l9QQM4M3N6N7N6N6K8K8n5n5m8m8j2j3M1M0NNo1o1o1o2L1L0L1
$$ 617 650 683 657 631 604 577 585 594 614 635 596 557 565 573 617 660 716 773 829 885 913 941 886 831 783 735 723 710 751 791 796 801 740 679 618 556 587 617 648
69F48L0qrqrqqK7K8Q0P9K1K1l2l1o7o6o1o0r2r1k5L4K3j3K1N6L4L4N6N6Q8Q7L6k3m9m9J9J9
$$ 648 678 670 661 653 644 636 628 655 683 763 842 863 884 852 821 754 688 627 567 475 384 359 393 416 403 424 480 514 548 604 660 748 835 871 848 799 750 769 788
64G88N4N5k3k2k2k3L9L8L8L8k7k6k7k7llllllllj7j7j8j7j8j7j7j8OONOk0k1k0k0k5k6JN9
$$ 788 842 897 874 852 830 807 846 884 922 960 933 907 880 853 850 847 844 841 838 835 832 829 812 795 777 760 742 725 708 690 696 702 707 713 693 672 652 632 607 581 582 641
59F41N8N8O0N9Pk8qqNNl2o8n4j9onm3m3lL2K8K9nnk0k0m0nM0M0O0K4l6p2q7q7n4j9K1K0K1
$$ 641 699 757 817 876 883 855 847 839 844 849 817 749 695 676 670 665 622 579 576 608 636 665 660 655 635 615 575 570 610 650 710 734 698 626 539 452 398 379 400 420 441
54D41K0N4N3M2PK5K4J7j8k1J5K5j0rK8L8L9OOppo4o4m0mJ1J2l9l8kL4M8J3%%L1L2nm1l2LJ7
$$ 441 461 515 568 610 617 642 666 683 665 644 659 684 674 665 693 731 770 776 782 775 768 704 640 600 596 607 619 580 542 540 574 622 635 635 635 666 698 693 652 620 623 640
49F40J7kkl5l5mL2J3J2JKJKpqppL6L7L6L7N6N7N4nq3q2o1jJ5J5J6J7Qk8o4o5m4qPPJ4J3J4
$$ 640 657 655 653 618 583 579 611 624 636 637 639 640 642 635 627 620 613 649 686 722 759 815 872 926 921 838 756 695 694 709 724 740 757 765 737 673 608 564 556 563 570 584 597 611
43F11J3kkkkl4l3l3l3j6j6j5j6k0k0j7j8K5O0L9L8M9J4kkN4N4Nl1J1M6M4Rmlnol1l2l2l2l
$$ 611 624 622 620 618 616 582 549 516 483 467 451 436 420 400 380 363 345 370 430 469 507 556 570 568 566 620 674 679 648 659 705 749 758 754 751 746 740 709 677 645 613 610
38F10kklJJJJK8K8M9J2l3l4l5l6K8K8J4k1l1LN3N2K8K9K6K5j6n3o6o5q1m6N2N3L2L3L1L1j9
$$ 610 608 606 603 604 605 606 607 635 663 712 724 691 657 622 586 614 642 656 635 604 607 660 712 740 769 795 820 804 751 685 620 539 493 545 598 630 663 694 725 706
33G06n5l4l4poppk4k4k5k4ppk7QM2M2M4M4K4K3M4Rk5k5k7k7j4j3j4j4k7k7m7j1llJ3M8R4N9
$$ 706 651 617 583 576 570 563 556 532 508 483 459 452 445 418 426 468 510 554 598 622 645 689 698 673 648 621 594 580 567 553 539 512 485 438 427 424 421 434 482 576 635
28F35j7n2n1n1l7kK5K5M7J2J5J4J5J4K4N9P2P2L6Jm8m8j2K3K3j2k5k5k7k7J2J2L2lRJ0PPj0
$$ 635 618 566 515 464 427 425 450 475 522 534 549 563 578 592 616 675 747 819 855 856 808 760 748 771 794 782 757 732 705 678 690 702 734 731 740 750 757 764 754
23G54j1j0j1j9k0k0j9J9K0L9Mm0l9m2m1k9k9o3lO2O2O5O6K2K1M0Mm7q3o3o4k7RN9O0N0N0J4
$$ 754 743 733 722 703 683 663 644 663 683 722 726 686 647 605 564 535 506 443 440 502 564 629 695 717 738 778 782 735 652 589 525 498 507 566 626 676 726 740
19G40J5m5m6m5m5JJN0Q5N6K0k8k9j6j6j6j6j1j2j2j1J2J2J2J2L7L7j3m7m0mM2M3j0m5k4k5
$$ 740 755 710 664 619 574 575 576 626 711 767 787 759 730 714 698 682 666 655 643 631 620 632 644 656 668 705 742 729 682 642 638 680 723 713 668 644 619
14F19j9j9j8j9L5L4L5L4J4J3J4J3k6k5k6k6qrNM0M8J2j3m8m2J8J01J00L1L0nnlll9l9l1l2
$$ 619 600 581 563 544 579 613 648 682 696 709 723 736 710 685 659 633 625 616 621 661 709 721 708 660 618 636 737 837 868 898 893 888 885 882 843 804 773 741
10G41l1l2j6j6K0P8Q1M5l0o4l2l1l4l4j5j4j5j4m4m3m4m3J8J9J8J9NMNNPPPPLLL8L8Q2Q1J0
$$ 741 710 678 662 646 666 744 825 870 840 776 744 713 679 645 630 616 601 587 543 500 456 413 431 450 468 487 492 496 501 506 513 520 527 534 537 540 578 616 698 779 789
5G89J1m3m3qpM0M1NNqpK8K7K3K3m8m9j2j3m8m8k4k4k4k4j9k0k0j9J8J9J9J9K4K5K4K5qqpq
$$ 789 800 757 714 706 699 739 780 785 790 782 775 803 830 853 876 828 779 767 754 706 658 634 610 586 562 543 523 503 484 502 521 540 559 583 608 632 657 649 641 634 626
0F26l2l2l2l2l1l2M0M0JKL7L7N4N5j6j6k6k6RJ0k4k3n8n9j5j6N5N5R6R5N8jp0p0n8k3J7J7
$$ 626 594 562 530 498 467 435 475 515 516 518 555 592 646 701 685 669 643 617 626 636 612 589 531 472 457 441 496 551 647 742 800 799 729 659 601 578 595 612
-5F12Ml2k5k6M1M2J9j7MLPPQPm1m1n8k3M1P8N7N7J7j8KKJKJ9j6l7p1p2l6NM1K3K2L0K9K8K7
$$ 612 616 584 559 533 574 616 635 618 622 625 632 639 647 654 613 572 514 491 532 610 667 724 741 723 725 727 728 730 749 733 696 625 553 517 522 563 586 608 638 667 695 722
-10G22K2j4o3o2p0l5J7J6jjk1J4K5K5K8K7llllk3k4k1k2K1N6L5L4j2m6m7j2L3L3J9j6l7l6
$$ 722 744 730 667 605 535 500 517 533 532 531 510 524 549 574 602 629 626 623 620 617 594 570 549 527 548 604 639 673 661 615 568 556 589 622 641 625 588 552
-15E52QM4L5k4m4rL1L0L3L3K1K1K1K1nonoj7j8j5j5k0J5nmJ2J2J2J2j1j1j1j1k4k3l8p2n4
$$ 552 560 604 639 615 571 562 593 623 656 689 710 731 752 773 768 762 757 751 734 716 701 686 666 681 676 672 684 696 708 720 709 698 687 676 652 629 591 519 465
-20D65j9L0L0J7J6J6J6J2J2k4k3m3m3j7M2N8N8K3j2k5k6J0M5M9J5kjL1no4o5m3pk7k7k0k0
$$ 465 446 476 506 523 539 555 571 583 595 571 548 505 462 445 487 545 603 626 614 589 563 573 618 667 682 680 679 710 705 641 576 533 526 499 472 452 432
-24D32k0k0M9M8M8M8J5J5J3J2j3m8m8j3L1L1ll9m0nRRk0j9l9lN2N2N5N5J3J3L3krrj1j1k0
$$ 432 412 392 441 489 537 585 600 615 628 640 627 579 531 518 549 580 577 538 498 493 502 511 491 472 433 430 482 534 589 644 657 670 703 701 692 683 672 661 641
-29F41k0j9k0m6m6m7m6K4K4K4K4K3K3K4l6n8k2J4J3k8k9k9k8J2J3J3J3J2J3J3J3M6M6M4M4
$$ 641 621 602 582 536 490 443 397 421 445 469 493 516 539 563 527 469 447 461 474 446 417 388 360 372 385 398 411 423 436 449 462 508 554 598 642
-33F42Qk8qqj5j6Nl1l8l8m0m0J8J7lL3N5N5P7M2j3j2j4j5lmlmL2L2Qn1n4j7oon0m9J0RJ0J0
$$ 642 650 622 614 606 591 575 580 549 511 473 433 393 411 428 425 458 513 568 645 687 674 662 648 633 630 626 623 619 651 683 691 640 586 569 563 557 507 458 468 477 487 497
-38D97k6k6J9J8N4N4K3K3l6l6k1k2J4J4k8k9k8k8J1J1M6M7O2O3J3m6o4o5l2l3k5k5k6k5L3
$$ 497 471 445 464 482 536 590 613 636 600 564 543 521 535 549 521 492 464 436 447 458 504 551 613 676 689 643 579 514 482 449 424 399 373 348 381
-43C81L4L3L4J2J3J3J3k9k8k9k9N2N1N1N1m3m3m3m3M9M8M9M9PQPQkjkjo1o1p7m1J2P1O1K4
$$ 381 415 448 482 494 507 520 533 504 476 447 418 470 521 572 623 580 537 494 451 500 548 597 646 653 661 668 676 674 673 671 670 609 548 471 430 442 513 574 598
-47E98j1j1j4j4k8k8k9k8PPPPlklkk4k4N9N8O6O5j7j7l1l0o5o6m4m4J4J5M5M4kl7m5K6N5N5
$$ 598 587 576 562 548 520 492 463 435 442 449 456 463 460 458 455 453 429 405 464 522 588 653 636 619 588 558 493 427 383 339 353 368 413 457 455 418 373 399 454 509
-52E09nmnmJ7J8J7J8j2j1j2j2OOOPj4j4j3j4J4J3n8n8n0n0K1K1M1M1M2M1l0l0l0k9j%j%j2
$$ 509 504 500 495 491 508 526 543 561 549 538 526 514 520 526 532 539 525 511 498 484 498 511 453 395 345 295 316 337 378 419 461 502 472 442 412 383 382 382 381 381 369
-57C69j1j1j2k0k0k0k0O3O3O3O3l7l7l7l7j0rrj0%%j%K1K2K1K1J3J2J3J2K9L0K9K9k4k4k4
$$ 369 358 347 335 315 295 275 255 318 381 444 507 470 433 396 359 349 340 331 321 321 321 320 320 341 363 384 405 418 430 443 455 484 514 543 572 548 524 500
-62E00k4m1m0l9l8L7P3R3K2j0j0j5j4m6m5K5K5N4N4N0N0No5k5k6m4m4m4m5RRRRM2M2M2M2j2
$$ 500 476 435 395 356 318 355 428 521 543 533 523 508 494 448 403 428 453 507 561 611 661 666 601 576 550 506 462 418 373 382 391 400 409 451 493 535 577 565
-67E65j1j1j1LMLMJ6J7J7J7M8M8ll8n9o0PPl4o9o9l4RRRRM5J0m1m2J4J4J5J4J1J2J1J2K1K0
$$ 565 554 543 532 535 539 542 546 562 579 596 613 661 709 706 668 609 549 556 563 529 460 391 357 366 375 384 393 438 448 407 365 379 393 408 422 433 445 456 468 489 509
-72E09J8J9ml9k2k1k1n7l7l7kklkK8K7K7K8K1K2K1K1K2K1K2K1k5k5m6j0L6L5L7L8MMMMrrp
$$ 509 527 546 542 503 481 460 439 382 345 308 306 304 301 299 327 354 381 409 430 452 473 494 516 537 559 580 555 530 484 474 510 545 582 620 624 628 632 636 627 618 611
-77F11pn5k0K8K9rm4m5rK3K3k7o1p8p8NO4O9O9K2j4j4j3l6jM8M8k1k1j1j0j1j0K2K3K3K3L8
$$ 611 604 549 529 557 586 577 533 488 479 502 525 498 437 359 281 286 350 419 488 510 496 482 469 433 432 480 528 507 486 475 465 454 444 466 489 512 535 573
-81E73L8N6K1j2m7k9k9j4j4j4j3l4l3l3l3L2L1lmk9k9K9L0O9O9J0J0k2k1k2k2NMO3O3LKl2
$$ 573 611 667 688 676 629 600 571 557 543 529 516 482 449 416 383 415 446 443 439 410 381 410 440 509 578 588 598 576 555 533 511 516 520 583 646 649 651 619
-86F19l3k9k9OOJ4J3J3J3L3L3L1L1m3p8r2l3K1K0K5K4K2K2K2K2l1l1l1l1j0j1j0j1j0j0j1
$$ 619 586 557 528 534 540 554 567 580 593 626 659 690 721 678 600 508 475 496 516 541 565 587 609 631 653 622 591 560 529 519 508 498 487 477 467 456
-90D56j0K3K4K3K4j8j8j8j8L3L3L3L3n5n6n6n5L5L4L5L5N0N0K5l5o8o9m6J3O0O1K9K9RQk7
$$ 456 446 469 493 516 540 522 504 486 468 501 534 567 600 545 489 433 378 413 447 482 517 567 617 642 607 539 470 424 437 497 558 587 616 625 633 606
-95F06k7n3n4ONK6K5j0j1j6j6j6j6pqqqK1K0N6N5M8M8l4l5j8j8j7j8J9K0Ll1n6n7j9J7M5M5
$$ 606 579 526 472 478 483 509 534 524 513 497 481 465 449 442 434 426 418 439 459 515 570 618 666 632 597 579 561 544 526 545 565 568 537 481 424 405 422 467 512
-99E12Rk7k1k1k3k3k5k5rK6M8M9K6l4p3p4l7lK9L0K9K9J2k4nmJ2J1J1J2j4j3j3j3NNPOK3N7
$$ 512 521 494 473 452 429 406 381 356 347 373 421 470 496 462 389 315 278 275 304 334 363 392 404 380 375 371 383 394 405 417 403 390 377 364 369 374 381 387 410 467
-104D67L8L7L8L7N6J9l2o8o8l2K2N8L8k2m2m3J0J1K3j1k5k5J2M9M8J3j1j0l2LK9K8rm4n2n2
$$ 467 505 542 580 617 673 692 660 592 524 492 514 572 610 588 546 503 513 524 547 536 511 486 498 547 595 608 597 587 555 558 587 615 606 562 510 458
-109D58j9j9J7J8J7J8%jK0j5m1m1m1m1MM0J9K0K4K4K3K4J5J5J5J5qqqrk6k6k3k4l5%%l6l1
$$ 458 439 420 437 455 472 490 490 489 509 494 453 412 371 330 334 374 393 413 437 461 484 508 523 538 553 568 560 552 544 535 509 483 460 436 401 401 401 365 334
-114C34l1l3l3j9k0l7kO8J04J06P0J6J6J3J4MNKLk3n8l9l8k3k3k3k3j1j0rqM6Q2P9M4j0m5
$$ 334 303 270 237 218 198 161 159 227 331 437 507 523 539 552 566 570 575 577 580 557 499 460 422 399 376 353 330 319 309 300 292 338 420 499 543 533 488
-118D88k8k8k5k6k3k4nL1P9P9M0Nj1j0j8j7j7j7kkjkrqrrRRRRl0l0l0l0L7L7L4L5Kl3jL5O2
$$ 488 460 432 407 381 358 334 329 360 439 518 558 563 552 542 524 507 490 473 471 469 468 466 457 449 440 431 440 449 458 467 437 407 377 347 384 421 455 490 492 459 458 493 555
-123E55K6m7q3n6k0opj4j5j4j4J0RRJ0RJ0RJ0JJKJJ9J9J9J9J3J3L3kk4k4k6k6l6l7n6k1K4
$$ 555 581 534 451 395 375 369 362 348 333 319 305 315 324 333 343 352 362 371 381 382 383 385 386 405 424 443 462 475 488 521 519 495 471 445 419 383 346 290 269 293
-128B93K4K7K6K2K3K2K3J3J4J4J3j7j8j7j8J%%JM7M7O4K9j9n5l7l7m1m1o1k5pok4J2K6K5k2
$$ 293 317 344 370 392 415 437 460 473 487 501 514 497 479 462 444 445 445 445 446 493 540 604 633 614 559 522 485 444 403 342 317 310 304 280 292 318 343 321
-133C21n9o5o6j7J9J5J5J8J7J8J7L1O6O2K5k3k3j3j2j3j3NNNNNNNNj8j9j6j7K5N9M0M0L8L8
$$ 321 262 197 131 114 133 148 163 181 198 216 233 264 330 392 417 394 371 358 346 333 320 325 330 335 340 345 350 355 360 342 323 307 290 315 374 414 454 492 530
-138E30j3m9o3o3q3m8lL2L3ll6p1p0l6L6P2P4L9J9J9J7J8O7O8O4O4lo2k9k9rqqrk6k6k6k6
$$ 530 517 468 405 342 259 211 208 240 273 270 234 163 93 57 93 165 239 278 297 316 333 351 418 486 550 614 611 549 520 491 482 474 466 457 431 405 379 353
-142C53%%%%M2M1L9M0Rk7opk5k6o1o1o2o3j1K4M7M7J4J4L9L8L9L9M0M0Ml2m0nQRl3l3LKj6
$$ 353 353 353 353 353 395 436 475 515 524 497 491 484 459 433 372 311 249 186 175 199 246 293 307 321 360 398 437 476 516 556 560 528 488 483 491 500 467 434 437 439 423
-147D23j7j7j7LLLMj4j3j3j3J6J7J4J4kl7l7kK9K9L1L2K2K2K2K2qpqpm2m3o2k7j5j6JL6L1
$$ 423 406 389 372 375 378 381 385 371 358 345 332 348 365 379 393 391 354 317 315 344 373 404 436 458 480 502 524 516 509 501 494 452 409 347 320 305 289 290 326 357
-152C57nl9l9J5N1L1L1LMLLJ9J8L9Lj1j0j3j2j3j3j3j2k2k1k2k2j9j9m0lM3M4M6M6N0M9Jn9
$$ 357 352 313 274 289 340 371 402 405 409 412 415 434 452 491 494 483 473 460 448 435 422 409 397 375 354 332 310 291 272 232 229 272 316 362 408 458 507 508 449
-157D49n7n7k3k3RM4K4K5ppopLK%%J6j9k0J6M7M7M9M9kjJ9j7n0n0n2n2poooJ2J2J1J2K1K1
$$ 449 392 335 312 289 298 342 366 391 384 377 371 364 367 369 369 369 385 366 346 362 409 456 505 554 552 551 570 553 503 453 401 349 342 336 330 324 336 348 359 371 392 413
-162D13M1Oj6j5j8j8j0j1j0j0K3K2K3K3l1l2OM1P0L5kjm8m7m7m7k2k1k1k2MMNMK1K2K2K2q
$$ 413 454 460 444 429 411 393 383 372 362 352 375 397 420 443 412 380 386 427 497 532 530 529 481 434 387 340 318 297 276 254 258 262 267 271 292 314 336 358 350
-167C50qqpmlN2N2K0l8o2o2qK8M4M3O8O7K9pl8l8m0m0l5l5%Jj3j2K4O0M3Pk9k9llmlM4M5M4
$$ 350 342 334 327 323 320 372 424 444 406 344 282 274 302 346 389 457 524 553 546 508 470 430 390 355 320 320 321 308 296 320 380 423 430 401 372 369 366 362 359 403 448 492
-172D92M5M7M8j4m8k8POl0l1l1l3l3k2k2k2k1J9K0J8J7J2k3k4J2K0J9K2K1m0m1l8l8nL0J0
$$ 492 537 584 632 618 570 542 549 555 525 494 463 430 397 375 353 331 310 329 349 367 384 396 373 349 361 381 400 422 443 403 362 324 286 281 311 321
-176C21J1J4J5J5J5%%%JJ0J0L0nk9l0K5K5J6k0l5l6PPNMk0n6n6k0L7L7L7L7j0m6k3k3jL4J5
$$ 321 332 346 361 376 391 391 391 391 392 402 412 442 437 408 378 403 428 444 424 389 353 360 367 372 376 356 300 244 224 261 298 335 372 362 316 293 270 269 303 318
-181C18J4JKJKk5k5k5k6KKLMK8O4M3M4RRK9oj9j9k2k1oppoppopK3K2K3K2K3K2K3K2NONNk8
$$ 318 332 333 335 336 338 313 288 263 237 239 241 244 248 276 340 383 427 436 445 474 468 449 430 408 387 381 374 367 361 354 347 341 334 357 379 402 424 447 469 492 514 519 525 530 535 507
-187E07k8k8k8l8l8K2N7O2K6l3l2l2MM0M1M8J4k6k6lkklMMn2n3l7kL7L7J8J7J7J8K7K7K5K5
$$ 507 479 451 423 385 347 369 426 488 514 481 449 417 421 461 502 550 564 538 512 509 507 505 502 506 510 458 405 368 366 403 440 458 475 492 510 537 564 589 614
-192F14l8p4n4n4J8J8N3N3J3J2m3m2k5L5N7K2j7j7j9k0l0l1l0l1KKKKL4L3L3L4%Jl4l5o2o3
$$ 614 576 502 448 394 412 430 483 536 549 561 518 476 451 486 543 565 548 531 512 492 462 431 401 370 372 374 376 378 412 445 478 512 512 513 479 444 382 319
-196C19llj2j2j2j3K9K9K8K9mmlmJ9J9K0J9J9K0J9J9J6J5J6J5POPOj8j9j9j9L1L1L2L1n1n1
$$ 319 316 313 301 289 277 264 293 322 350 379 375 371 368 364 383 402 422 441 460 480 499 518 534 549 565 580 587 593 600 606 588 569 550 531 562 593 625 656 605 554
-201E54n1n1l0l1l0l0l2l1l2l2JJJJL4L3L4L3JKJJnnnnnmnnL6L6L7L6o1o1k6k6L1L1k8k8k3
$$ 554 503 452 422 391 361 331 299 268 236 204 205 206 207 208 242 275 309 342 343 345 346 347 342 337 332 327 322 318 313 308 344 380 417 453 392 331 305 279 310 341 313 285 262
-206B62k4J2J2L7L6JJK3K3K4K3M0M1N8K3k9o4m4m5RM3M4Qm3m3m6m5%%J%jjl5l4m3rN3N2K5
$$ 262 238 250 262 299 335 336 337 360 383 407 430 470 511 569 592 563 499 455 410 419 462 506 514 471 428 382 337 337 337 338 338 337 336 301 267 224 215 268 320 345
-211C45j0k6k6qpqqJ6J7J6J7K2K3K2K2k7k8k8k8j9j9j6j7k4J2J1k4ONMLj1j1j1j2jjk3J2J2
$$ 345 335 309 283 275 268 260 252 268 285 301 318 340 363 385 407 380 352 324 296 277 258 242 225 201 213 224 200 206 211 215 218 207 196 185 173 172 171 148 160 172
-216A72k3JJL8P3P2L6kl7j9k0k0j9j8j7J0M6M4Ql3o8o7l2J6P6O4K9J3J2M4M4N6K1j9j8j1j1
$$ 172 149 150 151 189 262 334 370 368 331 312 292 272 253 235 218 228 274 318 326 293 225 158 126 142 218 282 311 324 336 380 424 480 501 482 464 453 442
-221D42j0j1m1m1m1m0NNLLJ4k1k4J2kl8m9m9pK8O8O7N5N5L9Ml8l8k5J1K0K0K0J9%l5l6%J0
$$ 442 432 421 380 339 298 258 263 268 271 274 288 267 243 255 253 215 166 117 110 138 206 273 328 383 422 426 388 350 325 336 356 376 396 415 415 380 344 344 354
-226C54J0qK8O1O2K4j0k8k7ONJ1J1RRnm0p6p7j6K0%%j3j4j3j3RJ0K3N8M2Ol0l1K4K3K2K1p
$$ 354 364 356 384 445 507 531 521 493 466 472 477 488 499 508 517 512 472 396 319 303 323 323 323 310 296 283 270 279 289 312 370 412 418 388 357 381 404 426 447 440
-230D40m2m2pJ3J3L5%j5j6j7j8L2L2nm1m7j1K3K3L2ll9m0k9Pj2j1ML9L7Jk1n6n7k1L4P0N2
$$ 440 398 356 349 362 375 410 410 395 379 362 344 376 408 403 362 315 304 327 350 382 379 340 300 271 278 266 255 259 298 335 336 315 259 202 181 215 285 337
-235C37N2J4J4J4J4PPQPrqK3K3k4q3j03j04l4M9Q2M6k4k5J0RK9L0K7K8pm2k2k2j9k0k0j9J2
$$ 337 389 403 417 431 445 452 459 467 474 465 457 480 503 479 396 293 189 155 204 286 332 308 283 293 302 331 361 388 416 409 367 345 323 304 284 264 245 257
-240B57J2j0K6K4j2j0K7L7L7k0k0k6k6k4k5OM1K1K1L7L8N5K0l7p3n4n5l7l6%L6L5%l6l7J5
$$ 257 269 259 285 309 297 287 314 351 388 368 348 322 296 272 247 253 294 315 336 373 411 466 486 449 376 322 267 230 194 194 230 265 265 229 192 207
-244B07J5J5J5K9K9K9K9J5J5L5jl3l4l4l3OM1K1K1QQj2K4L1L2N3J8llonm8m7m7m7j6j5l4L
$$ 207 222 237 252 281 310 339 368 383 398 433 432 399 365 331 298 304 345 366 387 395 403 391 415 446 478 531 549 546 543 537 532 484 437 390 343 327 312 278 281
-249B81M6Q2O2O2Qk8j1j0l9p4p4l9j7j7l5%M8M8P0L5j0j0j5j5k1n6l7l7l0l0l0l0kk%%j6K0
$$ 281 327 409 471 533 541 513 502 492 453 379 305 266 249 232 197 197 245 293 363 398 388 378 363 348 327 271 234 197 167 137 107 77 75 73 73 73 57 77
-254G7L3L4N2J7k4n9l2LM1M0K5K5k9l0J6Q7Q7J6m8m8n3n3j2j1j2j1M2M1M2M2J2J2J2J3LMM
$$ 77 110 144 196 213 189 130 98 101 142 182 207 232 203 173 189 276 363 379 331 283 230 177 165 154 142 131 173 214 256 298 310 322 334 347 350 354 358
-258C58Lk5k6k6k6k9k8k9k9qrrrK6K6O1O1J1J2m3m4j1O0N5N5nonoK4K4K4K4l0k9l0k9m2m2
$$ 358 361 336 310 284 258 229 201 172 143 135 126 117 108 134 160 221 282 293 305 262 218 207 267 322 377 372 366 361 355 379 403 427 451 421 392 362 333 291 249
-263B49m2m3k9k8OPjjN8N8P8P9mmm3m3M0M0J6J7m3m3k7k7L2L2N7N6N2N2K5m6o5o5k3k4k4k4
$$ 249 207 164 135 107 113 120 119 118 176 234 312 391 387 383 340 297 337 377 393 410 367 324 297 270 302 334 391 447 499 551 576 530 465 400 377 353 329 305
-267C05k1k1L7L8nnm0m1J8J9J8J9j6j6j5j6J4J3k2k1ooN4N3lkllj7j6j7j7k2k2k3k2J9J9J9
$$ 305 284 263 300 338 333 328 288 247 265 284 302 321 305 289 274 258 272 285 263 242 236 230 284 337 334 332 329 326 309 293 276 259 237 215 192 170 189 208 227
-272B27J9k0k0k0k0lklkM6M6M6M6m3m3m2m3QPQPj0j0j0j0L3L4L4L4l2l1l1l1RJ0RJ0rqqql6
$$ 227 246 226 206 186 166 163 161 158 156 202 248 294 340 297 254 212 169 177 184 192 199 189 179 169 159 192 226 260 294 262 231 200 169 178 188 197 207 198 190 182 174 138
-277A38l5l1l0n1J7O2O1rqrrK6K6K5K6L5L4L4L5m3m2m3m2j3j3j4j3N9N8N9N8M8M9l5l4j1j2
$$ 138 103 72 42 -9 8 70 131 122 114 105 96 122 148 173 199 234 268 302 337 294 252 209 167 154 141 127 114 173 231 290 348 396 445 410 376 365 353
-282C53K4K4QRn1n0m3m4J6J6M0M0K1n0o1o1J7J7J3J3J2J3J2J2O7O7J0o1r6k5L1L1L5L5J5J5
$$ 353 377 401 409 418 367 317 274 230 246 262 302 342 363 313 252 191 208 225 238 251 263 276 288 300 367 434 444 383 287 262 293 324 359 394 409 424
-286D24J5J5kllkj9j9j9j9j5j5j6j5k2k2L8L7N7N7kkl7l7kjk6k5k5k5J7J8J7J8L5L5L5L6Q
$$ 424 439 454 452 449 446 444 425 406 387 368 353 338 322 307 285 263 301 338 395 452 450 448 411 374 372 371 345 320 295 270 287 305 322 340 375 410 445 481 489
-291D89RRRn6n6n6n6J1J2J2J2K0K1K1K0j1j2j1j1poopJ1J0m9m9l8l7lkK6K5rj0K1K2K1K1p
$$ 489 498 507 516 460 404 348 292 303 315 327 339 359 380 401 421 410 398 387 376 369 363 357 350 361 371 322 273 235 198 195 193 219 244 235 225 246 268 289 310 303
-296C03pppJ0J1J1J0J9J8J8J8k3k3k3k3J3J2J3J3J3J3J3J3j9j8j9j9J7J7m2m2j1j1K5K5m4
$$ 303 296 289 282 292 303 314 324 343 361 379 397 374 351 328 305 318 330 343 356 369 382 395 408 389 371 352 333 350 367 325 283 272 261 286 311 267
-300B67m3J6J6l1l1o6o6jkjjJ9J8J9J9J9J9J9J8J6J7J6J6PPPQJ3J4J4J4k5k6m5j0K7K7K6K7
$$ 267 224 240 256 225 194 128 62 61 59 58 57 76 94 113 132 151 170 189 207 223 240 256 272 279 286 293 301 314 328 342 356 331 305 260 250 277 304 330 357
-305C57Rk6p4p5l6%k1k0J8J9J8J9L2L1L0L0k5o1n8k3K1N7L6L7Pk8NM0M7J1l8l7j5j4m8m8l6
$$ 357 366 340 266 191 155 155 134 114 132 151 169 188 220 251 281 311 286 225 167 144 165 222 258 295 302 274 279 319 366 377 339 302 287 273 225 177 141
-310A41%M8M8N6K0n4r0n4NM1M0J4J4M7M7M7J2l9l9j0j0j1j0k0k0n2n1l3K7O2O1P3L8j3j4k4
$$ 141 141 189 237 293 313 259 169 115 120 161 201 215 229 276 323 370 382 343 304 294 284 273 263 243 223 171 120 87 114 176 237 310 348 335 321 297
-314B97k4k5k4J0J1J0J1J9J9J7J7Jl4l2LL8P3N3N4j2m7k8k7J9K0J7J7L6Jn0n1m2m2l9m0j6
$$ 297 273 248 224 234 245 255 266 285 304 321 338 339 305 273 276 314 387 440 494 482 435 407 380 399 419 436 453 489 490 440 389 347 305 266 226 210
-318B10K0%%K7K7K8K7L2L3j7n1m3pM1M1LKKLk3k3k2k3pqppK0K0K0K0K3K3j2j2l5l4J6N2M7
$$ 210 230 230 230 257 284 312 339 371 404 387 336 293 286 327 368 371 373 375 378 355 332 310 287 280 272 265 258 278 298 318 338 361 384 372 360 325 291 307 359 406
-323D06M8jl7n5n5k0k0J0M6N8N9K7qk3k3K2K3Ok8m2m1o2k6J3M8N1J6nmK9K8M4M3pm3o5o6l0
$$ 406 454 453 416 361 306 286 266 276 322 380 439 466 458 435 412 434 457 463 435 393 352 290 264 277 325 376 392 387 383 412 440 484 527 520 477 412 346 316
-328C16l0lL2L2lj1j0j3j3j9j9n2n2n3j7J1M7L6Jm3m3k9N4R6O0L5jl3o7q3m8JJM1M0M0M1K9
$$ 316 286 283 315 347 344 333 323 310 297 278 259 207 155 102 85 96 143 179 180 137 94 65 119 215 275 310 309 276 209 126 78 79 80 121 161 201 242 271
-333B71K9k1n7k3k3k5k5l1l1k7k7n4MQ8R0O4O4K8K9j3j4j3j4LKKKlllllmllj2j2j2j3M2M2
$$ 271 300 279 222 199 176 151 126 95 64 37 10 -44 -40 48 138 202 266 294 323 310 296 283 269 272 274 276 278 275 272 269 266 263 259 256 253 241 229 217 204 246 288
-338B88OOl8l8L3L3K0K0K0K1m2m2m2m2j2j3j2j3O4O4O2O2k7o2p8j8%l4l1Mnmklqrp9p9p8p9
$$ 288 294 300 262 224 257 290 310 330 350 371 329 287 245 203 191 178 166 153 217 281 343 405 378 316 238 220 220 186 155 159 154 150 148 145 137 128 49 -30 -108 -187
-343a87L9M0O8O7L2L3M2M2M2M2K7K7K7K7n0n0m9n0j0j1j0j1k5k5M2M2On3q7q6l6K4O1O1P3
$$ -187 -148 -108 -40 27 59 92 134 176 218 260 287 314 341 368 318 268 219 169 159 148 138 127 102 77 119 161 167 114 27 -59 -95 -71 -10 51 124
-347A24P3L6k3l0k9L8L8O3O3K8K7k5k4k3k2k5J1rrppop%%%JMNNMo6o6j5K1M7M7%l5p8m3L3
$$ 124 197 233 210 180 151 189 227 290 353 381 408 383 359 336 314 289 300 291 282 275 268 262 255 255 255 255 256 260 265 270 274 208 142 127 148 195 242 242 207 129 86 119
-352A19O8L3L3L3L3K3j3j7J9J9m0r5o0JJLLM0M0M0M0j0j0j0j0K7K7K5K5J8j8o6o7j9J7ml%
$$ 119 187 220 253 286 319 342 329 312 331 350 310 215 155 156 157 160 163 203 243 283 323 313 303 293 283 310 337 362 387 405 387 321 254 235 252 248 245 245
-357B45J%Jl9l8n9k3L4L4L6L6QRRRl5l5k1J4L8Lm5m6p0o8k1J4rm5k0L9P2P3K7j0%jklK0J9
$$ 245 246 246 247 208 170 111 88 122 156 192 228 236 245 254 263 228 193 172 186 224 227 182 136 66 -2 -23 -9 -18 -63 -83 -44 28 101 128 118 118 117 115 112 132 151
-362A51J8J8j6n1l1l1l9l7l8l9KKL6L5M8J3l8l7K0J8K0K0K4K4K4K4k6k6k6k6popoM6M5M4M4
$$ 151 169 187 171 120 89 58 19 -18 -56 -95 -93 -91 -55 -20 28 41 3 -34 -14 4 24 44 68 92 116 140 114 88 62 36 29 23 16 10 56 101 145 189
-366A89N6K0j8j9L1L0onk5k6n9n9j3K2L8L8N1N0O9L3Rk6o8o8l6l5o7o7n2PL0nk2J1M8M9N3
$$ 189 245 265 247 228 259 289 283 278 253 227 168 109 96 118 156 194 245 295 364 397 406 380 312 244 208 173 106 39 -13 -6 24 19 -3 8 56 105 158
-371A58N2N0N1ll8j6j6K2N7N8K2rrj1j0l8l7l8l7n5n4n2n1j2K3O1O0O7L0qqJ5J5L6jj7j8j9
$$ 158 210 260 311 308 270 254 238 260 317 375 397 388 379 368 358 320 283 245 208 153 99 47 -4 -16 7 68 128 195 225 217 209 224 239 275 274 257 239 220
-375B20k0nnnnJ1J1J1J1L7L8L5L5k2n8l7l8MNMMl8l8l6l6j8J8kkJ3J3J3J2K1K1Ol1p0p0J1
$$ 220 200 195 190 185 180 191 202 213 224 261 299 334 369 347 289 252 214 218 223 227 231 193 155 119 83 65 83 81 79 92 105 118 130 151 172 178 147 77 7 18
-380A8J0K1K1l5l4k6L1Q2Q2O0O1K5K5J0J0m9m9m9m9J0J0j6j6K0K0J%l5l4n0n0RJ0N5N5k8k8
$$ 18 28 49 70 35 1 -25 6 88 170 230 291 316 341 351 361 312 263 214 165 175 185 169 153 173 193 194 194 159 125 75 25 34 44 99 154 126 98
-385I8l6l5j%K2K2N8N8mllmjjjkPOOOOOPOrj0rr%j%%J0J1J1J0mmnmj4j4j4j4PPOPj%jjJ4J3
$$ 98 62 27 26 26 48 70 128 186 182 179 176 172 171 170 169 167 174 180 186 192 198 204 211 217 208 198 189 180 180 179 179 179 189 200 211 221 217 213 208 204 190 176 162 148 155 162 168 175 174 174 173 172 186 199
-391A99J3J4m7m6JN9P8M2po6p5p4mN4L2L2L6L6J9K0j7j6j4j3p3p3l4l4M8M9J1J1m8m8LLLL
$$ 199 212 226 179 133 134 193 271 313 306 240 165 91 87 141 173 205 241 277 296 316 299 283 269 256 183 110 76 42 90 139 150 161 113 65 68 71 74 77
-396G7nok5J1N5N6%q2r2n8J%J0J1J0J1J8J8P5P5N1J6%%J1J1k5k4j9k0J7J6L2L1nm1n2j8M3
$$ 77 72 66 41 52 107 163 163 81 -11 -69 -68 -68 -58 -47 -37 -26 -8 10 85 160 211 227 227 227 238 249 224 200 181 161 178 194 226 257 252 211 159 141 184
-401A84P8Q5K5m7q3q2m6k9NN7N6M3Pj3j2j3j2k6J0M6M7ll7n4n3k2k1J3J4K8K8nnL0O6M5j3
$$ 184 262 347 372 325 242 160 114 85 90 147 203 246 253 240 228 215 203 177 187 233 280 277 240 186 133 111 90 103 117 145 173 168 163 193 259 304 291
-405B91m9j3kkl8l7lkj5j6K4O0M9M9L6%k1k2J0Rnm0m1nkkJ%m0m0m0m0qpK9O5L2ll8l7J1M7
$$ 291 242 229 227 225 187 150 147 145 130 114 138 198 247 296 332 332 311 289 299 308 303 263 222 217 215 213 214 214 174 134 94 54 46 39 68 133 165 162 124 87 98 145
-411A45M8J1j4j4j6j7RQj1K4L6L7L8L9j3j2j3j2J9K0K0K0%jj%m5m5m4m5k8k7k8k7K3K2K3K3
$$ 145 193 204 190 176 160 143 152 160 149 173 209 246 284 323 310 298 285 273 292 312 332 352 352 351 350 350 305 260 216 171 143 116 88 61 84 106 129 152
-415A52J6J6J7J6K3K3Pk8m5m5qK8K8K8L0L1pprrll9k0j9oopoKLLKj0j0rqJ4N0M9J5J4J5J1
$$ 152 168 184 201 217 240 263 270 242 197 152 144 172 200 228 258 289 282 275 266 257 254 215 195 176 170 164 157 151 153 156 159 161 151 141 132 124 138 188 237 252 266 281 292
-420B92J0Ol0k9Oj1j1rrL9L9J3m6j00j00p7j9OOJ0J0L6L6JJooL3O8J00R9L7Kj3m9o4o5m1o
$$ 292 302 308 278 249 255 244 233 224 215 254 293 306 260 160 60 -17 -36 -30 -24 -14 -4 32 68 69 70 64 58 91 159 259 358 395 397 384 335 271 206 165 159
-425A59RRJ9J8j7j8j4j5j4j4JKK2j4m7m6m8m9J6J6J9J9N3J11R5N9Mn5k4k4j4j4j2j2J0M6N9
$$ 159 168 177 196 214 197 179 165 150 136 122 123 125 147 133 86 40 -8 -57 -41 -25 -6 13 66 177 272 331 335 280 256 232 218 204 192 180 190 236 295
-430B95%n9o0j5J9K4l5p0p0kkkkL5L5L5L5j1j0j0j0j1j0j0j1L6L7L6L6j7j8j7j7JJ%JM2M2
$$ 295 295 236 176 161 180 204 169 99 29 27 25 23 21 56 91 126 161 150 140 130 120 109 99 89 78 114 151 187 223 206 188 171 154 155 156 156 157 199 241
-434B41M2M2l8l8l8l7o1o1k5L4O2K7k0k1l1l2l1l1J8J9J9J9M9M8M9M9ppopN8N9N8N8l0l1l1
$$ 241 283 325 287 249 211 174 113 52 27 61 123 150 130 109 78 46 15 -16 2 21 40 59 108 156 205 254 247 240 234 227 285 344 402 460 430 399 368
-439C68l1NNo6o6o6o5ONJ5J4J5J4J3J2J3J2J3J2J3J2j5j6j6j5m5m5m5m5qpqqk6k5k6k5L6L7
$$ 368 337 342 347 281 215 149 84 90 95 110 124 139 153 166 178 191 203 216 228 241 253 238 222 206 191 146 101 56 11 3 -4 -12 -20 -46 -71 -97 -122 -86 -49
-444d9L7L6N4N4N5N4k7k7k7k8j8j9N3N2L2L1l9m0k4k5k5k5RQRQL8L8L8L8JJKJk8k8k8k8j6
$$ -49 -12 24 78 132 187 241 214 187 160 132 114 95 148 200 232 263 224 184 160 135 110 85 94 102 111 119 157 195 233 271 272 273 275 276 248 220 192 164 148
-449A48j6j6j6K5K6K5K6l5l5o8rN1N1j6j6j1j2j1j1J4J4J5J4lkkkklkkL4L3L4L4MMMNOOPO
$$ 148 132 116 100 125 151 176 202 167 132 64 55 106 157 141 125 114 102 91 80 94 108 123 137 134 132 130 128 126 123 121 119 153 186 220 254 258 262 266 271 277 283 290 296
-454B96j6j5j6j6L7L6Jn8q6n0mlL3L3L2L3K8K8po5q8l0N2N2j5j5j6j5n7n7n3n4l0K9O3O2J7
$$ 296 280 265 249 233 270 306 307 249 163 113 109 106 139 172 204 237 265 293 286 221 133 103 155 207 192 177 161 146 89 32 -21 -75 -105 -76 -13 49 66
-458F6m2o4o6m5rN3N3M4M3M5M4j%%%l8l8K0J9K6j0j1K3J8j8MMonK8K7M4Qn2n2k0J6K9K9J4
$$ 66 24 -40 -106 -151 -160 -107 -54 -10 33 78 122 121 121 121 121 83 45 65 84 110 100 89 112 130 112 116 120 114 109 137 164 208 216 164 112 92 108 137 166 180
-463A80k1n8n7j3K2LLKKL5L5J6k1n7n7JL6J6J6MMLMJ8J8Ml1m4rK8K8J9J9J9J9J6J7Kl2o8l2
$$ 180 159 101 44 31 53 56 59 61 63 98 133 149 128 71 14 15 51 67 83 87 91 94 98 116 134 138 107 63 54 82 110 129 148 167 186 202 219 221 189 121 89
-468H9K8K8j%jjj0j1j1j0J6J6mL1N2N3rm3l9l9nnk6k7k6k6OONOJ5J4J5J4J5J4J5J4J%JJ%J
$$ 89 117 145 144 144 143 142 132 121 110 100 116 132 128 159 211 264 255 212 173 134 129 124 98 71 45 19 25 31 36 42 57 71 86 100 115 129 144 158 159 159 160 161 161 162
-474A62%JPPj2K3JJLLj9j8l3p0n5n5JJPPk6k5l1NM6Q0Q2M6j4j5j8j9J8N4N7K2j9n5j02j02
$$ 162 162 163 170 177 165 188 189 190 193 196 177 159 126 56 1 -54 -53 -52 -45 -38 -64 -89 -120 -115 -69 11 93 139 125 110 92 73 91 145 202 224 205 150 48 -54
-479e4q9n3j%L8L7N0N0j2m9k6k7QM3O3K6J4J3P5P5M9j0j1j1j3j2k7RJ1k4j6J9N6N6%Jl3l3
$$ -54 -143 -196 -197 -197 -159 -122 -72 -22 -34 -83 -109 -136 -128 -85 -22 4 18 31 106 181 230 220 209 198 185 173 146 155 166 142 126 145 201 257 257 258 225 192
-483A92nK9M6M5RRM5M4j5j4j5j4m9m9m9m9n6n5NM0M9J4k3k3l4l4j9J7RRJ2J1PPj5K0K4j2J0
$$ 192 187 216 262 307 316 325 370 414 399 385 370 356 307 258 209 160 104 49 54 94 143 157 134 111 77 43 24 41 50 59 71 82 89 96 81 101 125 113 123
-488A23J0j9j9l9mlkj%J3J3qK9M0M1o4o4o3o3nnM4M4M3M4O6O6PPk9k9k9k9J4J4J4J3MLn6n6
$$ 123 133 114 95 56 52 49 47 46 46 59 72 64 93 133 174 110 46 -17 -80 -85 -90 -46 -2 41 85 151 217 224 231 202 173 144 115 129 143 157 170 174 177 121 65
-493F5p3p5L2L2M7M7l5p0n7LP3P2J1J1J1J1mlllJ4J3J4J4rj0rrn3n2k8K9P4L9k1k0j4j4j3
$$ 65 -8 -83 -51 -19 28 75 40 -30 -87 -84 -11 61 72 83 94 105 101 98 95 92 106 119 133 147 138 128 119 110 57 5 -23 6 80 119 98 78 64 50 37
-498C7j4JKKJO1O1O0O1J7J7J7J8k7k6q5j21r6l9L3L2L4L4L4L4J5J4J4J4n0n0n0n1k6k7k4k4
$$ 37 23 24 26 28 29 90 151 211 272 289 306 323 341 314 288 203 82 -14 -53 -20 12 46 80 114 148 163 177 191 205 155 105 55 4 -22 -49 -73 -97
-502i7J3P2P3P4K1K1l8l8m8m7J1J2J8J9J9J9qqpqJ0J0m7m6o2k6J3M8L7j9q6q6m1M2P4L9JK
$$ -97 -84 -12 61 135 156 177 139 101 53 6 17 29 47 66 85 104 96 88 81 73 83 93 46 0 -62 -88 -75 -27 10 -9 -95 -181 -222 -180 -106 -67 -66 -64
-507f4L5L4N3N3L7Km5m6j0K4J3k2l6l5j4j4j5j4JJJJK2K2N6N7O2O2K2j3%%J7j7n3n2j5K0K1
$$ -64 -29 5 58 111 148 150 105 59 49 73 86 64 28 -7 -21 -35 -50 -64 -63 -62 -61 -60 -38 -16 40 97 159 221 243 230 230 230 247 230 177 125 110 130 151
-512A51K0Qk8m0m0J7J6J6J6oL0Rk6mmj5j5j5j5opoopommJ2M7M8J2k4k4k5k4k9PM5M6K9K9K7
$$ 151 171 179 151 111 71 88 104 120 136 130 160 169 143 139 135 120 105 90 75 69 62 56 50 43 37 33 29 41 88 136 148 124 100 75 51 22 29 74 120 149 178 205
-517B05K7k9o4o3k6L4P0N0N0K4j1j2K4L5L5k1k2j%%%m0m1o0k4NNPPjkjkJ2J1L2mqrj0j1nn
$$ 205 232 203 139 76 50 84 154 204 254 278 267 255 279 314 349 328 306 305 305 305 305 265 224 164 140 145 150 157 164 163 161 160 158 170 181 213 209 201 192 182 171 166 161
-522A61J0M5M6M6Qk6k0j9k1k1j6j7j6j6OPOPJ7J7J8J7j5j6J8J7Pk8q7q7q6k8K2K2nonoK6K4
$$ 161 171 216 262 308 316 290 270 251 230 209 193 176 160 144 150 157 163 170 187 204 222 239 224 208 226 243 250 222 135 48 -38 -66 -44 -22 -27 -33 -38 -44 -18 6
-527FML9L8MK5K6JKJKm7m6l4KM1Ml0k9J3M9M9J4l1l1l0l1KL7J7J8j3j3LL8N3N4pm2m4m5j1
$$ 6 10 49 87 91 116 142 143 145 146 148 101 55 21 23 64 68 38 9 22 71 120 134 103 72 42 11 13 50 67 85 72 59 62 100 153 207 200 158 114 69 58
-532E8j1LKKLLMLMk3k3k3k2opooK6K5N9N9N8K2j7j7m0m0l7l8J6N2K9L0j6n2k9l0J5N1L1L0
$$ 58 47 50 52 54 57 60 64 67 71 48 25 2 -20 -26 -33 -39 -45 -19 6 65 124 182 204 187 170 130 90 53 15 31 83 112 142 126 74 45 15 30 81 112 142
-537A42J%J%m0m1m0l9RRJ0RmnnnJ0J0RJ0OOK6rl8l6jL4M2M2QRRRM4M4N7N6J8j8j1j2Pk9o0
$$ 142 143 143 144 144 104 63 23 -16 -7 2 12 21 17 12 7 2 12 22 31 41 47 53 79 70 32 -4 -5 29 71 113 121 130 139 148 192 236 293 349 367 349 338 326 333 304 244
-542B44o1k3J2K9L0mnl7l8l8l7m4m4o4k9K3K3M1P5P5P5J8J8PQl0o5n3j8mml2l2MMnnnnl0l1
$$ 244 183 160 172 201 231 227 222 185 147 109 72 28 -16 -80 -109 -86 -63 -22 53 128 203 221 239 246 254 224 159 106 88 84 80 48 16 20 24 19 14 9 4 -26 -57
-547e7l1l1L7L7L7L6M1M1L8L8lo2k9k8n0m8p0l3K5K6K8K9J1J2J1J1LLLKk4k3k4k4l1l1nN4
$$ -57 -88 -119 -82 -45 -8 28 69 110 148 186 183 121 92 64 14 -34 -104 -137 -112 -86 -58 -29 -18 -6 5 16 19 22 25 27 3 -20 -44 -68 -99 -130 -135 -81
-552h1Q3Q3M6J1qm4m5j0K7K7K9K9rrrrnmnnK2K2J9K0J6k0J%L7L6L7L7qppqm0l9m0m0n7n8p6
$$ -81 2 85 131 142 134 90 45 35 62 89 118 147 138 129 120 111 106 102 97 92 114 136 155 175 191 171 172 172 209 245 282 319 311 304 297 289 249 210 170 130 73 15 -61
-557f1m1k5k5m2pN5N6K0j5J0M5M2Pj7j6J6J6K4K5l3l2j6J9N8N8RRRRk2k2k2k2K3K2K0K0Ol0
$$ -61 -102 -127 -152 -194 -201 -146 -90 -70 -85 -75 -30 12 19 2 -14 2 18 42 67 34 2 -14 5 63 121 130 139 148 157 135 113 91 69 92 114 134 154 160 130
-562A30j0j0j2j2j3j2J%J%J%LLk0J5nnlllkjjlkJ9j6j7K0K4K4K6K7LLK4j2k8k8l1l0k1k2k0
$$ 130 120 110 98 86 73 61 62 62 63 63 64 64 67 70 50 65 60 55 52 49 46 44 43 42 39 37 56 40 23 43 67 91 117 144 147 150 174 162 134 106 75 45 24 2 -18
-568a8k2L3L2L3L3j7j8j7j7j5j5l5%O0O2K4j1j2j3j4j5QRQQL0L0M9J4j0j0j2j3mnmnNMMNk
$$ -18 -40 -7 25 58 91 74 56 39 22 7 -8 -43 -43 17 79 103 92 80 67 53 38 46 55 63 71 101 131 180 194 184 174 162 149 145 140 136 131 136 140 144 149 147
-573A47jjjk3k2pK8L4L4k1k1k8OK0K0Ll3p0o9m9j5JJJ2J2RRk4o0l8l8J4M9M9J3JJjjj9j9K1
$$ 147 146 145 144 121 99 92 120 154 188 167 146 118 124 144 164 167 134 64 -5 -54 -69 -68 -67 -55 -43 -34 -25 -49 -109 -147 -185 -171 -122 -73 -60 -59 -58 -59 -60 -79 -98 -77
-578g7N5N5N5M1Pn1n2j7j7LMMMJ1J0J1J0qqqqmmK9L0L8Kl6l6o6o7n0j3J8N4O8O7N1qn7n6q
$$ -77 -22 33 88 129 136 85 33 16 -1 2 6 10 14 25 35 46 56 48 40 32 24 20 16 45 75 113 115 79 43 -23 -90 -140 -153 -135 -81 -13 54 105 97 40 -16 -24
-583b4qqqj7j7J9P6R2N6no4p4p3opK2K1K2K0kko8o9l3K7O3O4O9O9kjj9j9k0j9l7l6l7l7JK
$$ -24 -32 -40 -48 -65 -82 -63 13 105 161 156 92 18 -55 -61 -68 -46 -25 -3 17 15 13 -55 -124 -157 -130 -67 -3 66 135 133 132 113 94 74 55 18 -18 -55 -92 -91 -89
-588h9JJJ1J1J1J1J9K0J9K0KKKKK2K3K2K3OPOOk0k0k0k0qqqqj7j7j5j7K0J9K0K0%jj%k6k6
$$ -89 -88 -87 -76 -65 -54 -43 -24 -4 15 35 37 39 41 43 65 88 110 133 139 146 152 158 138 118 98 78 70 62 54 46 29 12 -3 -20 0 19 39 59 59 58 57 57 31 5
-593Ek5k6J2J2J3J1POOPl7l8l8l7M4M5M4M5k4k4K4N8M9j0m6m5mnL1L2RRRRrrrrn3n1n3n2j4
$$ 5 -20 -46 -34 -22 -9 2 9 15 21 28 -9 -47 -85 -122 -78 -33 11 56 32 8 32 90 139 129 83 38 34 29 60 92 101 110 119 128 119 110 101 92 39 -12 -65 -117 -131
-599a31j4J00J00R6L7j%k0j9j9j9QPQQl1l1l1l0MLMMMMMMj7j6j6j5MNMLk1k3k3k2mnl9m0o2
$$ -131 -145 -45 55 151 188 187 187 167 148 129 110 118 125 133 141 110 79 48 18 22 25 29 33 37 41 45 49 32 16 0 -15 -11 -6 -2 1 -20 -43 -66 -88 -92 -97 -136 -176 -238
-604b38o3N6N5K1K1K1K1N4N3J6m2n3n3k2k1j8j7N4N3P0P0%jJ9K0J9J9n3n3n2n3llmlL7L6L7
$$ -238 -301 -245 -190 -169 -148 -127 -106 -52 1 17 -25 -78 -131 -153 -174 -192 -209 -155 -102 -32 38 38 37 56 76 95 114 61 8 -44 -97 -100 -103 -107 -110 -73 -37 0
-609@L6QRn8n9k6L3O9P1K2K3j3j3jjl7l6k7k6k7k6K7K7K6K7KJKJj3j3j2j3lkllJ2J2J1J2M6
$$ 0 36 44 53 -5 -64 -90 -57 12 83 105 128 115 102 101 100 63 27 0 -26 -53 -79 -52 -25 1 28 30 31 33 34 21 8 -4 -17 -20 -22 -25 -28 -16 -4 7 19 65
-614F5M6M5M6JKJJ%J%%K1K0K1K1m8m9m9m8n3n2n3n3j8j9N3N2qqqqj2j3j2j3j6j7j7j7j3j4
$$ 65 111 156 202 203 205 206 207 207 208 208 208 229 249 270 291 243 194 145 97 44 -8 -61 -114 -132 -151 -98 -46 -54 -62 -70 -78 -90 -103 -115 -128 -144 -161 -178 -195 -208 -222
-619b22N8N7O0O0K5K5m6m4j1j0OPOOl1l2l1l1K4K5K5K5qppqKJKJ%j%jJ4J4J5J4n1n1m6m6K3
$$ -222 -164 -107 -47 13 38 63 17 -27 -38 -48 -42 -35 -29 -23 -54 -86 -117 -148 -124 -99 -74 -49 -57 -64 -71 -79 -77 -76 -74 -73 -73 -74 -74 -75 -61 -47 -32 -18 -69 -120 -166 -212 -189
-624a89R3N4N3K7K6K6K6l0k9l0k9l2l2l1l2qqO2O3M7M8k3k3K7K6rrrqrrl1l2l2l1J0J1J1J0
$$ -189 -96 -42 11 38 64 90 116 86 57 27 -2 -34 -66 -97 -129 -137 -145 -83 -20 27 75 52 29 56 82 73 64 55 47 38 29 -2 -34 -66 -97 -87 -76 -65 -55
-629e5j6j5j6j6K7K7K7K6J2J2J2J2ONONmnnnp2p3m3K9O4O4kkk3k3J1J2%%nO5P2P2NNj6j7j7
$$ -55 -71 -86 -102 -118 -91 -64 -37 -11 1 13 25 37 43 48 54 59 55 50 45 40 -32 -105 -148 -119 -55 9 7 5 -18 -41 -30 -18 -18 -18 -23 42 114 186 191 196 180 163 146
-634A46j7j1j2m7m7l5l7L4L4L0L0norqrro9p0l9L2L4L4LLMLLLK8K6l8l9jO9J43J44K6m5p5
$$ 146 129 118 106 59 12 -23 -60 -26 8 38 68 63 57 48 40 31 22 -47 -117 -156 -124 -90 -56 -53 -50 -46 -43 -40 -37 -9 17 -21 -60 -61 8 151 295 321 276 201
-639B01p6p5p3l9l9J0J0J0J1M5M4M4M5m8m8m7m8j5j4N6N6P1P1%%l2l2l2l3N1N0M6M6J5n6q6
$$ 201 125 50 -23 -62 -101 -91 -81 -71 -60 -15 29 73 118 70 22 -25 -73 -88 -102 -46 10 81 152 152 152 120 88 56 23 74 124 170 216 231 175 89
-643H9q7l4l6J%L0L1onj2j1K3K3j1j2j1j2J1J1J1J0j2j2j1j1M1P6P4L9rm4k6k7MMLMRJ0K9
$$ 89 2 -32 -68 -67 -67 -37 -6 -12 -17 -29 -40 -17 6 -5 -17 -28 -40 -29 -18 -7 3 -9 -21 -32 -43 -2 74 148 187 178 134 108 81 85 89 92 96 105 115 144
-648A44oppj1j2j5n2l1l0k5k4k3k2J3M9K4K5Ln6m3pMMM0L9N9K5j2j2j5K1L6L6L4L5jjoooo
$$ 144 138 131 124 113 101 86 34 3 -27 -52 -76 -99 -121 -108 -59 -35 -10 -7 -63 -106 -113 -109 -105 -65 -26 33 58 46 34 19 40 76 112 146 181 180 179 173 167 161 155
-653A55qqqrooopl3l2l2l3RJ0RRK8K7N0J5mL1K9po0n9k3J2J6J6J8J8qqrqK2K3j5m9n9k2J4
$$ 155 147 139 131 122 116 110 104 97 64 32 0 -33 -24 -14 -5 4 32 59 109 124 120 151 180 173 113 54 31 43 59 75 93 111 103 95 86 78 100 123 108 59 0 -22 -8
-659hJ2J5J5J4J5K0K1%L6L5L4L4L4J1k4o1o1m0nL3L2M0Mn7n6k1J4K9L0K8K8J4k0n2j6J9J8
$$ -8 4 19 34 48 63 83 104 104 140 175 209 243 277 288 264 203 142 102 97 130 162 202 206 149 93 72 86 115 145 173 201 215 195 143 127 146 164
-663A64ll9j9j9l4l3l3l3nmk5J1L3L4L5L5J1J1M4M3N1J4k5o2n7k1J6J5k6k6k6k6OPOPooK8
$$ 164 161 122 103 84 50 17 -16 -49 -54 -58 -83 -72 -39 -5 30 65 76 87 131 174 225 239 214 152 95 74 90 105 79 53 27 1 7 14 20 27 21 15 43
-668D3K7M9J3k7o3m8j4K2K3K5K5K6K5j5j5j6j5l2l2l1l2m2m2oL1L2ll8l8J6N2O7O6M0L9K3
$$ 43 70 119 132 105 42 -6 -20 2 25 50 75 101 126 111 96 80 65 33 1 -30 -62 -104 -146 -152 -121 -89 -92 -130 -168 -152 -100 -33 33 73 112 135
-672A35j2m3m4l0NpoK8K8L1mJ5J6K6K6j3m9l3l3l3l2J7N2L3L3j0j0j0j0j0j0j0j0l2l4l3l3
$$ 135 123 80 36 6 11 4 -2 26 54 85 81 96 112 138 164 151 102 69 36 3 -29 -12 40 73 106 96 86 76 66 56 46 36 26 -6 -40 -73 -106
-677a06pppoj8j7j7j7l2l2MLL7L7k1k2J2J2M7M8PQk8k8N6N6N6N6j8j7j8j7PQk7k8j9j9O3O3
$$ -106 -113 -120 -127 -133 -151 -168 -185 -202 -234 -266 -262 -259 -222 -185 -206 -228 -216 -204 -157 -109 -102 -94 -122 -150 -94 -38 18 74 56 39 21 4 11 19 -8 -36 -55 -74 -11 52
-682E2M8M8j1j1l6l6l6l5j9j9j9j9k5k5k6k5J4J3J3J3K5K4K4K4J6J5J5J5J5J5J5J5noonJ9
$$ 52 100 148 137 126 90 54 18 -17 -36 -55 -74 -93 -118 -143 -169 -194 -180 -167 -154 -141 -116 -92 -68 -44 -28 -13 2 17 32 47 62 77 72 66 60 55 74
-686G4J8J9J9qqqql6l6l5l6OOOOm0m0J9J9K8K9ppJ3J3M4M4j3r5j00o6J1P0L9L9k2k1k2k2o
$$ 74 92 111 130 122 114 106 98 62 26 -9 -45 -39 -33 -27 -21 -61 -101 -82 -63 -35 -6 -13 -20 -7 6 50 94 81 -14 -114 -180 -169 -99 -60 -21 -43 -64 -86 -108 -114
-691a14opopoopL2L3L2L2L1L2L2L3NNMNNNNNm6m7m5m7m3m3m3m2k9k9J0M6L3L4%%k7k6k6k6
$$ -114 -120 -127 -133 -140 -146 -152 -159 -127 -94 -62 -30 1 33 65 98 103 108 112 117 122 127 132 137 91 44 -1 -48 -91 -134 -177 -219 -248 -277 -267 -221 -188 -154 -154 -154 -181 -207 -233 -259
-696b59NMMMK3K3K2K3N4N4qm4k6k6PQN0N1M8j1k1k3RRj4j5l4JL5L6%l4k2J4K7K7J5J6J6J5
$$ -259 -254 -250 -246 -242 -219 -196 -174 -151 -97 -43 -51 -95 -121 -147 -140 -132 -82 -31 17 6 -15 -38 -29 -20 -34 -49 -83 -82 -47 -11 -11 -45 -67 -53 -26 1 16 32 48 63
-701F3j7j6j7j6l6l5JL7N5J9j7j7J6J6j8j7RM4M5Rl3l3l3l2rK7OPk4k4k2k3o2k6L4L3Ll3j3
$$ 63 46 30 13 -3 -39 -74 -73 -36 19 38 21 4 20 36 18 1 10 54 99 108 75 42 9 -23 -32 -5 1 8 -16 -40 -62 -85 -147 -173 -139 -106 -103 -136 -149
-706a49j3qrK3K3K7l3q0q0n4j9llK6K7K7K7N6N5N6N5RJ0RRRQRRk5k6k4k4J6N1N1J5k8k9l0
$$ -149 -162 -170 -179 -156 -133 -106 -139 -219 -299 -353 -372 -375 -378 -352 -325 -298 -271 -215 -160 -104 -49 -40 -30 -21 -12 -3 5 14 23 -2 -28 -52 -76 -60 -9 42 57 29 0 -30
-711c0l1JKJKJ9J9J8K0QRml9p2l7J1J2LLLLk2k3M9M8K8K8opk1k2k2k2LKLKj3j3l5J%l5j3j3
$$ -30 -61 -60 -58 -57 -55 -36 -17 1 21 29 38 34 -5 -77 -114 -103 -91 -88 -85 -82 -79 -101 -124 -75 -27 1 29 23 16 -5 -27 -49 -71 -68 -66 -63 -61 -74 -87 -122 -121 -121 -156 -169 -182
-716a82j0j0rj0K3K2K3K3rqqqpok6J0L5L6L7L8J7J7J5J7KKKKk1k0n2n3o9j0P1P2J9m1k6QK6
$$ -182 -192 -202 -211 -221 -198 -176 -153 -130 -139 -147 -155 -163 -170 -176 -202 -192 -157 -121 -84 -46 -29 -12 3 20 22 24 26 28 7 -13 -65 -118 -187 -197 -126 -54 -35 -76 -102 -94 -68
-721f8K5qpl4l5J7N2L5L4L6L5N5K0rm5l8lJ1J0J3J2L3ll0l0l2l2l6l7l4l5j1K4P3P2O8L3j8
$$ -68 -43 -51 -58 -92 -127 -110 -58 -23 11 47 82 137 157 148 103 65 62 73 83 96 108 141 138 108 78 46 14 -22 -59 -93 -128 -139 -115 -42 30 98 131 113
-726A13j7k1k0j8j8K3N9N6K1j5n1l2l1lL2J3J2qrk9PL2L1l5l6k8QN5N4L1k8o3o4n1j6N8R5
$$ 113 96 75 55 37 19 42 101 157 178 163 112 80 49 46 78 91 103 95 86 57 64 96 127 92 56 28 36 91 145 176 148 85 21 -30 -46 12 107
-731A07P5M0rj0ooooJKk0J5J3k3o9o9l1LJ7J7J3k3p0p1J1M6K6K6K1K1K1K1j0j0rj0L6L6j5
$$ 107 182 222 213 203 197 191 185 179 180 182 162 177 190 167 98 29 -2 1 18 35 48 25 -45 -116 -105 -59 -33 -7 14 35 56 77 67 57 48 38 74 110 95
-735I5n0n8n8m5j0NMRRrK7OPlmlmK9K9K8K9J5J5J4J5K8K8k1n6m5rLMJKl3l4onooJ0J0J0J0
$$ 95 45 -13 -71 -116 -126 -121 -117 -108 -99 -108 -81 -75 -68 -71 -75 -78 -82 -53 -24 4 33 48 63 77 92 120 148 127 71 26 17 20 24 25 27 -6 -40 -46 -51 -57 -63 -53 -43 -33 -23
-741b3j8j8j8j8n3n3NOK7K7qqJ1J1k5k4n1n1L1L2K0K1j3j2K8O4P8J8n0n0K9K8L4L2kjk6k6
$$ -23 -41 -59 -77 -95 -148 -201 -196 -190 -163 -136 -144 -152 -141 -130 -155 -179 -230 -281 -250 -218 -198 -177 -190 -202 -174 -110 -32 -14 -64 -114 -85 -57 -23 9 7 6 -20 -46
-746d6RRK8K8K4K5K3l6q1q2m7J1N9N9O1K8k3q0p7j7K8K8L0L1no%%L4L5mnnml2l4l3l3K3K2
$$ -46 -37 -28 0 28 52 77 100 64 -17 -99 -146 -135 -76 -17 44 72 49 -31 -108 -125 -97 -69 -39 -8 -13 -19 -19 -19 15 50 46 41 36 32 0 -34 -67 -100 -77 -55
-750e5K2K3J0J2M7M7J1J1m9m8m0m1j5M3Q7Q8J9m0p3p1k7L2N5N6%Jk7k8k7k6RJ0J0J1p1p1p1
$$ -55 -33 -10 0 12 59 106 117 128 79 31 -9 -50 -65 -22 65 153 172 132 59 -12 -39 -7 48 104 104 105 78 50 23 -3 6 16 26 37 -34 -105 -176
-755a76p2M1M1L9L9L6JK1K2J7J9J7J7nm0j9k1NNK2j2o7j03j16n7J5N0N4J8OPO5J00R3N8om1
$$ -176 -248 -207 -166 -127 -88 -52 -51 -30 -8 9 28 45 62 57 17 -2 -23 -18 -13 9 -3 -70 -173 -289 -346 -331 -281 -227 -209 -203 -196 -131 -31 62 120 114 73
-759G3k2k2jl6m4ql1l0OOLMj4m9m8j4RRM4M4M6J0k7k6K6O2K9pNM0J8J8l8l7k3J3J3J5m1m2
$$ 73 51 29 28 -8 -52 -60 -91 -121 -115 -109 -106 -102 -116 -165 -213 -227 -218 -209 -165 -121 -75 -65 -92 -118 -92 -30 -1 -8 -3 37 55 73 35 -2 -25 -12 1 16 -25 -67
-764f7m9m9n0m9J2J2J2J2K8K9M9J3j8j8l8kO6J02J13N6k4o1m3m3rrrr%%%%RJ0J0RnoooJ9J8
$$ -67 -116 -165 -215 -264 -252 -240 -228 -216 -188 -159 -110 -97 -115 -133 -171 -173 -107 -5 108 164 140 79 36 -7 -16 -25 -34 -43 -43 -43 -43 -43 -34 -24 -14 -5 -10 -16 -22 -28 -9 9
-769IN2N3L4jm0m0m1m0noJ2J2J2J2nmmnm2m3J7N2N3J9j8j8m4m5o4k9M3M4M6M6MNNNrrj1j1
$$ 9 61 114 148 147 107 67 26 -14 -19 -25 -13 -1 11 23 18 14 10 5 -37 -80 -63 -11 42 61 43 25 -19 -64 -128 -157 -114 -70 -24 22 26 31 36 41 32 23 12 1
-775Aqm4k3k2j0K6NOk2k1k2k2NNNNJ7J6mL1J5J4J6J7QPom3q8q7o5nJ5J5J8J9M9N0N0N0M0M2
$$ 1 -7 -51 -74 -96 -106 -80 -75 -69 -91 -112 -134 -156 -151 -146 -141 -136 -119 -103 -107 -76 -61 -47 -31 -14 -6 1 -5 -48 -136 -223 -288 -293 -278 -263 -245 -226 -177 -127 -77 -27 13 55
-780E5j8j7popok6k6J4M7O1O0M8J2qpj0rl4l4j8J7L9L9k1n7l6l7j7n5q4q4l8K2P8P8O6L0K3
$$ 55 37 20 13 7 0 -6 -32 -58 -44 3 64 124 172 184 176 169 159 150 116 82 64 81 120 159 138 81 45 8 -9 -64 -148 -232 -270 -248 -170 -92 -26 4 27
-785B7K2N4N4L8Lj7n1o2o3k7k9mll7l7jL4N0M9L4L5L5L4opJ3k2n1n0p0l5K3N9L9M1K1K1j5
$$ 27 49 103 157 195 198 181 130 68 5 -22 -51 -55 -58 -95 -132 -133 -99 -49 0 34 69 104 138 132 125 138 116 65 15 -55 -90 -67 -8 31 72 93 114 99
-789I9j5m8m7RQJ3k1l7l8lmjkJL6P1P3K9pk3k2onqqK5j0m9m8l6l6l4l4PM3K1K1Qk6ppK0K0
$$ 99 84 36 -11 -2 6 19 -2 -39 -77 -80 -84 -85 -87 -86 -50 21 94 123 116 93 71 65 60 52 44 69 59 10 -38 -74 -110 -144 -178 -171 -128 -107 -86 -78 -104 -111 -118 -98 -78
-794g8K1K0pppqk5k5k2k3oL0QQqm3k1k1k2J4N0N1N0J6j%k4k4m4rNONOL9Nl9p4n9n9l6K4O5
$$ -78 -57 -37 -44 -51 -58 -66 -91 -116 -138 -161 -167 -137 -129 -121 -129 -172 -193 -214 -236 -222 -172 -121 -71 -55 -56 -56 -80 -104 -148 -157 -152 -146 -141 -135 -96 -91 -130 -204 -263 -322 -358 -334 -269
-800b69O5L3L4L6L5LKlL2L2lk4k5k7k7J7J8J7J7j3j2j3j2J0J0RJ0K8K6K7K8p5p5p2p2j6M3
$$ -269 -204 -171 -137 -101 -66 -63 -61 -64 -32 0 -3 -27 -52 -79 -106 -89 -71 -54 -37 -50 -62 -75 -87 -77 -67 -58 -48 -20 6 33 61 -14 -89 -161 -233 -249 -206
-804b06RRL9L8L8L8N3N4N4N3J9J9J6m2j06j04k6L3Pk9k4J0N7N8j0j1k4k4M5M6KKKKj7j7j8
$$ -206 -197 -188 -149 -111 -73 -35 18 72 126 179 198 217 233 191 85 -19 -45 -12 -5 -34 -58 -48 9 67 57 46 22 -2 43 89 91 93 95 97 80 63 45
-809D5j7o9p0p0p1LMLLj2j1N9N9L0L0m1m1j8j9J7J6M4M4RQJKJJJ1J1J1J1L9M1L7L6k4q3o7
$$ 45 28 -41 -111 -181 -252 -249 -245 -242 -239 -251 -262 -203 -144 -114 -84 -125 -166 -184 -203 -186 -170 -126 -82 -73 -65 -64 -62 -61 -60 -49 -38 -27 -16 23 64 101 137 113 30 -37
-814c7l2jL4J7J6M2M2PPn4n3J6J6ONNNK8K7K7K8j0j1j0j0k8k8k8k7NPOOJ5J5J7J8K7O2P5J7
$$ -37 -69 -70 -36 -19 -3 39 81 88 95 41 -12 4 20 26 31 36 41 69 96 123 151 141 130 120 110 82 54 26 -1 4 11 17 23 38 53 70 88 115 177 252 269
-819B69m9m8p2l7J2J1Jl5n4j9K8K9J3J3J3J2j0j0j0j0j5j5J8J8J7j9o9p0m5m5m5m5J5J5J6
$$ 269 220 172 100 63 75 86 87 52 -2 -21 7 36 49 62 75 87 77 67 57 47 32 17 35 53 70 51 -18 -88 -133 -178 -223 -268 -253 -238 -222
-823b22J5K7K8L0K9K6O0O0K5nnppm7m5m7m6m6m6l1NP0P0K1j4j2j1K2K1K5K5M3J0l3l3l5l6
$$ -222 -207 -180 -152 -122 -93 -67 -7 53 78 73 68 61 54 7 -38 -85 -131 -177 -223 -254 -249 -179 -109 -88 -102 -114 -125 -103 -82 -57 -32 11 21 -12 -45 -80 -116
-827a16OOOOJ3J3J3J3J6J6n2n3m1nM6M5K4K3j2j2MMMMj6j6j6j6m0l9m0l9k2k2k0k0%L5L5%
$$ -116 -110 -104 -98 -92 -79 -66 -53 -40 -24 -8 -60 -113 -154 -159 -113 -68 -44 -21 -33 -45 -41 -37 -33 -29 -45 -61 -77 -93 -133 -172 -212 -251 -273 -295 -315 -335 -335 -300 -265 -265
-832b65k0j9k2k2K2K2K2K2L1L1L1L1J5J4J4J5J8J9J7J6Nl0p9p9n8k2K9K8K1K1L2O8P8K0n9
$$ -265 -285 -304 -326 -348 -326 -304 -282 -260 -229 -198 -167 -136 -121 -107 -93 -78 -60 -41 -24 -8 -3 -33 -112 -191 -249 -271 -242 -214 -193 -172 -140 -72 6 26 -33
-837c3o0l3Kj7j7J9J9J9J8LLLLj1j0j1j0k5k4M2M3M6j3n0n0KLLKjkkkjkk2J4K3K4K5K6L4L3
$$ -33 -93 -126 -124 -141 -158 -139 -120 -101 -83 -80 -77 -74 -71 -82 -92 -103 -113 -138 -162 -120 -77 -31 -44 -94 -144 -142 -139 -136 -134 -135 -137 -139 -141 -142 -144 -166 -152 -129 -105 -80 -54 -20 13
-842A3L2L1J1k5nnj0j0J0k6m1m2m5m5m4m4PM2P4P3K7rlL2K9nnnqojj%jJ6J7J5J5Qk6ppn0n0
$$ 13 45 76 87 62 57 52 42 32 42 16 -25 -67 -112 -157 -201 -245 -238 -196 -122 -49 -22 -31 -34 -2 27 22 17 12 4 -2 -3 -4 -4 -5 11 28 43 58 66 40 33 26 -24 -74
-847g4m8m9ML9J6J7K3j2j2K4L7L7M0M0J1J0J0J1k8k8k8k8m4m6m6m5k1k1k1k1K1K2j5j4LKP0
$$ -74 -122 -171 -167 -128 -112 -95 -72 -84 -96 -72 -35 2 42 82 93 103 113 124 96 68 40 12 -32 -78 -124 -169 -190 -211 -232 -253 -232 -210 -225 -239 -236 -234 -164
-852a64P0L9j9k2k2N0M9M9M9ONM0M1J4J3n7n7q6q7j6j5J2J3k3k3J5J5k0k1k5k6J0J0K5K6j0
$$ -164 -94 -55 -74 -96 -118 -68 -19 30 79 85 90 130 171 185 198 141 84 -2 -89 -105 -120 -108 -95 -118 -141 -126 -111 -131 -152 -177 -203 -193 -183 -158 -132 -142
-856a42j0j8j7j7j7N3N2N3N3M3M4k6k7m8n0n0m9n0n0m5J3Q9J24P0J2k7k6l1l0POPPPQQQll
$$ -142 -152 -170 -187 -204 -221 -168 -116 -63 -10 33 77 51 24 -24 -74 -124 -173 -223 -273 -318 -305 -216 -92 -22 -10 -37 -63 -94 -124 -117 -111 -104 -97 -90 -82 -74 -66 -69 -72
-861g2llM3M3QQl8l8L1L1m3m5rj0J5J6n6n6kjkkooopJ4J4J3J4mnmm%J%%j5j4j5j4llllJ5J6
$$ -72 -75 -78 -35 8 16 24 -14 -52 -21 10 -33 -78 -87 -97 -82 -66 -122 -178 -180 -181 -183 -185 -191 -197 -203 -210 -196 -182 -169 -155 -159 -164 -168 -172 -172 -171 -171 -171 -186 -200 -215 -229 -232 -235 -238 -241 -226 -210
-867b10nL1M8M7k1k2RQpm3m2m1K7K7J9J9J9J9M8M9kl8l6l6llqpnoK5O1O0K4m3m4m7m7OOj4
$$ -210 -215 -184 -136 -89 -110 -132 -123 -115 -122 -165 -207 -248 -221 -194 -175 -156 -137 -118 -70 -21 -23 -61 -97 -133 -136 -139 -147 -154 -159 -165 -140 -79 -19 5 -38 -82 -129 -176 -170 -164 -178
-872a78K1M4M4M4M3Q3M8k7o3l1MLl4m0m2pN3P7P9O5K9Rk7o0r6r0r2m3qK8K8L0L0J1J1M3M1
$$ -178 -157 -113 -69 -25 18 101 149 122 59 28 32 35 1 -39 -81 -88 -35 42 121 186 215 224 197 137 41 -49 -141 -184 -192 -164 -136 -106 -76 -65 -54 -11 30
-876C0K1l8p3p4o9l3J6J6mm0m0mJ%LKJ8J7J5J5J6k1%%K9L0O2O3Q0M5pqj9n4p0p1k8k9k9k8
$$ 30 51 13 -60 -134 -203 -236 -220 -204 -208 -248 -288 -292 -291 -291 -288 -286 -268 -251 -236 -221 -205 -226 -226 -226 -197 -167 -105 -42 38 83 76 68 49 -5 -75 -146 -174 -203 -232 -260
-881b60L8L9L8L9K9K9m1m2k8k9k8k8L5L6L5L6K3K2K3K3J1J2M7M7M1M1l1l0j5j6j6j5q0q0j0
$$ -260 -222 -183 -145 -106 -77 -48 -89 -131 -159 -188 -216 -244 -209 -173 -138 -102 -79 -57 -34 -11 0 12 59 106 147 188 157 127 112 96 80 65 -15 -95 -105
-886a05rJ5J5J5J5L3L3jn8o4nL0K9J5J6J5J4j7j8j7j8j8j8j7j8l9l8l9l8J2J1J2J2NOONll
$$ -105 -114 -99 -84 -69 -54 -21 12 11 -47 -111 -116 -86 -57 -42 -26 -11 3 -14 -32 -49 -67 -85 -103 -120 -138 -177 -215 -254 -292 -280 -269 -257 -245 -240 -234 -228 -223 -226 -229
-890b29llRJ0RJ0nnonJ8J8J7J8L0L1L0L0KKl3l4o2o2QRL0K9L0L0L4L4L3L4ooonqqqqK4K4j1
$$ -229 -232 -235 -226 -216 -207 -197 -202 -207 -213 -218 -200 -182 -165 -147 -117 -86 -56 -26 -24 -22 -55 -89 -151 -213 -205 -196 -166 -137 -107 -77 -43 -9 24 58 52 46 40 35 27 19 11 3 27 51 40
-896D0j1l0l1L9L9kjkkpoj0j0k0p9o6l1PQRJ0K8K8K4K4J0n0l6jOOQQjjllk5o1o0k5L5L4L7
$$ 40 29 -1 -32 7 46 44 43 41 39 32 26 16 6 -14 -93 -159 -190 -183 -175 -166 -156 -128 -100 -76 -52 -42 -92 -128 -129 -123 -117 -109 -101 -102 -103 -106 -109 -134 -195 -255 -280 -245 -211 -174
$$ [...]
-1616I97
##$OBSERVED INTEGRALS=	(X Y Z)
(1.8848041629517346962, 2.1188024624871801826, 5.242830677960036212)
(4.9846282681531146608, 5.0552753895820190522, 1)
(2.3642623096991615128, 2.5087677853491920921, 1.0524654697772197753)
(1.5498316770748208349, 1.764755675544232405, 13.765833447230363618)
(1.1582424023766204613, 1.2347598468578786512, 9.112063127949735275)
(1.073285533871696007, 1.1368625281833302232, 6.0964808526219282925)
(0.95063257139438950283, 1.0074580264870862667, 3.0798349994450613387)
##END=	
##TITLE=	Sep27-2021.40.fid
##JCAMP-DX=	6.0	$$ MestReNova 14.1.0-24037
##BLOCK_ID=	3
##DATA TYPE=	NMR PEAK TABLE
##DATA CLASS=	PEAK TABLE
##CROSS REFERENCE=	NMR SPECTRUM: BLOCK_ID=2                                     
##.OBSERVE FREQUENCY=	400.4124024600000098
##.OBSERVE NUCLEUS=	^1H
##NPOINTS=	65
##FIRSTX=	0.82431083382767778023
##LASTX=	7.5186262897581892517
##XFACTOR=	1
##YFACTOR=	1
##FIRSTY=	32.055297582407781931
##XUNITS=	PPM
##YUNITS=	ARBITRARY UNITS
##PEAK TABLE=	(XYW..XYW)
0.82431083382767778023,32.055297582407781931,0.0076569791599022645617
0.93893071787421289454,33.373176300650300163,0.0072617958263185332715
0.95331405720928064085,28.480193003355317671,0.0058527023909967874557
0.98468312607104269141,6141.4336601017994326,0.0073748110826351567434
1.0364455315854508299,117.56010284805390143,0.0079376690405915783372
1.0563346638914099529,81.33688244775183307,0.0077131167007437294314
1.0665331691009172221,11.586440793252393178,0.0053123720839088634654
1.0993002801667144386,6527.9690546263746,0.0072780585611638302576
1.114229260695240642,6644.4891761529597716,0.0061918413810676791592
1.1420618514593403603,14.018424857763218228,0.0063108926169424383462
1.1547290978838313791,11.935516792787613127,0.0079703316484248873386
1.165715833733380391,9.0399159980165535444,0.0039696347433194559967
1.1974411892268927993,21124.466749555886054,0.0057631890454865010096
1.2561998948425767697,27.955348002193218804,0.007174608926229978853
1.2713317398241754663,28.455981587507153563,0.0061252405422093179205
1.3545295435771715908,104.94951555514462882,0.007677730514902220485
1.5722254051238684358,188.66553598109035761,0.014382545044296639325
1.6017464236736682626,1725.4515815136976471,0.010514468238574667738
1.6098210652652007457,5555.5131121942094978,0.016896939539721385348
1.6402265357895735587,1905.8964508817598471,0.018184618825783878393
1.669048982300156414,143.39870384993591301,0.006469325984520939328
1.6792269640635597572,139.69583411837186304,0.0057732300782412796294
1.6926729693325428538,194.39659146842546988,0.0061643573341228939319
1.7026054159804293597,1786.3478902504916732,0.014425447887617589768
1.7114718601428966505,1078.5802913764580353,0.013268929661893172703
1.7254819838919259745,267.49453330140363505,0.0064951681977330451637
1.7363254782406880583,1129.6400373452638632,0.015807624573009240038
1.798688156182407516,4.1824368942768890278,0.014991444459779765946
1.8351902708214815618,7.8215955989147900596,0.026830750095355702933
$$ [...]
Impurity,Artifact|Weak,,1,-0.20521494550791102851,0,0
Artifact,Artifact|Weak,,1,0.26095711623888878661,0,0
Compound,None,,1,0.0026151937043488193181,0,0
Compound,None,,1,0.058275847668245950306,0,0
Artifact,Artifact|Weak,,1,-1,0,0
Artifact,Artifact|Weak,,1,0.084987630308538564261,0,0
Artifact,Artifact|Weak,,1,0.40000000000000007772,0,0
Compound,None,,1,-0.13912752570283098974,0,0
Compound,Artifact|Impurity|Weak|13C Sat.,,1,0.34013960970835943609,0,0
Compound,Artifact|Impurity|Weak|13C Sat.,,1,-0.2000000000000000111,0,0
Compound,Artifact|Impurity|Weak|13C Sat.,,1,-0.041008188615400842369,0,0
Impurity,None,,1,1.8778286740783951547,0,0
Solvent,2ry Solvent,,1,0.039883764585503495015,0,0
Solvent,2ry Solvent,,1,0.64781577117433686297,0,0
Compound,None,,1,1.4035287697486078518,0,0
Compound,None,,1,0.54766710782236671662,0,0
Compound,None,,1,0.7341293078004111905,0,0
Compound,None,,1,0.68353019796585701151,0,0
Compound,None,,1,0.024440802080596596424,0,0
Compound,None,,1,0.063357680558314866115,0,0
Compound,None,,1,0.68611070937463058961,0,0
Compound,None,,1,0.88260300123358770286,0,0
Artifact,Artifact|Weak,,1,1.9098778938922249537,0,0
Compound,Artifact|Impurity|Weak|13C Sat.,,1,-0.63249238871773150183,0,0
Artifact,Artifact|Weak,,1,-0.65603437584106927272,0,0
Compound,None,,1,-0.08150161362276614474,0,0
Compound,None,,1,-0.082357202348306401962,0,0
Compound,None,,1,0.252099478008477762,0,0
Compound,None,,1,-0.2000000000000000111,0,0
Compound,None,,1,-0.0063920926461826510501,0,0
Compound,None,,1,0.15477624449103388748,0,0
Compound,None,,1,0.40000000000000007772,0,0
Compound,None,,1,-0.13663045972259357796,0,0
Compound,None,,1,0.24891401539503282825,0,0
Compound,None,,1,-0.20713108614397285345,0,0
Compound,None,,1,0.063573740476115636611,0,0
Compound,None,,1,1.4093248972588801049,0,0
Compound,None,,1,0.48165473795841984295,0,0
Compound,None,,1,0.40000000000000007772,0,0
Compound,None,,1,-0.13693156418738683389,0,0
Compound,None,,1,0.45647825890899762502,0,0
Compound,None,,1,0.12538861335453330148,0,0
Compound,None,,1,0.2000000000000000111,0,0
Compound,Artifact|Impurity|Weak|13C Sat.,,1,0.59123970082262400361,0,0
Artifact,Artifact|Weak,,1,-0.2000000000000000111,0,0
Compound,None,,1,-0.024673622945700190989,0,0
Compound,None,,1,-0.13369016253852838982,0,0
Compound,None,,1,0.35096670503908683481,0,0
Compound,None,,1,-0.028488954728809412487,0,0
Compound,None,,1,0.013812758639972388952,0,0
Compound,None,,1,-0.0088461924692209148446,0,0
Compound,None,,1,-0.25899443620159817714,0,0
Compound,None,,1,0.12189549234365609776,0,0
Compound,Artifact|Impurity|Weak|13C Sat.,,1,-0.19879266641366455382,0,0
Compound,None,,1,0.2000000000000000111,0,0
Compound,Artifact|Impurity|Weak|13C Sat.,,1,0.025357331250301366754,0,0
Impurity,Artifact|Weak,,1,-0.31081288287913927393,0,0
Solvent,Artifact|Impurity|Weak|13C Sat.,,1,-0.264078049896789957,0,0
Solvent,None,,1,-0.033984400347197012138,0,0
Solvent,Artifact|Impurity|Weak|13C Sat.,,1,-0.29175338725128008299,0,0
##END=	
##END=	
