##TITLE=	Aug03-2021.20.fid
KJO-13-3
##JCAMP-DX=	6.0	$$ MestReNova 14.1.0-24037
##DATA TYPE=	LINK
##BLOCK_ID=	1
##BLOCKS=	2    
##ORIGIN=	Mestrelab Research S.L.
##OWNER=	Chris
##$MNOVA/LINK_BLOCK_TYPE=	ITEM	$$ NMR Spectrum
##$MNOVA/ITEM/POLYGON=	(XY..XY)
5321,5835
8722,5835
8722,8208
5321,8208
5321,5835
##$MNOVA/ITEM/Z=	0
##$MNOVA/ITEM/ANGLE=	0
##TITLE=	Aug03-2021.20.fid
##JCAMP-DX=	6.0	$$ MestReNova 14.1.0-24037
##BLOCK_ID=	2
##DATA TYPE=	NMR SPECTRUM
##DATA CLASS=	XYDATA
##NUMDIM=	1
##ORIGIN=	Bruker BioSpin GmbH
##OWNER=	nmr
##.OBSERVE FREQUENCY=	400.4124024600000098
##.OBSERVE NUCLEUS=	^1H
##.SOLVENT NAME=	CDCl3
##.PULSE SEQUENCE=	zg30
##LONGDATE=	2021/08/03 08:10:00.000
##.ACQUISITIONMODE=	SIMULTANEOUS (DQD)
##$ORIGINAL FORMAT=	Bruker XWIN-NMR
##$MNOVA/SCALES_VERSION=	8
##$PARAMETER FILE=	(acqus, ASCII, c:/Users/Chris/Desktop/UROP/NMR/KJO-13-3/acqus, 0)
$$ ##TITLE= Parameter file, TOPSPIN		Version 3.2
$$ ##JCAMPDX= 5.0
$$ ##DATATYPE= Parameter Values
$$ ##NPOINTS= 11	$$ modification sequence number
$$ ##ORIGIN= Bruker BioSpin GmbH
$$ ##OWNER= nmr
$$ $$ 2021-08-03 08:10:07.714 +0100  nmr@CZC10666PP
$$ $$ /opt/topspin/data/brad/nmr/Aug03-2021/20/acqus
$$ $$ process /opt/topspin3.2/prog/mod/shimcntl
$$ ##$ACQT0= -2.36344537815126
$$ ##$AMP= (0..31)
$$ 100 100 100 100 100 100 100 100 100 100 100 100 100 100 100 100 100 100
$$ 100 100 100 100 100 100 100 100 100 100 100 100 100 100
$$ ##$AMPCOIL= (0..19)
$$ 0 0 0 0 0 0 0 0 0 0 0 0 0 0 0 0 0 0 0 0
$$ ##$ANAVPT= -1
$$ ##$AQSEQ= 0
$$ ##$AQ_mod= 3
$$ ##$AUNM= <au_zg>
$$ ##$AUTOPOS= <6 >
$$ ##$BF1= 400.41
$$ ##$BF2= 400.41
$$ ##$BF3= 400.41
$$ ##$BF4= 400.41
$$ ##$BF5= 400.41
$$ ##$BF6= 400.41
$$ ##$BF7= 400.41
$$ ##$BF8= 400.41
$$ ##$BYTORDA= 0
$$ ##$CAGPARS= (0..11)
$$ 0 0 0 0 0 0 0 0 0 0 0 0
$$ ##$CFDGTYP= 0
$$ ##$CFRGTYP= 9
$$ ##$CHEMSTR= <none>
$$ ##$CNST= (0..63)
$$ 1 1 145 1 1 1 1 1 1 1 1 1 1 1 1 1 1 1 1 1 1 1 1 1 1 1 1 1 1 1 1 1 1 1 1
$$ 1 1 1 1 1 1 1 1 1 1 1 1 1 1 1 1 1 1 1 1 1 1 1 1 1 1 1 1 1
$$ ##$CPDPRG= (0..8)
$$ <> <> <> <> <mlev> <mlev> <mlev> <mlev> <mlev>
$$ ##$D= (0..63)
$$ 0 1 0 0 0 0 0 0 0 0.06 0 0 0 0 0 0 0.0002 0 0 0 0 0 0 0 0 0 0 0 0 0 0 0
$$ 0 0 0 0 0 0 0 0 0 0 0 0 0 0 0 0 0 0 0 0 0 0 0 0 0 0 0 0 0 0 0 0
$$ ##$DATE= 1627974606
$$ ##$DE= 6.5
$$ ##$DECBNUC= <off>
$$ ##$DECIM= 2496
$$ ##$DECNUC= <off>
$$ ##$DECSTAT= 4
$$ ##$DIGMOD= 1
$$ ##$DIGTYP= 12
$$ ##$DQDMODE= 0
$$ ##$DR= 22
$$ ##$DS= 2
$$ ##$DSPFIRM= 0
$$ ##$DSPFVS= 20
$$ ##$DTYPA= 0
$$ ##$EXP= <proton>
$$ ##$F1LIST= <111111111111111>
$$ ##$F2LIST= <222222222222222>
$$ ##$F3LIST= <333333333333333>
$$ ##$FCUCHAN= (0..9)
$$ 0 2 0 0 0 0 0 0 0 0
$$ ##$FL1= 90
$$ ##$FL2= 90
$$ ##$FL3= 90
$$ ##$FL4= 90
$$ ##$FOV= 20
$$ ##$FQ1LIST= <freqlist>
$$ ##$FQ2LIST= <freqlist>
$$ ##$FQ3LIST= <freqlist>
$$ ##$FQ4LIST= <freqlist>
$$ ##$FQ5LIST= <freqlist>
$$ ##$FQ6LIST= <freqlist>
$$ ##$FQ7LIST= <freqlist>
$$ ##$FQ8LIST= <freqlist>
$$ ##$FRQLO3= 17285.0399999619
$$ ##$FRQLO3N= 2
$$ ##$FS= (0..7)
$$ 83 83 83 83 83 83 83 83
$$ ##$FTLPGN= 0
$$ [...]
$$ 90 74 58 42 26 10 0 0
$$ ##$Sgu3PowerLevels= (0..7)
$$ 0 0 0 0 0 0 0 0
$$ ##$Sgu4PowerLevels= (0..7)
$$ 0 0 0 0 0 0 0 0
$$ ##$Sgu5PowerLevels= (0..7)
$$ 0 0 0 0 0 0 0 0
$$ ##$Sgu6PowerLevels= (0..7)
$$ 0 0 0 0 0 0 0 0
$$ ##$Sgu7PowerLevels= (0..7)
$$ 0 0 0 0 0 0 0 0
$$ ##$Sgu8PowerLevels= (0..7)
$$ 0 0 0 0 0 0 0 0
$$ ##$SguType= 3
$$ ##$ShimPowMaxUA= (0..63)
$$ 130000 130000 130000 130000 130000 130000 130000 130000 130000 130000 130000
$$ 130000 130000 130000 130000 130000 130000 130000 130000 130000 0 0 0 0
$$ 0 0 0 0 0 0 0 0 0 0 0 0 0 0 0 0 0 0 0 0 0 0 0 0 0 0 0 0 0 0 0 0 0 0 0 0
$$ 0 0 0 0
$$ ##$ShimPowMaxUC= (0..63)
$$ 130000 130000 130000 130000 130000 130000 130000 130000 130000 130000 130000
$$ 130000 130000 130000 130000 130000 130000 130000 130000 130000 0 0 0 0
$$ 0 0 0 0 0 0 0 0 0 0 0 0 0 0 0 0 0 0 0 0 0 0 0 0 0 0 0 0 0 0 0 0 0 0 0 0
$$ 0 0 0 0
$$ ##$ShimPowMaxUG= (0..63)
$$ 524287 524287 524287 524287 524287 524287 524287 524287 524287 524287 524287
$$ 524287 524287 524287 524287 524287 524287 524287 524287 524287 0 0 0 0
$$ 0 0 0 0 0 0 0 0 0 0 0 0 0 0 0 0 0 0 0 0 0 0 0 0 0 0 0 0 0 0 0 0 0 0 0 0
$$ 0 0 0 0
$$ ##$ShimPowRcbType= 3
$$ ##$ShimPowRes= (0..63)
$$ 1e-20 1e-20 1e-20 1e-20 1e-20 1e-20 1e-20 1e-20 1e-20 1e-20 1e-20 1e-20
$$ 1e-20 1e-20 1e-20 1e-20 1e-20 1e-20 1e-20 1e-20 0 0 0 0 0 0 0 0 0 0 0 0
$$ 0 0 0 0 0 0 0 0 0 0 0 0 0 0 0 0 0 0 0 0 0 0 0 0 0 0 0 0 0 0 0 0
$$ ##$ShimPowRng0= (0..63)
$$ 1 1 1 1 1 1 1 1 1 1 1 1 1 1 1 1 1 1 1 1 0 0 0 0 0 0 0 0 0 0 0 0 0 0 0 0
$$ 0 0 0 0 0 0 0 0 0 0 0 0 0 0 0 0 0 0 0 0 0 0 0 0 0 0 0 0
$$ ##$ShimPowRng1= (0..63)
$$ 1 1 1 1 1 1 1 1 1 1 1 1 1 1 1 1 1 1 1 1 0 0 0 0 0 0 0 0 0 0 0 0 0 0 0 0
$$ 0 0 0 0 0 0 0 0 0 0 0 0 0 0 0 0 0 0 0 0 0 0 0 0 0 0 0 0
$$ ##$ShimPowRng2= (0..63)
$$ 1 1 1 1 1 1 1 1 1 1 1 1 1 1 1 1 1 1 1 1 0 0 0 0 0 0 0 0 0 0 0 0 0 0 0 0
$$ 0 0 0 0 0 0 0 0 0 0 0 0 0 0 0 0 0 0 0 0 0 0 0 0 0 0 0 0
$$ ##$ShimPowRng3= (0..63)
$$ 1 1 1 1 1 1 1 1 1 1 1 1 1 1 1 1 1 1 1 1 0 0 0 0 0 0 0 0 0 0 0 0 0 0 0 0
$$ 0 0 0 0 0 0 0 0 0 0 0 0 0 0 0 0 0 0 0 0 0 0 0 0 0 0 0 0
$$ ##$ShimSysFunc= (0..63)
$$ 1 2 3 4 5 7 9 11 15 16 8 10 12 14 6 17 13 18 19 20 0 0 0 0 0 0 0 0 0 0
$$ 0 0 0 0 0 0 0 0 0 0 0 0 0 0 0 0 0 0 0 0 0 0 0 0 0 0 0 0 0 0 0 0 0 0
$$ ##$ShimSysMatrix= 0
$$ ##$ShimSysType= 1
$$ ##$TFXNUM= 0
$$ ##$TRIPLO2= 0
$$ ##$VTU= 2
$$ ##$VTUETH= <149.236.99.20>
$$ ##$VTUTY= <no>
$$ ##$WBREFAM= (0..15)
$$ 135 116 100 100 100 100 100 100 100 100 100 100 100 100 100 100
$$ ##$WBREFLM= (0..15)
$$ 0 0 0 0 0 0 0 0 0 0 0 0 0 0 0 0
$$ ##$WBREFPH= (0..15)
$$ 71.66 -68.25 0 0 0 0 0 0 0 0 0 0 0 0 0 0
$$ ##$WBSGU= (0..15)
$$ 0 0 0 0 0 0 0 0 0 0 0 0 0 0 0 0
$$ ##$XFAC= 2
$$ ##END=
$$ 
##$DECIM=	2496
##$DSPFVS=	20
##XUNITS=	HZ
##YUNITS=	ARBITRARY UNITS
##FIRSTX=	6396.7404958126517158
##LASTX=	-1616.080017007858487
##DELTAX=	-0.1222678036594264106
##XFACTOR=	1
##YFACTOR=	0.0035553294267519938536
##FIRSTY=	10.722138404846191406
##MINY=	-2.4956150054931640625
##MAXY=	77409.78125
##NPOINTS=	65536
##XYDATA=	(X++(Y..Y))
$$ [...]
1649G64n1N4O1jn6OL3k9p3p3j5j5J9J9Q2Q1j4j4J7J7JKKJJJO3O3P0P0J82J83K26L73N13N76
$$ 764 713 767 828 827 771 777 810 781 708 635 620 605 624 643 725 806 792 778 795 812 813 815 817 818 819 820 883 946 1016 1086 1268 1451 1677 2050 2563 3139
1645C139M72K85m8m00n74n12l72l10k84k22j49j49n0m9J3J3n3n3RJ0j4j3J8J7j8j9j8j9n1
$$ 3139 3611 3896 3848 3448 2874 2362 1990 1680 1396 1174 1025 876 826 777 790 803 750 697 706 716 702 689 707 724 706 687 669 650 599
1641E99n1N3N3J7J7j5j4q3q3K1K1k5k6OOj6j6j6j6PPQ0Q0O4O3J77J78J62J63J91J29jj05k00
$$ 599 548 601 654 671 688 673 659 576 493 514 535 510 484 490 496 480 464 448 432 439 446 526 606 670 733 910 1088 1250 1413 1604 1733 1732 1627 1427
1637A427k00j98r4j7j7j14j14q3q3MMMNk0k0L2L2o5o4j3j3J%P3P3j3j2J8J8l5l5L7L7J3J2
$$ 1427 1227 1029 935 918 901 787 673 590 507 511 515 519 524 504 484 516 548 483 419 406 393 394 394 467 540 527 515 533 551 516 481 518 555 568 580
1633E80J2J3l6l7L7L6n7n8noj8j8J2J3k7k7K4K5OOL7L7l4l5l5l5PPQ0Q0K1K0P2P3J1J1j9k0
$$ 580 592 605 569 532 569 605 548 490 485 479 461 443 455 468 441 414 438 463 469 475 512 549 515 480 445 410 417 424 504 584 605 625 697 770 781 792 773 753
1628G53m3m2J0J0n1n1KJm6m7m6m6rqJ05J06QRRRn8n8J5J5k9k9K4K3m2m3m2m2l3l4O1O0QPQ
$$ 753 710 668 678 688 637 586 588 589 543 496 450 404 395 387 492 598 606 615 624 633 575 517 532 547 518 489 513 536 494 451 409 367 334 300 361 421 429 436 444
1624D44QLMLMk4k4K8K8k0k0J2J1m2m2L1L0qqK3K3m1m1N3N3RRL9L8l9p1j9M3On7l5mklN0Q2
$$ 444 452 455 459 462 466 442 418 446 474 454 434 446 457 415 373 404 434 426 418 441 464 423 382 435 488 497 506 545 583 544 473 454 497 503 446 411 407 405 402 452 534
1619E34J8m4pqo6o6j5j4j2j2O0R2K7l5J%m2p3k0M2K0j1M1P2N0j2opl7l7L5O7L3k9K1Q4K4l9
$$ 534 552 508 501 493 427 361 346 332 320 308 368 460 487 452 453 453 411 338 318 360 380 369 410 482 532 520 514 507 470 433 468 535 568 539 560 644 668 629
1614F29l6K5J9j2j0K1Qk2k1J1PQN8N8n8j21p0qll5j8M4L0jN4J16P1RK7N8L2l0LLk4q6l9K4
$$ 629 593 618 637 625 615 636 644 622 601 612 619 627 685 743 685 564 494 486 483 448 430 474 504 503 557 673 744 753 780 838 870 840 843 846 822 736 697 721
1609G21lo6o1%rj0LL5ko4PO8L7k5qK3j6p8j7M4O4KJO4N4qn1k0Ok4m3K1L5MML5K1m0m1K2M1
$$ 721 718 652 591 591 582 572 575 610 608 544 551 619 656 631 623 646 630 552 535 579 643 645 646 710 764 756 705 685 691 667 624 645 680 684 688 723 744 704 663 685 726
1604G26RqN4N9mJ6M7Qk3K0Q2J15N4qN6M8J8J7M9j0p2n7k5l4r6r4l2lkk1J1j4p7p4j3J2J2o
$$ 726 735 727 781 840 836 852 899 907 884 904 986 1101 1155 1147 1203 1251 1269 1286 1335 1325 1253 1196 1171 1137 1041 947 915 912 910 889 900 886 809 735 722 734 746 740
1600G40K5J4m8m6J6MLL1R4L6k6k4L8L9RrN3M1k1jL0J4j7K6Q8J20N9J3M5K9l2o1o0l7o9r0k7
$$ 740 765 779 731 685 701 705 708 739 833 869 843 819 857 896 905 896 949 990 969 968 998 1012 995 1021 1109 1229 1288 1301 1346 1375 1343 1282 1222 1185 1116 1026 999
1595I99j2p5p4j2K2m0j22r1m0m0j4M7K4l8k1J0Jo1o3jN8mm6j6J5j6l4K9L3KKL3L6k7k7L5O3
$$ 999 987 912 838 826 848 808 686 595 555 515 501 548 572 534 513 523 524 463 400 399 457 453 407 391 406 390 356 385 418 420 422 455 491 464 437 472 535
1591E35L2k7MO2O2KKL2L3L3L3jjk2J0On6j02p2m2j04j26k2L2L1L4L4J6m5n0J3M8j5p4j3K4
$$ 535 567 540 544 606 668 670 672 704 737 770 803 802 801 779 789 795 739 637 565 523 419 293 271 303 334 368 402 418 373 323 336 384 369 295 282 306
1586C06plK9N5N5nnJ5J4pK5L5k7k5L7J03J02JJj2m2o5jK8l5p5m4OOQQLKj9J3O7Ml8pL6L6L8
$$ 306 299 296 325 380 435 430 425 440 454 447 472 507 480 455 492 595 697 698 699 687 645 580 579 607 572 497 453 459 465 473 481 484 486 467 480 547 551 513 506 542 578 616
1581F16L8L3L3l0k9m5m5m5m5KKKJP6P6k8k8j6j7j6j6QQRQN7N6N3N2J03M0n3q4m4m5q2k0O2
$$ 616 654 687 720 690 661 616 571 526 481 483 485 487 488 564 640 612 584 568 551 535 519 527 535 544 552 609 665 718 770 873 913 860 776 732 687 605 585 647
1576F47O2J3J4M8M9m5m5l9l9l8l9L6L5NNJ5J5n8n8MLk8k7J4J4l8l8J3J3j9j8RQk3k2M8M8m
$$ 647 709 722 736 784 833 788 743 704 665 627 588 624 659 664 669 684 699 641 583 587 590 562 535 549 563 525 487 500 513 494 476 485 493 470 448 496 544 540
1572E40mL1L1L1L1J9J8p4p5P1P2kjJ7J8n5n6J9J8J9J8nop8p8N4N4KKN6N6MNj2j3j2j2J3J4
$$ 540 536 567 598 629 660 679 697 623 548 619 691 689 688 705 723 668 612 631 649 668 686 681 675 597 519 573 627 629 631 687 743 747 752 740 727 715 703 716 730
1567G30j8j8M6M5k7k7N0M9k3k3k2k3p4p5QPL9L8K2K3l0l0J3J4j8j8Q1Q2j2j2kkkkMNo8o8l
$$ 730 712 694 740 785 758 731 781 830 807 784 762 739 665 590 598 605 644 682 704 727 697 667 680 694 676 658 739 821 809 797 795 793 791 789 793 798 730 662 659
1562F59lllL1L1%jK8K8mlQ6Q5Rn4j5J6l8j02n6Ol3l3MLo8j00l5K8K2K1M4M3j1p4qN4N1j2J5
$$ 659 656 653 650 681 712 712 711 739 767 763 760 846 931 940 886 871 887 849 747 691 697 664 631 635 638 570 470 435 463 485 506 550 593 582 508 500 554 605 593 608
1557F08J5m4j06o5lj1j1L3L3L2L3P7P8M2k1J2M3Pn6j3J8l7j00n8LM0L9N8R0L8k4k8L5J6j6
$$ 608 623 579 473 408 405 394 383 416 449 481 514 591 669 711 690 702 745 752 696 683 701 664 564 506 509 549 588 646 736 774 750 722 757 773 757
1553G57lK8jl2OO9O9PL1O3j4p5o9oPk4NO6L8k5k1M2N4N4Q0Q0K5l7mN8K3l9l4l3l4l4MO6k4
$$ 757 754 782 781 749 755 824 893 900 931 994 980 905 836 830 837 813 818 884 922 897 876 918 972 1026 1106 1186 1211 1174 1170 1228 1251 1212 1178 1145 1111 1077 1081 1147 1123
1548A123q6n2J1J0n2o0LJ4j7j8J3Ko1j5M7N9K8N0Q1M7j5o3l2j9q0j5j4M4M4P0P0PQj7j7j7
$$ 1123 1037 985 996 1006 954 894 897 911 894 876 889 891 830 815 862 921 949 999 1080 1127 1112 1049 1017 998 918 903 889 933 977 1047 1117 1124 1132 1115 1098 1081
1544A081j7P4P4P4P4K8K9l3l4l7l7l6l7l1l0k1q2q9J5N3qm5J7J0J0%%%%K3K3K3K4L9L8L9L9
$$ 1081 1064 1138 1212 1286 1360 1388 1417 1384 1350 1313 1276 1240 1203 1172 1142 1121 1039 950 965 1018 1010 965 982 992 1002 1002 1002 1002 1002 1025 1048 1071 1095 1134 1172 1211 1250
1539A250LLKLl4l5K8K8N5N5K4K4j2j2j2j2J1J1N3j0K9J34J30K5J7J7M1M2QQP1P1N5N5J18J18
$$ 1250 1253 1256 1258 1261 1227 1192 1220 1248 1303 1358 1382 1406 1394 1382 1370 1358 1369 1380 1433 1423 1452 1586 1716 1741 1758 1775 1816 1858 1866 1874 1945 2016 2071 2126 2244 2362
1535B362Q9Q9J93J93K26K27K89K89K70K70L02L01K64K65M51M52N53N53O66O66P09Q53J016
$$ 2362 2451 2540 2733 2926 3152 3379 3668 3957 4227 4497 4799 5100 5364 5629 6080 6532 7085 7638 8304 8970 9679 10532 11548
1532A1548J161J359J587J844K072K369K806L363M049M952O136P516R032J0642J2157J3214
$$ 11548 12709 14068 15655 17499 19571 21940 24746 28109 32158 37110 43246 50762 59794 70436 82593 95807
1530I5807J3401J2438J0257O886K629j858n948r235j1456j2466j2279j1319j0010q563p087
$$ 95807 109208 121646 131903 138789 141418 139560 133612 124377 112921 100455 88176 76857 66847 58284 51197
1528E1197n752m692l825l140k602k208j879j567j248j061q64o35l89k43j36J0J78L24M46O32
$$ 51197 45445 40753 36928 33788 31186 28978 27099 25532 24284 23223 22359 21724 21335 21092 20956 20966 21144 21468 21914 22546
1526B2546Q46J032J263J574J917K228K625L228L946M798N833P182Q714J0272J1649J2626J2784
$$ 22546 23392 24424 25687 27261 29178 31406 34031 37259 41205 46003 51836 59018 67732 78004 89653 102279 115063
1524A15063J1808R563O220K042k548o851j0236j2448j3464j3381j2363j0780r139p582o149
$$ 115063 126871 136434 142654 144696 142148 135297 125061 112613 99149 85768 73405 62625 53486 45904 39755
1522C9755m935m041l368k848k397k086j864j678j442j296j146j001q36o92n76m72m18m18m48
$$ 39755 34820 30779 27411 24563 22166 20080 18216 16538 15096 13800 12654 11653 10817 10125 9549 9077 8659 8241 7793
1520G793m48l86l85l55l55k50k51k35k35r0q9j50j50j19j18j44j43l9l9j09j10p8p8q4q3k2
$$ 7793 7345 6959 6574 6219 5864 5614 5363 5128 4893 4803 4714 4564 4414 4295 4177 4033 3890 3851 3812 3703 3593 3515 3437 3353 3270 3248
1516C248k1j55j55r3r3o9o8l8l8n4n3QRr5r5RRJ6J5J6J6r9j00l6l7k5k5L7L7o0o1LKm9m8J3
$$ 3248 3227 3072 2917 2824 2731 2662 2594 2556 2518 2464 2411 2419 2428 2333 2238 2247 2256 2272 2287 2303 2319 2220 2120 2084 2047 2022 1997 2034 2071 2011 1950 1953 1955 1906 1858 1871
1512A871J4l6l7l6l6j9j9M3M4mmK7K8k8k7L5L6o7o6l5l6j07j07LO5J%O3O3J1n1j6j7n2n3J2
$$ 1871 1885 1849 1812 1776 1740 1721 1702 1745 1789 1785 1781 1808 1836 1808 1781 1816 1852 1785 1719 1684 1648 1541 1434 1437 1502 1503 1503 1566 1629 1640 1589 1573 1556 1504 1451 1463
1508A463P5K0m2lmp1p2j0rj2j2j2j2m6m6K3Q5K4K4K8K8l0l1P0O9l4r6r7l4n8n8RQj4j4J7J7
$$ 1463 1538 1558 1516 1513 1509 1438 1366 1356 1347 1335 1323 1311 1299 1253 1207 1230 1315 1339 1363 1391 1419 1389 1358 1428 1497 1463 1367 1270 1236 1178 1120 1129 1137 1123 1109 1126 1143
1503A143o9o9pok6k5k6k5o3o2OO9J2J3M4M4j9q2p8p8l0l1P3P4QRL5L6qp0qN5L9L8L9L9k0q4
$$ 1143 1074 1005 998 992 966 941 915 890 827 765 771 840 852 865 909 953 934 852 774 696 666 635 708 782 790 799 834 870 862 792 784 839 878 916 955 994 974 890
1498H90k4L7J3m9l0Jj9n0m9j7k5k4%O3L5k7l6oJ5J5N7Q9L6k6J0Rj5m7nN7N6n%%l8p0k6L5p
$$ 890 866 903 916 867 837 838 819 769 720 703 678 654 654 717 752 725 689 683 698 713 770 859 895 869 879 888 873 826 821 878 934 929 929 929 891 821 795 830 823
1494H23l8OO9K9l2o2JJ6j5j5J6Ln8p0l9m0l9K4K5ooML5pp0l6K6J0J1L7J00L4k7k8L4K2l9k1
$$ 823 785 791 860 889 857 795 796 812 797 782 798 801 743 673 634 594 555 579 604 598 592 596 631 624 554 518 544 554 565 602 702 736 709 681 715 737 698 677
1489F77J1J9j3l0L2N7K5K5N7L9k2k5L7Jo1m0rl2l2L3R5P8k5m4j4m6p7l4K8rp2p0pL5Nj3N0
$$ 677 688 707 694 664 696 753 778 803 860 899 877 852 889 890 829 789 780 748 716 749 844 922 897 853 839 793 716 682 710 701 629 559 552 587 592 579 629
1485F29L3k9n3N1Q5K3l8K6L5k7o7l7m8m9J5P8N0n4r1k9J6j4j5J7J3n0m9J3J3j8K5Q6Q8j5n5
$$ 629 662 633 580 631 716 739 701 727 762 735 668 631 583 534 549 627 677 623 532 503 519 505 490 507 520 470 421 434 447 429 454 540 628 613 558
1480E58PL6k7n6OL6Mj3M9N9mo8o8k7k7l5K8N4ql2l1j7j7j6j7KKK4Q8P3J0m9J2L2Jj2j3Qn4
$$ 558 565 601 574 518 524 560 564 551 600 659 655 587 519 492 465 430 458 512 504 472 441 424 407 391 374 376 378 402 490 563 573 524 536 568 569 557 544 552 498
1475D98n8NM7j5j5M7N4ql9K3Q1K0k4PN1K0J8M9L0l3p9m7po9o7nN0M9L1O3N9ln0j9L2l0r0k8
$$ 498 440 445 492 477 462 509 563 555 516 539 620 640 616 623 674 694 712 761 791 758 679 632 625 556 489 484 534 583 614 677 736 733 683 664 696 666 576 548
1471E48L9L8K2N2N7oo9nN5K5k4L8P2Rn5n5pqppJ5J5j5j6P2P2RJ0LLk8k8k3k2k4k4Qk4j6M6
$$ 548 587 625 647 699 756 750 681 676 731 756 732 770 842 851 796 741 734 726 719 712 727 742 727 711 783 855 864 874 877 880 852 824 801 779 755 731 739 715 699 745
1466G45N8m5j05p3j1j2j1j1J2k0l9K3M9J7J8M8N5qp0qO3L1rrK4K4l8l8J5J5q8q9OONOK8K8
$$ 745 803 758 653 580 569 557 546 535 547 527 488 511 560 577 595 643 698 690 620 612 675 706 697 688 712 736 698 660 675 690 602 513 519 525 530 536 564 592
1461E92l4l4L2L2p2p2j6j6j6j6P9P8k6k5J3J4J3J3P1P0MMKo1o1JJ28J27j4j4N2N2j0j0M2M1
$$ 592 558 524 556 588 516 444 428 412 396 380 459 537 511 486 499 513 526 539 610 680 684 688 690 629 568 569 697 824 810 796 848 900 890 880 922 963
1457I63k0k1O4O4O4O4R3R3L1L0P3P2P2P3R9R9m6m6j5j4j60j60p1p0j02j02o8o7o8o8l1l1l2
$$ 963 943 922 986 1050 1114 1178 1271 1364 1395 1425 1498 1570 1642 1715 1814 1913 1867 1821 1806 1792 1632 1472 1401 1331 1229 1127 1059 992 924 856 825 794 762
1453G62l1L4L3k9k8J0J0r0r0rN2J8J8Q0Q1J3m9j2J9KKL3R5P7M6O7O6O3O2J32J00Qn5p6p6q0
$$ 762 731 765 798 769 741 751 761 671 581 572 624 642 660 740 821 834 785 773 792 794 796 829 924 1001 1047 1114 1180 1243 1305 1437 1537 1545 1490 1414 1338 1258
1448A258q0l0l0r3r2k3k3k2k3J0Rn3n3o2o2o3o2K5K5K4K5N3N3n3j15k5L7J9j4k4PQk5K6N6
$$ 1258 1178 1148 1118 1025 933 910 887 865 842 852 861 808 755 693 631 568 506 531 556 580 605 658 711 658 543 518 555 574 560 536 543 551 526 552 608
1444F08J4m9nN6L5MJ0J0QQJ5J6m7m7L0L0j2m2j7M6K8lJ4M5Ko0l3K8j0j14r2l1o8o7KO4K9L0
$$ 608 622 573 568 624 659 663 673 683 691 699 714 730 683 636 666 696 684 642 625 671 699 696 710 755 757 697 664 692 682 568 476 445 377 310 312 376 405 435
1440D35P4P5Pn5PL8J8J9Q2J13L0l2m4J8J5m8l5l4r7r7m9J3jl1J2P5P6J4LO5O3JPL9po8n4R
$$ 435 509 584 591 536 543 581 599 618 700 813 843 811 767 785 800 752 717 683 586 489 440 453 452 421 433 508 584 598 601 666 729 730 737 776 769 701 647 656
1435F56Rn4n0J3J4m7k1Q2N9lk9L4L4k8m7J6J3m8n0j8l6l6j3M9N3j0k2M0M1k2m1K2K2m0k3L9
$$ 656 665 611 561 574 588 541 520 602 661 658 629 663 697 669 622 638 651 603 553 535 499 463 450 499 552 542 520 560 601 579 538 560 582 542 519 558
1430E58L7k6m5j3j1m2QJ11Q7K4L2L2Pn5l7O7M2k1l1%%l1l0L3L4k8j0N3N1j2k7NK2m0j9M3M4
$$ 558 595 569 524 511 500 458 466 577 664 688 720 752 759 704 667 734 776 755 724 724 724 693 663 696 730 702 692 745 796 784 757 762 784 744 725 768 812
1426H12j9n3RRn3l5K8K7l5l6K5K2m0k9k9l0l1j1K0j8q0q4K0N9lk3L9Q3N1M1P4L0l2p1rqp1
$$ 812 793 740 749 758 705 670 698 725 690 654 679 701 661 632 603 573 542 531 551 533 453 369 389 448 445 422 461 544 595 636 710 740 708 637 628 620 549
1421E49q4k3K3qjO2O2jk1J0J0k1k0M3M2j9m7j5Lo0k9L4L4k8%O2O0jn5k4k4n5k8L4Q5K4j7J3
$$ 549 465 442 465 457 456 518 580 579 558 568 578 557 537 580 622 603 556 541 544 484 455 489 523 495 495 557 617 616 561 537 513 458 430 464 549 573 556 569
1417E69L0l3n2k2lo6n7OQ1M8j3J8L7k5p1j0Q7Q7K8K8L0K9j3J7L7k5p4m3j1j0qK3M2k0l9qR
$$ 569 599 566 514 492 489 423 366 372 453 501 488 506 543 518 447 437 524 611 639 667 697 726 713 730 767 742 668 625 614 604 596 619 661 641 602 594 603
1412F03n3r2l1K8K9J0P3P3J1k6k6rl9n0J2K8mm3J8N3K2j4J8O7Ml7oM2k2o5l4l1o3p6K8J00
$$ 603 550 458 427 455 484 494 567 640 651 625 599 590 551 501 513 541 537 494 512 565 587 573 591 658 662 625 619 661 639 574 540 509 446 370 398 498
1408D98J00L8PJ2n1m8J4O7Ml5K7J00O8j3j3Pk5p6j4O1K9l9l9j0j0n9n9J3J4n2n2%%kjN0N1
$$ 498 598 636 643 655 604 556 570 637 641 606 633 733 801 788 775 782 757 681 667 728 757 718 679 669 659 600 541 554 568 516 464 464 464 462 461 511 562
1403E62j7j6L5L6n1n0K2K3j1j1O2O2k9k9K3K2MLN5N5m2m2m1m2l7l7L6L6j6j6L6L6l7l6l7l7
$$ 562 545 529 564 600 549 499 521 544 533 522 584 646 617 588 611 633 637 640 695 750 708 666 625 583 546 509 545 581 565 549 585 621 584 548 511 474
1399D74j3j2L9L9k4k3O9P0PQN9N9m6m5OOm5m4K8K8k7k7K5K5NNN7N6j9j9j9j9l1l1Q4Q3m6m7
$$ 474 461 449 488 527 503 480 549 619 626 634 693 752 706 661 667 673 628 584 612 640 613 586 611 636 641 646 703 759 740 721 702 683 652 621 705 788 742 695
1394F95m6m7p1p2K2K1m2m3j2j2NMR8R8OONOo9o9O6O6j0j1M2M2l3l3M0L9M3M3M3M3o4o4RRo2
$$ 695 649 602 531 459 481 502 460 417 405 393 398 402 500 598 604 610 615 621 552 483 549 615 605 594 636 678 645 612 652 691 734 777 820 863 799 735 744 753 691
1390F91o2J0J1k7k8K4K5l2l2L0L0MMO6O6l2l1L0L1j2j2j4j4m7p8l5K7Nk6nmn5n6M9M8J0J0
$$ 691 629 639 650 623 595 619 644 612 580 610 640 644 648 714 780 748 717 747 778 766 754 740 726 679 601 566 593 598 572 567 563 508 452 501 549 559 569
1385E69PQll5J1P2OOO8O8rp2ML5k2q3q6k3k2q4k0M3J2k0K6Q8L9k4oK5K4l8l8K5j3m4J9M9K1
$$ 569 576 584 581 546 557 629 635 641 709 777 768 696 700 735 713 630 544 521 499 415 395 438 450 430 456 544 583 559 553 578 602 564 526 551 538 494 513 562 583
1380E83m2k5Pl0o1j9M4N7nmN7M7j6j5M7K3m0k0J1Ok6J7P9L3l0j0K1l1o2k0M3L0l3l1L1K4q
$$ 583 541 516 523 493 432 413 457 514 509 505 562 609 593 578 625 648 608 588 599 605 579 596 675 708 678 668 689 658 596 576 619 649 616 585 616 640 632
1376F32N2Q3L4p0m8J4j4p6p5j2ll5n0J2L4Kj3N0L5NQM0j5j5N0M9k1k2k2k2M8M9M8M9rqrqj
$$ 632 684 767 801 731 683 697 683 607 532 520 517 482 432 444 478 480 467 517 552 557 565 605 590 575 625 674 653 631 609 587 635 684 732 781 772 764 755 747 746
1371G46jnnk0q3j09oL1l0k4L9K9K9L3L4j9j8M4M5RRRRmlmmM3M3KO4O3m1m1m1n2n1l0L1J8q5
$$ 746 745 740 735 715 632 523 517 548 518 494 533 562 591 624 658 639 621 665 710 719 728 737 746 742 739 735 731 774 817 819 883 946 905 864 823 771 720 690 721 739 654
1366F54o3%Jo1o2KK4l7l8K5Q6K3mlpo8l3P0P6J3ppmllmRQQRJ8J9k3M0Or8p5j3M8j4l8l7l3
$$ 654 591 591 592 531 469 471 495 458 420 445 531 554 550 547 540 472 439 509 585 598 591 584 580 577 574 570 579 587 595 604 622 641 618 658 664 566 491 478 526 512 474 437 404
1361D04l3l2l3jjkjL5L5L5L5N5N5M9M9M3o0m1K2M5j7j8M6M1k0q1j8K8ln2J1M2k1l2jRk2m1
$$ 404 371 339 306 305 304 302 301 336 371 406 441 496 551 600 649 692 632 591 613 658 641 623 669 710 690 609 591 619 616 564 575 617 596 564 563 572 550 509
1356E09K1L7k6n7NO2jl1L0J08M5j2m4m4m4l3K9L9k3m7N7J07M4m9j6M7J7l8l9Jl1n2J1M4j7
$$ 509 530 567 541 484 489 551 550 519 549 657 702 690 646 602 558 525 554 593 570 523 580 687 731 682 666 713 730 692 653 654 623 571 582 626 609
1352F09j09m7Nk5m1K1O0K8k0M2O7No6lO7L6j5j5j0j0o2o2J7J8k1M1Q3K1l3l4J3J2j9j8L5L6
$$ 609 500 453 458 433 392 413 473 501 481 523 590 595 529 526 593 629 614 599 589 579 517 455 472 490 469 510 593 614 581 547 560 572 553 535 570 606
1347F06l9l9ol8n5PL9M0J2J3N1N2k4k5K3l9r1k9N8N8K7K7M1k2p7m6L5L6l6l5O1O1J0RO5O5
$$ 606 567 528 522 484 429 436 475 515 527 540 591 643 619 594 617 578 487 458 516 574 601 628 669 647 570 524 559 595 559 524 585 646 656 665 730 795
1343G95pqool7l7L9L9j2j3rj0m2m2L2Ko2j0M4M4k6k5QQm3m4K8K7q6q7NNNON3N3m1m0O1O0n3
$$ 795 788 780 774 768 731 694 733 772 760 747 738 728 686 644 676 678 616 606 650 694 668 643 651 659 616 572 600 627 541 454 459 464 469 475 528 581 540 500 561 621 568
1338E68n3J3J3J3J3J10J10nmL9M0m3r6m4j3l3l4QQk3k3j0j0j00j01J4O6L7L7R7R7ro0l6l6
$$ 568 515 528 541 554 567 677 787 782 778 817 857 814 718 674 661 628 594 602 610 587 564 554 544 444 343 357 423 460 497 594 691 682 622 586 550
1334E50p1p0N2N1%%N0N0k2k3JJl0l1Q3Q2j1j0J0J1q3j15k0L2j8p1j3L9K8mL3Q5N2%nom0m0
$$ 550 479 409 461 512 512 512 562 612 590 567 568 569 539 508 591 673 662 652 662 673 590 475 455 487 469 398 385 424 452 448 481 566 618 618 613 607 567 527
1329E27N8N8l5l6K8K7m5p6j2L9ll4K4N6j6m8ON8ml6L0Q2Pm4J5J5m9m8%L0j0p2qN4qp0k3L9
$$ 527 585 643 608 572 600 627 582 506 494 533 530 496 520 576 560 512 518 576 572 536 566 648 655 611 626 641 592 544 544 574 564 492 484 538 530 460 437 476
1324D76L9k3j4M9J1J2P2J03J7m6RQo0j22l2L0L1l2pN5po9l1L2L1l0J1P2J1n1rN3N4rn2J0p
$$ 476 515 492 478 527 538 550 622 725 742 696 705 713 653 531 499 529 560 528 521 576 569 500 469 501 532 502 513 585 596 545 536 589 643 634 582 592 585
1320E85l9J6P7%j05n9LJo2l1L0L1l2k5L7J8j3L7O9K5l6KO5O4LLO6Ko1m5j5n7j19l9O5M1k1
$$ 585 546 562 639 639 534 475 478 479 417 386 416 447 415 390 427 445 432 469 538 563 527 529 594 658 661 664 730 732 671 626 611 554 435 396 461 502 481
1315D81J1P3J1n2m4J8%l1NO7J0n3nR9P5J3k5L6L7k6l2L1P2M0N2N2l1j34j24k0J6m6l6K6Rk3
$$ 481 492 565 576 524 480 498 498 467 472 539 549 496 491 590 665 678 653 689 726 700 668 699 771 811 863 915 884 750 626 606 622 576 540 566 575 552
1311E52LO5Jo1j4j4M4M5K5K5l3l4n4QL5o9q4k2M0M1Q6Q7M8n5n9M6J9m3p3j0N2j1l0L2klpN6
$$ 552 555 620 621 560 546 532 576 621 646 671 638 604 550 558 593 524 440 418 458 499 585 672 720 665 606 652 671 628 555 545 597 586 556 588 586 583 576 632
1306F32K3q0j08mL5L5M1M0M4M4k0M1O9l5r3l2O6Mm2m1m0l9J1J14J14J0l0l0l7l6m9m9J4J4
$$ 632 655 575 467 463 498 533 574 614 658 702 682 723 792 757 664 632 698 702 660 619 579 540 551 665 779 789 759 729 692 656 607 558 572 586
1302E86kkkkm4m5J8J7KKKLjjO2O1J5J5J5J5n1n1J2J2KLKLn5n4n4n5l2l2L0L0J2J2J3J2m4m5
$$ 586 584 582 580 578 534 489 507 524 526 528 530 533 532 531 593 654 669 684 699 714 663 612 624 636 638 641 643 646 591 537 483 428 396 364 394 424 436 448 461 473 429 384
1297C84J8J7J4J4J4J4KKKKLMLLl0l0L2L2j9k0J6J6k1M1J14N2J8J7N2j0r1k9NMo1o2k7k7o5
$$ 384 402 419 433 447 461 475 477 479 481 483 486 490 493 496 466 436 468 500 481 461 477 493 472 513 627 679 697 714 766 756 665 636 641 645 584 522 495 468 403
1292D03kP7P7J1J2ko4j06m3P4P3mnK7K7m1m1J5J5m9J3P2P1J4J4J4J4l9l9J3J3o6o7j5j5o9
$$ 403 401 478 555 566 578 576 512 406 363 437 510 506 501 528 555 514 473 488 503 454 467 539 610 624 638 652 666 627 588 601 614 548 481 466 451 382
1288C82o8QPj6M6O4O3J3J3M9j4m1m0M9M9j2j2M0M0m3m3RRm0m1N3N3j5j5j1j1o0KQ1Q2k6k6
$$ 382 314 322 329 313 359 423 486 499 512 561 547 506 466 515 564 552 540 580 620 577 534 543 552 512 471 524 577 562 547 536 525 465 467 548 630 604 578
1283E78NOl7l7P8P7L5L5L9k4q3q2PPn2n3O2O1M3M2P3P3l8l7l8l8r8r9L6L6l3l3kkl6l5P8J09
$$ 578 583 589 552 515 593 670 705 740 779 755 672 590 597 604 552 499 561 622 665 707 780 853 815 778 740 702 604 505 541 577 544 511 509 507 471 436 514 623
1279F23O0l%l1p0p0K2K1kkP1P1j7j7P3P3Qn5l7oj0j1M2M2n7q8QO9K5oJ5J6o3o2J0J0j7j7N5
$$ 623 683 680 680 649 579 509 531 552 550 548 619 690 673 656 729 802 810 755 718 712 702 691 733 775 718 630 638 707 732 726 741 757 694 632 642 652 635 618 673
1274F73N6l1l2K1K0j7j8L3O5Pn5mK7k7k7K6N8Ln9l9rj8j8J5J5q2q3J4P6J4m8k6Mm2m2nN8L
$$ 673 729 698 666 687 707 690 672 705 770 777 722 718 745 718 691 717 775 778 719 680 671 653 635 650 665 583 500 514 590 604 556 530 534 492 450 445 503 506
1269E06k7QP1L4MK4K5J8J9J8J8r0r0QP1K4pJ4J4p7p7J9Q1L7k5J2J2m6p6k5L7j7q0nN8M0J0
$$ 506 479 487 558 592 596 620 645 663 682 700 718 628 538 546 617 641 634 648 662 585 508 527 608 645 620 632 644 598 522 497 534 517 437 432 490 530 540
1265E40O4J27N6pJ2M4k3n5%L1p6p5L1L0k8k9k8k8o5o5kkl2l3K7K6Mn8k3Q1R0K8O2O3Rr6p2
$$ 540 604 731 787 780 792 836 813 758 758 789 713 638 669 699 671 642 614 586 521 456 454 452 420 387 414 440 444 386 363 444 534 562 624 687 696 600 528
1260E28rK7K6L1L0ONONp3p4PJ10Q5k0j7j7k3k3L5L5Ln9rJ37J33K9ppr2r1k9l0j3j4PO9Nj00
$$ 528 519 546 572 603 633 639 644 650 655 582 508 515 625 710 690 673 656 633 610 645 680 683 624 615 752 885 914 907 900 808 717 688 658 645 631 638 707 712 612
1255F12p6j3j9q2l8O5N3N2J8P9M4o1l7K5mo7o7nK4l8o1M2L1l2k8L3L4k9k8L3L8k5m9N6M0k3
$$ 612 536 523 504 422 384 449 502 554 572 651 695 634 597 622 618 551 484 479 503 465 404 446 477 445 417 450 484 455 427 460 498 473 424 480 520 497
1251D97j9M2M5j8J7J8j7p8m4O0M1k1k2M1K4p9q0K4N4rqN4P6k8o3jk3k3k4k3N5ql5O9R8L6l1
$$ 497 478 520 565 547 564 582 565 487 443 503 544 523 501 542 566 487 407 431 485 476 468 522 598 570 507 506 483 460 436 413 468 460 425 494 592 628 597
1246E97l0oo8r5QR4L1J0J0m7m7m7m6j1j1j0j1K6K6K6K6M8M9QO9P5k9o8oK4l8m0K1K9p4j09
$$ 597 567 561 493 398 406 500 531 541 551 504 457 410 364 353 342 332 321 347 373 399 425 473 522 530 599 674 645 577 571 595 557 517 538 567 493 384
1242C84m8KJNNk5k5k4k5K5K5K6K5L4L5k8k8K8K9K8K9L3L4l3l2J9m3p0L4Q4K2l8K4P4J2n0J2
$$ 384 336 338 339 344 349 324 299 275 250 275 300 326 351 385 420 392 364 392 421 449 478 511 545 512 480 499 456 386 420 504 526 488 512 586 598 548 560
1238E60Q9K8l8l7J3J2J3J3L8L9o5o5rrqrM2M2k0k0K3K4l8l9K5K6K5K5J4J4m8m8kjkjK0K0m3
$$ 560 649 677 639 602 615 627 640 653 691 730 665 600 591 582 574 565 607 649 629 609 632 656 618 579 604 630 655 680 694 708 660 612 610 609 607 606 626 646 603
1233F03m2KJo0o1M7M6K5N6P8J5o0l0K8mk3M0P8J6r7l4N0J8n4n3K1K0j2j2M6J6l6K7J06P5j
$$ 603 561 563 564 504 443 490 536 561 617 695 710 650 620 648 644 621 661 739 755 658 624 674 692 638 585 606 626 614 602 648 664 628 655 761 836 835
1228H35jN1j2p0p0MLm8m8L2L2o1o2KKk9k9L2L1k0k1PPm5m5LLm9m8L9M0l3l3P6P7NMK6K5o7
$$ 835 834 885 873 803 733 737 740 692 644 676 708 647 585 587 589 560 531 563 594 574 553 560 567 522 477 480 483 434 386 425 465 432 399 475 552 557 561 587 612 545
1223E45o8j9j9j9j9O8O9nmL4L3l9l9L5L4j7j7O7O8m7m7O0O0l8j00k7Nj6j7P3P3k0k1RRm4m3
$$ 545 477 458 439 420 401 469 538 533 529 563 596 557 518 553 587 570 553 620 688 641 594 654 714 676 576 549 554 538 521 594 667 647 626 635 644 600 557
1219E57P6P7k2q4l7on8n9M5M5pplmp6p5L3L3j9j9M8M8ml4K1Q4L3KJ2J3p9p9NO8L8k4J4M4q
$$ 557 633 710 688 604 567 561 503 444 489 534 527 520 517 513 437 362 395 428 409 390 438 486 482 448 469 553 586 588 600 613 534 455 460 528 566 542 556 600 592
1214E92qM7M7k6k5LMm8m8M4M5l1r3k3M0K0j0L3O4qm0M5P5j9q1OO8L5k6k8Lm9q0j0N3K1m1j1
$$ 592 584 631 678 652 627 630 634 586 538 582 627 596 503 480 520 540 530 563 627 619 579 624 699 680 599 605 673 708 682 654 657 608 528 518 571 592 551 540
1210E40K0l2l2J3J3l8p0oN6Nn6KO4M7J6M6J09O0m4m1j0l4l4M0M0l3l2J6J7j4m5rN3Mn9K0Q3
$$ 540 560 528 496 509 522 484 414 408 464 469 413 415 479 526 542 588 697 757 713 672 662 628 594 634 674 641 609 625 642 628 583 574 627 631 572 592 675
1205F75J0n3j1N1jo3j9M4rp0j4M9J6m6KL2m0j03m7N7L4k9l6K6rj0M5J08Kj02o3M2M6j6N1J13
$$ 675 685 632 621 672 671 608 589 633 624 554 540 589 605 559 561 593 553 450 403 460 494 465 429 455 446 436 481 589 591 489 426 468 514 498 549 662
1201F62P0l3j8j7n5n5K0K0ppKO4K9p5n1J0Qn4l2L0L2l0k3Q0N6noN6P7k8n3n4j8q1o0M3J3J2
$$ 662 732 699 681 664 609 554 574 594 587 580 582 646 675 600 549 559 567 513 481 511 543 513 490 570 626 621 615 671 748 720 667 613 595 514 454 497 510 522
1196E22M7M6Qr6r1J4N0j3j5M8M7j5j1N1N1j1l6K6K6l7K1Q3K8j17j08nK9l3j6M8M7j5j2N1P5
$$ 522 569 615 623 527 436 450 500 487 472 520 567 552 541 592 643 632 596 622 648 611 632 715 743 626 518 513 542 509 493 541 588 573 561 612 687
1192F87l0oN7N3ql4K8N2n2r9l7oo8o2M2P7J5j7j8j7j7L4R6O2m3m0K3N3rJ1J14Q4k1r0k9k8
$$ 687 657 651 708 761 753 719 747 799 747 648 611 605 537 475 517 594 609 592 574 557 540 574 670 732 689 649 672 725 716 727 841 925 904 814 785 757
1187G57r0r4J1M9j3k6L6L9k3n6M8Q6K5qN4N7oJ0J13J13Rk3L8O3O4M8J11J27j9p9p8k2k1q3
$$ 757 667 573 584 633 620 594 630 669 646 590 638 724 749 741 795 852 846 856 969 1082 1091 1068 1106 1169 1233 1281 1392 1519 1500 1421 1343 1321 1300 1217
1183A217k1k2j25j54n1j9j23j47m4L4k7n8MO7Nm7J5M7j6q3k2M4M3jjL8k4n3RP2Rn4QL6L5k6
$$ 1217 1196 1174 1049 895 844 825 702 555 511 545 518 460 464 531 536 489 504 551 535 452 430 474 517 516 515 553 529 476 485 557 566 512 520 556 591 565
1179E65L5M0k3j00l8K7l5p2L2J08M6ppO0ll8K5Q9Q9JJk6k6q1j8J7m6j07m6j8j7p9j6N1j2n3
$$ 565 600 640 617 517 479 506 471 399 431 539 585 578 571 631 628 590 615 704 793 794 795 769 743 662 644 661 615 508 462 444 427 348 332 383 371 318
1174C18J0P5P5J1J2N0j2n5PJ07M4l8l8l9l8r9l6nnj5M7J09M7m8m8N1N2l4l4K8K8l2l3K9L0
$$ 318 328 403 478 489 501 551 539 484 491 598 642 604 566 527 489 390 354 349 344 329 376 485 532 484 436 487 539 505 471 499 527 495 462 491 521
1170E21%JL8k3r4m2L9Rn5lP7M5o8o8K4K3j1j1N1jo8l8N8N8J0M2J05N3n1n1L9L9KLL4L3r2r3
$$ 521 521 522 560 537 443 401 440 449 394 391 468 513 445 377 401 424 413 402 453 452 384 346 404 462 472 514 619 672 621 570 609 648 650 653 687 720 628 535
1165E35k0k0k5k4M8J7n5lJ00J01l2l3M1M0m2m2J0J0l6l7N7N6NNP8P7r2r3JJn2n3M1M2NON8
$$ 535 515 495 470 446 494 511 456 453 553 654 622 589 630 670 628 586 596 606 570 533 590 646 651 656 734 811 719 626 627 628 576 523 564 606 611 617 675
1161F75N8n3n3K0J9m6m6O9O8kkkko1o2P4J04j4o6jL1m5m5L0L0n2n2K0N2k2p4kN0nl7j5j6m8
$$ 675 733 680 627 647 666 620 574 643 711 709 707 705 703 642 580 654 758 744 678 677 708 663 618 648 678 626 574 594 646 624 550 548 598 593 556 541 525 477
1156D77m9O6O6%jN2N1onK5K6p2p2M2P4k7p9k6K7j5j6L9M0q5q5M9N0J9J8P0P1l5l5J7J7m3m3
$$ 477 428 494 560 560 559 611 662 656 651 676 702 630 558 600 674 647 568 542 569 554 538 577 617 532 447 496 546 565 583 653 724 689 654 671 688 645 602
1152F02j2j2o4o3QRK0K0P3P2l0l0M3M3J3J3J4J3r5r5k3k2J%R4R4N1N1N0N1q5q5j3j2o1o1J2
$$ 602 590 578 514 451 459 468 488 508 581 653 623 593 636 679 692 705 719 732 637 542 519 497 498 498 592 686 737 788 838 889 804 719 706 694 633 572 584
1147E84J2m9m8O6O6RQJ9Q2Rr5m0K2rp1K0Q1L4p0m1O2K7p7m8J5j3j4K2Q4K9p5m3O0K3m0l7K5
$$ 584 596 547 499 565 631 640 648 667 749 758 663 623 645 636 565 585 666 700 630 589 651 678 601 553 568 555 541 563 647 676 601 558 618 641 601 564 589
1143E89Mn9q2K2M8j4j1N1J4m7jJ02O4m0oR8P6J4j5M8O2jjO2M4j7J7J8j8q1l7O6K3q1p1p2j11
$$ 589 593 534 452 474 522 508 497 548 562 515 514 616 680 640 634 732 808 822 807 855 917 916 915 977 1021 1004 1021 1039 1021 940 903 969 992 911 840 768 657
1138F57j73q9N7J00L8QM0J1n1k2M0j1p3o5L8L6k6k4L8L8k4QO9M5j6k0M3k3j26r5QO4KL3R5
$$ 657 484 395 452 552 590 598 638 649 598 576 616 605 532 467 505 541 515 491 529 567 543 551 620 665 649 629 672 649 523 428 436 500 502 535 630
1134F30L7o7r8OJ2n0m0O4O8ONO8L8o5o6L8L0l1n3N1L5k6k5L9P8J6j8M5K8p6j03m0l6o6l5P0
$$ 630 667 600 502 508 520 470 430 494 562 568 573 641 679 614 548 586 616 585 532 583 618 592 567 606 684 700 682 727 755 679 576 536 500 434 399 469
1129D69O8POO9R2j1k1M0O5l8j09m7j3p5m7N8Q0J7l4K8J5q9r7l4K6l6l1P3R4j0j9M5P3l0n9
$$ 469 537 544 550 619 711 700 679 719 784 746 637 590 577 502 455 513 593 610 576 604 619 530 433 399 425 389 358 431 525 515 496 541 614 584 525
1125E25LN1j1m2K0P7J5j9M4P6k7p7j4J0n3p6K8J01L9j3M9Q3k1r1k9Qn4p7K6P5J2n7NQ3K1n2
$$ 525 528 579 568 526 546 623 638 619 663 739 712 635 621 631 578 502 530 631 670 657 706 789 768 677 648 656 602 525 551 626 638 581 586 669 690 638
1121F38J1M9j4o5lM2k0r2l0M2k1q9k6J5J6J9J9M6M7k7L6J10Oo6mM8n7j44q1j0ronL2L1JJN3
$$ 638 649 698 684 619 616 658 638 546 516 558 537 448 422 437 453 472 491 537 584 557 593 703 709 643 639 687 630 486 405 395 386 380 375 407 438 439 440 493
1116D93N3j9k0K9K8o5o5P7P8j6j6L7L7l5l6k1k1p3p4N5N4KKM4M4m9m9L6L6L6L7J17J17LLR4
$$ 493 546 527 507 536 564 499 434 511 589 573 557 594 631 596 560 539 518 445 371 426 480 482 484 528 572 523 474 510 546 582 619 736 853 856 859 953
1112I53R4M2M2O9O9q6q7p1p2j44j44k7k7j00j00K9K8klP3P3k1k1O5O4k9k9J9J9n4n4K1K2l1
$$ 953 1047 1089 1131 1200 1269 1183 1096 1025 953 809 665 638 611 511 411 440 468 466 463 536 609 588 567 632 696 667 638 657 676 622 568 589 611 580
1108E80l1K8K8m5m5N4N4o1o0j6j6m8m7P4P5m0m0QQm4m3R2R2k2k2K6K5q9q8K0K0K0K1N0N1q4
$$ 580 549 577 605 560 515 569 623 562 502 486 470 422 375 449 524 484 444 452 460 416 373 465 557 535 513 539 564 475 387 407 427 447 468 518 569 485
1103D85q4lkl3l3N2N3m1m1N2N3K1K1N9N9p6p6N3N4JKL9L9l3l4O1O0p4p5P0P0k4k4QRq5q5O8
$$ 485 401 398 396 363 330 382 435 394 353 405 458 479 500 559 618 542 466 519 573 574 576 615 654 621 587 648 708 634 559 629 699 675 651 659 668 583 498 566
1099E66O8o2o3J7Q0J4r0m3J9k2k1O4O4p0p1pqr4r5l9O4L8L7J33J33N7m7ooo4o4N0N0k2k3L3
$$ 566 634 572 509 526 606 620 530 487 506 484 463 527 591 521 450 443 435 341 246 207 271 309 346 479 612 669 622 616 610 546 482 532 582 560 537 570
1094E70L3l9m0J2J1q3q2j9j8n0n0M0L9RQQ7Q6k8k7J6J6p3p3l9K4k4q7rN2%o1rN4Nk6N3J16
$$ 570 603 564 524 536 547 464 382 363 345 295 245 285 324 333 341 428 514 486 459 475 491 418 345 306 330 306 219 210 262 262 201 192 246 251 225 278 394
1090C94M6j7J3P5Ln9qN4j9q1j3M9M9j4K9R1N8mL9P0lj07o2J%o1J5J20O4LJ6P7Qr6m2K1%l1
$$ 394 440 423 436 511 514 455 447 501 482 401 388 437 486 472 501 592 650 646 685 755 752 645 583 584 584 523 538 658 722 725 741 818 826 730 688 709 709 678
1085F78K2Q4J8q5n0N4K8l4m5J8l1r4l3P2M8j4K0Q2J4q9o9L5J0n3LO6L4k7KO4J5q9p4j1j1p3
$$ 678 700 784 802 717 667 721 749 715 670 688 657 563 530 602 650 636 656 738 752 663 594 629 639 586 589 655 689 662 664 728 743 654 580 569 558 485
1081D85m3O2L8k4qN3P8k7o2Jlo4l8K3K4l8m9J4J4m8j4M8K2q1n7M8M5n9n2J0J1n2l5O9M8j4
$$ 485 442 504 542 518 510 563 641 614 552 553 550 486 448 471 495 457 408 422 436 388 374 422 444 363 306 354 399 340 288 298 309 257 222 291 339 325
1076C25j1R2R5rk2Q1P9k5o9pJ7q8n9M4M4n9o0M5M4n9n0N5N4m9l9O5M2k1j1R3R3j1k1M1M1k1
$$ 325 314 406 501 492 470 551 630 605 536 529 546 458 399 443 487 428 368 413 457 398 348 403 457 408 369 434 476 455 444 537 630 619 598 639 680 659
1072F59k7P8P7k6k8L4L1l1m2K1J5q8j08mK4l8m9N5N7m7p6K7K7p6j02KL0l2l6O9J19J7j8M6
$$ 659 632 710 787 761 733 767 798 767 725 746 761 673 565 561 585 547 498 553 610 563 487 514 541 465 363 365 395 363 327 396 515 532 514 560
1068E60O8l5q9J5O2%n4QJ1n2q7J8Q7K5l9K3M7n7q0j7N2j0p3j1M5J3k3L9M1k2m9J2P0l4q0K3
$$ 560 628 593 504 519 581 581 527 535 546 494 407 425 512 537 498 521 568 511 431 414 466 456 383 372 417 430 407 446 487 465 416 428 498 464 384 407
1063D07P1Qo0KP5J3m9J4M4j7n8ML1p4j34l0O0L0pN6J09M7l5K7K3m0n3n3M0M0k0M3P0l4j19
$$ 407 478 486 426 428 503 516 467 481 525 508 450 454 485 411 277 247 307 337 330 386 495 542 507 534 557 517 464 411 451 491 471 514 584 550 431
1059D31n7P2J0p0o9K1K0K4K5P6P6k2k1N1N2k5k5K6K7k5k5M7M8o2o2L1L2k9k8K8K7m9J3O7l7
$$ 431 374 446 456 386 317 338 358 382 407 483 559 537 516 567 619 594 569 595 622 597 572 619 667 605 543 574 606 577 549 577 604 555 568 635 598
1055E98j09j09J9K0J5J6M7M6o6o6K7K7j1j1Q3Q2m5m4PPk7k8O6O7l4l4J8J8l6l7L7L6k6k6Q8
$$ 598 489 380 399 419 434 450 497 543 477 411 438 465 454 443 526 608 563 519 526 533 506 478 544 611 577 543 561 579 543 506 543 579 553 527 615
1050F15Q8k4k5K8K7m9m9Q6Q6n3n3M1M0j0j0Q3Q4n0n0J12J12P2J76L14K53ok34k58k58k61j57
$$ 615 703 679 654 682 709 660 611 697 783 730 677 718 758 748 738 821 905 855 805 917 1029 1101 1277 1591 1844 1838 1604 1346 1088 827 670
1047F70KLl8l7N7N6o5o4QRp5p4K0J9n0n1O5O4m6m5N8N9l7l7K5K6l8l8O3O2m3j05qpk3k2P8
$$ 670 672 675 637 600 657 713 648 584 592 601 526 452 472 491 441 390 455 519 473 428 486 545 508 471 496 522 484 446 509 571 528 423 415 408 385 363 441
1042D41P8m1j02L6L6o9p0L4L5m7m6N8N8ppN1N2%o2MMk1k0P9P9j8q1J9Q1no7L4L4o1o1KKn3
$$ 441 519 478 376 412 448 379 309 343 378 331 285 343 401 394 387 438 490 490 428 432 436 415 395 474 553 535 454 473 554 549 482 516 550 489 428 430 432 379
1037C79n2N8J20L4L3R6R5Pn5L8L8k6q8k9L3m3j06l9K3k4k4Q3J46M1o2mN8LLO6O5m8j11m9J4
$$ 379 327 385 505 539 572 668 763 770 715 753 791 765 677 648 681 638 532 493 516 492 468 551 697 738 676 672 730 733 736 802 867 819 708 659 673
1033F73j02j01j5Q9jo3KO4j8q1K4Q5M4j9M8M7l9j02k7P6Rr6l7K4J4m9J4P7Jo2k6L7m4m3K4
$$ 673 571 470 455 544 543 480 482 546 528 447 471 556 600 581 629 676 637 535 508 584 593 497 460 484 498 449 463 540 541 479 453 490 446 403 427
1029D27Q5J6q8l4K9rp0rN4Pn5NO6Qr7l5P0P4J1R0J93J15k9m3J9j0p3KJ07O1q3r2J2J9q5q3
$$ 427 512 528 440 406 435 426 356 347 401 408 353 358 424 432 335 300 370 444 455 545 738 853 824 781 800 790 717 719 826 887 804 712 724 743 658 575
1024E75K1ko5k4Q0L3l0k8L5qp0qN4j5p8l9O5J3n0j6M7M0k2J2J16N5r0o4M0K3m0K2Q5Mr9m3
$$ 575 596 594 529 505 585 618 588 560 595 587 517 509 563 548 470 431 496 509 459 443 490 530 508 520 636 691 601 537 577 600 560 582 667 671 572 529
1020E29O2N3r1r2N4N7m6m1O3O9Pj7Q8O6l8l5O9Q8K6L0J35J01m5j02m0o7j71j94m9L5k7k4L8
$$ 529 591 644 553 461 515 572 526 485 548 617 624 607 695 761 723 688 757 845 871 901 1036 1137 1092 990 950 883 712 518 469 504 477 453 491
1016D91L7o6o7L7M3k0J7J20J10l5p1L2M2k1j6Q9O6p9q7J7L0p4o9P6R3n2j00NO9l4q1j9J7m5
$$ 491 528 462 395 432 475 455 472 592 702 667 596 628 670 649 633 722 788 709 622 639 669 595 526 602 695 643 543 548 617 583 502 483 500 455
1012D55m0O3Q1k4k3Q1N3m9n0N4J05JJJ06J31K8m2K0J8q5j40l7k2j26j18K8J09No3%N1n3q7
$$ 455 415 478 559 535 512 593 646 597 547 601 706 707 708 814 945 973 931 951 969 884 744 707 685 559 441 469 578 583 520 520 571 518 431
1008D31J7M8n5q7J7J09Oo2%P7J5l6K5O3JkO0Q2k2p4j1L7o6j18j4K8l4j06lN5pn6ON4rq1j9
$$ 431 448 496 441 354 371 480 486 424 424 501 516 480 505 568 569 567 627 709 687 613 602 639 573 455 441 469 435 329 326 381 374 318 324 378 369 288 269
1003B69M1k1p4j1R9L7m0qN3j0o4M0J12Q0PL9R0j4q6k4M7j6o8oN0j2q5k3N5pn9LN7np8j6P5
$$ 269 310 289 215 204 303 340 300 292 345 335 271 311 423 503 510 549 639 625 539 515 562 546 478 472 522 510 425 402 457 450 391 394 451 446 368 352 427
999D27J2n9KN7mn7NQ9K6m9J4P7k6j34p2J2J3p5j2P8J5n4RO9P0l8K4J23O1m0l9L8k5j05j04
$$ 427 439 380 382 439 435 378 383 472 498 449 463 540 514 380 308 320 333 258 246 324 339 285 294 363 433 395 419 542 603 563 524 562 537 432 328
994C28J3J3n3RO3O2k5L8J23O1r7r7J%llN4qj01l9O5O5l8K3J09J10o4o3k9k8j02j01J1J0n5
$$ 328 341 354 301 310 373 435 410 448 571 632 535 438 439 439 436 433 487 479 378 339 404 469 431 454 563 673 609 546 517 489 387 286 297 307 252
990B52OR9R9j6j5N7mq3q4M5M5o9p0J9J9q8k7J18J18j4j3R1R2m3m4K7K7q7q8K4K5m9m8J19J18
$$ 252 258 357 456 440 425 482 478 395 311 356 401 332 262 281 300 212 185 303 421 407 394 485 577 534 490 517 544 457 369 393 418 369 321 440 558
986E58NNN9N9p6p6j1j0j25j25j4j5j4j4J03J03j1j1N8N8n3n2O2J24mmN0N0o5o4P4P4m7j09
$$ 558 563 568 627 686 610 534 523 513 388 263 249 234 220 206 309 412 401 390 448 506 453 401 463 587 583 579 629 679 614 550 624 698 651 542
982E42j1j1p3p3J1P3ml6M0P2j4p5J8Q0m1p2K9R1K6l5M6M5m0p2J2P4k8r0OO8On6M6J08Ko0j2
$$ 542 531 520 447 374 385 458 454 418 458 530 516 441 459 539 498 426 455 546 572 537 583 628 588 516 528 602 574 484 490 558 564 508 554 662 664 604 592
977E92J9m3p5J7P9J7m6N5Q5j8m9N1J13l0r2k5L8k5q7KO4l9j02n2J0n3j14k2M1l8p0N3J15L9
$$ 592 611 568 493 510 589 606 560 615 700 682 633 684 797 767 675 650 688 663 576 578 642 603 501 449 459 406 292 270 311 273 203 256 371 410
973D10o5K4J28O3m0L4R7L2l1MO5l5r8j3R1j1j14n2N2lo6J9J23R0j4KL3r2j54p1P6K8l3L2R4
$$ 410 345 369 497 560 520 554 651 683 652 656 721 686 588 575 666 655 541 489 541 538 472 491 614 704 690 692 725 633 479 408 484 512 479 511 605
969F05N5m9j5M8Qr5q5J8pp0J5P7L8o6j7M4j5p7LJ49R5rj7M6l4j38n2N3K1q2l3P1O9l5OO8K6
$$ 605 660 611 596 644 652 557 472 490 483 413 428 505 543 477 460 504 489 412 415 564 659 650 633 679 645 507 455 508 529 447 414 485 554 519 525 593 619
964F19p7q9k6k6q9PJ12J0r4n8M5M6n8l1P4P4l1k7P7M3o0l2L1qj12o1M4M7n8k0J26J25k0m9
$$ 619 542 453 427 401 312 319 431 441 347 289 334 380 322 291 365 439 408 381 458 501 441 409 440 432 320 259 303 350 292 272 398 523 503 454
960D54N4N2n2m8N6Q8j7PJ10P2p4l3P1O8l6m7N6K0j26j25K0N6m8m8N5N6m8m3O0Q4o1r8NM1k0
$$ 454 508 560 508 460 516 604 587 594 704 776 702 669 740 808 772 725 781 801 675 550 570 626 578 530 585 641 593 550 610 694 633 535 540 581 561
956E61k8P7M0j05j46m2mo6k1J25J58J2m1O2O0m4r0J4N0j3l7K6M9n6r8l6oo7o8L6P7J6j6Q7
$$ 561 533 610 650 545 399 357 353 287 266 391 549 561 520 582 642 598 508 522 572 559 522 548 597 541 443 407 401 334 266 302 379 395 379 466
952D66J14l1r2J2M0o3q6J7Q0k3j02JM1k1l3P1J05Kq2K3O1%m6N8J21J7l9K4M7n6o5L9J00no8
$$ 466 580 549 457 469 509 446 360 377 457 434 332 333 374 353 320 391 496 498 416 439 500 500 454 512 633 650 611 635 682 626 561 600 700 695 627
947F27nJ8q6j13j0R5ro7L7R6pm2K1P5k9o8L7J19k6j14n1Qn4j14j0J35L2q5k3P8J6p7j5J13
$$ 627 622 640 554 441 431 526 517 450 487 583 576 534 555 630 601 533 570 689 663 549 498 506 452 338 328 463 495 410 387 465 481 404 389 502
943E02Q2k5L8P3J2l9O6J28K4o1JJ02M1m8J5J16N4m0j0M0k4j23o2Mn9j31k7N4rq9k6P7J5j04
$$ 502 584 559 597 670 682 643 709 837 861 800 801 903 944 896 911 1027 1081 1041 1031 1071 1047 924 862 866 807 676 649 703 694 605 579 656 671 567
939E67m2K1m2j10m7J8m4r1J4J33P1j9J2O1kr0k7P6J4r4l1P2J0r9l7Q8N8m3j2R0N9l8l8L0l2
$$ 567 525 546 504 394 347 365 321 230 244 377 448 429 441 502 500 410 383 459 473 379 348 420 430 331 294 382 440 397 385 475 534 496 458 488 456
935D56j33p1P6P7L0K9R2j3j10m9R7R7n9n9PQr1k9P5J3r4r4M8M8k9k9P5P4k4k4Q0Q0o5o6Q0
$$ 456 323 252 328 405 435 464 556 543 433 384 481 578 519 460 467 475 384 355 430 443 349 255 303 351 322 293 368 442 418 394 474 554 489 423 503
931E03Q0j1j1N1N2m1m1N6oj26j27N7N6n3n4N0N0m8m9N6N5m4m3O0O0m3m4J9J8p7p8O8O8j6j5
$$ 503 583 572 561 612 664 623 582 638 632 506 379 436 492 439 385 435 485 437 388 444 499 455 412 472 532 489 445 464 482 405 327 395 463 447 432
926D32Q8Q9k8k7P6P6l0l1L2L2p3p3L1L1n3n2R3R3J7J6J20J21o6o5O3J67J34J33K59L22L65
$$ 432 520 609 581 554 630 706 676 645 677 709 636 563 594 625 572 520 613 706 723 739 859 980 914 849 912 1079 1213 1346 1605 1927 2292
922B292N11P62P61M79Q5k27m96p19p19m46k59k28k28j06m3j79j79o4kj19j19nN7k5k5P9P8
$$ 2292 2803 3565 4326 4805 4890 4663 4167 3448 2729 2283 2024 1796 1568 1462 1419 1240 1061 997 995 876 757 752 809 784 759 838 916
919I16k7q9%O2k9r2KO5l8j00J5P6l5r7L8J00k8r0K2Q5Kj01J3P5kj06l0L2k5q7K6R0Jo1K7J31
$$ 916 889 800 800 862 833 741 743 808 770 670 685 761 726 629 667 767 739 649 671 756 758 657 670 745 743 637 607 639 614 527 553 643 644 583 610 741
915G41Mj00m8N6j4j18m0K2l8j00rR5J3m9K4Q6J7q7l4O9Jo0J2P4j3j16k6P8J8q6j0N1l2j37
$$ 741 745 645 597 653 639 521 481 503 465 365 356 451 464 415 439 525 542 455 421 490 491 431 443 517 504 388 362 440 458 372 362 413 381 244
911B44k7J18L5o9PJ10N3n2J9J23O0q5o2M2Nr9k7P8M4o0k9P5O1m2j9M3qj12q0K3j7q0l1P4K9
$$ 244 217 335 370 301 308 418 471 419 438 561 621 536 474 516 521 422 395 473 517 457 428 503 564 522 503 546 538 426 346 369 352 272 241 315 344
906C44p4JJ04Q4K1M9J54Q9j5j7Q6K5j21n0R5Q2o2o3%qp0k5P9M0q4n5P0J5j11n8O6N2p3m2Q3
$$ 344 270 271 375 459 480 529 683 772 757 740 826 851 730 680 775 857 795 732 732 724 654 629 708 748 664 609 679 694 583 525 591 643 570 528 611
902F11N2p1p2N3N3p1p1N3Q6l8qJ17J3j11n9O6L8q7q6L8L5r0r0L5P1n4n4P1N9o5o6N9P5n0n0
$$ 611 663 592 520 573 626 555 484 537 623 585 577 694 707 596 537 603 641 554 468 506 541 451 361 396 467 413 359 430 489 424 358 417 492 442 392
898C92P4Q7l8l8Q6J00k5o3jMj21r4L1Q2m3m2Q2J25%l7K6K5r9j03K1L8q6n5P0J29Mo8N7N6o9
$$ 392 466 553 515 477 563 663 638 575 574 578 457 363 394 476 433 391 473 598 598 561 587 612 513 410 431 469 383 328 398 527 531 463 520 576 507
893E07o8N6O3o2j13J2P5m8q0M5J32Ro5O1Q7l8r0L5J01k4r7K8Q2m2m2Q2J24%r3L1Q6l9j32q
$$ 507 439 495 558 496 383 395 470 422 342 387 519 528 463 524 611 573 483 518 619 595 498 526 608 566 524 606 730 730 637 668 754 715 583 575
889E75R1l3q6L9R8k7p9M6J19oj37j3N8on5OM3o1j33l0Q3K1n5QP2p4j26J9J55R2j9M3J16J3
$$ 575 666 633 547 586 684 657 578 624 743 737 600 587 645 639 584 590 633 572 439 409 492 513 458 466 538 464 338 357 512 604 585 628 744 757
885G57n9KR8oj02KQ3k0r3J0J06Kr1J3Q8j5j45q3L1l2n7M7J70O7m5J7J17J3j19n7K7l5q6k5
$$ 757 698 700 798 792 690 692 775 755 662 672 778 780 689 702 790 775 630 547 578 546 489 536 706 773 728 745 862 875 756 699 726 691 605 580
881E80P6J4p9j7J02L9p8m7M1k0j19j5R3L0m2K0R5j0j65o1Q0J8j13n0J21R1k3PJ21N8p9j6J23
$$ 580 656 670 591 574 676 715 637 590 631 611 492 477 570 600 558 578 673 663 498 437 517 535 422 372 493 584 561 568 689 747 668 652 775
877G75O1j15q4N8N8k8L3J44J13mnR9L6r8l6Q2Q3k6L7J41P9l6K7J85J22l6l6J32J31L8L9J73
$$ 775 836 721 637 695 753 725 758 902 1015 1011 1006 1105 1141 1043 1007 1089 1172 1146 1183 1324 1403 1367 1394 1579 1701 1665 1629 1761 1892 1930 1969 2142
873B142J74llJ20J19NNJ29J28k6k7J49J50L5L6J31J32K3Q6K55K55J44J45K36K35N3rJ05J05
$$ 2142 2316 2313 2310 2430 2549 2554 2559 2688 2816 2790 2763 2912 3062 3097 3133 3264 3396 3419 3505 3760 4015 4159 4304 4540 4775 4828 4819 4924 5029
870E029j0rJ39K01J32J31L01K38m5j91j26o4j38p7R0J51M7M8J92J93P4P4J12M9j19j81k0j9
$$ 5029 5019 5010 5149 5350 5482 5613 5914 6152 6107 5916 5790 5726 5588 5511 5601 5752 5799 5847 6039 6232 6306 6380 6492 6541 6422 6241 6221 6202
866F202j17j16K3K4r8j59ppj21j22j1N2n7n6N4N3o1o0N8N9j18j18L8L9j21k25r9r9j99j99
$$ 6202 6085 5969 5992 6016 5918 5759 5752 5745 5624 5502 5491 5543 5486 5430 5484 5537 5476 5416 5474 5533 5415 5297 5335 5374 5253 5028 4929 4830 4631 4432
862D432n2n3j83j83n9Lj06j69n4Rj41j40OO8q0j44j7Q6p0j73q8k6j60k23r9Nq6j89o9L4m3
$$ 4432 4380 4327 4144 3961 3902 3905 3799 3630 3576 3585 3444 3304 3310 3378 3298 3154 3137 3223 3153 2980 2892 2866 2706 2483 2384 2389 2303 2114 2045 2079 2036
859B036j05J7Q0r2j95n7M7m6j50l9O5J1r3RP1k2j26JO3m5j70r0L5l2r3K5J51l3j57j09J5k8
$$ 2036 1931 1948 2028 1936 1741 1684 1731 1685 1535 1496 1561 1572 1479 1488 1559 1537 1411 1412 1475 1430 1260 1170 1205 1173 1080 1105 1256 1223 1066 957 972 944
855I44k7N1J13J1j14k6R8nj30n6P0Oj17j4J10M9p6K8J53M9p6PJ33K8r7l9Q5K3j01pJ18J4j11
$$ 944 917 968 1081 1092 978 952 1050 1045 915 859 929 935 818 804 914 963 887 915 1068 1117 1041 1048 1181 1209 1112 1073 1158 1181 1080 1073 1191 1205 1094
851A094o9N5N5o9m0Q5K3j02JJ26K2j02k2J02jj26j00K4Q6l8JJ24O3o2J4J38J08j7QJ32K9r6
$$ 1094 1025 1080 1135 1066 1026 1111 1134 1032 1033 1159 1181 1079 1057 1159 1158 1032 932 956 1042 1004 1005 1129 1192 1130 1144 1282 1390 1373 1381 1513 1542 1446
847A446n1P4P3n1%J24O2o3J0J34P2n2l3R2K9r5p8M8M7p8rJ16O4j44r5J13J22jK3J47R0j17
$$ 1446 1395 1469 1542 1491 1491 1615 1677 1614 1624 1758 1830 1778 1745 1837 1866 1771 1693 1741 1788 1710 1701 1817 1881 1737 1642 1755 1877 1876 1899 2046 2136 2019
843B019p6M8M3q2k1J04J04k0m2Q2Q3m2l7Q9Q8l6q1M5J8j06j28Q0R6k9j4J10M9p7q0M3P5m9
$$ 2019 1943 1991 2034 1952 1931 2035 2139 2119 2077 2159 2242 2200 2163 2252 2340 2304 2223 2268 2286 2180 2052 2132 2228 2199 2185 2295 2344 2267 2187 2230 2305 2256
839B256o1O4P0n5o7J40J41o7n7O8R4l1q4M2J03k1j29mmj29o8N7N6o7k5J00J47o1j32pK4j01
$$ 2256 2195 2259 2329 2274 2207 2347 2488 2421 2364 2432 2526 2495 2411 2453 2556 2535 2406 2402 2398 2269 2201 2258 2314 2247 2222 2322 2469 2408 2276 2269 2293 2192
835B192j09R9J98P3O9J95K06kj67j04l8j63j59M8J06k0qJ16J94j4j56l1L2l0o1O4J72M7j9
$$ 2192 2083 2182 2380 2453 2522 2717 2923 2921 2754 2650 2612 2449 2290 2338 2444 2424 2416 2532 2726 2712 2556 2525 2557 2527 2466 2530 2702 2749 2730
831B730J06J52n5r5L1J29Ml7Q8J25jo0J47K45J22J2J36J68M3q0M4J90O5j0J15J77N3jJ23J86
$$ 2730 2836 2988 2933 2838 2869 2998 3002 2965 3053 3178 3177 3117 3264 3509 3631 3643 3779 3947 3990 3910 3954 4144 4209 4199 4314 4491 4544 4543 4666 4852
828D852O1n6O9J73M8j02K3J68M3j3J11K15R0JJ26K67J43qN5J98J37K1J25J90Q7k8P6J79P6
$$ 4852 4913 4857 4926 5099 5147 5045 5068 5236 5279 5266 5377 5592 5682 5683 5809 6076 6219 6211 6266 6464 6601 6622 6747 6937 7024 6996 7072 7251 7327
824G327m9N4J58N5j1R4K18P2r0k8J21J21pR6J84J21J8J21K70J66QJ11K68K07M9N0J71O7p5
$$ 7327 7278 7332 7490 7545 7534 7628 7846 7918 7828 7800 7921 8042 8035 8131 8315 8436 8454 8575 8845 9011 9019 9130 9398 9605 9654 9704 9875 9942 9867
821I867j3Q9K7j09m6O0O1k5k4J70J69K1J25L04L05K71M17P20Q65R88J465K159K636K618J892
$$ 9867 9854 9943 9970 9861 9815 9875 9936 9911 9887 10057 10226 10247 10372 10676 10981 11252 11669 12389 13254 14242 15707 17866 20502 23120 25012
818B5012M56j351k592k654k023j505j214q19m14l10l50k05L2L1q4q4J86J86R3R3K80K80J86
$$ 25012 25468 24117 21525 18871 16848 15343 14129 13310 12896 12586 12236 12031 12063 12094 12010 11926 12112 12298 12391 12484 12764 13044 13230
815A3230J87M14M15K96K95N24N24M13M14O96P59O71P75J066J169J130J276J629J816J888K117
$$ 13230 13417 13831 14246 14542 14837 15361 15885 16298 16712 17408 18167 18838 19613 20679 21848 22978 24254 25883 27699 29587 31704
812C1704K548K818K919L147L477L622L574L636L792L793L610L548L582L479L298L360L736
$$ 31704 34252 37070 39989 43136 46613 50235 53809 57445 61237 65030 68640 72188 75770 79249 82547 85907 89643
810H9643M048M276M795N584O351P010P964R090J0128J1006J1960J3041J3829J4256J4630J4906
$$ 89643 93691 97967 102762 108346 114697 121707 129671 138761 148889 159895 171855 184896 198725 212981 227611 242517
808B42517J4844J4437J3898J3356J2567J1439J0484R877R336Q883Q757R122R494R942J0898
$$ 242517 257361 271798 285696 299052 311619 323058 333542 343419 352755 361638 370395 379517 389011 398953 409851
806D09851J2361J4147J5956J8157K0633K2918K4715K6169K7202K7410K6724K5686K4456K3003
$$ 409851 422212 436359 452315 470472 491105 514023 538738 564907 592109 619519 646243 671929 696385 719388
805G19388K1107J8990J6726J4110J1221Q604O648N110L984L361L371L662M121N160O779Q648
$$ 719388 740495 759485 776211 790321 801542 810146 816794 821904 825888 829249 832620 836282 840403 845563 852342 860990
803H60990J0569J2853J5646J8428K0709K2411K3409K3347K1986J9701J6524J2328O979J207
$$ 860990 871559 884412 900058 918486 939195 961606 985015 1008362 1030348 1050049 1066573 1078901 1085880 1087087
801A087087m286r394j3779j6978j8872j9744j9814j8859j6844j4395j1985r700p386n267l684
$$ 1087087 1082801 1073407 1059628 1042650 1023778 1004034 984220 965361 948517 934122 922137 912437 905051 899784 896100
799H96100k231r07M9L63K38k39j360l478o344r386j2584j5774j8556k0876k2995k5268k7220
$$ 896100 893869 892962 893011 893374 893612 893373 892013 888535 882191 872805 860221 844447 825891 805015 782020 756752 729532
797G29532k8363k8736k8438k7317k5308k2857k0356j7822j5180j2895j1251j0128r210q587
$$ 729532 701169 672433 643995 616678 591370 568513 548157 530335 515155 502260 491009 480881 471671 463084
795D63084q463q587q820r361j0381j1751j2998j4202j5424j6463j6970j7261j7453j7390j6764
$$ 463084 454621 446034 437214 427853 417472 405721 392723 378521 363097 346634 329664 312403 294950 277560 260796
794B60796j5829j4931j3914j2611j1261j0147r130p986o884o208n730n206m687m527m558m498
$$ 260796 244967 230036 216122 203511 192250 182103 172973 164987 158103 151895 146165 140959 136272 131745 127187 122689
792A22689m436m657m927m919m857m953n098m953m642m503m400m029l593l343l157k749k313
$$ 122689 118253 113596 108669 103750 98893 93940 88842 83889 79247 74744 70344 66315 62722 59379 56222 53473 51160
790E1160k172k111j882j530j469j501j307j038j036j140j033q46q48r93q90o61o53p57o53
$$ 51160 48988 46877 44995 43465 41996 40495 39188 38150 37114 35974 34941 34095 33247 32254 31364 30703 30050 29293 28640
787B8640m66n01o46n66l78m19o05n92l64l30m34l49k03k43l88l52j64k04l91l90k04k26m13
$$ 28640 28174 27673 27027 26461 26083 25664 25059 24467 24103 23773 23339 22990 22787 22544 22156 21804 21640 21436 21045 20655 20451 20225 19812
784A9812m10k23j68l13l37j49j32l18l16j28j13k59k79r2o6k12k35m8o1k48k22p7p9k25k27
$$ 19812 19402 19179 19011 18698 18361 18212 18080 17762 17446 17318 17205 16946 16667 16575 16509 16297 16062 16014 15953 15705 15483 15406 15327 15102 14875
781A4875q2r0k77k79r3n6k43k44n6q7k73k72q4j8j63k24p7m8j92j96m9j9k06k09k3L6j72k30
$$ 14875 14793 14703 14426 14147 14054 13998 13755 13511 13455 13368 13095 12823 12739 12721 12558 12334 12257 12209 12017 11821 11772 11753 11547 11338 11315 11351 11179 10949
778A0949j06l6k43l01j75j11k34k87p9l2k40k96q9m9j73k46l9K0j05j82K5Q6j21k15r0nj29
$$ 10949 10843 10807 10564 10263 10088 9977 9743 9456 9377 9345 9105 8809 8720 8671 8498 8252 8213 8233 8128 7946 7971 8057 7936 7721 7631 7626 7497
775G497k07JJ8j06j64l8M1q2j66M2J30p6k12q7L2r2j75L2J15r3j86o1Q5m0j43j9P9m6j29P9
$$ 7497 7290 7291 7309 7203 7039 7001 7042 6960 6794 6836 6966 6890 6678 6591 6623 6531 6356 6388 6503 6410 6224 6163 6248 6208 6065 6046 6125 6079 5950 6029
771F029J42o6j60l5R8k7r5L0J26q2k22r7Rj14j77n3P5n0j54k9J09j5k02p8L2r3j56l1J38J2
$$ 6029 6171 6105 5945 5910 6008 5981 5886 5916 6042 5960 5738 5641 5650 5536 5359 5306 5381 5331 5177 5148 5257 5242 5040 4962 4994 4901 4745 4714 4852 4864
767D864j32qM6p8k24r9N4p2j74n1J16rj13J2J61L7j09J6J27Lj42j8J20nj50k5J06j9k02p7
$$ 4864 4732 4724 4770 4692 4468 4369 4423 4351 4177 4126 4242 4233 4120 4132 4293 4330 4221 4237 4364 4367 4225 4207 4327 4322 4172 4147 4253 4234 4032 3955
764C955R5L2kJ22K71J47pN6J83L8j29k4J33L0j57n3J17J3j48q6R4L1j14n2J25O2q3k0J56R4
$$ 3955 4050 4082 4080 4202 4473 4620 4613 4669 4852 4890 4761 4737 4870 4900 4743 4690 4807 4820 4672 4586 4680 4711 4597 4545 4670 4732 4649 4629 4785 4879
760D879n2J0J81J19j10m8J64J02q8q8N8N8q5k2J24O2j25o2J18N7j34j33N1N1j33p1J33P0j54
$$ 4879 4827 4837 5018 5137 5027 4979 5143 5245 5157 5069 5127 5185 5100 5078 5202 5264 5139 5077 5195 5252 5118 4985 5036 5087 4954 4883 5016 5086 4932
756D932r3R4R3q7k4J66J03j27j28Q8Q8n5QJ60R8j81k44l8l8j88j88O3O3j24j24L5L4j94j94
$$ 4932 4839 4933 5026 4939 4915 5081 5184 5057 4929 5017 5105 5050 5058 5218 5316 5135 4891 4853 4815 4627 4439 4502 4565 4441 4317 4352 4386 4192 3998
753C998K3K3j23j22N1N2j35j36M7M7j81j82j5j5k02k03M2M2j00j00J10J73j4p7R7R7j36j35
$$ 3998 4021 4044 3921 3799 3850 3902 3767 3631 3678 3725 3544 3362 3347 3332 3130 2927 2969 3011 2911 2811 2921 3094 3080 3003 3100 3197 3061 2926
749B926O1O2j21j22P9J41l9l9J70J70n5n5J55K17L7L6K11K11l6j40M4J49k0q3J07K11J52J52
$$ 2926 2987 3049 2928 2806 2885 3026 2987 2948 3118 3288 3233 3178 3333 3550 3587 3623 3834 4045 4009 3869 3913 4062 4042 3959 4066 4277 4429 4581
746D581L60M21J75P1K30K29J8q5J27K31O2%J82K85R9nJ08J70j5p6J62L08J00mJ98L03J50M7
$$ 4581 4941 5362 5537 5608 5838 6067 6085 6000 6127 6358 6420 6420 6602 6887 6986 6981 7089 7259 7244 7168 7330 7638 7738 7734 7932 8235 8385 8432
743H432K22K21k6k13o3M0o6j70pJ39k8j31K7J72Mj00L9J44k0j65j8Q5j02k05KJ48j4k00p2
$$ 8432 8654 8875 8849 8636 8573 8613 8547 8377 8370 8509 8481 8350 8377 8549 8553 8453 8492 8636 8616 8451 8433 8518 8416 8211 8213 8361 8347 8147 8075
739H075P2r6j99k9J59L3j11L4J80L5j11O8K14O5p9K3J28p5k21o9J17m9j95l0J57j0j55K5K11
$$ 8075 8147 8051 7852 7823 7982 8015 7904 7938 8118 8153 8042 8110 8324 8389 8310 8333 8461 8386 8165 8096 8213 8164 7969 7939 8096 8086 7931 7956 8167
735H167J10p7Q6K74J67k0L2J78N5j31JJ87Q4j02l8J48M3j44p6P0j0j97q4J02J7j28k5J62J42
$$ 8167 8277 8200 8286 8560 8727 8707 8739 8917 8972 8841 8842 9029 9113 9011 8973 9121 9164 9020 8944 9014 9004 8807 8723 8825 8842 8714 8689 8851 8993
732H993mQ8K74J74j4M8K34J41q7m4J01l3k62k06o1j52l38k25Lo9k56j65O4M2j44o6J63R0r7
$$ 8993 8989 9077 9351 9525 9511 9559 9793 9934 9847 9803 9904 9871 9609 9403 9342 9190 8852 8627 8630 8561 8305 8140 8204 8246 8102 8036 8199 8289 8192
728H192k4K05J56j14p9J09P3j56j42Mp9l49l07l6l4k21j43Q6J35j1J12L40K72LoJ82J69j02
$$ 8192 8168 8373 8529 8415 8336 8445 8518 8362 8220 8224 8145 7796 7489 7453 7419 7198 7055 7141 7276 7265 7377 7717 7989 7992 7986 8168 8337 8235
725H235j28J8J5j31o0J68J44j25j09J19J17j12q1J46J53p7k9K82L64J79J55L42L35O4K1J66
$$ 8235 8107 8125 8140 8009 7949 8117 8261 8136 8027 8146 8263 8151 8070 8216 8369 8292 8263 8545 8909 9088 9243 9585 9920 9984 10005 10171
722A0171J18j12r4J34J61j10j27J43J89l9o5J64K15j2o9J59K30M3JK30K84N5j9K10K27m2j78
$$ 10171 10289 10177 10083 10217 10378 10268 10141 10284 10473 10434 10369 10533 10748 10736 10667 10826 11056 11099 11100 11330 11614 11669 11650 11860 12087 12045 11867
719A1867l2j9k47l35j07j3k00k07O3J77n1j17J11K59P2l0J17J31r6k27l9N4j33j96L3J08j62
$$ 11867 11835 11816 11569 11234 11127 11114 10914 10707 10770 10947 10896 10779 10890 11149 11221 11191 11308 11439 11343 11116 11077 11131 10998 10802 10835 10943 10781
715A0781k96j09n9k47l41j12K4j62k03O6K38N1q0J06K42J3j42LP5j11k38n1O6j21k52k4J50
$$ 10781 10485 10376 10317 10070 9729 9617 9641 9479 9276 9342 9580 9631 9551 9657 9899 9912 9770 9773 9848 9737 9499 9448 9514 9393 9141 9117 9267
712I267l6j54L2J47m0k10k3R4r4j88M1K35M8r7R0K43N6j31J4J70j7j99n3Q7j00k31kK11O6
$$ 9267 9231 9077 9109 9256 9216 9006 8983 9077 8983 8795 8836 9071 9119 9022 9112 9355 9411 9280 9294 9464 9447 9248 9195 9282 9182 8951 8949 9160 9226
708I226j25O2K38N1j67k1J52Qj58j2J67K1j41M5K61J16r1N5K31Q6j03M2K61J15o3Q2K59J14
$$ 9226 9101 9163 9401 9452 9285 9264 9416 9424 9266 9254 9421 9442 9301 9346 9607 9723 9632 9687 9918 10004 9901 9943 10204 10319 10256 10338 10597 10711
705A0711q7N9L16K11M5J90M10K65N1J96M32L28J26K71M89L85J75L19N77M73J96L01N39M77
$$ 10711 10624 10683 10999 11210 11255 11445 11855 12120 12171 12367 12799 13127 13253 13524 14013 14398 14573 14892 15469 15942 16138 16439 16978 17455
702A7455K66M13O99O99M90O35Q82Q82O84P88J063J063R25J111J466J466J404J612K003K129
$$ 17455 17721 18134 18833 19532 20022 20657 21539 22421 23105 23893 24956 26019 26944 28055 29521 30987 32391 34003 36006 38135
700C8135K087K378K892L183L226L601M083M291M314M689N373N830O120O743P401P608P444
$$ 38135 40222 42600 45492 48675 51901 55502 59585 63876 68190 72879 78252 84082 90202 96945 104346 111954 119398
697A19398P381P450P243O902P027P417P624P681Q138Q995R783J0574J1696J2754J3128J2672
$$ 119398 126779 134229 141472 148374 155401 162818 170442 178123 186261 195256 205039 215613 227309 240063 253191 265863
696B65863J2048J1415J0460R475R019Q962Q587P895P438P282P075O842P051P523P647P318
$$ 265863 277911 289326 299786 309261 318280 327242 335829 343724 351162 358444 365519 372361 379412 386935 394582 401900
694D01900P110P152O944O517O309O336N878M825L786K800J513j81j551k491l362m165m539
$$ 401900 409010 416162 423106 429623 435932 442268 448146 452971 456757 459557 461070 460889 459338 456847 453485 449320 444781
691D44781m435m560n072n362n257n256n460n253m800m737n270n894o198o655p281p655p831
$$ 444781 440346 435786 430714 425352 420095 414839 409379 404126 399326 394589 389319 383425 377227 370572 363291 355636 347805
689C47805q537r838j0958j1461j1524j1229j0273q686p316o487n615m509l636l193k736k176
$$ 347805 339268 329430 318472 307011 295487 284258 273985 265299 257983 251496 245881 241372 237736 234543 231807 229631
687B29631k051k486k777k491j952j394l55J275K728L757M877O451P987R272J0726J2449J3571
$$ 229631 227580 225094 222317 219826 217874 216480 216125 217400 220128 223885 228762 235213 243200 252472 263198 275647 289218
685B89218J3746J3456J3050J2428J1654J1447J2287J3575J4833J6370J8565K0849K3009K5127
$$ 289218 302964 316420 329470 341898 353552 364999 377286 390861 405694 422064 440629 461478 484487 509614
684E09614K7178K8216K7525K5657K3388K0937J8618J7163J6686J6396J5756J5134J4959J4960
$$ 509614 536792 565008 592533 618190 641578 662515 681133 698296 714982 731378 747134 762268 777227 792187
682G92187J4881J5090J5735J6110J5763J5056J4606J4148J3515J3058J2934J2228J0067P036
$$ 792187 807068 822158 837893 854003 869766 884822 899428 913576 927091 940149 953083 965311 975378 982414
680I82414L818M53l033o064q161r532j0588j0961j0401r612r398r607r814j0437j1642j2929
$$ 982414 986232 986685 983652 977588 969427 959895 949307 938346 927945 918333 908935 899328 889514 879077 867435 854506
678H54506j3604j4227j5302j6423j7170j7710j8486j9192j9456k0080k1670k3706k5237k6025
$$ 854506 840902 826675 811373 794950 777780 760070 741584 722392 702936 682856 661186 637480 612243 586218
677E86218k6175k5303k3169k0719j8898j7528j6222j5100j4757j4756j4639j4847j5765j6885
$$ 586218 560043 534740 511571 490852 471954 454426 438204 423104 408347 393591 378952 364105 348340 331455
675C31455j7395j7270j6937j6231j4757j3137j1993j1120j0088r049q463p923o947n743m959
$$ 331455 314060 296790 279853 263622 248865 235728 223735 212615 202527 193478 185015 177092 170145 164402 159443
673A59443m253l158j953j212n89M97J950L128M416O331Q616J0653J2522J4798J6999J8186
$$ 159443 155190 152032 150079 148867 148278 148775 150725 153853 158269 164600 173216 183869 196391 211189 228188 246374
671B46374J8185J7409J5541J2358Q496N117K500M23p81l18J384L660O526J0299J4578J8362
$$ 246374 264559 281968 297509 309867 318363 323480 325980 326403 325622 325304 326688 330348 336874 347173 361751 380113
669C80113K1393K4089K5958K6253K5152K3497K1359J8161J4153J0234O724L320L50j542k725
$$ 380113 401506 425595 451553 477806 502958 526455 547814 565975 580128 590362 597086 600406 600756 599214 596489
667E96489m003n352n929n492m350k336Q91M649P577R383J0834J2184J3057J3409J3745J3745
$$ 596489 592486 587134 581205 575713 571363 569027 569918 574567 582144 591527 602361 614545 627602 641011 654756 668501
665F68501J2439J0009P557N543L586J779O49k01j692l456l760j372L437J0020J7620K4576
$$ 668501 680940 690949 698506 704049 707635 709414 710063 709862 708170 704714 700954 699582 703019 713039 730659 755235
663G55235K8672K8859K5926K1129J5602J0929Q345P327O239M516L225L288M594O899J0109
$$ 755235 783907 812766 838692 859821 875423 886352 894697 902024 908263 912779 916004 919292 923886 930785 940894
662I40894J3370J5404J6131J6889J8405K0140K1614K2597K2203J9423J5125J1971J1619J3638
$$ 940894 954264 969668 985799 1002688 1021093 1041233 1062847 1085444 1107647 1127070 1142195 1154166 1165785 1179423
660A179423J7066K1311K5610K8839L0769L1933L1995K9322K3362J5305O397k799j1416j7854
$$ 1179423 1196489 1217800 1243410 1272249 1303018 1334951 1366946 1396268 1419630 1434935 1441332 1438533 1427117 1409263
658A409263k1405k2679k1952j8557j2639n688J351Q878J6956K4353L0062L4110L6165L4950
$$ 1409263 1387858 1365179 1343227 1324670 1312031 1306343 1307694 1316572 1333528 1357881 1387943 1422053 1458218 1493168
656A493168K9613K0867R965j949j2683j9698k2666k3921k5643k8068l0788l3350l4408l1869
$$ 1493168 1522781 1543648 1553613 1551664 1538981 1519283 1496617 1472696 1447053 1418985 1388197 1354847 1320439 1288570
655A288570k5453j7558j0725n600k422j883l316m489m219l646l832m222m990p766j3228j9521
$$ 1288570 1263117 1245559 1234834 1229234 1226812 1224929 1221613 1217124 1212905 1209259 1205427 1201205 1196215 1188449 1175221 1155700
653A155700k5066l0167l4797l6969l5496l1869k7364k1174j2929m572K758J0735K0099K8345
$$ 1155700 1130634 1100467 1065670 1028701 993205 961336 933972 912798 899869 895297 898055 908790 928889 957234
651I57234L3847L9057M6594N5746O7354Q4633J01141R4170M3690l9273j14006j45987j35334
$$ 957234 991081 1030138 1076732 1132478 1199832 1284465 1385606 1479776 1523466 1484193 1370187 1224200 1088866
649A088866j06913q0893o1199m5230l3043k5298k0102j5472j1954j0438j0295j0439j0834
$$ 1088866 981953 901060 839861 794631 761588 736290 716188 700716 688762 678324 668029 657590 646756
648F46756j1520j1890j1580j0997j0354r295p654n974n123n438o953r292j1638j3103j3374
$$ 646756 635236 623346 611766 600769 590415 581120 573466 567492 562369 556931 549978 540686 529048 515945 502571
646E02571j2932j2330j1957j1854j1908j1763j1232j0464r854r542r614r884r902r341q437
$$ 502571 489639 477309 465352 453498 441590 429827 418595 408131 398277 388735 379121 369237 359335 349994 341557
644C41557q084q855j0702j3104j5201j6161j5559j3861j1930j0214q906q285q431q945r131
$$ 341557 333473 324618 313916 300812 285611 269450 253891 240030 228100 217886 208980 200695 192264 183319 174188
642A74188q833q396p896p169o408o013n866n554n071m718m516m079l415l021k839k485k021
$$ 174188 165355 156959 149063 141894 135486 129473 123607 118053 112982 108264 103748 99669 96254 93233 90394 87909 85888
640H5888j792j789j561j172j026j054q67n47n47o52n48k08j44k62j99J03K49J57L03O45P49
$$ 85888 84096 82307 80746 79574 78548 77494 76627 76080 75533 74881 74333 74125 73981 73719 73520 73623 73872 74029 74332 74977 75726
638G5726O57Q02J151J275J215J422J866K075K058K350K926L300L539M079N013N803O497P620
$$ 75726 76383 77185 78336 79611 80826 82248 84114 86189 88247 90597 93523 96823 100362 104441 109454 115257 121754 129374
635A29374R134J0671J2213J4332J7085K0033K3076K6606L0471L4002L6639L8342L8560L6276
$$ 129374 138508 149179 161392 175724 192809 212842 235918 262524 292995 326997 363636 401978 440538 476814
634D76814L1338K4819J7781J1012N416K217J777L479O952J2227J8822K5757L2511L8699M3740
$$ 476814 508152 532971 550752 561764 567180 569397 571174 574653 581605 593832 612654 638411 670922 709621 753361
632G53361M6356M6081M3631L9706L4265K7719K1033J4824R052M026M96j569l188n058o927
$$ 753361 799717 845798 889429 929135 963400 991119 1012152 1026976 1036028 1040054 1040550 1038981 1035793 1030735 1023808
630A023808q600j0221j1320j0615p643l366O89L970N922O212N127L591J690j258n957j1895
$$ 1023808 1015208 1004987 993667 983052 975409 972043 972732 976702 982624 988836 993963 997554 999244 997986 992029 980134
628I80134j8475k5577l2444l7719m0818m2519m3439m3231m1362l7999l3502k7647k0946j4757
$$ 980134 961659 936082 903638 865919 825101 782582 739143 695912 654550 616551 583049 555402 534456 519699
626E19699r960o431m084l544n117q232j2272j7298k2735k7179k9310k9310k7543k4095j9398
$$ 519699 509739 503308 499224 495680 490563 482331 470059 452761 430026 402847 373537 344227 316684 292589 273191
625B73191j4455j0147n869j213L398P493J1189J4006J4130R936K503n166j0522j2319j0699
$$ 273191 258736 248589 242720 241507 244905 252398 263587 277593 291723 301659 304162 298996 288474 276155 265456
623B65456o849k322J785N730R597J2712J4361J4653J3725J1337P640L840R75q74j875j564
$$ 265456 258607 256285 258070 263800 273397 286109 300470 315123 328848 340185 347825 351665 352640 351766 349891 348327
621C48327L52L197O309R818J4013J8020K0982K2955K4321K4673K3791K2317K0806J8875J5965
$$ 348327 348679 351876 358185 368003 382016 400036 421018 443973 468294 492967 516758 539075 559881 578756 594721
619E94721J2622R718P206N010L743L896M872N986P709J0897J5402K0661K6123L0314L0667
$$ 594721 607343 617061 624267 629277 633020 636916 641788 647774 655483 666380 681782 702443 728566 758880 789547
617G89547K5809J8063J1627R073J0420J4677K0761K7178L2703L7376M1635M5186M7234M7587
$$ 789547 815356 833419 845046 854119 864539 879216 899977 927155 959858 997234 1038869 1084055 1131289 1178876
615A178876M6007M1126L1149J5679m111k5976m6812o3070p2573p6083p5869p3523o9777o5562
$$ 1178876 1224883 1266009 1297158 1312837 1308726 1282750 1235938 1172868 1100295 1024212 948343 874820 805043 739481
614G39481o1970n8917n5760n2501m9607m6554m2534l7821l3389k9300k5164k1281j8346j6165
$$ 739481 677511 618594 562834 510333 460726 414172 371638 333817 300428 271128 245964 224683 206337 190172
612A90172j3978j1880j0504r612q529p304o663o435n830m979m626m564m138l453l222l326
$$ 190172 176194 164314 153810 144198 135669 128365 121702 115267 109437 104458 99832 95268 91130 87677 84455 81129
610H1129l074k513k329k474k277j799j711j981j867j430j326j596j496j059j056j368j244
$$ 81129 78055 75542 73213 70739 68462 66663 64952 62971 61104 59674 58348 56752 55256 54197 53141 51773 50529
608E0529q09p27j040r72n78n37q89q72n19n27r21r92o39o37r89r60n23l63o74o69k75k66o62
$$ 50529 49720 48993 47953 46981 46403 45866 44977 44105 43586 43059 42138 41146 40507 39870 38881 37921 37398 37035 36361 35692 35417 35151 34489
605C4489o77k41j61n56o24k30j28n23o11k57j12m65n48j54l1l85m92j39Ol47m43r0N8k95l89
$$ 34489 33812 33571 33410 32854 32230 32000 31872 31349 30738 30481 30369 29904 29356 29202 29171 28786 28294 28155 28161 27814 27371 27281 27339 27044 26655
602B6655NJ70j84l37J6K21r1l05M9K92O4o3K90N86L57J73O09J331J808K473M197O683Q032
$$ 26655 26660 26830 26646 26309 26325 26546 26455 26150 26199 26491 26555 26492 26782 27368 27725 27898 28507 29838 31646 34119 38316 44999 53031
599E3031O189J059m788p758o714m077k645k540k096j037o19r71r62l18p4n09o72j94L5l60
$$ 53031 59220 60279 55491 47733 41019 36942 34297 31757 29661 28624 28005 27034 26072 25754 25680 25171 24499 24305 24340 23980
597B3980m43P6L05j32l13J64L49j29l96kK03k33m86r2J78k17m24J2K76j59m94j83M8l46o60
$$ 23980 23537 23613 23918 23786 23473 23637 23986 23857 23461 23459 23662 23429 22943 22851 23029 22812 22388 22400 22676 22517 22023 21840 21888 21542 20882
594B0882k66M0k71m93r8J95j59m12j8K73q0l94JK91j45n21k09J36j76n02j89J44k08n25k13
$$ 20882 20616 20656 20385 19892 19794 19989 19830 19418 19400 19673 19593 19199 19200 19491 19346 18825 18616 18752 18576 18074 17885 18029 17821 17296 17083
591A7083J40j72m81j28K62ql15lK93o0m72j61K05o4m44j74J22j89n60k48J41j71o43m15Jj86
$$ 17083 17223 17051 16570 16442 16704 16696 16381 16378 16671 16611 16139 15978 16183 16119 15675 15501 15623 15434 14874 14626 14767 14596 13953 13538 13539 13353
588A3353m99j46L29O0l75j46K31m0n01k32J99p0n20l33J19k6m10j81K45k5m44j73L18Q9l81
$$ 13353 12854 12708 13037 13097 12722 12576 12807 12767 12266 12034 12233 12163 11643 11310 11429 11403 10993 10812 11057 11032 10588 10415 10733 10822 10441
584A0441j94K84R6l49j21L92J65m12l07J68O3l44j56L23J36l58k13K62J17l25j79K96J51l99
$$ 10441 10247 10531 10627 10278 10157 10549 10714 10302 9995 10163 10226 9882 9726 10049 10185 9827 9614 9876 9993 9668 9489 9785 9936 9537
582I537k95J83P9m11k66K71J67l65k61K17J12m19l16K01R7m26l63J40L6m90l44K94K95k20
$$ 9537 9242 9425 9504 9093 8827 9098 9265 8900 8639 8856 8968 8549 8233 8434 8531 8105 7742 7882 7918 7428 7084 7378 7673 7453
579G453k20K97K35k74k12L51L52k65k65K06J43m27m27J36J98l05l05K56K55k78l40J77J76
$$ 7453 7233 7530 7765 7491 7279 7630 7982 7717 7452 7658 7801 7374 6947 7083 7281 6976 6671 6927 7182 6904 6564 6741 6917
576F917l24k62L91M52j44k06L10L73k06l09K26K27l85m47J28K32k79l42K37L41k61l65K14
$$ 6917 6593 6331 6722 7174 7030 6824 7134 7507 7301 6992 7218 7445 7060 6613 6741 6973 6694 6352 6589 6930 6669 6304 6518
573F518L59j93k97L24M69j10k56L03M48j35l22K18L63j71l58K41M28j49l37K43M71j11k97
$$ 6518 6877 6684 6387 6711 7180 7070 6814 7117 7565 7430 7108 7326 7689 7518 7160 7401 7829 7680 7343 7586 8057 7946 7649
570G649K86N16qj53M59P30J74r6L61N06j94n89o7K44k23m09J84N38K5k45K74N44k1l75J24
$$ 7649 7935 8451 8443 8290 8749 9479 9653 9557 9918 10424 10230 9641 9574 9818 9595 9186 9370 9908 9933 9688 9962 10506 10485 10110 10234
567A0234M35j09m19P6M29n9l70J66N20k0l73J41M94j00n37l8L56j32n27j1L84j30n66o8L27
$$ 10234 10669 10560 10141 10217 10646 10587 10217 10383 10903 10883 10510 10651 11145 11045 10508 10470 10826 10694 10167 10156 10540 10410 9844 9776 10103
564A0103j46n82q4L11j88o24j88K49k18o12m1M78J1m66o5L30j49o26j15L62j20o40j62L57
$$ 10103 9957 9375 9291 9602 9414 8790 8602 8851 8633 8021 7980 8458 8469 8003 7938 8268 8119 7493 7378 7740 7620 6980 6818 7175
561G175m3n21p0M50K6n34j55L64o6n44l3N28J12m48l4N68J88l52M1O63K85k55J81Q04M87n3
$$ 7175 7132 6611 6541 6991 7017 6483 6328 6692 6626 6082 6049 6577 6689 6241 6207 6775 6963 6611 6652 7315 7600 7345 7526 8330 8817 8764
558H764L78J000N83m0L54R78O76N4M17J040P49K92Q48J803J909J702K642M011M526M817O259
$$ 8764 9142 10142 10725 10685 11039 12017 12693 12747 13164 14204 14953 15245 16093 17896 19805 21507 24149 28160 32686 37503 43762
555D3762Q129Q713Q340Q153P447M900J288j656m023o684q885r160q122p436o980n502l634
$$ 43762 51891 60604 68944 77097 84544 89444 90732 89076 85053 78369 69484 60324 52202 44766 37786 32284 28650
553B8650k977k976k257j054r57j413j020o4k00r06p60n4l36j292j192m04m39j063p98P4Q5
$$ 28650 25673 22697 20440 19386 18429 17016 15996 15932 15732 14826 14066 14012 13676 12384 11192 10788 10349 9286 8488 8562 8647
551H647n38l26N47M08m65m13L77L31m58l60M30L03n69n43J63R2p80o87K68L35m53m43L46K93
$$ 8647 8109 7783 8330 8738 8273 7860 8237 8568 8110 7750 8180 8483 7914 7371 7534 7626 6846 6159 6427 6762 6309 5866 6212 6505
548F505m97m91M64N53l20l72M18M51m21n29L42L84m88n86K86M77l11l74M16N23l48m17M57
$$ 6505 6008 5517 5981 6534 6214 5842 6260 6711 6290 5761 6103 6487 5999 5413 5699 6176 5865 5491 5907 6430 6082 5665 6122
545F122N75k97m83L05L80n75p26K30M42m30o51K20M03m48o40K95N71k81m48M46O72k20m37
$$ 6122 6697 6400 5917 6222 6602 6027 5301 5531 5973 5543 4892 5112 5515 5067 4427 4722 5293 5012 4564 5010 5682 5462 5025
542E025M99P44k31n37M39Q35j5l38N97R16j43o59J09M73l79p41J92O13k38o35K99P30j63o40
$$ 5025 5524 6268 6037 5500 5939 6774 6759 6421 7018 7934 7791 7132 7241 7714 7335 6594 6786 7399 7161 6526 6825 7555 7392 6752
539F752K52P07k28p78P3N60k51o81K53P28k47p93J00P33l5n21L31Q29j05o84K09Q28k4o05
$$ 6752 7004 7711 7483 6705 6778 7338 7087 6406 6659 7387 7140 6347 6447 7180 7145 6624 6955 7784 7679 6995 7204 8032 8008 7403
536G403K88R27P5n87K23Q37n5p62Q9Q06m5p10J82R63J53o12J97R01M9o78K57J194M68j63R78
$$ 7403 7691 8618 8693 8106 8329 9166 9111 8349 8438 9244 9199 8489 8671 9634 9787 9175 9372 10273 10322 9644 9901 11095 11563 11400 12378
533A2378K264J952J835L725N591M490J388r16j950k718k762j579r07j882k568j426r4m48j026
$$ 12378 14642 16594 18429 22154 27745 32235 33623 32707 30757 28039 25277 23698 22791 20909 18341 16915 16821 16373 15347
531A5347j75O44k91j329n61M56k28j233n48M99o2r34k07P02j50j258o15M06l21j456q11K52
$$ 15347 15172 15816 15525 14196 13635 14091 13863 12630 12082 12581 12519 11585 11378 12080 11930 10672 10057 10463 10142 8686 7875 8127
528H127l50j276l84R33L72p99k39Q03J17j019l34J003N27o03Q2J331P28o08j72R98L55r75
$$ 8127 7777 6501 6117 7050 7422 6623 6384 7187 7304 6285 5951 6954 7481 6878 6960 8291 9019 8411 8239 9237 9592 8617
526H617m56P75K14j112n93P33K13j154o77O39J20j188n86R21N27q72m36J056P04o70j92J319
$$ 8617 8161 8936 9150 8038 7445 8178 8391 7237 6560 7199 7319 6131 5545 6466 6993 6121 5685 6741 7445 6775 6583 7902
523G902R66n19k90J068O31r65o95P52L99j135p41R49P62p87n17J109R23o35l65J333J146n68
$$ 7902 8868 8349 8059 9127 9758 8793 8098 8850 9249 8114 7373 8322 9084 8297 7780 8889 9812 9177 8812 10145 11291 10723
520A0723m63J159R72p54o50R67P38j073r68Q61Q92q56q25R64J026p41q04Q96Q33j058j058
$$ 10723 10260 11419 12391 11637 10987 11954 12692 11619 10651 11512 12404 11548 10723 11687 12713 11972 11168 12064 12897 11839 10781
518A0781Q36R81p65p02J296J482l78n24J404J509n50q61J019J248p58j154O80R49q10n83K147
$$ 10781 11617 12598 11833 11131 12427 13909 13531 13007 14411 15920 15370 14509 15528 16776 16018 14864 15544 16493 15683 15100 17247
515A7247L122J508J363L509L863J445L04J328N60k714l855j455K27o42m13K032K800R34P89
$$ 17247 20369 21877 23240 26749 30612 32057 32361 33689 34249 31535 27680 26225 26452 25810 25397 27429 30229 31163 31952
513C1952L719N484M574N135Q284R156N678K232J586R62j300k672l104o302j1322j1529n829
$$ 31952 35671 41155 45729 50864 59148 68304 73982 76214 77800 78762 77462 74790 71686 65384 54062 42533 36704
511C6704j469k139l010p68N20j391k097N15J636j173k875p02O70j563k851m54J165p56j711
$$ 36704 35235 33096 30086 29318 29838 28447 26350 26865 28501 27328 24453 23751 24421 22858 20007 19553 20718 19962 18251
508A8251R41K395k74j810P52K454j7j719O24K162n02k288J81J884p28k430N03K704L16j470
$$ 18251 19192 21587 21313 19503 20255 22709 22692 20973 21597 23759 23257 20969 21150 23034 22306 19876 20379 23083 23399 21929
506B1929J393L511N78k038R5J963o68k538O76L376N67k132M75K927O0k473N15L464O49k215
$$ 21929 23322 26833 27411 25373 25468 27431 26763 24225 24901 28277 28844 26712 27187 30114 30174 27701 28216 31680 32329 30114
503C0114N46L662J107j592J538M819J995j286J150L517k83l979o59L286N56k891L70M399J617
$$ 30114 30660 34322 35429 33837 35375 40194 42189 40903 42053 45570 45287 41308 40649 43935 44491 41600 41970 46369 47986
501D7986j914J731O008K671j857J315O007L178q50K840P617L930j592J477O586L186k088J478
$$ 47986 46072 47803 53811 56482 54625 55940 61947 65125 64275 67115 74732 78662 77070 78547 85133 88319 86231 87709
499H7709P250L923j684J963P652L105m080j94Q569Q459M764R130J3989P001j512M543J6048
$$ 87709 94959 98882 97198 99161 106813 109918 105838 105644 114213 122672 127436 136566 150555 157556 156044 160587 176635
497A76635J5210R271J5148K4805K0460J0846J4880K3788J8490R831K0175L8635M0301L4840
$$ 176635 191845 201116 216264 241069 261529 272375 287255 311043 329533 339364 359539 398174 438475 473315
495D73315M8067P0472P5446P3556R1935J14756J06595Q1989Q3997J07026J12828J09484J34898
$$ 473315 521382 591854 667300 740856 832791 947547 1054142 1136131 1220128 1327154 1439982 1549466 1684364
494A684364J75327J91203K10451K93620M21262N35142O79437R59182J373753J866803K504474
$$ 1684364 1859691 2050894 2261345 2554965 2976227 3511369 4190806 5149988 6523741 8390544 10895018
492A0895018L293876L743457L007487Q33047j823321l523696l684921k918385k114785j588250
$$ 10895018 14188894 17932351 20939838 21772885 19949564 16425868 12740947 9822562 7707777 6119527
491F119527j191935q44892o22001n15041m14223k93391k18404j94379j55572r2094n9336o8452
$$ 6119527 4927592 4082700 3460699 2945658 2531435 2238044 2019640 1825261 1669689 1577595 1518259 1449807
489A449807p4093o5683p7236j08071j16905r6243q0626p9733o8411m4427l4954m2947m2331
$$ 1449807 1375714 1310031 1232795 1124724 1007819 911576 830950 751217 682806 638379 603425 560478 518147
488E18147k8895k5146l3140l0296j4618q772j6186j6137n234l207j3610j7540j0293q024j3527
$$ 518147 489252 464106 430966 400670 386052 377280 361094 344957 339723 336516 322906 305366 295073 287049 273522
486B73522j1243l41J428q725j3053o511m272j0937j2588n258k595q637j0303l597j102o853
$$ 273522 262279 261938 263366 254641 241588 235077 230805 219868 207280 202022 199427 190790 180487 176890 175788 168935
484A68935q609k317L45m660o342q81R70m533o604j267J218l329n242o12J148l814o005j499
$$ 168935 160326 158009 158354 153694 147352 146471 147441 142908 136304 135037 136255 132926 127684 127072 128220 124406 118401 116902
482A16902O91l565n528j188Q94l363n610j562Q62k440m062j37J710k421m870j360R72k204
$$ 116902 117593 114028 108500 107312 108206 104843 99233 97671 98533 96093 92031 91894 93604 91183 86313 84953 85925 83721
480H3721m246r84J044k132m014n88J765j121l331q18O07k653m521j054J708n97k551Q6J984
$$ 83721 79475 78491 79535 77403 73389 72801 74566 73445 70114 69296 69903 67250 62729 61675 63383 62786 60235 60321 62305
477F2305q62l168r06Q95j700l688j052J230r08k767k55J974j24k145m8J945k7j808L72K237
$$ 62305 61443 58275 57369 58264 56564 52876 51824 53054 52146 49379 49124 51098 50974 48829 48781 50726 50699 48891 49263 51500
475E1500k34k711r04J300k99k181k49J950O00p99J382L518J628q51J67J671J55r80J783M552
$$ 51500 51266 48555 47651 48951 48652 46471 46222 48172 48772 47973 49355 52873 54501 53650 53817 55488 55643 54663 56446 60998
472F0998K911K05Q89K099m14l908m053k841l942n122l026m83j293k845j371N75p74k848j705
$$ 60998 63909 64114 65003 67102 66688 62780 58727 55886 51944 46822 43796 43313 42020 39175 37804 38379 37605 34757 33052
470C3052L36o40k493j351O51m09k371j353P40N5j523l40J714Q62j225p47P24l35k266j373
$$ 33052 33388 32748 30255 28904 29555 29146 26775 25422 26162 26217 24694 24354 26068 26930 25705 24958 25682 25347 23081 21708
468B1708O23k1j812j002J026N47j084l17J537Q10j168p73R03L85j295p35R56L11j515r55R40
$$ 21708 22331 22310 20498 19496 20522 21069 19985 19668 21205 22015 20847 20074 20977 21362 20067 19332 20288 20599 19084 18129 19069
465A9069O29j016o22J011M50j455j227L86P5j474r55Q66O38j025p14J044Q98o85m15J215R46
$$ 19069 19698 18682 18060 19071 19521 18066 16839 17225 17300 15826 14871 15737 16375 15350 14636 15680 16578 15893 15478 16693 17639
463A7639p79p16Q29O83q82p37Q05O18r94q48P99P38q35p31Q84Q84o25o26R25R24o32o95Q48
$$ 17639 16860 16144 16973 17656 16774 16037 16842 17460 16466 15618 16417 17155 16320 15589 16473 17357 16732 16106 17031 17955 17323 16628 17476
460A7476R52n61q32M20L57j192j379M3J88j169j231K71M16r82j087M29P41m90n51R53J223
$$ 17476 18428 17867 17035 17455 17812 16620 15241 15284 15472 14303 13072 13343 13759 12777 11690 12119 12860 12370 11819 12772 13995
457A3995j99n51O86Q31n78r31K80M67q91j119L21Q41l38o49N28P15o35j029K48O84n26r20
$$ 13995 13796 13245 13931 14762 14184 13253 13533 14000 13109 11990 12311 13152 12814 12165 12693 13408 12773 11744 11992 12676 12150 11230
455A1230L19O73n87r40L72Q90k47p65K97P34l93p87M38R15k78p98L25Q43k55p73L09Q69k44
$$ 11230 11549 12222 11635 10695 11067 11957 11710 10945 11242 11976 11583 10796 11234 12149 11871 11073 11398 12241 11986 11213 11522 12391 12147
452A2147q47J60P61j11n46N02R37k79j006o5N36l32q52J27O46m56j183l36K87o54j194j84
$$ 12147 11300 11460 12221 12110 11564 12066 13003 12724 11718 11653 12189 11857 11005 11132 11778 11322 10139 9803 10090 9436 8242 8058
449H058N22l30q69J11Q18j06p30J66R56J35m88L87J011J28o62N0O73k14r21r7O93lo27J24
$$ 8058 8580 8250 7381 7492 8310 8204 7474 7640 8596 8731 8243 8630 9641 9769 9107 9157 9830 9616 8695 8598 9291 9288 8661 8785
446H785Q30K6p64j62M60l03j009k22N67j55q61j05P68J18o71lP02j9q08k08N82J6p73j66N40
$$ 8785 9615 9641 8877 8715 9175 8872 7863 7641 8208 8053 7192 7087 7855 7973 7302 7299 8001 7982 7174 6966 7548 7564 6791 6625 7165
443G165n7q46k32N57M3p45q5P89K63n25o8P21K80m27J14R03L93m78NP93K80n92k06O67K20
$$ 7165 7108 6262 6030 6587 6630 5885 5800 6589 6852 6327 6259 6980 7260 6833 6947 7850 8243 7765 7770 8563 8843 8251 8045 8712 8932
440H932o52l27L80q7r59n42L31Ro97k36O36K47o25l66M24P0p18l78M95K30o42l46N26K46n43
$$ 8932 8280 7953 8333 8246 7287 6745 7076 7085 6388 6152 6788 7035 6410 6044 6468 6538 5820 5442 5937 6167 5525 5179 5705 5951 5408
437E408k72N18K89n00k11N77L18n55l59N12K79n10l15N57L69n02l92L97K47m60k62O10M66
$$ 5408 5136 5654 5943 5443 5232 5809 6127 5572 5213 5725 6004 5494 5179 5736 6105 5603 5211 5608 5855 5395 5133 5743 6209
434F209l23j63O47N68k83k08O02O27n7J25Q51N79m38n48J38P3o95n49L44M66k19o4Q71J022
$$ 6209 5886 5723 6370 6938 6655 6447 7049 7676 7619 7744 8595 9174 8736 8188 8326 8399 7704 7155 7499 7965 7746 7682 8553 9575
431I575L36J66N20J19p73o00M60O41m4j3Q38Q66R8Q8R81J191O71R62K144K760K573L204M928
$$ 9575 9911 10077 10597 10716 9943 9343 9803 10444 10400 10387 11225 12091 12189 12277 13258 14449 15120 16082 18226 20986 23559 26763 31691
428C1691O136O573P515Q946R116P558N685L836Q64l060n998p265q181r032q591o826n424m988
$$ 31691 37827 44400 51915 60861 69977 77535 83220 87056 87920 84860 78862 71597 63416 54384 45793 38967 33543 28555
426B8555m165k606j693j880j766q31m86j046j144l76q5p29r78k92ko46q44j59J32n13p38n2
$$ 28555 24390 21784 20091 18211 16445 15614 15128 14082 12938 12562 12477 11748 10770 10478 10476 9830 8986 8827 8959 8446 7708 7656
423G656K53l48n40J04L73k70n94PL01l42o38OL33k70n60M3L56k46n45R9M86p5m69R1M44j16
$$ 7656 7909 7561 7021 7125 7498 7228 6634 6641 6942 6600 5962 5968 6301 6031 5471 5514 5870 5624 5079 5178 5664 5589 5120 5211 5655 5539
420E539m76Q5M77q4m47P2M07j54n42J9M11j50n59m1L93j27n40k2L91q7m60N8N13L6l94Q4N02
$$ 5539 5063 5148 5625 5541 5094 5166 5573 5419 4877 4896 5307 5157 4598 4557 4950 4823 4283 4261 4652 4565 4105 4163 4676 4712 4318 4402 4904
417D904j7m85oM65j2m75m0L97l9n23m4M87N2m54j02L40r6n92j56L74O2l92KM44M9m44m9M23
$$ 4904 4887 4402 4396 4861 4849 4374 4334 4731 4692 4169 4125 4612 4664 4210 4108 4448 4352 3760 3604 3978 4040 3648 3650 4094 4143 3699 3650 4073
414D073K8n14k03K98n5n23j27M07N4m89j77L60R0m03n0M87J76l53q2M16J04m23j52M05J36
$$ 4073 4101 3587 3384 3682 3627 3104 2977 3384 3438 2949 2772 3132 3222 2819 2769 3256 3432 3079 2997 3413 3517 3094 2942 3347 3483
411C483m33j62L72J44l96j68L33O3m43k15L45J17l86j17M78K91k46n9M96L09k57j53L35O5
$$ 3483 3050 2888 3260 3404 3008 2840 3173 3236 2793 2578 2923 3040 2654 2537 3015 3306 3060 3001 3497 3806 3549 3396 3731 3796
408C796m91l05K87J83l31j43L96K50l12j67L50K04l82k79K38J34l77k73K87J84l67k63L16
$$ 3796 3305 3000 3287 3470 3139 2996 3392 3642 3330 3163 3513 3717 3335 3056 3294 3428 3051 2778 3065 3249 2882 2619 2935
405B935K54k97j94L26K22l62k99K58J96l65l03K80K49k87k56K85K85k40k40K80K79k44k43
$$ 2935 3189 2892 2698 3024 3246 2884 2585 2843 3039 2674 2371 2651 2900 2613 2357 2642 2927 2687 2447 2727 3006 2762 2519
402B519K31J69l33k72L33L34j75j74L83L82j82k46K64K63l10l72J40J40l74l74J65K69k32
$$ 2519 2750 2919 2586 2314 2647 2981 2806 2632 3015 3397 3215 2969 3233 3496 3186 2814 2954 3094 2720 2346 2511 2780 2548
399B548k96K68L31j82k43K72L35k12l17K01L03k07l11J82L27j53k98K03L06k24l69J44K90
$$ 2548 2252 2520 2851 2669 2426 2698 3033 2821 2504 2705 3008 2801 2490 2672 2999 2846 2548 2751 3057 2833 2464 2608 2898
396B898j98l85R5K82j78k82K14L59j44l31J04K92j68l13J80L67j36l65J12L41j00k86J26L54
$$ 2898 2700 2315 2410 2692 2514 2232 2446 2805 2661 2330 2434 2726 2558 2245 2425 2792 2656 2291 2403 2744 2644 2358 2484 2838
393B838p9l08J26L54r4l65N6K85j31l18R0L18j27m39m1K70r1k77J40L69n3k80J11L40k9k99
$$ 2838 2759 2451 2577 2931 2837 2472 2528 2813 2682 2364 2454 2772 2645 2206 2165 2435 2344 2067 2207 2576 2523 2243 2354 2694 2665 2366
390B366R1L61q9m01m7K64o3l33K3K93l4l03Q8L58m9l61j0L01Kl09M1L52K8l25J0L21ol17r
$$ 2366 2457 2818 2729 2328 2281 2545 2482 2149 2172 2465 2431 2128 2216 2574 2525 2164 2154 2455 2457 2148 2189 2541 2569 2244 2254 2575 2569 2252 2243
387B243L03Kl51j8K92j9l73k2L31M0l12m6L08M8l47r2K61Ml07L7M33J91k04OL60P4l20j50
$$ 2243 2546 2548 2197 2179 2471 2452 2079 2057 2388 2428 2116 2070 2378 2426 2079 1987 2248 2252 1945 1982 2415 2606 2402 2408 2768 2842 2522 2372
383B372K04%l11o5K88M9l04p5K77P6k77n1L01Q4l11q5L10P4l20r1L03Q7l07j01L34J78k16
$$ 2372 2576 2576 2265 2200 2488 2537 2233 2158 2435 2511 2234 2183 2484 2568 2257 2172 2482 2556 2236 2145 2448 2535 2228 2127 2461 2639 2423
380B423m5L09J29k66j25K69O0l76k85J09k3l34r6L40K04k33j03K92J72k22r5K58Q7l07j88
$$ 2423 2378 2687 2816 2550 2425 2694 2754 2378 2093 2202 2179 1845 1749 2089 2293 2060 1957 2249 2421 2199 2104 2362 2449 2142 1954
377A954K49J49k44j00K95K10k26j40K54J48k47j66K70J88k05j44K51J90k47j84K52K43j51
$$ 1954 2203 2352 2108 2008 2303 2513 2287 2147 2401 2549 2302 2136 2406 2594 2389 2245 2496 2686 2439 2255 2507 2750 2599
374B599j20K74J94k42k26J26P5l21l04J73K05j48j39K54J97k82l17J18J81j71j91K03J75j99
$$ 2599 2479 2753 2947 2705 2479 2605 2680 2359 2055 2228 2433 2285 2146 2400 2597 2315 1998 2116 2297 2126 1935 2138 2313 2114
371B114j97J76K11j63j63K10K28j47j77J96K19j55k17J57K22j51k13J60J77j97j96J77K32
$$ 2114 1917 2093 2304 2141 1978 2188 2416 2269 2092 2288 2507 2352 2135 2292 2514 2363 2150 2310 2487 2290 2094 2271 2503
368B503j42k45J28K85q8j92J81K64j09k14J60K59j14k24J50K23k33l74JJ97j76l16N8J79j11
$$ 2503 2361 2116 2244 2529 2441 2249 2430 2694 2585 2371 2531 2790 2676 2452 2602 2825 2592 2218 2219 2416 2240 1924 1982 2161 2050
365B050k20J54L01p2k59J15K55j18k95mJ75j15k67J08L07J6j70J20L18n7k84Q9K64k6k50M1
$$ 2050 1830 1984 2285 2213 1954 2069 2324 2206 1911 1907 2082 1967 1700 1808 2115 2131 1961 2081 2399 2342 2058 2147 2411 2385 2135 2176
362B176K05q6k73J7L04J3j37J54L53k1k43M7K17p4k61L0L03J2k58L3K56l4k63K7K80j1k34
$$ 2176 2381 2295 2022 2039 2343 2356 2219 2373 2726 2705 2462 2509 2726 2652 2391 2421 2724 2736 2478 2511 2767 2733 2470 2497 2777 2766 2532
359B532N6L11J03j25Q2L08J7k57L3L05J4k08Q1L10J02j68J23M26K18J08M82R29Q67P50J041
$$ 2532 2588 2899 3002 2877 2959 3267 3284 3027 3060 3365 3379 3171 3252 3562 3664 3496 3619 4045 4263 4371 4853 5782 6649 7399 8440
356H440J080L95m97p67p40r69j145p50k54l16n05j94J59k8l31j44J39m7k98p1K49O2k46o0
$$ 8440 9520 9915 9418 8651 7911 6942 5797 5047 4793 4477 3972 3778 3937 3909 3578 3434 3573 3526 3228 3157 3406 3468 3222 3162
353C162K49O3k46o0K66J19j68J9M06L03L1J34L55J26k23p9K56J11j56j1L10K07q9J40N19M16
$$ 3162 3411 3474 3228 3168 3434 3553 3385 3404 3810 4113 4144 4278 4633 4759 4536 4457 4713 4824 4668 4657 4967 5174 5085 5225 5744 6160
350F160J35L64Q08Q70Q49J451K354K790K881L068K912J729L1r87j282j594j977j833j329r76
$$ 6160 6295 6659 7467 8337 9186 10637 12991 15781 18662 21730 24642 26371 26402 25415 24133 22539 20562 18729 17400 16424
347A6424o04M13J779K963M074N133M598J338l053n650n553m328l345k451j478r59r96q50l37
$$ 16424 15820 16233 18012 20975 25049 30182 34780 36118 33065 27415 21862 17534 14189 11738 10260 9301 8305 7455 7118
345G118j51l85l86j6Q7j59j58J08J08k45k44J08J08j20j20L28L28K3K3M00N03K79L41P93J021
$$ 7118 6967 6582 6196 6180 6267 6108 5950 6058 6166 5921 5677 5785 5893 5773 5653 5981 6309 6332 6355 6755 7258 7537 7878 8671 9692
342I692Q78J149J893K371K430K701L438L874L644L165K463J112l60k98J736L938M307K771
$$ 9692 10570 11719 13612 15983 18413 21114 24552 28426 32070 35235 37698 38810 38450 38152 39888 43826 48133 50904
340E0904O73j112k711m331n743o283n576l791j863o58rO97J196P40n18j556j827j890j919
$$ 50904 51577 50465 47754 43423 37680 31397 25821 22030 20167 19509 19500 20197 21393 22133 21615 20059 18232 16342 14423
337A4423j629j006p15q09o01r2K82K76N67J316K022K448K738K515J062j139k510k518j978
$$ 14423 12794 11788 11073 10264 9663 9571 9853 10129 10696 12012 14034 16482 19220 21735 22797 21658 19148 16630 14652
335A4652j656j282n27p0m4Q1N27Q18O74N50Q31Q93N29J55J07j01p18j093r14p07r05q43j17
$$ 14652 12996 11714 11187 11117 11073 11154 11681 12499 13173 13723 14554 15447 15976 16131 16238 16137 15419 14326 13412 12705 11800 10957 10840
332A0840N07P30J105J831K039J183k71j235j610j687j396p41k85m66n91l29l8j09j08M83J106
$$ 10840 11347 12077 13182 15013 17052 18235 17964 16729 15119 13432 12036 11295 11010 10544 9953 9624 9586 9477 9369 9852 10958
330A0958J331J623K272K481J447l39j727k517k744k454j641j017q49q49m94j20k16l41p6J31
$$ 10958 12289 13912 16184 18665 20112 19773 18046 15529 12785 10331 8690 7673 6824 5975 5481 5361 5145 4804 4728 4859
327D859lk11M7L37J92j6K76N66M54Q1O8O8k10n84m87k79m35n60l66p6j92l17j28J22nk54p6
$$ 4859 4856 4645 4692 5029 5221 5205 5481 6047 6501 6582 6650 6718 6508 5924 5437 5158 4723 4163 3797 3721 3529 3212 3084 3206 3201 2947 2871
324B871J74J8k31j41J07k7k77n3J96Q2j68j15J35M0k08p5J75L9k09r9J51R9j50l5K14L8k11
$$ 2871 3045 3063 2832 2691 2798 2771 2494 2441 2637 2719 2551 2436 2571 2611 2403 2328 2503 2542 2333 2234 2385 2484 2334 2299 2513 2551 2340
321B340p7J73J00j49n9J91J18j31m5K05J11j38NK54K02m7kK47N0j99k34J5j20l69k62j3O0
$$ 2340 2263 2436 2536 2387 2328 2519 2637 2506 2461 2666 2777 2639 2644 2898 3100 3053 3051 3298 3348 3149 2915 2930 2810 2441 2179 2166 2226
317B226j89p0J79Q6j64j41J07N6j93j62Q7J19j31r5J54J53r5j44J06J06j44j00J49R7j52j28
$$ 2226 2037 1967 2146 2232 2068 1927 2034 2090 1897 1735 1822 1941 1810 1715 1869 2022 1927 1783 1889 1995 1851 1751 1900 1997 1845 1717
314A717J21R0j59j87O2J14j35r9J51J50r9j05J44J44j04j70Q0J11j38j20J29J30j20j72P8
$$ 1717 1838 1928 1769 1582 1644 1758 1623 1524 1675 1825 1726 1621 1765 1909 1805 1635 1715 1826 1688 1568 1697 1827 1707 1535 1613
311A613J51r8j04J45J97n2j53R8J69p9j56R3J24j25j98N1J67q2j45J25J97p3j52P6J46q2j50
$$ 1613 1764 1666 1562 1707 1904 1852 1699 1797 1966 1887 1731 1824 1948 1823 1625 1676 1843 1761 1616 1741 1938 1865 1713 1789 1935 1853 1703
308A703P9J73n6j43Q5J61j09k21PJ39q9j71N6J71n8j86M2J56p2j74N4J26j02k24LJ57l0j33
$$ 1703 1782 1955 1899 1756 1841 2002 1893 1672 1679 1818 1729 1558 1614 1785 1727 1541 1583 1739 1667 1493 1547 1673 1571 1347 1350 1507 1477 1344
304A344R4J94l6j43J26K54K5j43KJ21j07k56k8J65k2j58L0J67k0j32R6K51K3j60K7J42m6k06
$$ 1344 1438 1632 1596 1453 1579 1833 1858 1715 1717 1838 1731 1475 1447 1612 1590 1432 1462 1629 1609 1477 1573 1824 1847 1687 1714 1856 1810 1604
301A604K2J94Pj48kJ17p0j79N0K44J6j74k8J48l8k08k1J56l1k26l9J74K8j41NJ81L5j17K8
$$ 1604 1626 1820 1827 1679 1677 1794 1724 1545 1595 1839 1855 1681 1653 1801 1763 1555 1534 1690 1659 1433 1394 1568 1596 1455 1460 1641 1676 1559 1587
297A587J89m0k56j11J21J6j65k0J80L5j55j0K08O3j55j0J85L9j48m5J55J0k13o8J48M3j46
$$ 1587 1776 1736 1480 1369 1490 1506 1341 1321 1501 1536 1381 1371 1579 1642 1487 1477 1662 1701 1553 1508 1663 1673 1460 1392 1540 1583 1437
294A437%K17P2j76p2J44L9j48m5J73P0j76p2J41P8j25o2J40L6j83p9J38L5k11j07J27O4j67
$$ 1437 1437 1654 1726 1550 1478 1622 1661 1513 1468 1641 1711 1535 1463 1604 1682 1557 1495 1635 1671 1488 1409 1547 1582 1371 1264 1391 1455 1288
291A288j04R5L3j82p8J79J17j03m0J94J33j00j00J11M9j77j16J26J26r3r2J47J46p0p0J62
$$ 1288 1184 1279 1312 1130 1052 1231 1348 1245 1205 1399 1532 1432 1332 1443 1492 1315 1199 1325 1451 1358 1266 1413 1559 1489 1419 1581
287A581J00j32j31J03J03j53j52R0R0j11m8J76J76o6o7J31J30j27j28N3N3j64j01J43J44r5
$$ 1581 1681 1549 1418 1521 1624 1471 1319 1409 1499 1388 1340 1516 1692 1626 1559 1690 1820 1693 1565 1618 1671 1507 1406 1549 1693 1598
284A598r6J65J64o7o6J47J48j18j79N2N3j46j46J14J14j21j21P6P6j27j28J49J49p5j37R1
$$ 1598 1502 1667 1831 1764 1698 1845 1993 1875 1696 1748 1801 1655 1509 1623 1737 1616 1495 1571 1647 1520 1392 1541 1690 1615 1478 1569
281A569R1j66k28RJ12j03j03R7R8j22j85Q7J91J4q9J13J75k1q3R4J56r0j52M6J07o7j30J06
$$ 1569 1660 1494 1266 1275 1387 1284 1181 1278 1376 1254 1069 1156 1347 1361 1272 1385 1560 1539 1456 1550 1706 1616 1464 1510 1617 1550 1420 1526
278A526J69o2j65L1J36p0j32O5J28p1j75K3J26p1j33Q2J87m2j44N2J56o2j65J1J14o7j71M8
$$ 1526 1695 1633 1468 1499 1635 1565 1433 1498 1626 1555 1380 1403 1529 1458 1325 1407 1594 1552 1408 1460 1616 1554 1389 1400 1514 1447 1276 1324
274A324J51m9j53LJ07m7j51O2K07J8j28P0K15K8j16K4J27o5j68K1J66k4k11n0R5n3j56mJ42
$$ 1324 1475 1426 1273 1276 1383 1336 1185 1247 1454 1472 1344 1414 1629 1657 1541 1565 1692 1627 1459 1480 1646 1622 1411 1361 1456 1403 1247 1243 1385
271A385l4j79L6J82K7j60k2J23o4k09j5J72O4q2N3J98J5j73n8J29lj47j6J72M2j45J2J97P8
$$ 1385 1351 1172 1208 1390 1417 1257 1235 1358 1294 1085 1070 1242 1306 1224 1277 1475 1490 1317 1259 1388 1385 1238 1222 1394 1436 1291 1303 1500 1578
267A578j10j4J32Lj84n2J35J1j77l8J48L7j09OJ51K1j65p5J12%j86n4J74P8j09l3J53P5j12
$$ 1578 1468 1454 1586 1589 1405 1353 1488 1499 1322 1284 1432 1469 1360 1366 1517 1538 1373 1298 1410 1410 1224 1170 1344 1422 1313 1280 1433 1508 1396
264A396n7J30L3j12j8J27Pj79o8J19K1j66p7J52O0j47m2J65R8j09m7J61J07j00l9J70P5j33
$$ 1396 1339 1469 1502 1390 1372 1499 1506 1327 1259 1378 1399 1233 1156 1308 1368 1221 1179 1344 1442 1333 1286 1447 1554 1454 1415 1585 1660 1527
260A527j33P5N8j50m1Q4J5j92r9J91J37p1q1M4N1j55n8J51R1j16q6J23N9j49q7J22J31p5j07
$$ 1527 1394 1469 1527 1377 1336 1420 1435 1243 1144 1335 1472 1401 1320 1364 1415 1260 1202 1353 1444 1328 1242 1365 1424 1275 1188 1310 1441 1366 1259
257A259J00Q8j20j20Q8J15r2o2J47J27q0j43O5R2j17j17R2J13r5r4J13Q6j21j21Q7J10r7r7
$$ 1259 1359 1447 1327 1207 1295 1410 1318 1256 1403 1530 1450 1307 1372 1464 1347 1230 1322 1435 1340 1246 1359 1445 1324 1203 1290 1400 1303 1206
253A206J10J55n3q4J23J21q6j49N8P9j28r8J10J44o5j26Q1J68l8r6K9Q3j24j87K1Q2m2r9K5
$$ 1206 1316 1471 1418 1334 1457 1578 1492 1343 1401 1480 1352 1254 1364 1508 1443 1317 1398 1566 1528 1432 1461 1544 1420 1233 1254 1336 1294 1195 1220
250A220N8o6j19Q9J18q9j46O1J19on3J55J92j5j13J1J00j07j69L8J52K7p7M8J26q2j48O0J45
$$ 1220 1278 1212 1093 1182 1300 1211 1065 1126 1245 1239 1186 1341 1533 1518 1405 1416 1516 1409 1240 1278 1430 1457 1380 1428 1554 1472 1324 1384 1529
246A529m0j18K8R2n2j41M6J63k3j46%J51l7j58j3J17k7j16P0J73j5j73k8J14Rp8O7J27o0k06
$$ 1529 1489 1371 1399 1491 1439 1298 1344 1507 1484 1338 1338 1489 1452 1294 1281 1398 1371 1255 1325 1498 1483 1310 1282 1396 1405 1327 1394 1521 1461 1255
242A255j9J16l0j54L3K17P1q9J4J47Jj85m0J16J1j33l0J25k0j66k0J41L6j29J6J48M4q4O3
$$ 1255 1236 1352 1322 1168 1201 1418 1489 1400 1414 1561 1562 1377 1337 1453 1464 1331 1301 1426 1406 1240 1220 1361 1397 1268 1284 1432 1476 1392 1455
239A455J71K5j76p3J26K2j63n8P9J7r5N1K01N6j46m3J11Oj77p4J08M5q1K2J88Q4j20n8R5p
$$ 1455 1626 1651 1475 1402 1528 1550 1387 1329 1408 1425 1330 1381 1582 1638 1492 1449 1560 1566 1389 1315 1423 1468 1387 1409 1597 1681 1561 1503 1598 1591
235A591j56n2J03%j61r8P4J3j18j3J50M6j15n3J35P1j39j07O5Lj42q0P6M6j00NJ86J25o4o5
$$ 1591 1435 1383 1486 1486 1325 1227 1301 1314 1196 1183 1333 1379 1264 1211 1346 1417 1278 1171 1236 1239 1097 1017 1093 1139 1039 1044 1230 1355 1291 1226
232A226J00O9n7OJ44Q1j07j08M0M1j02l9J60R8r2r2M3M2j42p9Q3K2j26j27R4R3n6n6J42Q0
$$ 1226 1326 1395 1338 1344 1488 1569 1462 1354 1394 1435 1333 1294 1454 1552 1460 1368 1411 1453 1311 1232 1315 1337 1211 1084 1178 1271 1215 1159 1301 1381
228A381j13j13P0P1p5p4R1R1r5r6J04J04j25j24J11J12p5p6P7P7j09j10P7P7j10j10Q6Q6r8
$$ 1381 1268 1155 1225 1296 1221 1147 1238 1329 1234 1138 1242 1346 1221 1097 1208 1320 1245 1169 1246 1323 1214 1104 1181 1258 1148 1038 1124 1210 1112
224A112r7J15J76m5m5J15J16l0k9J28J29j00j00Q2Q2j08j70j2N1r3r2J17J17p2j35QP0p2p3
$$ 1112 1015 1130 1306 1261 1216 1331 1447 1417 1388 1516 1645 1545 1445 1527 1609 1501 1331 1319 1370 1277 1185 1302 1419 1347 1212 1220 1290 1218 1145
221A145J02J01q2q1J10J73n2j14M8J10p6j39N1J13l3r4O0J22k4q5N5J16m6j51J5P8p1j33N2
$$ 1145 1247 1348 1266 1185 1295 1468 1416 1302 1350 1460 1384 1245 1296 1409 1376 1282 1342 1464 1440 1355 1410 1526 1480 1329 1344 1422 1351 1218 1270
217A270J13k9r1Q3J88j6j60j3R1m1j03K3Q6n7j19QJ12l0j33L3J58k8j53MJ27j7j42pJ18J4
$$ 1270 1383 1354 1263 1346 1534 1518 1358 1345 1436 1395 1292 1315 1401 1344 1225 1233 1345 1315 1182 1215 1373 1345 1192 1196 1323 1306 1164 1157 1275 1289
214A289j10J1J36rj34M7J72K6r8K1J46%j24LJ27j8j43n7O7Oj20k8R7pj32mJ20N8o7J6J41m
$$ 1289 1179 1190 1326 1317 1183 1230 1402 1428 1330 1351 1497 1497 1373 1376 1503 1485 1342 1285 1352 1358 1238 1210 1307 1300 1168 1164 1284 1342 1275 1291 1432 1428
210A428j28k5R9L7q7N3J77P8j29l8Q6n9j83p8J31k1j44q0M6J4j11J9J43L9q6qJ16N4p0j3J12
$$ 1428 1300 1275 1374 1411 1324 1377 1554 1632 1503 1465 1551 1492 1309 1231 1362 1341 1197 1117 1163 1177 1066 1085 1228 1267 1181 1173 1289 1343 1273 1260 1372
206A372Qj16k4J00M8j59p5J34Q1m4j6J08M6p8k9R7L9j69p1N3J6j08lJ22P0j37n5J53P0n4R
$$ 1372 1380 1264 1240 1340 1388 1229 1154 1288 1369 1325 1309 1417 1463 1385 1356 1453 1492 1323 1252 1305 1321 1213 1210 1332 1402 1265 1210 1363 1433 1379 1388
202A388J33Q2j26o9J40Q7l7m7P7K5j82j13R4R5j14j05J03N1p4o8N6N7o7o9P7J02q5p5P0O8
$$ 1388 1521 1603 1477 1408 1548 1635 1598 1551 1628 1653 1471 1358 1452 1547 1433 1328 1431 1482 1408 1340 1396 1453 1386 1317 1394 1496 1411 1336 1406 1474
198A474p7m5J01J24o2o8P7P5p0r2N4N4r1n5R0J14p4q0O4Q8r8j34N4N4j34j35N1N9q6r1R5J34
$$ 1474 1397 1352 1453 1577 1515 1447 1524 1599 1529 1437 1491 1545 1454 1399 1489 1603 1529 1449 1513 1601 1503 1369 1423 1477 1343 1208 1259 1318 1232 1141 1236 1370
194A370j1l6J09J03q3j27O0R9m6m8J39J99J2l5O9N1j36j66j9M2j03j16P1J33n3j42NQ2k2q0
$$ 1370 1359 1323 1432 1535 1452 1325 1385 1484 1438 1390 1529 1728 1740 1705 1774 1825 1689 1523 1504 1546 1443 1327 1398 1531 1478 1336 1341 1423 1401 1321
191A321O6J02m3q8R9J38qq2O2J23k3o8L6N4j33j93pQ7j6n4N1J02q4j63K3J01m4j00M5J46J
$$ 1321 1387 1489 1446 1358 1457 1595 1587 1505 1567 1690 1667 1599 1635 1689 1556 1363 1356 1443 1427 1373 1424 1526 1442 1279 1302 1403 1359 1259 1304 1450 1451
187A451q7J8P6k7j03%O0q5j51L6J35L0o7P9J41nq5J9J04m1j28J7R5rj08lJ02jq0O6J53l3j76
$$ 1451 1364 1382 1458 1431 1328 1328 1388 1303 1152 1188 1323 1353 1286 1365 1506 1501 1416 1435 1539 1498 1370 1387 1482 1473 1365 1362 1464 1463 1383 1449 1602 1569 1393
183A393l1J28K4j20j5J07M4n5N0J14J1r7PJ32j4j36p3K8l5j15j2R4j0j28k5J17J4j03m2O3
$$ 1393 1362 1490 1514 1394 1379 1486 1530 1475 1525 1639 1650 1553 1560 1692 1678 1542 1469 1497 1462 1347 1335 1429 1419 1291 1266 1383 1397 1294 1252 1315
179A315%q1K4J12l4j70o6J34P2o1KJ05M3j01l9J06M4j07m4J04M1m3O2J88M3j36p3O6Mj35p3
$$ 1315 1315 1234 1258 1370 1336 1166 1100 1234 1306 1245 1247 1352 1395 1294 1255 1361 1405 1298 1254 1358 1399 1356 1418 1606 1649 1513 1440 1506 1510 1375 1302
176A302P3J0j21n9R4R3k5L7J27K4j56r4M9j3j66j03J07P6p1rJ37P4n3k1R7L6j29r8P1P1q5
$$ 1302 1375 1385 1264 1205 1299 1392 1367 1404 1531 1555 1399 1305 1354 1341 1175 1072 1179 1255 1184 1175 1312 1386 1333 1312 1409 1445 1316 1218 1289 1360 1275
172A275k4J24O2q2n2R2O2r6o3J21R0r9r8M5M5n2n3R3R3m4m5J8J8j16j15L4L4j07m4J24R4q2
$$ 1275 1251 1375 1437 1355 1303 1395 1457 1361 1298 1419 1509 1410 1312 1357 1402 1350 1297 1390 1483 1439 1394 1412 1430 1314 1199 1233 1267 1160 1116 1240 1334 1252
168A252q3O1O1n8n8J28J29m5m6N9N8j00r9M5M6q9q9N6N6l1l2J13J14r6r7R1R1o2o3Q3Q3j24
$$ 1252 1169 1230 1291 1233 1175 1303 1432 1387 1341 1400 1458 1358 1259 1304 1350 1261 1172 1228 1284 1253 1221 1334 1448 1352 1255 1346 1437 1375 1312 1395 1478 1354
164A354j24O3O3r6r6M8M8p9j11N5J17l6r9M9J10m9q0O4R7o7j28J5P7l3r5J1P3k2n2R2J24n4
$$ 1354 1230 1293 1356 1260 1164 1212 1260 1181 1070 1125 1242 1206 1107 1156 1266 1217 1137 1201 1298 1231 1103 1118 1195 1162 1067 1078 1151 1129 1077 1169 1293 1239
160A239j16O9J32k2q4J9Q2m3j05L8J00j5j18l0L1r7j29J8J21J0n3P1J03p7j39K0J23Nj00L0
$$ 1239 1123 1192 1324 1302 1218 1237 1319 1276 1171 1209 1309 1294 1176 1146 1177 1080 951 969 1090 1100 1047 1118 1221 1144 1005 1025 1148 1153 1053 1083
156A083R3l3r5K4J28Or8QJ13k8q9L2J36l0j34k9P3k1j25lJ42K5p8j4R0rj13L2J36pj10qR6
$$ 1083 1176 1143 1048 1072 1200 1206 1108 1116 1229 1201 1112 1144 1280 1250 1116 1087 1160 1139 1014 1011 1153 1178 1100 1086 1176 1167 1054 1086 1222 1215 1105 1097 1193
152A193mj29k6R9O0o5l0L3l8j63k1J03O8n6OJ30K1j04%J25l5j60o1J47N6o8o3O1J9j06kJ22
$$ 1193 1189 1060 1034 1133 1193 1128 1098 1131 1093 930 909 1012 1080 1024 1030 1160 1181 1077 1077 1202 1167 1007 946 1093 1149 1081 1018 1079 1098 992 990 1112
148A112O6o0M4J69N5p0l4K7l6j61o1O4rj34l0R5M1q4q4M1J7j07lJ21R1l3l3R2K4j01l8Q6L8
$$ 1112 1178 1118 1162 1331 1386 1316 1282 1309 1273 1112 1051 1115 1106 972 942 1037 1078 994 910 951 968 861 858 979 1070 1037 1004 1096 1120 1019 981 1067 1105
144A105q6q7L8J1j13n2P3O3o2JJ25P4n0n1P5O5n9kJ23R5j12j28lOj19o1J46N6o9o4O0L6q9
$$ 1105 1019 932 970 981 868 816 889 952 890 891 1016 1090 1040 989 1064 1129 1070 1068 1191 1286 1174 1046 1043 1049 930 869 1015 1071 1002 938 998 1034 945
140I45q8L5N8o6o7N8M5q0k2J02J02j06j11R7J43o5p5M9N6o8o9N6O2o3o2O2R3l1r4L1M7p8j5
$$ 945 857 892 950 884 817 875 920 840 818 920 1022 916 805 902 1045 980 905 954 1010 942 873 929 991 928 866 928 1021 990 896 927 974 896 881
136H81J10J13j1p4N1N7o7o7N8N3p1j33rK2j02q7J21J66M1r8K6N7o7o6N7P3n2q3M1J23kj06
$$ 881 991 1104 1093 1019 1070 1127 1060 993 1051 1104 1033 900 891 913 811 724 845 1011 1052 954 980 1037 970 904 961 1034 982 899 940 1063 1061 955
132I55J9M1q3q3M1P8m7m7P8J14j0j15J0O6o0j21LJ09j5p8M7R9k5j30mQ1m4j02K3J17N4pN4
$$ 955 974 1015 932 849 890 968 921 874 952 1066 1056 941 951 1017 957 836 839 948 933 855 902 1001 976 846 842 923 879 777 800 917 971 964 1018
128A018J04k0j29lR6k9r1L4P9m7p7M8J64L9p1rQ9l6j05m2L8k3r4L0Q2m3j07m5M6j6n5O9J35
$$ 1018 1122 1102 973 970 1066 1037 946 980 1059 1012 935 983 1147 1186 1115 1106 1195 1159 1054 1012 1050 1027 933 963 1045 1002 895 850 896 880 825 894 1029
124A029J0r4L0J17qp0N4J47K2q5k2Q6K3j15RR2K8p5j2P3n2j93o9N6N6m4m3O3Jj07m4O8On2
$$ 1029 1039 945 975 1092 1084 1014 1068 1215 1237 1152 1130 1216 1239 1124 1133 1225 1253 1178 1166 1239 1187 994 925 981 1037 993 950 1013 1014 907 863 931 937 885
120H85N3J37L4q6k4Q5K3q1j9R0K9q2q2Qn4j13rJ16N4m8J5J30O7m3m3O0kj10m7Q5K3q1j9J02
$$ 885 938 1075 1109 1023 999 1084 1107 1026 1007 1097 1126 1044 962 970 916 803 794 910 964 916 931 1061 1128 1085 1042 1102 1100 990 943 1028 1051 970 951 1053
116A053M0j02l9P4P5o6o7K3K3p8j6J07M5j01l8P6J4r1k8R3L1q0q0N8mj07m5J05J05l6l6M5
$$ 1053 1093 991 952 1026 1101 1035 968 991 1014 936 920 1027 1072 971 933 1009 1023 932 904 997 1028 948 868 926 922 815 770 875 980 944 908 953
112I53M6n8n8P2P1p3p4O9P0p6p6K1K1j18n5J25J25J9m4MLr9l5J00R9q3q3J6J5q8q9N4N3n1
$$ 953 999 941 883 955 1026 953 879 948 1018 942 866 887 908 790 735 860 985 1004 960 964 967 868 833 933 1032 949 866 882 897 809 720 774 827 776
108G76n1R2R2j1j2J58J58Pn6J5J5j33j34QQr6r6L9L9k3k3J62J62l0r1J6M8p5p6P8J10n6j18
$$ 776 725 817 909 898 886 1044 1202 1209 1153 1168 1183 1050 916 924 932 836 740 779 818 795 772 934 1096 1066 975 991 1039 964 888 966 1076 1020 902
104I02kO1o1r1K6Q8l3o4P0J02k6q8J5M5p5p6O1J24j8q1M0J01k0n1N6J19k5q7j4M9p2j03M0
$$ 902 900 961 900 809 835 923 890 826 896 998 972 884 899 944 869 793 854 978 960 879 919 1020 1000 949 1005 1124 1099 1012 998 1047 975 872 912
100I12J02Jo2K3Q6j8q1K3Q5n7j20j7Q8L1l1M9Q1m7j10J1P4qj11jO0no6R1J53J6j29o0M5m4
$$ 912 1014 1015 953 976 1062 1044 963 986 1071 1014 894 877 965 996 965 1014 1095 1048 938 949 1023 1015 904 903 963 958 892 983 1136 1152 1023 963 1008 964
96I64j06l1P2j3p5N2J14nj09k9P5j1p3j4R1K8p6NO6j4j17l9O4J0n2L6J41L6o7N1J14rj12j9
$$ 964 858 827 899 886 811 863 977 972 863 834 909 898 825 811 902 930 854 859 925 911 794 755 819 829 777 813 954 990 923 974 1088 1079 967 948
92I48Q4K2q2oR8K1j26r2N3L2l0J9Q2Nj00o7L6J3n0KJ05M5n8n0N5l1r3j8Q6j3j16k0J25O4q3
$$ 948 1032 1054 972 966 1064 1085 959 867 920 952 922 941 1023 1028 928 861 897 910 860 862 967 1012 954 904 959 928 835 817 903 890 774 754 879 943 860
87H60n3N1K0q4MJ49Q7n8n0N4qj12p1P4N1n3l3P0M3o2%J44Q3o3q3K2K6l5m0O4Pr7o6Q0K8p7
$$ 860 807 858 878 794 798 947 1034 976 926 980 972 860 789 863 914 861 828 898 941 879 879 1023 1106 1043 960 982 1008 973 933 997 1004 907 841 921 949 872
83H72n3R2R2n3n4M9J8q6rJ35R9q8j25K0N4n0m3O2N6q9p2P4J03m3o9L6Pr7j12P4J32K8l8O6
$$ 872 819 911 1003 950 896 945 963 877 868 1003 1102 1014 889 909 963 913 870 932 988 899 827 901 1004 961 892 928 935 838 726 800 932 960 922 988
79I88O6l7p6K9K8p5r2J1J2r2p4L0L2p1m6R9J02m4o3Q1J42mo5L9O7l6r6RJ0r2q4O2J01lp1L3
$$ 988 1054 1017 941 970 998 923 831 842 854 762 688 718 750 679 633 732 834 790 727 808 950 946 881 920 987 951 855 864 874 782 698 760 861 858 787 820
74H20O4m0m4N9O0m4l8O6Q9n6j03KQ9K7k2Q2Q4j9n8M7P4k8j14n2%o2j07mN1n2m8N6J08Nq8J6
$$ 820 884 844 800 859 919 875 837 903 992 936 833 835 924 951 929 1011 1095 1076 1018 1065 1139 1111 997 945 945 883 776 772 823 771 723 779 887 892 804 820
70H20O9l6p9K6P7k7j15j2L5k8o2%N7m7j09oM4j9n1N3J25K2o2%P6k8p8K6J17N5l3P2J23J9q8
$$ 820 889 853 774 800 877 850 735 723 758 730 668 668 725 678 569 563 607 588 537 590 715 737 675 675 751 723 645 671 788 843 810 882 1005 1024 936
66I36k6M6j6j06lQ8K5l6K5Q3k1j05kQ7K4m7J6Q8K5r4l2K3m0r9MP5J2q1j9N6op6K8J21J8p4
$$ 936 910 956 940 834 831 919 944 908 933 1016 995 890 888 975 999 952 968 1056 1081 987 955 978 938 839 843 918 930 849 830 886 880 804 832 953 971 897
61H97j2R6L3r2r2MMl9O5J21J7j00l8P6P7l7l6K9p5j31k8J02M0j12n0Q6N5o6l5Q1Q1m0m0N1
$$ 897 885 981 1014 922 830 834 838 799 864 985 1002 902 864 940 1017 980 944 973 898 767 739 841 881 769 719 805 860 794 759 840 921 881 841 892
57H92j2j27o5P3P3m2m2L4L4n2RJ05M3p6m5Q6N5p0p0M2M3k8k7O6O6o0o0L4L3o1o1P4P4l8l7
$$ 892 880 753 688 761 834 792 750 784 818 766 775 880 923 847 802 888 943 873 803 845 888 860 833 899 965 905 845 879 912 851 790 864 938 900 863
53H63N5N6p6p6J01J00k2k3K9K9n0n0O3O4q3q3ooj18n6J06J07k9k8M4M4r0r1RP2j4j4Q4Q3o1
$$ 863 918 974 898 822 923 1023 1001 978 1007 1036 986 936 999 1063 980 897 891 885 767 711 817 924 895 867 911 955 865 774 783 855 841 827 911 994 933
48I33o1L2L2l2l1O2O2q8q8O6O6n6q8RP1l4l3J04J36j3p5J2J2r7j28K9R2L4LN4N4o7r9J6P7
$$ 933 872 904 936 904 873 935 997 909 821 887 953 897 809 818 889 855 822 926 1062 1049 974 986 998 901 773 802 894 928 931 985 1039 972 873 889 966
44I66j9q1L5R7J9j2O2O1o6o7K7K7o7o8K3K4o9j01L4R7Pn5L5O7m2j04QP0Ko1L0R3l1j35l9K4
$$ 966 947 866 901 998 1017 1005 1067 1128 1062 995 1022 1049 982 914 937 961 892 791 825 922 929 874 909 976 934 830 838 908 910 849 879 972 941 806 767 791
40G91k4q7K8R0Qn4J8Q1oo8KL3n5j17k9P6J1n1O4J25lj07j3R1O2%L3R6%o2J0P3J3m9KO5J4m9
$$ 791 767 680 708 798 806 752 770 851 845 777 779 812 757 640 611 687 698 647 711 836 833 726 713 804 866 866 899 995 995 933 943 1016 1029 980 982 1047 1061 1012
35A012M2J04Kj03p9j7n4j16k6P9K1m1N2J15L3p1%J03L3p1KJ05L5o9m3K0k3q5l9O6Or7k5P9
$$ 1012 1054 1158 1160 1057 978 961 907 791 765 844 865 824 876 991 1024 953 953 1056 1089 1018 1020 1125 1160 1091 1048 1068 1045 960 921 987 993 896 871 950
31I50L0p4k4J21J15J2L8J00N0n4n4N0K3m0RJ13O2m2j8M4Qr5k6P9O5l8J3J18J05KN4J99K68
$$ 950 980 906 882 1003 1118 1130 1168 1268 1318 1264 1210 1260 1283 1243 1252 1365 1427 1385 1367 1411 1419 1324 1298 1377 1442 1404 1417 1535 1640 1642 1696 1895 2163
27B163K05K64L68M26M27N72Q02R99J144J428J739J836J442M71p96j923k319j934j331r95q49
$$ 2163 2368 2632 3000 3426 3853 4425 5227 6226 7370 8798 10537 12373 13815 14286 13490 11567 9248 7314 5983 4988 4139
24D139o44l74k51l14k54j09j28j90j39l4m8j52j03M3N1n3n1N4N3n0n1N3M5n9r0J4j1j14j12
$$ 4139 3495 3121 2870 2556 2302 2193 2065 1875 1736 1702 1654 1502 1399 1442 1493 1440 1389 1443 1496 1446 1395 1448 1493 1434 1344 1358 1347 1233 1121
21A121rmo6n9M5J8q5j09L7M1o3n2R3J26K1m5J6Pr8j00MJ2r2r2J2O8l7l6O7R6qm0O5N6m8p2
$$ 1121 1112 1108 1042 983 1028 1046 961 852 889 930 867 815 908 1034 1055 1010 1026 1033 935 835 839 851 759 667 679 747 710 674 741 837 829 789 854 910 862 790
16G90P4R9mn3N0Q0k3n2J0J2r1r5J0N9m5m5N9J19J5l5K8P9k4q0K5M5n9j27o4ko4o4kM1k1k4
$$ 790 864 963 959 906 956 1036 1013 961 971 983 892 797 807 866 821 776 835 954 969 934 962 1041 1017 937 962 1007 948 821 757 755 691 627 625 666 645 621
12F21L9O6l7m0O4J00lp0qL8k4m9N4R0j3q1j9L8k4q2K2J00lp1rO0kk7P6J08Mq3k2O6Ml0L3Q5
$$ 621 660 726 689 649 713 813 810 740 732 770 746 697 751 841 828 747 728 766 742 660 682 782 779 708 699 759 757 730 806 914 918 835 813 879 883 853 886 971
7I71k0j10m7P2Rl1l1K3q2j37l3O5Lk8L4R9nr8OP7J5r3l0K9L0l7K6Q3K1n3J1P4J2q2j9M0k2
$$ 971 951 841 794 866 875 844 813 836 754 617 584 649 652 624 658 757 752 654 660 737 752 659 629 658 688 651 677 760 781 728 739 813 825 743 724 764 742
3G42j11m9K8K8m1m0L7L6nN8J20J6r6l3M4j8j50q7M0M0k9k8Q4Q4oN5J18N6o4o5K2m0j12n1J04
$$ 742 631 582 610 638 597 557 594 630 625 683 803 819 723 690 734 716 566 479 519 559 530 502 586 670 664 719 837 893 829 764 786 746 634 583 687
-1F87J04J1J0N3j1q6k5O1kr8r8L1L1n6OP1P1o0o0M8M8k5k4O7O8l0l0Q6K3p6p7N0M9o4o5P7
$$ 687 791 802 812 865 854 768 743 804 802 704 606 637 668 612 618 689 760 700 640 688 736 711 687 754 822 792 762 848 871 795 718 768 817 753 688 765
-6G65P7l7l8l2l3j40p8M9M9o1o2O1O1NNR3L1o9o9J08J08k7k7P1P0m4m4O8O7l2r5J9J9j6j5
$$ 765 842 805 767 735 702 562 484 533 582 521 459 520 581 586 591 684 715 646 577 685 793 766 739 810 880 836 792 860 927 895 800 819 838 822 807
-10H07N3N4o1o1L7L7n7n7R3R2k9r0k1k0n6n6P7P8l8l7M4M3k9k9N5N5k4q7J4J3j21j21n2J2
$$ 807 860 914 853 792 829 866 809 752 845 937 908 818 797 777 721 665 742 820 782 745 789 832 803 774 829 884 860 773 787 800 679 558 506 518
-14E18p2p2N1J14K4l8L0R3L7k5L1L2o9j31o9pm1m2J10J73Q3k2RJ0q7q6JO4J2n0QPo9p0J7J6
$$ 518 446 374 425 539 563 525 555 648 685 660 691 723 654 523 454 447 406 364 474 647 730 708 717 727 640 554 555 619 631 581 589 596 527 457 474 490
-19D90l1l2R1J54M4j9O7J29J7q6j1N1J6m7K0N1k5q7k8L4l8j00kO0j2p5OO8J6m7JO3l1r3NO8
$$ 490 459 427 518 672 716 697 764 893 910 824 813 864 880 833 853 904 879 792 764 798 760 660 658 718 706 631 637 705 721 674 675 738 707 614 619 687
-23F87mo7QP0J9m4J7Q0On5l8K4m3p4K2J26N4m9m5J8l4r6rR5P0QNL7j9q1rN3Jo1k7L5j7p9K0
$$ 687 683 616 624 694 713 669 686 766 772 717 679 703 660 586 608 734 788 739 694 712 678 582 573 668 738 746 751 788 769 688 679 732 733 672 645 680 663 584 604
-28F04Q3J1n2qN3n2j56k1J25R8nPO8K0q4l3P0O8l5j4M9K0q4o0M4J8m4J3P5J0r4m7R8P2l2m8
$$ 604 687 698 646 638 691 639 483 462 587 685 680 687 755 775 691 658 728 796 761 747 796 816 732 672 716 734 690 703 778 788 694 647 745 817 785 737
-32G37J3J1n1pN5K9p5l1P3M2o2k5P8P6k8mN9L0p3p5L0Nn6n7M6K5l7l0P3K4q0m9N4M7r9q2K1
$$ 737 750 761 710 703 758 787 712 681 754 796 734 709 787 863 835 831 890 920 847 772 802 807 751 694 740 765 728 698 771 795 715 666 720 767 668 586 607
-37F07N0n4l7O7O6l7l7O7O6l7q8J6M5n9r6l3J8m3l9O5L7o7m9N4J02L9kO0N5m8m6N9N6m8m2
$$ 607 657 603 566 633 699 662 625 692 758 721 633 649 694 635 539 506 524 481 442 507 544 477 428 482 584 623 621 681 736 688 642 701 757 709 667
-41F67K1K1m1l0P5M6n8r2J2O3m0o9L6O1jk7L6O1m3l6O7O7l7m8N5J05Jn1J1M0k3l7K5N1n3r5
$$ 667 688 709 668 638 713 759 701 609 621 684 644 575 611 672 671 644 680 741 698 662 729 796 759 711 766 871 872 821 832 872 849 812 837 888 835 740
-45G40RM1o3j03JO8Ok8L4Q9j5l6K7P8k5q0j8L3k8k3Q2J07l8r6QP6k8q1j8P5k9j01l8N2j0l8
$$ 740 749 790 727 624 625 693 699 671 705 794 779 743 770 848 823 743 725 758 730 707 789 896 858 762 770 846 818 737 719 794 765 664 626 678 668 630
-50F30K4P5J4n8MO2m2r5RR7L5k1M1O8l7r1J2J20J6n9n9J1J1o0KP9J6r0k8L0L0m9J3P2l3j03
$$ 630 654 729 743 685 689 751 709 614 623 720 755 734 775 843 806 715 727 847 863 804 745 756 767 707 709 788 804 714 686 716 746 697 710 782 749 646
-54F46m2N2N2m6m5M5j7q7k4L4L4j7M5P7J4m5m5K7K8m8J4P0Qo7nQ8K6n4QQ0J9r8l5Q2Q2m8m8
$$ 646 604 656 708 662 617 662 645 558 534 568 602 585 630 707 721 676 631 658 686 638 652 722 730 663 658 746 772 718 726 806 825 727 692 774 856 808 760
-59G60QQp6j4O3%r2k9M5M6o7o7K7K7m0l9P2Rq1j8P7P8p3p3LMl7K7O4O3m1m1R3R4m4m3QQn9
$$ 760 768 776 700 686 749 749 657 628 673 719 652 585 612 639 599 560 632 641 560 542 619 697 624 551 554 558 521 548 612 675 634 593 686 780 736 693 701 709 650
-64F50o0L4L5m3m2N1N1q9r0K5K6r0q9K5K5RJ0Q2Q2n6n5K1K1m4J9J18J18J1J1Q4Q4j03j04r
$$ 650 590 624 659 616 574 625 676 587 497 522 548 458 369 394 419 428 438 520 602 546 491 512 533 489 508 626 744 755 766 850 934 831 727 718
-68G18j0n5n4N9O0l3l2jkq8q9L0R3J1k1N5Q5J0k1N0N1n6n5J7J7o7o6O8O8k6k5M4M3m2j04l5
$$ 718 708 653 599 658 718 685 653 652 650 562 473 503 596 607 586 641 726 736 715 765 816 760 705 722 739 672 606 674 742 716 691 735 778 736 632 597
-72E97lo4o4P3P3j8j8N2N3l2o4N2J15K5oM6M7o0o0N4Q5l5r8k5L8k9o1N7J20J5m6j3M8m0p1
$$ 597 594 530 466 539 612 594 576 628 681 649 585 637 752 777 771 817 864 804 744 798 883 848 750 725 763 734 673 730 850 865 819 806 854 814 743
-76G43K3Q6J1r3l9K4k8r1j9J1n5q7QP1Nn7L5R6L9o5m1K0m6j08l4K9rm1N6J19Q2K0O8J00j6
$$ 743 766 852 863 770 731 755 727 636 617 628 573 486 494 565 570 513 548 644 683 618 577 597 551 443 409 438 429 388 444 563 645 665 733 833 817
-81H17p9qN5j4p6k4L8J6m6m4J8m2p3K4Q6J8m6PO9L3k9JO4mo7j4M7k9r1m4J01Q2J9J4M4ql8
$$ 817 738 730 785 771 695 671 709 725 679 635 653 611 538 562 648 666 620 627 696 729 700 701 765 761 694 680 727 698 607 563 664 746 765 779 823 815 777
-85G77J2P4k5j28r7PJ3m9j6M7j0p2J8Q0K7p7k8P6N6m8k2M0%o2l0L1Lo0j0N2Or8m8N5L0p4p1
$$ 777 789 863 838 710 613 620 633 584 568 615 605 533 551 631 658 581 553 629 685 637 615 655 655 593 563 594 597 537 527 579 585 487 439 494 524 450 379
-90C79L3N7nk6P8O3Jk7L5K7l6L8R9O1knN8J4r0o7mj1p3nR9M8n5n5M9K5p9j02M3P7k7k5Q0P4
$$ 379 412 469 464 438 516 579 580 553 588 615 579 617 716 777 775 770 828 842 752 685 681 670 597 592 691 739 684 629 678 703 624 522 565 642 615 590 670 744
-94G44l0mN8M1k2k2M0L7k6k5L7K2m1m1K1K9l3n9M4O1m4k0M2M8n6n5M8O9OPO9M1o2o6L9L6o8
$$ 744 714 710 768 809 787 765 805 842 816 791 828 850 809 768 789 818 785 726 770 831 787 767 809 857 801 746 794 863 869 876 945 986 924 858 897 933 865
-99H65m2K1ko4o5j%o1q5J9L4k8k6L7L5k7n4N1Q8j6o2%J2n0n1J3K1m1m1K2N4pl4P0R2j3p9j8
$$ 865 823 844 842 778 713 712 712 651 566 585 619 591 565 602 637 610 556 607 695 679 617 617 629 579 528 541 562 521 480 502 556 549 515 585 677 664 585 567
-104E67J4m9q0j7Rn4p6K7P9J8l2L0M8j4rR5J21J7n4J0O9l4j02m0J9j1o0KJ4m8p0L4P5M4K7
$$ 567 581 532 452 435 444 390 314 341 420 438 406 436 484 470 461 556 677 694 640 650 719 685 583 543 562 551 491 493 507 459 389 423 498 542 569
-108E69Q9J13Rl9K2N2j1o2%L1l0q5J8Q6K3p1m0L3l0o2jR2L1m6j5M1k1r4l2K8mn2J0N8ml5K7
$$ 569 658 771 780 741 763 815 804 742 742 773 743 658 676 762 785 714 674 707 677 615 614 706 737 691 676 717 696 602 570 598 594 542 552 610 606 571 598
-112E98J24O2j7j7M2k0r4l3M7J5l7l8Nk7m8J5R7L4k0J0N9mn7MQ2J9n4RO3Jp4p5jjm0K2J22
$$ 598 722 784 767 750 792 772 678 645 692 707 670 632 637 610 562 577 674 708 688 698 757 753 696 700 782 801 747 756 819 820 746 671 670 669 629 651 773
-117G73O1n7n7j7j8r0r1LLl7K6Q5K2p4p4K5K5ML5Q4K2n3k1L7L8l1L2P0Pq7n6L7Oq5n4L6L7
$$ 773 834 777 720 703 685 595 504 507 510 473 499 584 606 532 458 483 508 512 547 631 653 600 579 616 654 623 655 725 732 645 589 626 632 547 493 529 566
-121E66j4j3R4R4m0m1L0L0m3j2O8Nj14j13M1M1l2l2N3N2m1m1L1L0k1k2L6L6n7n7N6N6n8n8
$$ 566 552 539 633 727 687 646 676 706 663 651 719 724 610 497 538 579 547 515 568 620 579 538 569 599 578 556 592 628 571 514 570 626 568 510
-126E10L5L4L5L5R7R8l8l7J3J3q1q1J2J1r8r9rN3k9l0L7R9L2L3N0N1o1o2M1P3k4q6QQk7k7
$$ 510 545 579 614 649 746 844 806 769 782 795 714 633 645 656 558 459 450 503 474 444 481 580 612 645 695 746 685 623 664 737 713 627 635 643 616 589
-130E89J16J15K3K2M0M0n3n3LKm9m9M5M4o9o9L2L3q2q2n3n3n2n3N1N2%jN5N5q0q0JKn1n0J5
$$ 589 705 820 843 865 905 945 892 839 842 844 795 746 791 835 766 697 729 762 680 598 545 492 440 387 438 490 490 489 544 599 519 439 440 442 391 341 356
-134C56J4j7j6P9Q0j4j4P7P7NMJ3J2o0o1N9N8PON5N4n9o0ppl5l4J4P6J0r4o6ll8r9k0M1k1
$$ 356 370 353 337 416 496 482 468 545 622 627 631 644 656 596 535 594 652 659 665 720 774 715 655 648 641 606 572 586 662 672 578 512 509 471 372 352 393 372
-139C72k2L5J38O3JL4L4o3o2K1K2ooJ7Q0J3r1l0L1K6l8J7J7o0o0K5K5ooM7M7nnMNk2k3NO7
$$ 372 350 385 523 586 587 621 655 592 530 551 573 567 561 578 658 671 580 550 581 607 569 586 603 543 483 508 533 527 521 568 615 610 605 609 614 592 569 574 641
-144F41Mj00p8K5L1l1OO8J6m6k3L9L9k3m3K0K1m0RJ12N1n4n2J0Qn5n8MMn8k5L8L8k5k7L5L5
$$ 641 645 545 467 492 523 492 498 566 582 536 513 552 591 568 525 545 566 526 535 647 698 644 592 602 610 555 497 501 505 447 422 460 498 473 446 481 516
-148E16k7j5M6j3p5j1R2O9PJ7Q0J9m2m3O1O2m3n0J2n1j12p1L4J0n2k4L7L8k5lN9N9mk5L7L5
$$ 516 489 474 520 507 432 421 513 582 589 606 686 705 663 620 681 743 700 650 662 611 499 428 462 472 420 396 433 471 446 443 502 561 557 532 569 604
-153F04k7NL7oo8k4P9N6oj3N0N0j2l9K4M8n7q5k3Jj03j20j6K0m2j4M9M9j4m0K3K5l6l6O8J07
$$ 604 577 582 619 613 545 521 600 656 650 637 687 737 725 686 710 758 701 616 593 594 491 371 355 375 333 319 368 417 403 363 386 411 375 339 407 514
-157E14M5K2Q3M5n9n8MNn8l6O8M4j8j8M4M4j9%O2K6p8j18j3K3l9q0j8K3qK6K5K8K7j4M8P6
$$ 514 559 581 664 709 650 592 596 601 543 507 575 619 601 583 627 671 652 652 714 740 662 544 531 554 515 435 417 440 432 458 483 511 538 524 572 648
-162F48k9n9KO3%l8K5M8n6m6J6J3m9p1qN3qk2M1O4m0r8l5K4l9o4kO3%PJ11J11Pp0rJ30O9l6
$$ 648 619 560 562 625 625 587 612 660 604 558 574 587 538 467 459 512 504 482 523 587 547 449 414 438 399 335 333 396 396 403 514 625 632 562 553 683 752 716
-166G16l6m0l9l6l6L0L0m8J5M2o2j27o5lkl5l5O9O8M7M6M6M6l0l0J1n1r4J0N1N1MLLM%%O2
$$ 716 680 640 601 565 529 559 589 541 556 598 536 409 344 341 339 304 269 338 406 453 499 545 591 561 531 542 491 397 407 458 509 513 516 519 523 523 523 585
-171E85O3o1o1M3M3kjO1O1k6k6k6k6p6p6K8K8K8K8K8K8l9l8K4K4m9m8R6R7QQQRo6o6mln1n1
$$ 585 648 587 526 569 612 610 609 670 731 705 679 653 627 551 475 503 531 559 587 615 643 604 566 590 614 565 517 613 710 718 726 734 743 677 611 607 604 553 502
-176E02N3N3m9m8N5N5k4k4M9J8l4J7R7O6m0m0l9l9p4k1N3Jr6o5K9K9RJ0Q3Q2m4m4j3j2q5q4
$$ 502 555 608 559 511 566 621 597 573 622 640 606 623 720 786 746 706 667 628 554 533 586 587 491 426 455 484 493 503 586 668 624 580 567 555 470 386
-180C86N1N0mmK7K7p4p3O1O1J4J4J4J4k9l0M3M3j8j9N4N4o5o5K8K8m4m4N0M9m9n0M4M3mmm
$$ 386 437 487 483 479 506 533 459 386 447 508 522 536 550 564 535 505 548 591 573 554 608 662 597 532 560 588 544 500 550 599 550 500 544 587 583 579 575
-185E75lk3k3K9K9o4o4QQq1q2M3R4J0k1N9J11K5m7llp9p9oonoO8O7l7l7L5L6l0l0K2K2K9L0
$$ 575 572 549 526 555 584 520 456 464 472 391 309 352 446 456 435 494 605 630 583 580 577 498 419 413 407 402 396 464 531 494 457 492 528 498 468 490 512 541 571
-189E71N8Pp9p9N1N1l2o4kN0nmO8O7k2p5k5K7j1m1J3M5l0k9K5K5o2o3K8K7j1p4J3J17M9j3
$$ 571 629 636 557 478 529 580 548 484 482 532 527 523 591 658 636 561 536 563 552 511 524 569 539 510 535 560 498 435 463 490 479 405 418 535 584 571
-194E71k3k3o1o1J1J2l9m0P5P4J2J1J1J2k2k2L1L0l7l7L6L6k7k6K6K5p5p5kkj%P1P2noK6K6
$$ 571 548 525 464 403 414 426 387 347 422 496 508 519 530 542 520 498 529 559 522 485 521 557 530 504 530 555 480 405 403 401 400 400 471 543 538 532 558 584
-198E84n1n1K1K2k9l0K2K3m4m4j2j3JJL2L2m3m3j2j2k9k9M5M4qqK0J9k6q7m3O2M0k2J2P5J7
$$ 584 533 482 503 525 496 466 488 511 467 423 411 398 399 400 432 464 421 378 366 354 325 296 341 385 377 369 389 408 382 295 252 314 354 332 344 419 436
-203D36m5j4M9J8m4j2N0L8k4K6Q8L3p2m0O4O5LM0M0k8r1m8N5K1q4n4RqrK7Q9kj05q3k0jo3
$$ 436 391 377 426 444 400 388 438 476 452 478 566 599 527 487 551 616 619 659 699 671 580 532 587 608 524 470 479 471 462 489 578 576 471 388 368 367 304
-207C04j7Q7L4o9p1qKLL8R9P4k9rN3N2n1k8L5J3m9p3L2M4j7j8M4M1o2o3M1M2k2j8M4K2m0m0
$$ 304 287 374 408 339 268 260 262 265 303 402 476 447 438 491 543 492 464 499 512 463 390 422 466 449 431 475 516 454 391 432 474 452 434 478 500 460 420
-212D20K3L0l2k7P7Q5j9m4J8Ln9n0N2O5Kk9L4K1q2q2K2N4qoN7M1k1k1M1Qn5n5PM4j9J0P3P1
$$ 420 443 473 441 414 491 576 557 513 531 534 475 425 477 542 544 515 549 570 488 406 428 482 474 468 525 566 545 524 565 573 518 463 470 514 495 505 578 649
-217F49l2o1KO3JkO1M9n4q2k0L2l0l0L2J1n1n1J1J0n1n1J1M2k0k0M3Q3K1n2J1L0l2l2L0N5
$$ 649 617 556 558 621 622 620 681 730 676 594 574 606 576 546 578 589 538 487 498 508 457 406 417 459 439 419 462 545 566 514 525 555 523 491 521 576
-221E76pn9LK7l6n9M5O8Nk3L9Q5K3m9J3P3J0k4k5pl8n9MK9l3q8J6O6Lq7n6J0Rj0K2N1j1o4
$$ 576 569 510 513 540 504 445 490 558 563 540 579 664 687 638 651 724 734 710 685 678 640 581 585 614 581 493 509 575 578 491 435 445 454 444 466 517 506 442
-226D42lL8k4k5L8O6Mo6nM9J7jO2J04M1l8l7J4m8j21n9J2J3oK6K5l7l9K3L9k3n5PP5J3m2j1
$$ 442 439 477 453 428 466 532 536 470 465 514 531 530 592 696 737 699 662 676 628 507 448 460 473 467 493 518 481 442 465 504 481 426 433 508 521 479 468
-230D68M5j7q7k5N5N5L6O6Q0k4r5o5ONm5m4J4J5k2M0R9O8k5k5POLLL0l2o6nO5Ko9l9j1j1m9
$$ 468 513 496 409 384 439 494 530 596 676 652 557 492 498 503 458 414 428 443 421 461 560 628 603 578 585 591 594 597 627 595 529 524 589 591 522 483 472 461 412
-235D12J4O0lr3l1L4L4l5l5J5J5p8p8K4K4LL4Q3K2l2%O8O8k3k3N4N4kkP0Pp2p2J1J2o2o1K
$$ 412 426 486 483 390 359 393 427 392 357 372 387 309 231 255 279 282 316 399 421 389 389 457 525 502 479 533 587 585 583 653 660 588 516 527 539 477 416 418
-240D18Jn0n0JKKKQ3Q3l1l1L7L7n7n6N2N3%JP0P0L5L5O2%j38j38jO2nnL0L0o3o4k6k6n8n7
$$ 418 419 369 319 320 322 324 326 409 492 461 430 467 504 447 391 443 496 496 497 567 637 672 707 769 769 631 493 492 554 549 544 574 604 541 477 451 425 367 310
-244C10K5K4K5K5Q6Q5k9k9K9K9q6q5J4J5l7l7K9L0o4o4RQRQP8P8j5j6M9N0llL6L7p8p8ppl8
$$ 310 335 359 384 409 495 580 551 522 551 580 494 409 423 438 401 364 393 423 359 295 304 312 321 329 407 485 470 454 503 553 550 547 583 620 542 464 457 450 412
-249D12l8P0P0k5q8m1K2j8j7M4M5m5m6nN7K6l7J4J4m1m2M1M0ppM0J03N1j1O5O4K3m0RRm8m7
$$ 412 374 444 514 489 401 360 382 364 347 391 436 391 345 340 397 423 386 400 414 373 331 372 412 405 398 438 541 592 581 646 710 733 693 702 711 663 616
-254F16K0K0n6j18m7J6J1n1J3J2k2k2%%j%K1K1k7k7N9J21P4l1l4kk3k3OO9K2rO1R2J6m6k2
$$ 616 636 656 600 482 435 451 462 411 424 436 414 392 392 392 391 391 412 433 406 379 438 559 633 602 568 566 543 520 526 595 617 608 669 761 777 731 709
-258G09Rk2n3KO3po9J5P8K9p6m7J4nl7NO7J7m5k6L6Lo0l6onl7J7P9K7l5l7nl4o5MJ08J06K
$$ 709 718 696 643 645 708 701 632 647 725 754 678 631 645 640 603 608 675 692 647 621 657 660 600 564 558 553 516 533 612 639 604 567 562 528 463 467 575 681 683
-263F83l7l8q9q9j0R4M2k0J5M6rp1n5Pm2j04q2K2J2k0J5P6P7J4j7J3j7m9J9Q1N7m6l1P3M7
$$ 683 646 608 519 430 420 514 556 536 551 597 588 517 462 469 427 323 241 263 275 255 270 346 423 437 420 433 416 367 386 467 524 478 447 520 567
-267E67j4l2L0Nr9p2L2L7k5m2K1K0m1k5L9L8k4l0L2L2l0J4P5M1k1n2n1j7p9o9pmo6j3R2O8
$$ 567 553 521 551 556 457 385 417 454 429 387 408 428 387 362 401 439 415 385 417 449 419 433 508 549 528 476 425 408 329 260 253 249 183 170 262 330
-272C30OpN5N5pm4J9J9m4m4J9K2m1o9L5J5m8m8N5R4L2OO9L7k5l0L3L2k9l2L0N4n0o2%O1kl0
$$ 330 336 329 384 439 432 388 407 426 382 338 357 379 338 269 304 319 271 223 278 372 404 410 479 516 491 461 494 526 497 465 495 549 499 437 437 498 496 466
-276D66L3N6m7q8k6j%j1N1P9k6o1JK4q0j14j1O7Nk8L4O5Ln2J1L7L8rN3N0n5r1k9L7L7m7J6
$$ 466 499 555 508 420 394 393 393 382 433 512 486 425 426 450 370 256 245 312 317 289 323 388 391 339 350 387 425 416 469 519 464 373 344 381 418 371 387
-281C87P8J6j8j7J7m5m3K0N0j1o5kO0kn8MK7K7k1k1J8m5o0LK9L0k2M2M5j8n6OJ06M4nnM9n4
$$ 387 465 481 463 446 463 418 375 395 445 434 369 367 427 425 367 371 398 425 404 383 401 356 296 299 328 358 336 378 423 405 349 355 461 505 500 495 544 490
-285D90j37j37OPj1N1Q3K0POM2k1o8oN8N9j7j7J8J8o1KO4Jm4m4j4j3k3L9P1Ql7l6K7K6l4K8
$$ 490 353 216 222 229 218 269 352 372 379 385 427 406 338 332 390 449 432 415 433 451 390 392 456 457 413 369 355 342 319 358 429 437 400 364 391 417 383 411
-290D11R1K9l9l9J9K0k3k3Q1Q2n0m9m2j03j15n2N5N4NMNMk8k9L4L4l9l8ppp1p0L3L3qpN4N5
$$ 411 502 531 492 453 472 492 469 446 527 609 559 510 468 365 250 198 253 307 312 316 321 325 297 268 302 336 297 259 252 245 174 104 137 170 162 155 209 264
-295B64J1J0P3P3rrrro1o2M3M2jjL0L1l3l2P2P2J5J5M7M6m9m9j4j3p4j2N7N7m6m6j4j4j8j8
$$ 264 275 285 358 431 422 413 404 395 334 272 315 357 356 355 385 416 383 351 423 495 510 525 572 618 569 520 506 493 419 407 464 521 475 429 415 401 383 365
-299C65M5M4n3n4N0N0llN9N9k4k4k4k4l5l6K7K6o5o6mlo6o6Q0P9j3j3M9M9J1J2J1J2n9n9L
$$ 365 410 454 401 347 397 447 444 441 500 559 535 511 487 463 428 392 419 445 380 314 310 307 241 175 255 334 321 308 357 406 417 429 440 452 393 334 337
-304C37Lk9l0P5P4J6J5P4P4l0r3p6m4n3n4N2N3J8J9J8J9p9p8L2R5K0K1Q3Q2%o3k8k7j22j21
$$ 337 340 311 281 356 430 446 461 535 609 579 486 410 366 313 259 311 364 382 401 419 438 359 281 313 408 428 449 532 614 614 551 523 496 374 253
-308B53j2M9J7j5j3J9j1m3K2N3k3k3M1M2JJO3O4J3J2J3J3m9m8J0J0n9j21j9M3N7K6K8N9K4
$$ 253 241 290 307 292 279 298 287 244 266 319 296 273 314 356 357 358 421 485 498 510 523 536 487 439 449 459 400 279 260 303 360 386 414 473 497
-312D97qQQl6r9p9m7o3l0P7J09L4k7k8L5K6mJ3J4l2r4j7Q6N7nkN9N1j2j2N1M5j6JL2J4m8J3
$$ 497 489 497 505 469 370 291 244 181 151 228 337 371 344 316 351 377 373 386 400 368 274 257 343 400 395 393 452 503 491 479 530 575 559 560 592 606 558 571
-317E71P5qp0n0j9l1o2j8M5J6j6K9R2K7l4j3J8k2k2K0N2no6o7nj8n0nN7K5l8l8K4L1l1j4J7
$$ 571 646 638 568 518 499 468 406 388 433 449 433 462 554 581 547 534 552 530 508 528 580 575 509 442 437 419 369 364 421 446 408 370 394 425 394 380 397
-322C97k4q6m8N4N5qqN4K7p7p7K7N1j3rN3R0K8JJl5r7k1Q3M4j8j6M7lo5o5kL4k9k8L3K6l7
$$ 397 373 287 239 293 348 340 332 386 413 336 259 286 337 324 315 368 458 486 487 488 453 356 335 418 462 444 428 475 472 407 342 340 374 345 317 350 376 339
-326C39l7K5Ko0KO4N9mo3%L0L0K9L0l4r6o1M3N2j1j0N1L3p1p1L3P0Ql3jol7OO9L1l1l1L1N5
$$ 339 302 327 329 269 271 335 394 390 327 327 357 387 416 446 412 316 255 298 350 339 329 380 413 342 271 304 374 382 349 348 342 305 311 380 411 380 349 380 435
-331D35ppN6N4ro8pL1jj8M3K9l4l4K8L3l0k1Q2J14N2J5J4l9j43j46m1Jl0m5J7jo3l2L0M8j5
$$ 435 428 421 477 531 522 454 447 478 477 459 502 531 497 463 491 524 494 473 555 669 721 736 750 711 568 422 381 382 352 307 324 323 260 228 258 306 291
-336B91j5M7N0j1m3J9L0l2o1KK9lRP1P9k6n4QM6j7m8J5K6l5l6K7L9k2n2J1M3J2nN8P2J0m2
$$ 291 276 323 373 362 319 338 368 336 275 277 306 303 312 383 462 436 382 390 436 419 371 386 412 377 341 368 407 385 333 344 387 399 394 452 524 534 492
-340D92K1Rn4n6PM3o1j09m6K9lk0M3N2j0o2JO5Kl2%L9k3k1M2R9R9O5O5O9l5j05m3qpj2N0Q7
$$ 492 513 522 468 412 419 462 401 292 246 275 272 252 295 347 337 275 276 341 343 311 311 350 327 306 348 447 546 611 676 745 710 605 562 554 547 535 585 672
-345F72K4n5n5k5q8j16j1Q0J9n4n5J7J6nK6O7Np4p5l9p1q0K3J02J02J5J6L7L7OOj2j1o3o4
$$ 672 696 641 586 561 473 357 346 426 445 391 336 353 369 364 390 457 462 388 313 274 203 123 146 248 350 365 381 418 455 461 467 455 444 381 317
-349C17K9K9m4m4J5J4j6j7L9L9j2j3N5N5K5K4N0N0k3k2RRm3m2onp7p8J2J2j9j9K3K2qrN4N4
$$ 317 346 375 331 287 302 316 300 283 322 361 349 336 391 446 471 495 545 595 572 550 559 568 525 483 477 472 395 317 329 341 322 303 326 348 340 331 385 439
-354D39j9j9M2M2l1l0J9K0l2l2N8N7l6l5LMm9m8j2j1o3o4nonnM9N0o5o4l0l0JKO6O6J4J4Q9
$$ 439 420 401 443 485 454 424 443 463 431 399 457 514 478 443 446 450 401 353 341 330 267 203 198 192 187 182 231 281 216 152 122 92 93 95 161 227 241 255 344
-358C44R0k5k5RRq5q5N8N7K7K6M6M6ooN5N6l7l8nmp7p8JJ%JN7N7NNL1L1m2m1M0M1j2j1k6k6
$$ 344 434 409 384 393 402 317 232 290 347 374 400 446 492 486 480 535 591 554 516 511 507 430 352 353 354 354 355 412 469 474 479 510 541 499 458 498 539 527 516 490 464
-363D64k6k7L1L1m2m1M8M9k1q2k6k6l0l0K7K7p2p3J4P7M1M1P9P9J6J7J1J1q9q8m3J9j5j5Q5
$$ 464 438 411 442 473 431 390 438 487 466 384 358 332 302 272 299 326 254 181 195 272 313 354 433 512 528 545 556 567 478 390 347 366 351 336 421
-368D21Q6k0q3k0M2L8k3J9J8m3m3M3J05K5p9p4p4j15n3R1R1K6l6M2M2k1k0J7Q1J7m4J0J0j7
$$ 421 507 487 404 384 426 464 441 460 478 435 392 435 540 565 486 412 338 223 170 261 352 378 342 384 426 405 385 402 483 500 456 466 476 459
-372D59q0m2K1j9j8P2P2Qn5k6L7JKJ5P7J4m8J8J8n2j13p2j0J4J4L0L1Pn5jO2jo3m3J9j7j6
$$ 459 379 337 358 339 321 393 465 473 418 392 429 430 432 447 524 538 490 508 526 474 361 289 279 293 307 337 368 375 320 319 381 380 317 274 293 276 260
-376B60jO2K6K7M5M5j9q2n4Rk6k6qN4mo6m7J5k0j9K5Q8K5l6j7j5p6p6k0Q3O5KK7R1K7l4oN5
$$ 260 259 321 347 374 419 464 445 363 309 318 292 266 258 312 308 242 195 210 190 171 196 284 309 273 256 241 165 89 69 152 217 219 246 337 364 330 324 379
-381C79N2j0j3j4Mk7k5L7L9k4m1K2%l1k0k0o1r1pR8P4J1J1M1lo5p8j4l3o3NO7P0PNO8M8J7
$$ 379 431 421 408 394 398 371 346 383 422 398 357 379 379 348 328 308 247 156 149 247 321 332 343 384 381 316 238 224 191 128 133 200 270 277 282 350 398 415
-386D15J5M6Ln9k7L7L6k6o7nno6m1K1K1m1l2L1L0l2m6J7Kk9rR5P2RlK9j4p6n4N1K7l5m1K2
$$ 415 430 476 479 420 393 430 466 440 373 368 363 297 256 277 298 257 225 256 286 254 208 225 227 198 189 284 356 365 362 391 377 301 247 298 325 290 249 271
-390B71K2m0p0rN3j0k8MK1m1l8K6K5l8j1N1N1j1k4L8L8k4n8Mj4m4k6L7L9k3l9K3K3l9nN8N7
$$ 271 293 253 183 174 227 217 189 193 214 173 135 161 186 148 137 188 239 228 204 242 280 256 198 202 188 144 118 155 194 171 132 155 178 139 134 192 249
-395B49nM0J02R9L6J9K0K4l9k5L8L7k5n4PL1p2j09m7j2j1p7j4OOk5L6M1k2l1L1N8m%%j%l2
$$ 249 244 284 386 485 521 540 560 584 545 520 558 595 570 516 523 554 482 373 326 314 303 226 212 218 224 199 235 276 254 223 254 312 308 308 308 307 307 275
-400B75L1L0p5r2J2P9J8k8L4O6Mp2j0O0lm4m3RQj6M5R8L5rrK9l4p9K4P0Po0o1qqp0pM5j7m8
$$ 275 306 336 261 169 181 260 278 250 284 350 354 282 272 332 329 285 242 251 259 243 288 386 421 412 403 432 398 319 343 413 420 360 299 291 283 213 206 251 234 186
-404A86m8M2M2j9k0L3L3k6k5NOk7k6K9K9j4M8J00L8kkM5M6l6l5nnm2m2L0L1j6j6N0j2m0l9
$$ 186 138 180 222 203 183 216 249 223 198 203 209 182 156 185 214 200 248 348 386 384 382 427 473 437 402 397 392 350 308 338 369 353 337 387 375 335 296
-409B96N0N0l7l8J4J5k1k1L2L1%%L1L1l3l4J8J8o3o4RRk2k1k2k1n9n8N6N6LMMMn5n5J7J8J9
$$ 296 346 396 359 321 335 350 329 308 340 371 371 371 402 433 400 366 384 402 339 275 284 293 271 250 228 207 148 90 146 202 205 209 213 217 162 107 124 142 161
-414A61J9N1N0j0j1M1M2k3k2N0N1o4o4QRllK8K8o0o1L3L4k2k1J0Rk9l0O4O4j5j4L8L8%%L1
$$ 161 180 231 281 271 260 301 343 320 298 348 399 335 271 279 288 285 282 310 338 278 217 250 284 262 241 251 260 231 201 265 329 314 300 338 376 376 376 407
-418D07L1k1k2k1k1p2p1O3O4m0l9rqn1n0M3M3l2l2K0J9rj0O3O3J5J5O3O3j8q0k8L4K0K1K4
$$ 407 438 417 395 374 353 281 210 273 337 297 258 249 241 190 140 183 226 194 162 182 201 192 182 245 308 323 338 401 464 446 366 338 372 392 413 437
-423D37K5k2k1M7M7k0q3m7m7m2m2N2N2MNL6L5o9p0J0P2onL3R4K0m3mmrj0Q1Q0Mn8k3k3k4k4
$$ 437 462 440 419 466 513 493 410 363 316 274 232 284 336 340 345 381 416 347 277 287 359 353 348 381 475 495 452 448 444 435 425 506 586 590 532 509 486 462 438
-428D38L6L7q3j13l0L3K5pN6Q6Qn4l7no0r2mN7O0K9M7M7k5q6n1n2j09j10k7P7O4KM1M2Mk6
$$ 438 474 511 428 315 285 318 343 336 392 478 486 432 395 390 330 238 234 291 351 380 427 474 449 363 312 260 151 41 14 91 155 157 198 240 244 218
-432B18J4P6J2n1l1%n8q9k8P6P0QM6M5K8l4l8K4L9k2k3M0J6m7k5Ok2k3K1N1lo6m6j5l0k9L6
$$ 218 232 308 320 269 238 238 180 91 63 139 209 217 263 308 336 302 264 288 327 305 282 322 338 291 266 272 250 227 248 299 296 230 184 169 139 110 146
-436A46J00M9j2ML6j8q0jJ02J23O2J4j7r0j22m1K1Ln9JO3K1q2n7NK1rk8L5K2m1l9K3N9K9K8
$$ 146 246 295 283 287 323 305 225 224 326 449 511 525 508 418 296 255 276 279 220 221 284 305 223 166 171 192 183 155 190 212 171 132 155 214 243 271
-441B71N9J3m9l2%k3n4j0N1K2m0mJ00N9m5k0M3J9m4m4J8M0k2mK7J1n0n1J2ml4RP3O3%J9M9
$$ 271 330 343 294 262 262 239 185 175 226 248 208 204 304 363 318 298 341 360 316 272 290 330 308 304 331 342 292 241 253 249 215 224 297 360 360 379 428
-445D28J6m6m8J4J4m8m9J4j0p2p3j0J6m7m6J5M9j4j4M9P2J1K7N9L9k3k6L7N6oo7mll5l5mJ2
$$ 428 444 398 350 364 378 330 281 295 285 213 140 130 146 99 53 68 117 103 89 138 210 221 248 307 346 323 297 334 390 384 317 313 310 275 240 236 248
-450B48n1n2J0N8lmN9R1K9l6l6m7m6k0M1Nk7J5P8P5l0o9oJ5m8m8J5L8k3m7N6J14N2j5j4pp0
$$ 248 197 145 155 213 210 206 265 356 385 349 313 266 220 200 241 246 219 234 312 387 357 288 282 297 249 201 216 254 231 184 240 354 406 391 377 370 300
-454C00o9pj2j2J5P7J11M9j8j8j6m7o9oJ2n1n0J2Q7K6j9J1J0n2j13n0K9K9nN6N6on8k7QRQ
$$ 300 231 224 212 200 215 292 403 452 434 416 400 353 284 278 290 239 189 201 288 314 295 306 316 264 151 101 130 159 154 210 266 260 202 175 183 192 200
-459B00QN1J9lO0N3ro0LL5Mm2J9M5J3l6oL2Jl4K8O2jn1J1O4L3kkK8l5n4QN9lp6m4nok1k1J1
$$ 200 208 259 278 275 335 388 379 319 322 357 361 319 338 383 396 360 354 386 387 353 381 443 442 391 402 466 499 497 495 523 488 434 442 501 498 422 378 373 367 346 325 336
-464C36j9m0K3P5M3rK3M2k0r4o3LMk5k6L3L2m0m0MMj1j1K9K9k2k3J7J8j4j4O6O6k7k7MLm9
$$ 336 317 277 300 375 418 409 432 474 454 360 297 300 304 279 253 286 318 278 238 242 246 235 224 253 282 260 237 254 272 258 244 310 376 349 322 326 329 280
-469B80j8J4m8j00l8K2j0n7k6R8R7M8M8M7M7m6m6jkj7j7%Jp2p2qpj0j0M5J4l7K6J01O9klO7
$$ 280 262 276 228 128 90 112 102 45 19 117 214 262 310 357 404 358 312 311 309 292 275 275 276 204 132 124 117 107 97 142 156 119 145 246 315 313 310 377
-473C77O7noMNo9o8M3M4l0k9j8j7q4k1J19J19O4KJ4J3q3q4k3k3n4n4N0N1kkJ3J2n6n6l1L2
$$ 377 444 439 433 437 442 373 305 348 392 362 333 315 298 214 193 312 431 495 497 511 524 441 357 334 311 257 203 253 304 302 300 313 325 269 213 182 214
-478B14M9M9J01J00m1j03o8o8m1m0M7M8k6k5L4L4LLM9M9no8k2M0JJjjn3n3OOm6m6M0M1J0J0
$$ 214 263 312 413 513 472 369 301 233 192 152 199 247 221 196 230 264 267 270 319 368 363 295 273 313 314 315 314 313 260 207 213 219 173 127 167 208 218 228
-483B28L6L6j6j6rj0o1o1M7M7mnN7N6J9m3j4j3m5m4J0P2%o2n0m9kjQQm1m0M9J12M5M6MLq9
$$ 228 264 300 284 268 259 249 188 127 174 221 217 212 269 325 344 301 287 274 229 185 195 267 267 205 155 106 104 103 111 119 78 38 87 199 244 290 294 297 208
-487B08r0%Jm8m8M3J05L7k6NO7L2l0RRk6k5K3K2j8m9M4J07K8p6m8J4pl9j9J1lmM2J04M1k0
$$ 208 118 118 119 71 23 66 171 208 182 187 254 286 256 265 274 248 223 246 268 250 201 245 352 380 304 256 270 263 224 205 216 213 209 251 355 396 376
-492C76RQl6o7k7L5L6k7j5J6k8r0k2M1L9k3k8Mj7j6O3R5J1n0l1L2L2l0j6M6K5oj1j1j3j3l4
$$ 376 385 393 357 290 263 298 334 307 292 308 280 190 168 209 248 225 197 201 184 168 231 326 337 287 256 288 320 290 274 320 345 339 328 317 304 291 257
-496B57l4l2l3L9O9K9l3J4P7N8K7O2R4L1p3q2n1p2p1k3M0j9q1j3M9M9j3rN3N3rn3Rl0k9K2
$$ 257 223 191 158 197 266 295 262 276 353 411 438 500 594 625 552 470 419 347 276 253 293 274 193 180 229 278 265 256 309 362 353 300 309 279 250 272
-501B72K3j8m9m2K0K2m0m4J9J8m4m0K3K1m2l0KJl0j3N0N2j1NO8O7NqN4N4rJ9Q2J9m4o1%Jo1
$$ 272 295 277 228 186 206 228 188 144 163 181 137 97 120 141 99 69 71 72 42 29 79 131 120 125 193 260 265 257 311 365 356 375 457 476 432 371 371 372 311
-506C11o2J%o1l0L3P3M3jjL6k7m6J6k1k1kK8M9j4k8MK1m1n9MOn6lJ01R9nn4k2qp0r4l1L5L5
$$ 311 249 250 250 189 159 192 265 308 307 306 342 315 269 285 264 243 241 269 318 304 276 280 301 260 201 205 211 155 152 253 352 347 293 271 263 193 99 68 103 138
-510A38OL8N6nm3j1j2m2n9MM8J7NL6N5pn4RN1K1JL2N1j1n1J0P1Rj4J7J5j6j4J7L4k8j5J6L2
$$ 138 144 182 238 233 190 179 167 125 66 70 118 135 140 176 231 224 170 179 230 251 252 284 335 324 273 283 354 363 349 366 381 365 351 368 402 374 359 375 407
-515D07l1n0j8k1n1m7j7l1l2jO1O5KLO5O3Jk6NNk7m0K2K3l8p9j8K6nk0J1J4j8l2L0R0K9k2
$$ 407 376 326 308 287 236 189 172 141 109 108 169 234 236 239 304 367 368 342 347 352 325 285 307 330 292 213 195 221 216 196 207 221 203 171 201 291 320 298
-520B98k2ml6q1k0M8M7J9J9J9J9k9l0K2K3PPQPl1l1MMl8K4N5pl7l7L2L1JJN3N3m5m5m1m2m8
$$ 298 276 272 236 155 135 183 230 249 268 287 306 277 247 269 292 299 306 314 321 290 259 263 267 229 253 308 301 264 227 259 290 291 292 345 398 353 308 267 225 177
-525A77J4N2N1L2L1L9k3q0j8nnn4n3K0J9m7m7K5K5ppK4K5m8m7M6M6LLPPK7Q9Q9K6n6n6rqq1
$$ 177 191 243 294 326 357 396 373 293 275 270 265 211 158 178 197 150 103 128 153 146 139 163 188 140 93 139 185 188 191 198 205 232 321 410 436 380 324 315 307 226
-530B26q0J3J4k4k3K9K9m2m1N1N2J3J3M4M4k5k5POj4j5J7J7n4n3K0J9m8m8K5K4m2m3L1L0j
$$ 226 146 159 173 149 126 155 184 142 101 152 204 217 230 274 318 293 268 275 281 267 252 269 286 232 179 199 218 170 122 147 171 129 86 117 147 146
-534A46%P3P2lklll4l4L8L8j0j1O2O2j7j8j8j7m1m2J1J1o0n9lO0L3KK3K4j6j6j6j6l6l7J6
$$ 146 146 219 291 288 286 283 280 246 212 250 288 278 267 329 391 374 356 338 321 280 238 249 260 200 141 138 198 231 233 256 280 264 248 232 216 180 143 159
-539A59J5l8l9lll3L0J26J26J8m4k9Ll7o8j4J7lkL1L0K2K1K1K1m4m4j3j3o4o4N0N0pqpqk9
$$ 159 174 136 97 94 91 58 88 214 340 358 314 285 288 251 183 169 186 183 181 212 242 264 285 306 327 283 239 226 213 149 85 135 185 178 170 163 155 126
-543A26k9M3M3J6J5M5M5o5r6m0K1j1j2M5M4m2m1L1L1KLL3O4K4l7jjl7l6jO1J6j5J5M7qp0l9
$$ 126 97 140 183 199 214 259 304 239 143 103 124 113 101 146 190 148 107 138 169 171 174 207 271 295 258 257 256 219 183 182 243 259 244 259 306 298 228 189
-548A89K4j1m2J0M1j8p9m7J6j1j0K4N5Nn8oN7O4L2N0N0K0m3n6k5k2k1RJ0m1p3MO6N7N8N7N7
$$ 189 213 202 160 170 211 193 114 67 83 72 62 86 141 146 88 82 139 203 235 285 335 355 312 256 231 209 188 197 207 166 93 97 163 220 278 335 392
-552C92o0j22q7J6N6p%O2J6J5K0J9l4l5K8K7rrm0m1k0j9P7P8M3o1l7K5MMQQl5l5K7K7lmml
$$ 392 332 210 123 139 195 188 188 250 266 281 301 320 286 251 279 306 297 288 248 207 187 168 245 323 366 305 268 293 297 301 309 317 282 247 274 301 298 294 290 287
-557B87j6j5j5j6k7k8k8k7l5l5K8K7J9J8M9N0L8L8POL1L1L1L1LLLLo3o3o3o3j0rJ8J8Mn8k4
$$ 287 271 256 241 225 198 170 142 115 80 45 73 100 119 137 186 236 274 312 319 325 356 387 418 449 452 455 458 461 398 335 272 209 199 190 208 226 230 172 148
-562A48Q1R2K9RQj0rj0rj4j3j4j3j4j4j3j4j0rn2J1K0q5q0K3N9N9O2O2j4p6p2L2O2%n5OMM
$$ 148 229 321 350 359 367 357 348 338 329 315 302 288 275 261 247 234 220 210 201 149 160 180 95 15 38 97 156 218 280 266 190 118 150 212 212 157 163 167 171
-567A71QQK3K4l9l9L3L4K9L0Nn6m2j0J5j7l6K7M9j2n4k2j5j5J1P3Q8K6oN7L0l2p5m4k6n7p7
$$ 171 179 187 210 234 195 156 189 223 252 282 287 231 189 179 194 177 141 168 217 205 151 129 114 99 110 183 271 297 291 348 378 346 271 227 201 144 67
-571F7j5J3n0k9JJ3j5l6K6P9J7LL5N6om9j8J4J4J2J3qp1o9qRQMO8R2L1l5l5j8j8k1k0Pk5m3
$$ 67 52 65 15 -14 -13 0 -15 -51 -25 54 71 74 109 165 159 110 92 106 120 132 145 137 66 -3 -11 -2 6 10 78 170 201 166 131 113 95 74 54 61 36 -7
-576gJ7N1K0k3k3J6j5l4K8O4L2L3O4J2n0n2J0P1Qn1J0O7L6m7m7k4k5m6j4L5k7q8k4O7O7O7
$$ -7 10 61 81 58 35 51 36 2 30 94 126 159 223 235 185 133 143 214 222 171 181 248 284 237 190 166 141 95 81 116 89 1 -23 44 111 178
-581A78O8O4Km5j4L0ko1l1K4K4K2K3M0k2o6l5j%KJL1L1m2m2K6K6k6k6L4L3LKj1j1o3o3k6k5
$$ 178 246 310 312 267 253 283 281 220 189 213 237 259 282 322 300 234 199 198 198 200 201 232 263 221 179 205 231 205 179 213 246 249 251 240 229 166 103 77 52
-585E2k6k5N2N3N2N2L9L9p5p6J%L2L1P3P3m2m1k7k7n9n8J5J5j6j6O1O2j1j1K6K6m7m7N3N3
$$ 52 26 1 53 106 158 210 249 288 213 137 138 138 170 201 274 347 305 264 237 210 151 93 108 123 107 91 152 214 203 192 218 244 197 150 203 256
-590B56k0k0j5j5o7o7J1J2k0k0L5L5L5L5K5K6m8m7J2J2j8j9L5L6j6j6K5K6k7k6K8K8llM8M8
$$ 256 236 216 201 186 119 52 63 75 55 35 70 105 140 175 200 226 178 131 143 155 137 118 153 189 173 157 182 208 181 155 183 211 208 205 253 301
-594C01k5k5j7j7o9o9L6L5j6j7K4K4qpK3K4k9k8K0K1l2l1k0k0k0k0RJ0J0J0L5L4j7j7K5K5
$$ 301 276 251 234 217 148 79 115 150 134 117 141 165 157 150 173 197 168 140 160 181 149 118 98 78 58 38 47 57 67 77 112 146 129 112 137 162
-599A62opL6L5l8l7rrm0m0O0O1L0L0RQk0k0Q4J14K0m2n2k0m3m2K1K1l1l1L1L2m2m1j6j5j6
$$ 162 156 149 185 220 182 145 136 127 87 47 107 168 198 228 237 245 225 205 289 403 423 381 329 309 266 224 245 266 235 204 235 267 225 184 168 153 137
-603A37j5M4M4j0p3k1M1KJK6K5k6n7k3L9L4L4M1M2l4r6m2K1J3J2L2L1JKL5O6J3m9l8pk4k4
$$ 137 122 166 210 200 127 106 147 149 150 176 201 175 118 95 134 168 202 243 285 251 155 113 134 147 159 191 222 223 225 260 326 339 290 252 245 221 197
-608A97qN3L5Lpl9r1r2j0N3Pk3j1N2L5LK0N1M9J8L6L7%o2k8L5Jo1k6OJ7J8Q3J15K2m0l8K5
$$ 197 189 242 277 280 273 234 143 51 41 94 101 78 67 119 154 157 177 228 277 295 331 368 368 306 278 313 314 253 227 233 250 268 351 466 488 448 410 435
-612D35Mk7J0J0m4j06n2N2O0lj3M9K8lKLn2n1rqpoML5oo8p5j1n1n1J1J0J2J3K5N6J6m7MO7
$$ 435 439 412 422 432 388 282 230 282 342 339 326 375 403 400 402 405 353 302 293 285 278 272 276 311 305 237 162 151 100 49 60 70 82 95 120 176 192 145 149 216
-617B16O7Mk3M0L9k3n7NOn7k4L9J9j1mK7M6j6m0K2K2m1p2j0k7n9k7L6J9j1k1M1M1k1o3l3l2
$$ 216 283 287 264 304 343 320 263 268 274 217 193 232 251 240 236 263 309 293 253 275 297 256 184 174 147 88 61 97 116 105 84 125 166 145 82 49 17
-622A7o2k7L6K1j1K2Q4Q4K3j0K2L7k5o8l6j9q1o9qJ6J6L7L6N9K7J0P2P4J2j5M7M5j7k6NNk7
$$ 17 -45 -72 -36 -15 -26 -4 80 164 187 177 199 236 211 143 107 88 7 -62 -70 -54 -38 -1 35 94 121 131 203 277 289 274 321 366 349 323 328 333 306
-626C06j2N0M9j2l4lJ4m7m1K1K2m1n2J0pl8l2L0L2l0m2K0Q3K0qN4N1j2k9k8k9k9%O3O6MmN8
$$ 306 294 344 393 381 347 344 358 311 270 291 313 272 220 230 223 185 153 183 215 185 143 163 246 266 258 312 363 351 322 294 265 236 236 299 365 369 365 423
-631D23N5ql4l4j7m8l6K5K6l7q8n7j7j6l0l0L2L3k1k1j7j7rN3N5pq6n5j0rm0K2O9L7L3O4P9
$$ 423 478 470 436 402 385 337 301 326 352 315 227 170 153 137 107 77 109 142 121 100 83 66 57 110 165 158 72 17 7 -2 -42 -20 49 86 119 183 262
-635B62J7k2k1L7L7%%L7k5q5n4K8K8mmL3k9p0l9NOm8J5O1L0J4M5M3J2j7j6j9j8o1o1l9p1o9
$$ 262 279 257 236 273 310 310 310 347 322 237 183 211 239 235 231 264 235 165 126 131 137 89 104 165 195 209 254 297 309 292 276 257 239 178 117 78 7 -62
-640f2pL7Oj0K1K2pm2K0Q1K0n0j9M4P5K0j2PQk3k3M0L9nnnnPOPPk5k4k4k4nnmnk3k3Q1Q1J4
$$ -62 -69 -32 -26 -36 -15 7 0 -42 -22 59 79 29 10 54 129 149 137 144 152 129 106 146 185 180 175 170 165 172 178 185 192 167 143 119 95 90 85 81 76 53 30 111 192 206
-646B06J3J4J3m3m3K0J9k7k8L5L5j8j8j9j8p3p2L0L1j%j%m8m6J5J5j2j3j2j2o2o2Q4Q4J4J4
$$ 206 219 233 246 203 160 180 199 172 144 179 214 196 178 159 141 68 -4 26 57 56 56 55 55 7 -39 -24 -9 -21 -34 -46 -58 -120 -182 -98 -14 0 14
-650A4J4J5j3j3J7J8j5j4M7M7rj0N3N2L0L0kjn6n5PPk1k1M1M1J1J1k0k1opR7R7l5l6K7K7j0
$$ 14 28 43 30 17 34 52 37 23 70 117 108 98 151 203 233 263 261 260 204 149 156 163 142 121 162 203 214 225 205 184 178 171 268 365 330 294 321 348 338
-655C38j1K0K1r1r1k9k9j6j6J6J5o1o0Q4Q5O3O2J%l9l9qqn3n3RRrrN2N3k3k4k4k3l3l3K9L0
$$ 338 327 347 368 277 186 157 128 112 96 112 127 66 6 90 175 238 300 301 301 262 223 215 207 154 101 110 119 110 101 153 206 183 159 135 112 79 46 75 105
-660A05L9M0J01J02J1J1J1J1k8k7k8k7n5n5QQPQQPo9o9opj1j1N1N1j7j7J4J4m7m6J4J4k0n1
$$ 105 144 184 285 387 398 409 420 431 403 376 348 321 266 211 219 227 234 242 250 257 188 119 113 106 95 84 135 186 169 152 166 180 133 87 101 115 95 44
-664D4j0N2K1m2k2RLk8K3K2l6l6K4K6J%N9N8Lo0jO0J3n1j9M4jo3n9Lk1k0NO8O3JL5L6j5p7
$$ 44 34 86 107 65 43 52 55 27 50 72 36 0 24 50 51 51 110 168 171 111 110 170 183 132 113 157 156 93 34 37 16 -4 1 69 132 133 168 204 189 112
-669A12j7M5M6J4L6L6J1J1j1K1Jo2n9KK6K5QL9J9m3m2J9J5j7j2J9J1J1K3N4oo8qN5J8m4k5
$$ 112 95 140 186 200 236 272 283 294 283 304 305 243 184 186 212 237 245 284 303 260 218 237 252 235 223 242 253 264 287 341 335 267 259 314 332 288 263
-674B63Pk2n4j1N2L3k9KO5R4L3l5l5l3o4n3J0J8j4j4J8po9o8nL2L1L1L2J0n1l7nRk3k4PQn4
$$ 263 270 248 194 183 235 268 239 241 306 400 433 398 363 330 266 213 223 241 227 213 231 224 155 87 82 114 145 176 208 218 167 130 125 134 111 87 94 102 48
-678D8j7j7n0n2k7L6L7OK7K6kkK2Q3P6J4M8M9k9r2j16j3M3J3J5M6L8k5pK4K4qpK3J6j5j7J3
$$ 48 31 14 -36 -88 -115 -79 -42 -36 -9 17 15 13 35 118 194 208 256 305 276 184 68 55 98 111 126 172 210 185 178 202 226 218 211 234 250 235 218 231
-683B31L1l2l4K9M0k2k2M0M0k2m6m6k3k4%O2O2jo3%J2n0m8J4Jl0k8LJl0m7J4Q2N1PQJ2j9m1
$$ 231 262 230 196 225 265 243 221 261 301 279 233 187 164 140 140 202 264 263 200 200 212 162 114 128 129 99 71 74 75 45 -2 12 94 145 152 160 172 153 112
-688A12K1L7k6o8l7Rk1m1K1N7ol0l0m0p2n2N2J05P4L6L6OOLMJ6j6l5K7M1J0pN5Q4K2o4l3K
$$ 112 133 170 144 76 39 48 27 -14 7 64 58 28 -2 -42 -114 -166 -114 -9 65 101 137 143 149 152 156 172 156 121 148 189 199 192 247 331 353 289 256 258
-692B58o0n8NM1M0j7j8j9j9j9j9j7j7j9j9K4qk2L0O5J4l5mK8lo3l2%JLLjjjjL1L1J0M2O4J2
$$ 258 198 140 145 186 226 209 191 172 153 134 115 98 81 62 43 67 59 37 67 132 146 111 107 135 132 69 37 37 38 41 44 43 42 41 40 71 102 112 154 218 230
-697B30l9pRk2l4J8Q0M9n6q7l5nm2j0L6L6k4k4KJKKj8j8j8j8J4J3J4J4kkkkK5K5NL6O6J4m6
$$ 230 191 184 193 171 137 155 235 284 228 141 106 101 59 49 85 121 97 73 75 76 78 80 62 44 26 8 22 35 49 63 61 59 57 55 80 105 110 146 212 226 180
-702A80ON8N7jkl1l1l2l1J3J2n0m9llmlK4K4m0m0Qk4m8K3J10P9j3o5j4J7mlN5N6ooOPn6n5
$$ 180 186 244 301 300 298 267 236 204 173 186 198 148 99 96 93 89 86 110 134 94 54 62 38 -10 13 123 202 189 124 110 127 123 120 175 231 225 219 225 232 176 121
-708A21J8J8J9J8M2M2k1k0m1m1p6j4N6N6j4j3mmmmP5P6LLPPm6m5n6n7n7n5K2K3K3K3M9N0m4
$$ 121 139 157 176 194 236 278 257 237 196 155 79 65 121 177 163 150 146 142 138 134 209 285 288 291 298 305 259 214 158 101 44 -11 11 34 57 80 129 179 135
-712A35m3J6J7J7J7Q4Q5k9k9J8J8p2p1l0L3kkM4M4On6l0l0l3l4kkn4n2L6L6NOL1L2k0k0M8
$$ 135 92 108 125 142 159 243 328 299 270 288 306 234 163 133 166 164 162 206 250 256 200 170 140 107 73 71 69 15 -37 -1 35 40 46 77 109 89 69 117
-717A17M9k5k5nnonK4K5K4K5N1N2K0K1J7J7l5l4J1J1m0m1NMMMN2N3o3o2j3j2j03j02m3J9J8
$$ 117 166 141 116 111 106 100 95 119 144 168 193 244 296 316 337 354 371 336 302 313 324 284 243 248 252 256 260 312 365 302 240 227 215 112 10 -33 -14 4
-722Dm2ooooO4J27P5J3ONk9k9N4N5j4j4PP0J7m4l7l6l7l6j1N1N3rl4lk5k4J9J8J9J8L8L9j8
$$ 4 -38 -44 -50 -56 -62 2 129 204 217 223 228 199 170 224 279 265 251 258 328 345 301 264 228 191 155 144 195 248 239 205 202 177 153 172 190 209 227 265 304 286
-726B86q1m2j0m2p2m4J6%l0qK2K2qJ2M4ol8J6P9P8J6K8O0K5l7n5QJ8j4MMj2p3o2%J3j9oK5
$$ 286 205 163 153 111 39 -5 11 11 -19 -27 -5 17 9 21 65 59 21 37 116 194 210 238 298 323 286 231 239 257 243 247 251 239 166 104 104 117 98 92 117
-731A17K3qj3j2j5j4J1J1J1J1J1J1J1J0k1k2j7j8j0N3N6ok6L6L5k6k5L8J9j3k6OPk3k9L4J6
$$ 117 140 132 119 107 92 78 89 100 111 122 133 144 155 165 144 122 105 87 77 130 186 180 154 190 225 199 174 212 231 218 192 198 205 182 153 187 203
-736B03j5j6J6j6p9l6K6K5l8k3RrqJO3O7Nl3L0J0k1oK6M5j7l8K4K5l8j9M4P4M4j8j7J7m4o3
$$ 203 188 172 188 172 93 57 83 108 70 47 56 47 39 40 103 170 175 142 172 182 161 155 181 226 209 171 195 220 182 163 207 281 325 307 290 307 263 200
-740B00l1l1o2j5M8N0j3j2M9M6j6k3k2k3k2QP0N5K4NL6N4qn5k3k3n5n8NL2L1K6N7P7J4k6N
$$ 200 169 138 76 61 109 159 146 134 183 229 213 190 168 145 123 131 201 256 280 285 321 375 367 312 289 266 211 153 158 190 221 247 304 381 395 369 374
-745C74Kl0n7n8n9n9l0l1rm0m7J4M1M1L1O1N0j2jL1J7m6n8NO3Jm2m2k5n6p9j8K6mk6NM8M7
$$ 374 376 346 289 231 172 113 83 52 43 3 -44 -30 11 52 83 144 194 182 181 212 229 183 125 130 193 194 152 110 85 29 -50 -68 -42 -46 -72 -67 -19 28
-750B8M1M0M8j4j9M4M4j9l7K5O6L5j3j3Ok5o9oL9Pk6ONk6m1j0k5k5l3L0L3k8p6j3RRRRM1M1
$$ 28 69 109 157 143 124 168 212 193 156 181 247 282 269 256 262 237 168 162 201 208 182 188 193 167 126 116 91 66 33 63 96 68 -8 -21 -12 -3 6 15 56 97
-754I7k1k0J0J1ONL7L7rqK3K2qqrql3l3l0k9mN9Q9K8l6l5K7K7n5PP7P6NNk7k6p6p6K7K8%%
$$ 97 76 56 66 77 83 88 125 162 153 145 168 190 182 174 165 157 124 91 61 32 28 87 176 204 168 133 160 187 132 139 216 292 297 302 275 249 173 97 124 152 152 152
-760A52J%n5n4QQM7M6M7M7lllkk3k2M0M0rrK3K2o5o4lkJ3J3J3J3j5j4J7J8p9p8j6j6m6m8J5
$$ 152 153 153 98 44 52 60 107 153 200 247 244 241 238 236 213 191 231 271 262 253 276 298 233 169 166 164 177 190 203 216 201 187 204 222 143 65 49 33 -13 -61 -46
-765d6J6O0O2O2O2l0l0k6k6k9L4O0O1J6J6N2j2r4r4ONk7k8L4L5m4m4j3j3o2o3%jJ6J7M7M6
$$ -46 -30 30 92 154 216 186 156 130 104 75 109 169 230 246 262 314 302 208 114 120 125 98 70 104 139 95 51 38 25 -37 -100 -100 -101 -85 -68 -21 25
-769B5rrqrJ%O2O3m3m3O1O0POOO%%j%p4p4K9L0J6J6J5J6k1k0Q3Q3J3J2J3J3k1k1k1k1p1p1
$$ 25 16 7 -1 -10 -9 -9 53 116 73 30 91 151 158 164 170 176 176 176 175 175 101 27 56 86 102 118 133 149 128 108 191 274 287 299 312 325 304 283 262 241 170 99
-774I9lO0K4K4K7K8n3n2n3n2j0j0N3N2LKLKm4m4J8J8k0k1k0k1RJ0RRM4M3M3M4k8k8k8k8p8
$$ 99 96 156 180 204 231 259 206 154 101 49 39 29 82 134 137 139 142 144 100 56 74 92 72 51 31 10 19 29 38 47 91 134 177 221 193 165 137 109 31
-779C1p6j3N0no7k8k8l0l1L2L2J7J6J6J7ppN6N5NNNNRRRRj3j3j3j3n6n6l0L3j1j1J7P8M8j3
$$ 31 -45 -58 -8 -13 -80 -108 -136 -166 -197 -165 -133 -116 -100 -84 -67 -74 -81 -25 30 35 40 45 50 59 68 77 86 73 60 47 34 -22 -78 -108 -75 -86 -97 -80 -2 46 33
-784C3K1K2lo5o4lqpJ9Q1K1m1lkK3K3K3K4K3K3K1K2k1n2o9pOPJ0J0j9j9K1N3L9k4k5L7L3k9
$$ 33 54 76 73 8 -56 -59 -67 -74 -55 26 47 6 3 1 24 47 70 94 117 140 161 183 162 110 41 34 40 47 57 67 48 29 50 103 142 118 93 130 163 134
-789A34rK1j3m4m2j1LLM6P7M4j9J5J4j9q1o6l5l9p1k6L6J8j3K9R1M9n5l1L1K8l5j6J6J5j5
$$ 134 125 146 133 89 47 36 39 42 88 165 209 190 205 219 200 119 53 18 -21 -92 -118 -82 -64 -77 -48 43 92 37 6 37 65 30 14 30 45 30
-793C0l3K9L2KK3K3PQj4J7K8l5l7K6Qn5r4o4k2k1M5J06P7J6N0N0L0l2n9n9n7n6QP0N4rRM0
$$ 30 -3 26 58 60 83 106 113 121 107 124 152 117 80 106 114 59 -35 -99 -121 -142 -97 9 86 102 152 202 232 200 141 82 25 -31 -23 47 101 92 101 141
-798A41J2m9r3o0m4m4j7M6K1rL5R7R6L5PPOn7m0qj3j4J4P7P0M0N6N7Ko0m5j3l8o9o7l5k6k6
$$ 141 153 104 11 -49 -93 -137 -154 -108 -87 -96 -61 36 132 167 174 181 187 130 90 82 69 55 69 146 216 256 312 369 371 311 266 253 215 146 79 44 18 -8
-803h%O0O5Mk3k2m1p2n5M9R1L0J9N0J7m5m3J9M5M6M5M6no8o9pM3J2k9k9qrk9JMn9n6NK0K0
$$ -8 -8 52 117 121 98 76 35 -37 -92 -43 48 78 97 147 164 119 76 95 140 186 231 277 272 204 135 128 171 183 154 125 117 108 79 80 84 25 -31 -26 -6 14
-808A4K4K4N3N3%L1N5pp3p4k3k4QQj5j5j6j5j3j3j5j6J1k1m2K1J8m3m2K0Q6N4J0J0j8p8n0
$$ 14 38 62 115 168 168 199 254 247 174 100 77 53 61 69 54 39 23 8 -5 -18 -33 -49 -38 -59 -101 -80 -62 -105 -147 -127 -41 13 23 33 15 -63 -113
-812a13J2Q3N1rK3M2J1RM0N3rk5PK4l8j23r1rj0J6P7J10M9j7j7l6l6l6l6K8K8llM3M3k2k1
$$ -113 -101 -18 33 24 47 89 100 109 149 202 193 168 175 199 161 38 -53 -62 -72 -56 21 131 180 163 146 110 74 38 2 30 58 55 52 95 138 116 95
-817I5nl6n5OL9Rk3RK4l8j04j05k3k3QQJ00R9mmonnoN5N5N6N5K6K7K6K6k1k0k1k0J2J3J3J2
$$ 95 90 54 -1 5 44 53 30 39 63 25 -79 -184 -207 -230 -222 -214 -114 -15 -19 -23 -29 -34 -39 -45 10 65 121 176 202 229 255 281 260 240 219 199 211 224 237 249
-821B49L5L4o9o9l9l9l9l9M9M9n5n4J4J3J4J4M1M0k2k2LLk8k8m1l9K2K0O9O9l5l5n5n3n4n5
$$ 249 284 318 249 180 141 102 63 24 73 122 67 13 27 40 54 68 109 149 127 105 108 111 83 55 14 -25 -3 17 86 155 120 85 30 -23 -77 -132
-826a32O3O4%JL2L3l0l0P7P7M6M5N3N2n2n2o2o2l1l1M0M0J0RK1K2K1K2M1M2o2o2llllQQn4
$$ -132 -69 -5 -5 -4 28 61 31 1 78 155 201 246 299 351 299 247 185 123 92 61 101 141 151 160 181 203 224 246 287 329 267 205 202 199 196 193 201 209 155
-831A55n4M0M0RRK1K1m1m2k7k7k7k7O1O2kjj2j2j2j2L4L5k8k8j4j4j4j5J7J7m5m6k1k0k1k1
$$ 155 101 141 181 190 199 220 241 200 158 131 104 77 50 111 173 171 170 158 146 134 122 156 191 163 135 121 107 93 78 95 112 67 21 0 -20 -41 -62
-835f2N3N2j0rK1K1l9l9M2P3K3k9j8j8k1k1J8J8J8J7JJo2o0OOOON5N7K4k9ppqqM9Q0j0o1l9
$$ -62 -9 43 33 24 45 66 27 -12 30 103 126 97 79 61 40 19 37 55 73 90 91 92 30 -30 -24 -18 -12 -6 49 106 130 101 94 87 79 71 120 200 190 129 90
$$ [...]
##$OBSERVED INTEGRALS=	(X Y Z)
(1.9709046027492520547, 2.0277370625731356846, 2.9322267476437553491)
(1.5094250289793045283, 1.7498263340343376271, 13.868923695678841312)
(1.190594929367311261, 1.2570889073612570019, 9.0168363311704649021)
(3.7938745351181673016, 3.829372963869701163, 0.18201322550693682656)
##END=	
##TITLE=	Aug03-2021.20.fid
##JCAMP-DX=	6.0	$$ MestReNova 14.1.0-24037
##BLOCK_ID=	3
##DATA TYPE=	NMR PEAK TABLE
##DATA CLASS=	PEAK TABLE
##CROSS REFERENCE=	NMR SPECTRUM: BLOCK_ID=2                                     
##.OBSERVE FREQUENCY=	400.4124024600000098
##.OBSERVE NUCLEUS=	^1H
##NPOINTS=	108
##FIRSTX=	0.063135233434050266887
##LASTX=	7.5186964043223714071
##XFACTOR=	1
##YFACTOR=	1
##FIRSTY=	48.158257958468198012
##XUNITS=	PPM
##YUNITS=	ARBITRARY UNITS
##PEAK TABLE=	(XYW..XYW)
0.063135233434050266887,48.158257958468198012,0.0028273182464731696703
1.0185033456018206532,2.3846732175242610907,0.0020786820338324989675
1.0671581837453913977,300.69078862630209414,0.0038687093757530589995
1.076152239298042268,8.7986420677513486055,0.0021306961279987353744
1.0804601267959150768,9.4348203943545918548,0.0022970811109990683062
1.0991854986177069797,8.2875587167389745957,0.0050072277811036951245
1.1159858491336727138,4.0859293045318008097,0.0027742807572641321051
1.12621269547297298,10.431261153096404115,0.0099491280494403856044
1.1478140712476374574,15.809588224567416859,0.0064401341852492492365
1.163728378273840125,4.0731745682655384755,0.0038007376353226892014
1.1693494612783266184,8.761953588254865366,0.0016143267012086463981
1.1745405219392590634,9.2643925956204746797,0.0024922935346443114875
1.1787203325135975351,123.12674679896862528,0.0039630517720534675849
1.1819249326992053994,41.415744279944981088,0.0033188499349253710799
1.1860797553377369074,22.895990068170988252,0.0031039222588146362335
1.1917438841540528571,12.935774719077279826,0.0018226371639385602081
1.208329556531922977,224.27030748385359971,0.019599348964738218942
1.2128614091267313491,39.934130411369721969,0.0013874346384132895706
1.221920085163703984,1675.335340176633963,0.0038219796034086356458
1.2281380952897034131,76857.841766429963172,0.0026391664811381259498
1.2387922739902523794,41.192106968529962785,0.0014227825630860285819
1.2419485768222489064,32.46947081461150475,0.00062416357071494476573
1.2444188701564069532,9.7772588451904347551,0.00031140996678293448316
1.2476933705928030527,14.119715858169511691,0.0039615282832586081602
1.2478956579835680518,23.436707506656695443,0.00062488380298233807929
1.2504985734520934759,2.5648341232720275329,0.00030423106980627585318
1.2550025233937323055,28.899319425665741079,0.0032681999692358129801
1.2584488579837487254,6.2468286943741544448,0.0026414120167387077423
1.2607169963960405124,11.891161026898748432,0.0041218112859848048124
1.2626658906901411239,18.007562279437859587,0.0022465662626053608218
1.2681750575604318065,15.328357092444528931,0.0061790947816520846309
$$ [...]
Compound,None,,1,-0.59089299086917546067,0,0
Compound,None,,1,0.2555861934504421451,0,0
Compound,None,,1,1,0,0
Compound,None,,1,1.1999999999999999556,0,0
Compound,None,,1,-0.080273966708129196324,0,0
Compound,None,,1,0.47089498712207483733,0,0
Solvent,2ry Solvent,,1,1.3148878468124336472,0,0
Compound,Artifact|Weak,,1,-1,0,0
Compound,None,,1,-0.04991634994663407543,0,0
Compound,None,,1,0.61816333589988159414,0,0
Compound,None,,1,-0.71957173615648872822,0,0
Compound,None,,1,-0.90464041170123610236,0,0
Compound,None,,1,-0.40816606981039876834,0,0
Compound,None,,1,-0.28813352882099596552,0,0
Compound,None,,1,-0.80897905283131432697,0,0
Compound,None,,1,1.3569431651920180748,0,0
Compound,Artifact|Weak,,1,-0.19522649323969218371,0,0
Compound,Artifact|Weak,,1,0.055120280770853818941,0,0
Compound,None,,1,0.6090869915915196886,0,0
Compound,None,,1,1.3453571940875708179,0,0
Compound,None,,1,1.1450193171399787317,0,0
Compound,None,,1,-0.24590740445604331033,0,0
Compound,None,,1,0.31508973981402138564,0,0
Compound,None,,1,0.21430680644514149558,0,0
Compound,None,,1,-0.1246001045299967025,0,0
Compound,None,,1,0.28663500879065373361,0,0
Compound,None,,1,0.1565236659337995162,0,0
Compound,None,,1,0.1048094036891259323,0,0
Compound,None,,1,0.50160850914870724893,0,0
Compound,None,,1,0.82174449601184773595,0,0
Compound,None,,1,0.42786062271569019755,0,0
Artifact,Artifact|Weak,,1,-1,0,0
Artifact,Artifact|Weak,,1,-1,0,0
Artifact,Artifact|Weak,,1,0.19544204553979127592,0,0
Artifact,Artifact|Weak,,1,-0.84451300038542642667,0,0
Impurity,Artifact|Weak,,1,1.1176589777044383389,0,0
Compound,None,,1,0.22385157095937424643,0,0
Compound,None,,1,0.60128345555498785568,0,0
Compound,None,,1,0.058457779948818289206,0,0
Compound,None,,1,0.84462972338622210877,0,0
Compound,None,,1,0.62112285451679571935,0,0
Impurity,Artifact|Weak,,1,0.51466228816505266153,0,0
Artifact,Artifact|Weak,,1,-1,0,0
Impurity,Artifact|Weak,,1,0.021677648136568611337,0,0
Impurity,Artifact|Weak,,1,-0.80000000000000004441,0,0
Artifact,Artifact|Weak,,1,0.50345014878216642895,0,0
Impurity,Artifact|Weak,,1,0.70518936875129067943,0,0
Impurity,Artifact|Weak,,1,-0.67654022461941942801,0,0
Impurity,Artifact|Weak,,1,0.30068547771726061857,0,0
Compound,None,,1,0.40000000000000007772,0,0
Compound,None,,1,0.34051329882290104489,0,0
Artifact,Artifact|Weak,,1,-0.95262258781368713834,0,0
Impurity,Artifact|Weak,,1,0.19272758711823495537,0,0
Impurity,Artifact|Weak,,1,0.25034406321591468059,0,0
Impurity,Artifact|Weak,,1,0.19968537446322320861,0,0
Artifact,Artifact|Weak,,1,0.16206759830244624188,0,0
Impurity,Artifact|Weak,,1,-0.072514790705680953753,0,0
Impurity,Artifact|Weak,,1,0.14134909539486298358,0,0
Solvent,Artifact|Impurity|Weak|13C Sat.,,1,0.40000000000000007772,0,0
Impurity,Artifact|Weak,,1,-0.16183973521672029294,0,0
Solvent,None,,1,0,0,0
Impurity,Artifact|Weak,,1,-0.43865245941616132219,0,0
Solvent,Artifact|Impurity|Weak|13C Sat.,,1,-0.2000000000000000111,0,0
##END=	
##END=	
