##TITLE=	Aug25-2021.70.fid
KJO-21
##JCAMP-DX=	6.0	$$ MestReNova 14.1.0-24037
##DATA TYPE=	LINK
##BLOCK_ID=	1
##BLOCKS=	2    
##ORIGIN=	Mestrelab Research S.L.
##OWNER=	Chris
##$MNOVA/LINK_BLOCK_TYPE=	ITEM	$$ NMR Spectrum
##$MNOVA/ITEM/POLYGON=	(XY..XY)
5321,5835
8722,5835
8722,8208
5321,8208
5321,5835
##$MNOVA/ITEM/Z=	0
##$MNOVA/ITEM/ANGLE=	0
##TITLE=	Aug25-2021.70.fid
##JCAMP-DX=	6.0	$$ MestReNova 14.1.0-24037
##BLOCK_ID=	2
##DATA TYPE=	NMR SPECTRUM
##DATA CLASS=	XYDATA
##NUMDIM=	1
##ORIGIN=	Bruker BioSpin GmbH
##OWNER=	nmr
##.OBSERVE FREQUENCY=	400.4124024600000098
##.OBSERVE NUCLEUS=	^1H
##.SOLVENT NAME=	CDCl3
##.PULSE SEQUENCE=	zg30
##LONGDATE=	2021/08/25 16:58:00.000
##.ACQUISITIONMODE=	SIMULTANEOUS (DQD)
##$ORIGINAL FORMAT=	Bruker XWIN-NMR
##$MNOVA/SCALES_VERSION=	8
##$PARAMETER FILE=	(acqus, ASCII, c:/Users/Chris/Desktop/UROP/NMR/KJO-21/acqus, 0)
$$ ##TITLE= Parameter file, TOPSPIN		Version 3.2
$$ ##JCAMPDX= 5.0
$$ ##DATATYPE= Parameter Values
$$ ##NPOINTS= 11	$$ modification sequence number
$$ ##ORIGIN= Bruker BioSpin GmbH
$$ ##OWNER= nmr
$$ $$ 2021-08-25 16:58:06.782 +0100  nmr@CZC10666PP
$$ $$ /opt/topspin/data/brad/nmr/Aug25-2021/70/acqus
$$ $$ process /opt/topspin3.2/prog/mod/shimcntl
$$ ##$ACQT0= -2.36344537815126
$$ ##$AMP= (0..31)
$$ 100 100 100 100 100 100 100 100 100 100 100 100 100 100 100 100 100 100
$$ 100 100 100 100 100 100 100 100 100 100 100 100 100 100
$$ ##$AMPCOIL= (0..19)
$$ 0 0 0 0 0 0 0 0 0 0 0 0 0 0 0 0 0 0 0 0
$$ ##$ANAVPT= -1
$$ ##$AQSEQ= 0
$$ ##$AQ_mod= 3
$$ ##$AUNM= <au_zg>
$$ ##$AUTOPOS= <16 >
$$ ##$BF1= 400.41
$$ ##$BF2= 400.41
$$ ##$BF3= 400.41
$$ ##$BF4= 400.41
$$ ##$BF5= 400.41
$$ ##$BF6= 400.41
$$ ##$BF7= 400.41
$$ ##$BF8= 400.41
$$ ##$BYTORDA= 0
$$ ##$CAGPARS= (0..11)
$$ 0 0 0 0 0 0 0 0 0 0 0 0
$$ ##$CFDGTYP= 0
$$ ##$CFRGTYP= 9
$$ ##$CHEMSTR= <none>
$$ ##$CNST= (0..63)
$$ 1 1 145 1 1 1 1 1 1 1 1 1 1 1 1 1 1 1 1 1 1 1 1 1 1 1 1 1 1 1 1 1 1 1 1
$$ 1 1 1 1 1 1 1 1 1 1 1 1 1 1 1 1 1 1 1 1 1 1 1 1 1 1 1 1 1
$$ ##$CPDPRG= (0..8)
$$ <> <> <> <> <mlev> <mlev> <mlev> <mlev> <mlev>
$$ ##$D= (0..63)
$$ 0 1 0 0 0 0 0 0 0 0.06 0 0 0 0 0 0 0.0002 0 0 0 0 0 0 0 0 0 0 0 0 0 0 0
$$ 0 0 0 0 0 0 0 0 0 0 0 0 0 0 0 0 0 0 0 0 0 0 0 0 0 0 0 0 0 0 0 0
$$ ##$DATE= 1629907085
$$ ##$DE= 6.5
$$ ##$DECBNUC= <off>
$$ ##$DECIM= 2496
$$ ##$DECNUC= <off>
$$ ##$DECSTAT= 4
$$ ##$DIGMOD= 1
$$ ##$DIGTYP= 12
$$ ##$DQDMODE= 0
$$ ##$DR= 22
$$ ##$DS= 2
$$ ##$DSPFIRM= 0
$$ ##$DSPFVS= 20
$$ ##$DTYPA= 0
$$ ##$EXP= <proton>
$$ ##$F1LIST= <111111111111111>
$$ ##$F2LIST= <222222222222222>
$$ ##$F3LIST= <333333333333333>
$$ ##$FCUCHAN= (0..9)
$$ 0 2 0 0 0 0 0 0 0 0
$$ ##$FL1= 90
$$ ##$FL2= 90
$$ ##$FL3= 90
$$ ##$FL4= 90
$$ ##$FOV= 20
$$ ##$FQ1LIST= <freqlist>
$$ ##$FQ2LIST= <freqlist>
$$ ##$FQ3LIST= <freqlist>
$$ ##$FQ4LIST= <freqlist>
$$ ##$FQ5LIST= <freqlist>
$$ ##$FQ6LIST= <freqlist>
$$ ##$FQ7LIST= <freqlist>
$$ ##$FQ8LIST= <freqlist>
$$ ##$FRQLO3= 17285.0399999619
$$ ##$FRQLO3N= 2
$$ ##$FS= (0..7)
$$ 83 83 83 83 83 83 83 83
$$ ##$FTLPGN= 0
$$ [...]
$$ 90 74 58 42 26 10 0 0
$$ ##$Sgu3PowerLevels= (0..7)
$$ 0 0 0 0 0 0 0 0
$$ ##$Sgu4PowerLevels= (0..7)
$$ 0 0 0 0 0 0 0 0
$$ ##$Sgu5PowerLevels= (0..7)
$$ 0 0 0 0 0 0 0 0
$$ ##$Sgu6PowerLevels= (0..7)
$$ 0 0 0 0 0 0 0 0
$$ ##$Sgu7PowerLevels= (0..7)
$$ 0 0 0 0 0 0 0 0
$$ ##$Sgu8PowerLevels= (0..7)
$$ 0 0 0 0 0 0 0 0
$$ ##$SguType= 3
$$ ##$ShimPowMaxUA= (0..63)
$$ 130000 130000 130000 130000 130000 130000 130000 130000 130000 130000 130000
$$ 130000 130000 130000 130000 130000 130000 130000 130000 130000 0 0 0 0
$$ 0 0 0 0 0 0 0 0 0 0 0 0 0 0 0 0 0 0 0 0 0 0 0 0 0 0 0 0 0 0 0 0 0 0 0 0
$$ 0 0 0 0
$$ ##$ShimPowMaxUC= (0..63)
$$ 130000 130000 130000 130000 130000 130000 130000 130000 130000 130000 130000
$$ 130000 130000 130000 130000 130000 130000 130000 130000 130000 0 0 0 0
$$ 0 0 0 0 0 0 0 0 0 0 0 0 0 0 0 0 0 0 0 0 0 0 0 0 0 0 0 0 0 0 0 0 0 0 0 0
$$ 0 0 0 0
$$ ##$ShimPowMaxUG= (0..63)
$$ 524287 524287 524287 524287 524287 524287 524287 524287 524287 524287 524287
$$ 524287 524287 524287 524287 524287 524287 524287 524287 524287 0 0 0 0
$$ 0 0 0 0 0 0 0 0 0 0 0 0 0 0 0 0 0 0 0 0 0 0 0 0 0 0 0 0 0 0 0 0 0 0 0 0
$$ 0 0 0 0
$$ ##$ShimPowRcbType= 3
$$ ##$ShimPowRes= (0..63)
$$ 1e-20 1e-20 1e-20 1e-20 1e-20 1e-20 1e-20 1e-20 1e-20 1e-20 1e-20 1e-20
$$ 1e-20 1e-20 1e-20 1e-20 1e-20 1e-20 1e-20 1e-20 0 0 0 0 0 0 0 0 0 0 0 0
$$ 0 0 0 0 0 0 0 0 0 0 0 0 0 0 0 0 0 0 0 0 0 0 0 0 0 0 0 0 0 0 0 0
$$ ##$ShimPowRng0= (0..63)
$$ 1 1 1 1 1 1 1 1 1 1 1 1 1 1 1 1 1 1 1 1 0 0 0 0 0 0 0 0 0 0 0 0 0 0 0 0
$$ 0 0 0 0 0 0 0 0 0 0 0 0 0 0 0 0 0 0 0 0 0 0 0 0 0 0 0 0
$$ ##$ShimPowRng1= (0..63)
$$ 1 1 1 1 1 1 1 1 1 1 1 1 1 1 1 1 1 1 1 1 0 0 0 0 0 0 0 0 0 0 0 0 0 0 0 0
$$ 0 0 0 0 0 0 0 0 0 0 0 0 0 0 0 0 0 0 0 0 0 0 0 0 0 0 0 0
$$ ##$ShimPowRng2= (0..63)
$$ 1 1 1 1 1 1 1 1 1 1 1 1 1 1 1 1 1 1 1 1 0 0 0 0 0 0 0 0 0 0 0 0 0 0 0 0
$$ 0 0 0 0 0 0 0 0 0 0 0 0 0 0 0 0 0 0 0 0 0 0 0 0 0 0 0 0
$$ ##$ShimPowRng3= (0..63)
$$ 1 1 1 1 1 1 1 1 1 1 1 1 1 1 1 1 1 1 1 1 0 0 0 0 0 0 0 0 0 0 0 0 0 0 0 0
$$ 0 0 0 0 0 0 0 0 0 0 0 0 0 0 0 0 0 0 0 0 0 0 0 0 0 0 0 0
$$ ##$ShimSysFunc= (0..63)
$$ 1 2 3 4 5 7 9 11 15 16 8 10 12 14 6 17 13 18 19 20 0 0 0 0 0 0 0 0 0 0
$$ 0 0 0 0 0 0 0 0 0 0 0 0 0 0 0 0 0 0 0 0 0 0 0 0 0 0 0 0 0 0 0 0 0 0
$$ ##$ShimSysMatrix= 0
$$ ##$ShimSysType= 1
$$ ##$TFXNUM= 0
$$ ##$TRIPLO2= 0
$$ ##$VTU= 2
$$ ##$VTUETH= <149.236.99.20>
$$ ##$VTUTY= <no>
$$ ##$WBREFAM= (0..15)
$$ 135 116 100 100 100 100 100 100 100 100 100 100 100 100 100 100
$$ ##$WBREFLM= (0..15)
$$ 0 0 0 0 0 0 0 0 0 0 0 0 0 0 0 0
$$ ##$WBREFPH= (0..15)
$$ 71.66 -68.25 0 0 0 0 0 0 0 0 0 0 0 0 0 0
$$ ##$WBSGU= (0..15)
$$ 0 0 0 0 0 0 0 0 0 0 0 0 0 0 0 0
$$ ##$XFAC= 2
$$ ##END=
$$ 
##$DECIM=	2496
##$DSPFVS=	20
##XUNITS=	HZ
##YUNITS=	ARBITRARY UNITS
##FIRSTX=	6396.7535921827702623
##LASTX=	-1616.0669206377399405
##DELTAX=	-0.1222678036594264106
##XFACTOR=	1
##YFACTOR=	0.0079542425351261519806
##FIRSTY=	12.490228652954101562
##MINY=	4.0873503684997558594
##MAXY=	7907.888671875
##NPOINTS=	65536
##XYDATA=	(X++(Y..Y))
$$ [...]
1886A451k7J8J8M0M0onl3l2J4J3L3L4j2j2k1k0K5K5J8J8J9J8ooJ4N9Q7Q6L9om6m5r1r0p9l3
1881A499J7J7j5j4j4j4nmnmM0M1L7L7J3l3q0q0kM4J9J8J1J1J0J1nonoK6K5k2o8p3k8K0J9n
1877A427onoL3L4L3L3K6K6K5K6K0K0K0K0rrrqJ0J0J0J0j8j8j8j8RQRQj2j2j2j1lkk8J7O8O8
1872A766K0k5k6k7J5J6j0rn6n5p1p2k6k6M2M3M2M2N3N4N3N4M1M1mnm3m3m3m3rrrrl3l3l0k9
1867A537%M5O5O6L4L4j1j2j6j7j3j4lM2N9N9j8o3l8l8j1j2j1j1j1j0j0j0K4K4K4K3l2l2l2
1863A611l2k0k1k1k0J1J2J1J2m6m5k5K0M9N0N3N3RRRRqrJ1N7M2M3j%ppqplmm6m6j8K8K7j8
1858A714n6n7J6J6M1M0nnk5k4k4k4LLLLkllkJ1J2J2J2K0K0M6%n8n7q4l8L3P9N6N6M3M2K3k3
1853A814o3o4j9K7K5k0l7l7l3l4l3l3l0k9j0L6L7L7ooLLLLJ2J2J1J2ooooj2j3PN3N1N2QRk3
$$ y = [1451, 1424, 1442, 1460, 1500, 1540, 1534, 1529, 1496, 1464, 1478, 1491, 1524, 1558, 1546, 1534, 1513, 1493, 1518, 1543, 1561, 1579, 1598, 1616, 1610, 1604, 1618, 1677, 1764, 1850, 1889, 1883, 1837, 1792, 1701, 1611, 1532, 1499, 1516, 1533, 1518, 1504, 1490, 1476, 1471, 1467, 1462, 1458, 1498, 1539, 1576, 1613, 1626, 1593, 1513, 1433, 1431, 1475, 1494, 1512, 1523, 1534, 1544, 1555, 1550, 1544, 1539, 1533, 1559, 1584, 1562, 1494, 1421, 1393, 1413, 1432, 1427, 1421, 1416, 1410, 1443, 1477, 1510, 1543, 1569, 1595, 1620, 1646, 1666, 1686, 1706, 1726, 1717, 1708, 1699, 1691, 1701, 1711, 1721, 1731, 1713, 1695, 1677, 1659, 1668, 1676, 1685, 1693, 1681, 1669, 1657, 1646, 1643, 1641, 1613, 1630, 1698, 1766, 1786, 1761, 1735, 1708, 1723, 1739, 1729, 1720, 1664, 1609, 1538, 1466, 1440, 1414, 1456, 1499, 1541, 1583, 1636, 1690, 1743, 1797, 1838, 1879, 1875, 1870, 1827, 1784, 1741, 1698, 1689, 1680, 1671, 1662, 1629, 1596, 1566, 1537, 1537, 1582, 1647, 1713, 1747, 1781, 1770, 1758, 1742, 1725, 1712, 1698, 1695, 1737, 1796, 1855, 1837, 1774, 1736, 1698, 1687, 1675, 1664, 1653, 1642, 1632, 1622, 1612, 1636, 1660, 1684, 1707, 1675, 1643, 1611, 1579, 1559, 1538, 1517, 1497, 1508, 1520, 1531, 1543, 1497, 1452, 1427, 1447, 1496, 1546, 1599, 1652, 1661, 1670, 1679, 1688, 1680, 1671, 1682, 1739, 1781, 1824, 1823, 1823, 1816, 1809, 1801, 1794, 1791, 1787, 1741, 1695, 1677, 1705, 1732, 1714, 1658, 1601, 1617, 1633, 1674, 1714, 1709, 1704, 1679, 1655, 1631, 1607, 1610, 1613, 1616, 1619, 1617, 1614, 1611, 1609, 1620, 1632, 1644, 1656, 1676, 1696, 1742, 1742, 1684, 1627, 1543, 1505, 1538, 1617, 1673, 1729, 1772, 1814, 1837, 1814, 1751, 1687, 1668, 1695, 1720, 1700, 1663, 1626, 1593, 1559, 1526, 1493, 1463, 1434, 1424, 1460, 1497, 1534, 1528, 1522, 1525, 1528, 1531, 1534, 1546, 1558, 1569, 1581, 1575, 1569, 1563, 1557, 1545, 1532, 1539, 1592, 1643, 1695, 1703, 1712, 1689]
1848A689k3k2k3L6L6J9k7NN0O8O7rj0n2n2n2oO9O9Qo8n1oK0K0K3K3j2j2j2j3k3k4k3k4m2m1
1843A575l9l9m8lK0K0L3P8P8L3k1k0k3k4k8k9qL7L9M0M0M0K0k4m5m4n6n6n3n3jM5J8J9jjM4
1839A563M5KLK3O8L6L6L5L6k2o8j11o6ON2N4Qm1m1m4m4J3J3J2J3M8M8M5M6Ol9q7q6k4K1M2
1834A601M1J7J7J7J7J0J1l5l5l3l3l1l0ON2O8O9Pl9j2j3KKKLk0j9k0k0k1k2N4N4M6M7mm9q6
1830A621q5qL8L1L0j2j3pqpqRQRQK1K1K0K1j8j8j9j8nmM0M1J5J5J5J5j7j8j7j8l3l4n9j3M3
1825A582M4M6M6K6K5k0k0m5m5JJmmM2M1J0RRJ0K0K1K1K1PPl8l8p6p7n7j2M7M7N0N0K2K1k4
1820A766k4l3l3l3l3QQN0N1J8k8m7m7NMNNlmlmJ6J5J6J5J5J4J4J4l3l3M0L9M0pn6n6l8l7Q
1815A614Ql8l8o4j9JJk2K3Q8Q8O8K3Km4k1k0qqn3n3NNM7M7Q1L5m6m5k0k0k0k0J8J7J8J7l1
$$ y = [1689, 1666, 1644, 1621, 1657, 1693, 1712, 1685, 1690, 1740, 1808, 1875, 1866, 1856, 1804, 1752, 1700, 1694, 1763, 1832, 1840, 1772, 1721, 1715, 1735, 1755, 1778, 1801, 1789, 1777, 1765, 1752, 1729, 1705, 1682, 1658, 1616, 1575, 1536, 1497, 1449, 1446, 1466, 1486, 1519, 1597, 1675, 1708, 1687, 1667, 1644, 1620, 1592, 1563, 1555, 1592, 1631, 1671, 1711, 1751, 1771, 1747, 1702, 1658, 1602, 1546, 1493, 1440, 1439, 1484, 1502, 1521, 1520, 1519, 1563, 1608, 1610, 1613, 1636, 1704, 1740, 1776, 1811, 1847, 1825, 1757, 1646, 1580, 1586, 1638, 1692, 1700, 1659, 1618, 1574, 1530, 1543, 1556, 1568, 1581, 1629, 1677, 1722, 1768, 1774, 1735, 1648, 1562, 1538, 1559, 1601, 1642, 1659, 1676, 1693, 1710, 1720, 1731, 1696, 1661, 1628, 1595, 1564, 1534, 1540, 1592, 1660, 1729, 1736, 1697, 1685, 1672, 1674, 1676, 1678, 1681, 1661, 1642, 1622, 1602, 1581, 1559, 1613, 1667, 1713, 1760, 1756, 1707, 1621, 1536, 1528, 1566, 1597, 1627, 1615, 1602, 1595, 1587, 1580, 1572, 1581, 1589, 1598, 1606, 1627, 1648, 1668, 1689, 1671, 1653, 1634, 1616, 1611, 1607, 1647, 1688, 1703, 1718, 1733, 1748, 1731, 1713, 1696, 1678, 1645, 1611, 1552, 1539, 1582, 1626, 1672, 1718, 1744, 1769, 1749, 1729, 1684, 1639, 1640, 1641, 1637, 1633, 1675, 1716, 1726, 1735, 1744, 1754, 1774, 1795, 1816, 1837, 1844, 1851, 1813, 1775, 1699, 1622, 1565, 1553, 1600, 1647, 1697, 1747, 1769, 1790, 1766, 1742, 1709, 1676, 1643, 1610, 1618, 1626, 1676, 1727, 1745, 1717, 1670, 1623, 1628, 1632, 1637, 1642, 1639, 1635, 1632, 1628, 1644, 1659, 1675, 1690, 1705, 1719, 1733, 1747, 1714, 1681, 1721, 1760, 1800, 1793, 1737, 1681, 1643, 1606, 1614, 1622, 1584, 1546, 1482, 1463, 1464, 1465, 1443, 1466, 1554, 1642, 1710, 1733, 1735, 1691, 1670, 1650, 1642, 1634, 1581, 1528, 1533, 1538, 1585, 1632, 1713, 1748, 1702, 1657, 1637, 1617, 1597, 1577, 1595, 1612, 1630, 1647, 1616]
1811A616l2l1l2OPPORJ0RRp5p6n6j0O6O7M9Mk1k1J8J9L0j5l5l5L7L7L7L7J8J8k8k7K7K6K7
1806A702K6m0m1l8l8j1L5RRk5k5qL7L8pk5k4MMMML2L2P4P5K1k5m5m5k1k2k1k2nnL7L7L2j3
1801A706o4o4k1k0k1k1L3L4L4L4poM0L9L2L2j3j4n7n7n7n7%jj%M5M6O9K3qn3n7j0L5L6ppp
1796A608ppoK4K4Pl9k8J0Ql1o2o1m2m1j5j5L0L0OOOOJ8J9J9J9j6j6PPM6M5%%ppppk0k0k1k0
1791A450K9K9K9K9j5j4j5j4J2J1J2J2K6K6K6K6j0rj0j0L2L2RRqrL7L7L8L7l9l8j1j1j0j1m3
1787A671m3k0k1JJM7M6M2M2l4l3m9m9k6k6j%K2K2LLj9k0j3j4l4l4qK9K3jJ1L2O5O4J7J8k8
1782A686k8lmJ7J7j1m8m0j6PQQRL6L6K0l2p6p6k9J7J7J8K0K0J4J3J4J3K2K1k4k4J3J2L6L5
1777A718jkk4k5k0k1j7j8J4N9Q0P9N6N6J1J1m9m8p4k8RRrn4m2m2k2k2j4j3j1j0QN4N5Qj8j8
$$ y = [1616, 1584, 1553, 1521, 1527, 1534, 1541, 1547, 1556, 1566, 1575, 1584, 1509, 1433, 1377, 1367, 1433, 1500, 1549, 1553, 1532, 1511, 1529, 1548, 1578, 1563, 1528, 1493, 1530, 1567, 1604, 1641, 1659, 1677, 1649, 1622, 1649, 1675, 1702, 1728, 1688, 1647, 1609, 1571, 1560, 1595, 1604, 1613, 1588, 1563, 1555, 1592, 1630, 1623, 1598, 1574, 1578, 1582, 1586, 1590, 1622, 1654, 1728, 1803, 1824, 1799, 1754, 1709, 1688, 1666, 1645, 1623, 1618, 1613, 1650, 1687, 1719, 1706, 1642, 1578, 1557, 1537, 1516, 1495, 1528, 1562, 1596, 1630, 1623, 1617, 1657, 1696, 1728, 1760, 1747, 1733, 1676, 1619, 1562, 1505, 1505, 1504, 1503, 1503, 1548, 1594, 1663, 1686, 1678, 1625, 1568, 1558, 1593, 1629, 1622, 1615, 1608, 1601, 1594, 1588, 1612, 1636, 1643, 1604, 1576, 1586, 1594, 1563, 1501, 1440, 1398, 1357, 1342, 1327, 1357, 1387, 1393, 1399, 1405, 1411, 1429, 1448, 1467, 1486, 1470, 1454, 1461, 1468, 1514, 1559, 1559, 1559, 1552, 1545, 1538, 1531, 1511, 1491, 1470, 1450, 1479, 1508, 1537, 1566, 1551, 1537, 1522, 1508, 1520, 1531, 1543, 1555, 1581, 1607, 1633, 1659, 1649, 1640, 1630, 1620, 1652, 1684, 1693, 1702, 1694, 1685, 1722, 1759, 1797, 1834, 1795, 1757, 1746, 1735, 1725, 1714, 1671, 1628, 1608, 1587, 1588, 1589, 1636, 1682, 1724, 1766, 1732, 1699, 1650, 1601, 1575, 1549, 1548, 1548, 1570, 1592, 1595, 1598, 1579, 1559, 1546, 1532, 1498, 1464, 1456, 1485, 1508, 1507, 1518, 1550, 1615, 1679, 1696, 1714, 1686, 1658, 1655, 1651, 1668, 1685, 1674, 1626, 1586, 1570, 1577, 1585, 1593, 1602, 1638, 1674, 1694, 1662, 1586, 1510, 1481, 1498, 1515, 1533, 1553, 1573, 1587, 1600, 1614, 1627, 1649, 1670, 1646, 1622, 1635, 1647, 1683, 1718, 1717, 1715, 1691, 1666, 1646, 1625, 1608, 1590, 1604, 1663, 1743, 1822, 1878, 1934, 1945, 1956, 1907, 1859, 1785, 1757, 1766, 1775, 1766, 1712, 1670, 1628, 1606, 1584, 1570, 1557, 1546, 1536, 1544, 1598, 1653, 1661, 1643, 1625]
1773A625K9P5P8P8O2J6m6m6m8m9m0m0m0m0k4k4k5k4l4l4J2J2M6M6JJj8j7j4j5J2N6P7P6L8
1769A762L8qqm5m5m5m6j0j1L5L5KLk0k0RQRQk5k5kkK7K8k3o8l8l9k1K5N8N8O4J8k4k3k7k6
1764A586j7j7l8jL4L3j0j0m1m1m0l9J6L9M9J0JK3K3jOK9J5J5j8j8j6j6J1M9M9J1j8j8K6K6
1759A692K1K2J9K0l5p2o2l9J2N0M1J9j8m1k7k7K3O0N9K1j6l9m2k0nk8n6n7l0PM7O9K7j2kK2
1755A603rqppqrrrL0L0L0L1L4L5j1j0M9N0K4j4l7o0o2l9k0j9j8j8j2j2L4L3J4J5k9k8QM6K5
1750A636K5K3K4L3J1m2p9p1m8pJ5N0N0L7L7O0J4k9p5m9K7J01J02N6J0k8k9l1l1k7k7k7k7j0
1746A674rn3n2k8J8L8L7M1M1l3l2m8lM8M8K9K9j7j7j8j8j7j8QRRQk6k7J9J9l3l3l3l4L1L1
1742A588L1L0K3K2k3k4j4j5j4j5m1m1RN4L3L2j1j0JJJJj3j3j4j3M9N0R0R0R2J6m8m7rqrqn2
$$ y = [1625, 1654, 1729, 1807, 1885, 1947, 1963, 1917, 1871, 1823, 1774, 1734, 1694, 1654, 1614, 1590, 1566, 1541, 1517, 1483, 1449, 1461, 1473, 1519, 1565, 1566, 1567, 1549, 1532, 1518, 1503, 1515, 1571, 1648, 1724, 1762, 1800, 1792, 1784, 1739, 1694, 1649, 1603, 1593, 1582, 1617, 1652, 1654, 1657, 1637, 1617, 1626, 1634, 1643, 1651, 1626, 1601, 1599, 1597, 1624, 1652, 1629, 1561, 1523, 1484, 1463, 1488, 1546, 1604, 1668, 1686, 1662, 1639, 1612, 1586, 1569, 1552, 1514, 1513, 1547, 1580, 1570, 1560, 1519, 1478, 1438, 1399, 1415, 1454, 1503, 1513, 1514, 1537, 1560, 1559, 1565, 1594, 1609, 1624, 1606, 1588, 1572, 1556, 1567, 1616, 1665, 1676, 1658, 1640, 1666, 1692, 1713, 1735, 1754, 1774, 1739, 1667, 1605, 1566, 1578, 1628, 1669, 1688, 1670, 1629, 1602, 1575, 1598, 1658, 1717, 1738, 1722, 1683, 1641, 1621, 1616, 1588, 1532, 1475, 1445, 1452, 1499, 1568, 1595, 1583, 1581, 1603, 1594, 1586, 1579, 1572, 1564, 1555, 1546, 1537, 1567, 1597, 1627, 1658, 1692, 1727, 1716, 1706, 1755, 1805, 1829, 1815, 1778, 1718, 1656, 1617, 1597, 1578, 1560, 1542, 1530, 1518, 1552, 1585, 1599, 1614, 1585, 1557, 1565, 1611, 1636, 1661, 1684, 1708, 1741, 1752, 1710, 1631, 1560, 1512, 1505, 1520, 1570, 1620, 1657, 1694, 1754, 1768, 1739, 1664, 1615, 1642, 1743, 1845, 1901, 1911, 1883, 1854, 1823, 1792, 1765, 1738, 1711, 1684, 1674, 1665, 1612, 1560, 1532, 1550, 1588, 1625, 1666, 1707, 1674, 1642, 1594, 1591, 1639, 1687, 1716, 1745, 1728, 1711, 1693, 1675, 1658, 1640, 1648, 1657, 1666, 1674, 1648, 1621, 1640, 1659, 1626, 1593, 1560, 1526, 1557, 1588, 1619, 1649, 1672, 1694, 1671, 1647, 1633, 1618, 1604, 1589, 1548, 1507, 1516, 1570, 1603, 1635, 1624, 1614, 1615, 1616, 1617, 1618, 1605, 1592, 1578, 1565, 1614, 1664, 1754, 1844, 1936, 1952, 1904, 1857, 1848, 1840, 1831, 1823, 1771]
1737A771n1m9m8J0N5N6J0j3j3j7j6k4k5k5k4l3l3J2J3j3j3j3j3j3j3j3j2K1K1K2K1L5L4L5
1733A642L4m0m0m0m1k9k9J8O3P3K7J1J0J2J2J1J2j8j7j8j8ONONJ4J4on1m3m3L0L0J8J9J8J9
1728A676j4j4j3j4k5k5k5k6K5K4K5K4J3J3J3J3mmmmJ5J5J5J5k7k7k8k7k8k8J9O4N6RpqOOO
1723A700OL0L0J1l5l4l3POn4j00p1NL1L1L6L6K8K8K8K8RQRRj8j8j8j8rj0j0rJ2J2l1l1JM6
1719A648M6%l7l8m1m1MMMMk0k0%M6N4N4J2J1opopN5N5J0J0LLm2m3j0j0L3L2N5J0o8o8j7K7
1714A699K8j7j3j2j5j5mlmmL1L1L1L1j1j1j0j1k6k6k6k6m0m0NNL4L4L4L4m1m0m0m0k5k5J7
1709A489J8jm7k1k2M1M1M2M1L2L3j3j3nmnmqpqpM7M7P2K7o0o0o1o0o0j4J0N6R5R6P8L3ONM8
1704A877M8K8K9j6j7m5m6%jk6k5k6k6j4j5L2L1J4J4J4J5l2l1p7p7o3o2m3KM1M0M3M3N7N7L6
$$ y = [1771, 1720, 1671, 1623, 1633, 1688, 1744, 1754, 1741, 1728, 1711, 1695, 1671, 1646, 1621, 1597, 1564, 1531, 1543, 1556, 1543, 1530, 1517, 1504, 1491, 1478, 1465, 1453, 1474, 1495, 1517, 1538, 1573, 1607, 1642, 1676, 1636, 1596, 1556, 1515, 1486, 1457, 1475, 1538, 1611, 1638, 1649, 1659, 1671, 1683, 1694, 1706, 1688, 1671, 1653, 1635, 1641, 1646, 1652, 1657, 1671, 1685, 1679, 1628, 1585, 1542, 1572, 1602, 1620, 1639, 1657, 1676, 1662, 1648, 1635, 1621, 1596, 1571, 1546, 1520, 1545, 1569, 1594, 1618, 1631, 1644, 1657, 1670, 1666, 1662, 1658, 1654, 1669, 1684, 1699, 1714, 1687, 1660, 1632, 1605, 1577, 1549, 1568, 1632, 1688, 1697, 1690, 1682, 1688, 1694, 1700, 1706, 1736, 1766, 1777, 1742, 1708, 1675, 1682, 1688, 1634, 1534, 1463, 1468, 1499, 1530, 1566, 1602, 1630, 1658, 1686, 1714, 1723, 1731, 1740, 1749, 1731, 1713, 1695, 1677, 1668, 1658, 1648, 1639, 1651, 1663, 1632, 1601, 1602, 1648, 1694, 1694, 1657, 1619, 1578, 1537, 1541, 1545, 1549, 1553, 1533, 1513, 1513, 1559, 1613, 1667, 1679, 1690, 1684, 1677, 1671, 1664, 1719, 1774, 1784, 1794, 1797, 1800, 1758, 1715, 1705, 1695, 1728, 1760, 1815, 1825, 1757, 1689, 1672, 1699, 1727, 1710, 1697, 1685, 1670, 1655, 1651, 1648, 1644, 1640, 1671, 1702, 1733, 1764, 1753, 1742, 1732, 1721, 1695, 1669, 1643, 1617, 1577, 1537, 1542, 1547, 1581, 1615, 1649, 1683, 1642, 1602, 1562, 1522, 1497, 1472, 1489, 1507, 1506, 1459, 1438, 1416, 1457, 1498, 1540, 1581, 1613, 1646, 1633, 1620, 1615, 1611, 1606, 1602, 1594, 1587, 1579, 1572, 1619, 1666, 1738, 1765, 1705, 1645, 1584, 1524, 1464, 1450, 1460, 1516, 1611, 1707, 1785, 1818, 1824, 1829, 1877, 1925, 1953, 1982, 1966, 1949, 1904, 1858, 1858, 1857, 1831, 1806, 1780, 1754, 1740, 1725, 1757, 1788, 1802, 1816, 1830, 1845, 1813, 1782, 1705, 1628, 1565, 1503, 1460, 1462, 1503, 1543, 1586, 1629, 1686, 1743, 1779]
1700A779j0m6o8n6n6j9K5J3j0l7l8OPK2K3pk9k7J9Q2J05Q8M2Pj6m2m1m2m3m6m7j%j1j0j0j0
1695A496qpqpJ9K0J6J7J8k7m4m4K2O7O7K2j%K6N0N0Ml9l9pP0R5N0Mm1o2o3p0m8j2L4K3%J5
1691A658J6jjJ7O3M9K5mmopnnM1O3L0j7p6r8o9k4MLOOM0M1l6l6j1j0j1j1L3L4L3L4j2j2j2
1686A728j2J5J5J4J5l2l2l2l1o4o3m3KL5L5Q0Q0Q1L6J1l5m3m4m6m6m5m4L1L2PQQPN9N9N6N6
1681A858K3k1m2m2l7l8l8l8j7j6j7j7M3M3kkk3k3k0k0m0OK5K6j8j7m4LL1L2j1j1%%%%L7L7
1676A610qrk5k5J8J8J7k9m6m5j0L5N5N5j0j0L3L2L1j4l4l4L3L3L4L3rqrqk5k4k5k5l6l5j6
1672A518K9L4L3rrk3k3K3K2M9M8M6M5K3k1m2m2k2k2k2k2K0K1k5k5l7l6RRl5l5l6l5J0RN2N2
1667A531O8K3k8k8J8J8nmjjK1K2J6J6J6J6J6J6jm7o4j8K9K9J3J4J3J3OPOPMMNMopk9k9n0m9
$$ y = [1779, 1769, 1723, 1655, 1599, 1543, 1524, 1549, 1562, 1552, 1515, 1477, 1483, 1490, 1512, 1535, 1528, 1499, 1472, 1491, 1573, 1678, 1766, 1808, 1815, 1799, 1757, 1716, 1674, 1631, 1585, 1538, 1537, 1537, 1526, 1516, 1506, 1496, 1488, 1481, 1473, 1466, 1485, 1505, 1521, 1538, 1556, 1529, 1485, 1441, 1463, 1530, 1597, 1619, 1618, 1618, 1644, 1694, 1744, 1748, 1709, 1670, 1663, 1733, 1828, 1878, 1882, 1841, 1779, 1716, 1646, 1598, 1586, 1620, 1643, 1643, 1658, 1674, 1673, 1672, 1689, 1752, 1801, 1826, 1822, 1818, 1812, 1805, 1800, 1795, 1836, 1899, 1929, 1912, 1836, 1738, 1669, 1645, 1649, 1652, 1658, 1664, 1704, 1745, 1709, 1673, 1662, 1652, 1641, 1630, 1663, 1697, 1730, 1764, 1752, 1740, 1728, 1716, 1731, 1746, 1760, 1775, 1743, 1711, 1679, 1648, 1584, 1521, 1478, 1480, 1515, 1550, 1630, 1710, 1791, 1827, 1838, 1803, 1760, 1716, 1670, 1624, 1579, 1535, 1566, 1598, 1605, 1613, 1621, 1628, 1687, 1746, 1802, 1858, 1881, 1860, 1818, 1776, 1739, 1701, 1663, 1625, 1608, 1592, 1575, 1558, 1601, 1644, 1642, 1640, 1617, 1594, 1574, 1554, 1514, 1520, 1545, 1571, 1553, 1536, 1492, 1495, 1526, 1558, 1547, 1536, 1536, 1536, 1536, 1536, 1573, 1610, 1602, 1593, 1568, 1543, 1561, 1579, 1596, 1567, 1521, 1476, 1466, 1501, 1556, 1611, 1601, 1591, 1624, 1656, 1687, 1673, 1639, 1605, 1638, 1671, 1705, 1738, 1729, 1721, 1712, 1704, 1679, 1655, 1630, 1605, 1569, 1534, 1518, 1547, 1581, 1614, 1605, 1596, 1573, 1550, 1573, 1595, 1644, 1692, 1738, 1783, 1806, 1785, 1743, 1701, 1679, 1657, 1635, 1613, 1633, 1654, 1629, 1604, 1567, 1531, 1540, 1549, 1514, 1479, 1443, 1408, 1418, 1427, 1479, 1531, 1599, 1622, 1594, 1566, 1584, 1602, 1597, 1593, 1592, 1591, 1612, 1634, 1650, 1666, 1682, 1698, 1714, 1730, 1729, 1682, 1618, 1600, 1629, 1658, 1671, 1685, 1698, 1711, 1717, 1724, 1730, 1737, 1741, 1745, 1750, 1754, 1748, 1741, 1712, 1683, 1633, 1584]
1662A584k9J6K4K3j9j9j6j5j6j5K3K3K4K3rrrrK5K5K5K5J5J4J4J4J1J2QRj9o5q1q2o6k1L2
1658A470P6P7L1j6j7l4l4n3n4JM6O6O7J9J9llj3j2l5l5k3k3K3K3KKKKJ6J6J6J6k5k6k5k6o
1653A527popM1M1M1M0N2N3N2N2J4J3J7J7N3R9J45J44J03K6q3j58j58j13o2j7LMK8K9J0J0j2
1649A991j3o9p0m6m7kjjkL5L4j6o2k5k5nnj9j9j9j9kkjkj9j9N6N7N9N8N9N8P7P7J23J22J38
1644B434J37J58K03K66K66K19N1j36k73l08l08k38j62r9r9p6p5n3n3m9m8llJ3J4J7k9n6n6
1641A654k5N0O6O6K5K5j8j7o3o3n6n6J9K0N3N4N3N3O1O1O0O1mmM1M1N1N2L1P6J70K46L06L06
1637C395K76J69l9k36l54l54k60j53j25j24j01n6l6q1r9r8l7l7RRK1K1k2k1K3O8M3M3OPL2
1633A889j3o7o7n1mJ7J7K1K0K3K3K3K3M4M5P0K4j7j7j8j7j6K9Q3Q2J06J52J45J00k8j34j48
$$ y = [1584, 1555, 1571, 1595, 1618, 1599, 1580, 1564, 1549, 1533, 1518, 1541, 1564, 1588, 1611, 1602, 1593, 1584, 1575, 1600, 1625, 1650, 1675, 1690, 1704, 1718, 1732, 1743, 1755, 1763, 1772, 1753, 1688, 1607, 1525, 1459, 1438, 1470, 1546, 1623, 1654, 1638, 1621, 1587, 1553, 1500, 1446, 1447, 1493, 1559, 1626, 1645, 1664, 1661, 1658, 1645, 1633, 1598, 1563, 1540, 1517, 1540, 1563, 1565, 1567, 1569, 1571, 1587, 1603, 1619, 1635, 1610, 1584, 1559, 1533, 1527, 1520, 1514, 1507, 1548, 1589, 1630, 1670, 1722, 1775, 1827, 1879, 1893, 1906, 1923, 1940, 1993, 2092, 2237, 2381, 2484, 2510, 2427, 2269, 2111, 1998, 1936, 1919, 1922, 1926, 1954, 1983, 1993, 2003, 1991, 1978, 1909, 1839, 1793, 1746, 1744, 1743, 1742, 1740, 1775, 1809, 1793, 1731, 1706, 1681, 1676, 1671, 1652, 1633, 1614, 1595, 1593, 1591, 1590, 1588, 1569, 1550, 1606, 1663, 1722, 1780, 1839, 1897, 1974, 2051, 2174, 2296, 2434, 2571, 2729, 2932, 3198, 3464, 3683, 3734, 3598, 3325, 3017, 2709, 2471, 2309, 2210, 2111, 2035, 1960, 1907, 1854, 1805, 1757, 1754, 1751, 1764, 1778, 1795, 1766, 1710, 1654, 1629, 1679, 1745, 1811, 1836, 1861, 1843, 1826, 1763, 1700, 1644, 1588, 1607, 1627, 1680, 1734, 1787, 1840, 1901, 1962, 2022, 2083, 2079, 2075, 2116, 2157, 2208, 2260, 2291, 2367, 2537, 2783, 3089, 3395, 3671, 3840, 3801, 3565, 3211, 2857, 2597, 2444, 2319, 2195, 2094, 2038, 2002, 1921, 1822, 1724, 1687, 1650, 1659, 1668, 1689, 1710, 1688, 1667, 1690, 1758, 1801, 1844, 1850, 1857, 1889, 1876, 1809, 1742, 1691, 1687, 1704, 1721, 1742, 1762, 1785, 1808, 1831, 1854, 1898, 1943, 2013, 2037, 2020, 2003, 1985, 1968, 1952, 1981, 2064, 2146, 2252, 2404, 2549, 2649, 2621, 2487, 2339]
1629B339j03k9l0l0k9m2q8o2o2l9l8l6l5j1L4RRJ1J2RRk1o6o6k1J4J3k9k9mmM2M1N6N6k0k0
1624A740PQPQNONOm5m6k8J7K7j8o0o1k3N3Q3Q3O7K2k9k9J8J7J8J7l5l4J1J0NNm0m1j2j2j3
1620A719j2KJKJl2l3l2l3k7k8n3qP7P7N9J4k8k9l1l2J0J1pn3n4rRQJ7J7J7J6POOOk1k0k1k0
1615A499PPQPPPQPJ5J5J5J5L9L9L9L8K2K2Km3n4n4n7n6j9j9K7K6J6J5l0l1RRQRj1j1L1L1K3
1610A637k3m3m2RJ0RRL4L5L4L4MNNMnnm8m8m9lM7M7L4L3L4L3j5j6j5j6J3J4N6N6O0J4l6l5
1605A871n3n2oprqn2n1k8J7L7L6NNMNm1m1RN4K4K3j9j9KK%jl2p7p7l2K3K2K5K6K2K3K2K2L8
1600A712L8qql5l4J1J1L2L1L2L2L2L2K9K9K4k1m1m1ppnmj7K8K9j8o7o7pO9P8P7PPjjjjkll
1595A941lOOONL6L5j0j0l3l4J2J2J5J6l5q0r3r4k0k1K9K8K8K9j9k0j9j9K0J9k3k3j4L0N1N1
$$ y = [2339, 2236, 2207, 2177, 2147, 2118, 2076, 1988, 1926, 1864, 1825, 1787, 1751, 1716, 1705, 1739, 1748, 1757, 1768, 1780, 1789, 1798, 1777, 1711, 1645, 1624, 1638, 1651, 1622, 1593, 1589, 1585, 1627, 1668, 1724, 1780, 1760, 1740, 1747, 1755, 1762, 1770, 1775, 1781, 1786, 1792, 1747, 1701, 1673, 1690, 1717, 1699, 1639, 1578, 1555, 1608, 1691, 1774, 1841, 1863, 1834, 1805, 1823, 1840, 1858, 1875, 1840, 1806, 1817, 1827, 1832, 1837, 1797, 1756, 1744, 1732, 1719, 1707, 1709, 1710, 1712, 1713, 1681, 1648, 1616, 1583, 1556, 1528, 1475, 1467, 1544, 1621, 1680, 1694, 1666, 1637, 1606, 1574, 1584, 1595, 1588, 1535, 1481, 1472, 1481, 1489, 1506, 1523, 1540, 1556, 1563, 1569, 1575, 1581, 1560, 1540, 1519, 1499, 1506, 1513, 1521, 1528, 1535, 1542, 1550, 1557, 1572, 1587, 1602, 1617, 1656, 1695, 1734, 1772, 1794, 1816, 1818, 1775, 1721, 1667, 1610, 1554, 1535, 1516, 1543, 1569, 1585, 1600, 1570, 1539, 1548, 1557, 1565, 1574, 1563, 1552, 1583, 1614, 1637, 1614, 1571, 1529, 1538, 1548, 1557, 1566, 1600, 1635, 1669, 1703, 1707, 1712, 1717, 1721, 1716, 1711, 1663, 1615, 1566, 1563, 1610, 1657, 1691, 1724, 1758, 1791, 1776, 1760, 1745, 1729, 1742, 1756, 1812, 1868, 1928, 1942, 1906, 1871, 1818, 1766, 1760, 1753, 1744, 1736, 1684, 1633, 1605, 1622, 1659, 1695, 1700, 1705, 1709, 1714, 1673, 1632, 1641, 1695, 1719, 1742, 1723, 1704, 1706, 1708, 1708, 1707, 1675, 1598, 1521, 1489, 1512, 1534, 1559, 1585, 1607, 1630, 1652, 1674, 1712, 1750, 1742, 1734, 1699, 1665, 1676, 1687, 1719, 1750, 1782, 1814, 1846, 1878, 1907, 1936, 1960, 1939, 1898, 1857, 1850, 1843, 1838, 1834, 1817, 1845, 1874, 1856, 1789, 1722, 1715, 1784, 1862, 1939, 1946, 1953, 1952, 1951, 1950, 1949, 1947, 1944, 1941, 1938, 1944, 1950, 1956, 1961, 1997, 2032, 2022, 2012, 1979, 1945, 1957, 1969, 1984, 2000, 1965, 1885, 1792, 1698, 1678, 1657, 1686, 1714, 1742, 1771, 1752, 1732, 1713, 1694, 1714, 1733, 1710, 1687, 1673, 1703, 1754, 1805]
1590A805JJKJL2L3j3j4m6m6jjj8j8j8j8L0L0L1L0J9K0jm7j7j7k1k0rrJ1N7N7N8j6j5k2k1o4
1585A746o4n0nJ4J5K8K8Ql7k8k8J9O5N4N3J1J1j1j1j0j1o6o6o5o6J9K0Km3o0j5L3L2M4M4M4
1581A654M4POL3j3l9l9MML7L7Q2Q3L4L5J5l1p2p1k9k9NNM7M8L9pk6k7oon1n2o8o9k3k3MMm2
1576A504m2j7j7N9N9K8K9j6j7m0m0L5L6N0M9N0N0NONNPOPPl5l5l5l5opooMNK7K8K7K7j8j8
1571A725l7l8l7l8kjM4M4L2L3j3j3j5j4j5j4KKJKj4j3j4j3k0j9o5o4m3m3KLN3N3P6P6MMm2
1566A569m2jkM4M4N4N3QQJ0J0J0J0j9j9j9j9l0l0l0l1%%j%rqL7L7RRj4j3k5k5N2N1L7L8qq
1561A737k0k0LLM0L9no%%k3k2j2j2j2j2j6j7l9m0l7l7QRJ8J8J8J8RQL0O8N8K1j7m0j6QJ6J6
1556A742k7k7k6k7J1J0J1J0J1J0J1J0m1m2n2k9%L7L1PJ4J4J2J2k2k2k3k3j0l2m0lM4M4M6M7
$$ y = [1805, 1806, 1807, 1809, 1810, 1842, 1875, 1862, 1848, 1802, 1756, 1755, 1754, 1736, 1718, 1700, 1682, 1712, 1742, 1773, 1803, 1822, 1842, 1841, 1794, 1777, 1760, 1739, 1719, 1710, 1701, 1712, 1769, 1826, 1884, 1868, 1853, 1831, 1810, 1746, 1682, 1632, 1627, 1641, 1656, 1684, 1712, 1720, 1683, 1655, 1627, 1646, 1711, 1765, 1818, 1829, 1840, 1829, 1818, 1808, 1797, 1731, 1665, 1600, 1534, 1553, 1573, 1575, 1532, 1472, 1457, 1490, 1522, 1566, 1610, 1654, 1698, 1705, 1711, 1744, 1731, 1692, 1653, 1657, 1661, 1698, 1735, 1817, 1900, 1934, 1969, 1984, 1953, 1881, 1810, 1781, 1752, 1757, 1762, 1809, 1857, 1896, 1889, 1863, 1836, 1830, 1824, 1773, 1721, 1653, 1584, 1561, 1538, 1542, 1546, 1504, 1462, 1445, 1428, 1487, 1546, 1574, 1603, 1587, 1570, 1530, 1490, 1525, 1561, 1611, 1660, 1710, 1760, 1765, 1771, 1776, 1781, 1788, 1794, 1801, 1808, 1773, 1738, 1703, 1668, 1662, 1655, 1649, 1643, 1647, 1652, 1679, 1707, 1734, 1761, 1743, 1725, 1688, 1650, 1613, 1575, 1573, 1572, 1616, 1660, 1692, 1725, 1712, 1699, 1684, 1670, 1655, 1641, 1643, 1645, 1646, 1648, 1634, 1621, 1607, 1594, 1574, 1555, 1490, 1426, 1383, 1340, 1342, 1345, 1398, 1451, 1527, 1603, 1607, 1611, 1569, 1527, 1526, 1524, 1568, 1612, 1666, 1719, 1727, 1735, 1745, 1755, 1765, 1775, 1756, 1737, 1718, 1699, 1669, 1639, 1609, 1578, 1578, 1578, 1577, 1577, 1568, 1560, 1597, 1634, 1643, 1652, 1638, 1625, 1600, 1575, 1627, 1678, 1715, 1753, 1745, 1737, 1717, 1697, 1700, 1703, 1743, 1782, 1777, 1771, 1771, 1771, 1748, 1726, 1714, 1702, 1690, 1678, 1662, 1645, 1606, 1566, 1529, 1492, 1500, 1509, 1527, 1545, 1563, 1581, 1590, 1598, 1628, 1696, 1754, 1775, 1758, 1718, 1702, 1710, 1726, 1742, 1715, 1688, 1662, 1635, 1646, 1656, 1667, 1677, 1688, 1698, 1709, 1719, 1678, 1636, 1584, 1555, 1555, 1592, 1623, 1630, 1644, 1658, 1670, 1682, 1660, 1638, 1615, 1592, 1582, 1550, 1510, 1507, 1551, 1595, 1641, 1688]
1552A688M1M2J8j9l7j4J4J5j7l8m8rM4M4K3j5l2l3j2j2N1N1O1L8mm2m5pok7k6lPPQQmlllK2
1547A723K2K3K2mmmmm6m7m7m7k0k0k0k0K0K0K0K0K3K4Nl9n0mP1P0O2J7lll1l1l1l1%%J%jj
1542A635%jk8k7k7k8K1K2K1K1KKKKPOPOM6M7%JllM2M2j2j3j3j3m1m2l9l8k2K4M5R1Q4L7rr
1537A845j5j4j4j4PQPQmmmll5l5l5l5qqqrk4k5k5k4K4K5K5K4POPOL2L2j3j4ONL2j4r3r3m6
1532A490%K7K7m6m6j7j8j7j8K2K2K3K2N9N9J4J4M2M2M3M2L1L1J4l1n5rQQj4j5m0NL2L1L4L5
1527A851j2j2n8n8j4j4j4j4oonom1m1o7k1L0L0L3L3N3N4QQK3K2K3K2jkjjj3j3j3j2rj0rrr
1522A699rj0rj3j2j3j3k0j9K6K6M9M9M9M9M9M9l1p7q7q7m0OOOQRl6l7POK9j6l7l6K3K2Om0
1517A531p7l2J8O3O3J6%%N5N4Nm1l3l4M0L9N4N3k2k2opJ9k6q0p9l2J3J1J0J3J3MNm1m1qqL8
$$ y = [1688, 1729, 1771, 1789, 1770, 1733, 1719, 1733, 1748, 1731, 1693, 1645, 1636, 1680, 1724, 1747, 1732, 1700, 1667, 1655, 1643, 1694, 1745, 1806, 1844, 1840, 1798, 1753, 1746, 1740, 1713, 1687, 1684, 1691, 1698, 1706, 1714, 1710, 1707, 1704, 1701, 1723, 1745, 1768, 1790, 1786, 1782, 1778, 1774, 1728, 1681, 1634, 1587, 1567, 1547, 1527, 1507, 1527, 1547, 1567, 1587, 1610, 1634, 1639, 1600, 1550, 1546, 1617, 1687, 1749, 1766, 1763, 1760, 1729, 1698, 1667, 1636, 1636, 1636, 1637, 1637, 1636, 1635, 1635, 1634, 1606, 1579, 1552, 1524, 1545, 1567, 1588, 1609, 1611, 1613, 1615, 1617, 1624, 1630, 1637, 1643, 1689, 1736, 1736, 1737, 1734, 1731, 1773, 1815, 1803, 1790, 1777, 1764, 1723, 1681, 1642, 1604, 1582, 1606, 1651, 1742, 1826, 1863, 1854, 1845, 1830, 1816, 1802, 1788, 1795, 1803, 1810, 1818, 1814, 1810, 1806, 1803, 1768, 1733, 1698, 1663, 1655, 1647, 1639, 1630, 1606, 1581, 1556, 1532, 1556, 1581, 1606, 1630, 1637, 1643, 1650, 1656, 1688, 1720, 1707, 1693, 1699, 1704, 1736, 1722, 1629, 1536, 1490, 1490, 1517, 1544, 1498, 1452, 1435, 1417, 1400, 1382, 1404, 1426, 1449, 1471, 1530, 1589, 1603, 1617, 1659, 1701, 1744, 1786, 1817, 1848, 1862, 1831, 1776, 1767, 1775, 1783, 1769, 1754, 1714, 1719, 1751, 1782, 1816, 1851, 1839, 1827, 1769, 1711, 1697, 1683, 1669, 1655, 1649, 1643, 1638, 1632, 1591, 1550, 1483, 1462, 1492, 1522, 1555, 1588, 1641, 1695, 1703, 1711, 1734, 1756, 1779, 1801, 1800, 1798, 1797, 1796, 1783, 1770, 1757, 1745, 1736, 1726, 1717, 1708, 1699, 1690, 1680, 1671, 1658, 1646, 1633, 1620, 1600, 1581, 1607, 1633, 1682, 1731, 1780, 1829, 1878, 1927, 1896, 1819, 1732, 1645, 1605, 1611, 1617, 1623, 1631, 1640, 1604, 1567, 1574, 1580, 1609, 1593, 1556, 1520, 1543, 1565, 1571, 1531, 1454, 1422, 1440, 1503, 1566, 1582, 1582, 1582, 1637, 1691, 1696, 1655, 1622, 1588, 1628, 1667, 1721, 1774, 1752, 1730, 1724, 1717, 1736, 1710, 1630, 1551, 1519, 1532, 1543, 1553, 1566, 1579, 1583, 1588, 1547, 1506, 1498, 1490, 1528]
1513A528L7L8L8J8k8j1j1j3j4j1j0j1j1M5M4M5M5j5j5j6j5J3J3l2l3p8p8k8J8L0L1m0l9pL9
1508A466L9onmL8L8M1M1O6K1m5m6JM8L1L1rrJ0N5K9L0k7k8pL8K7K7K9L0m5m4m4m5q0q0o0j4
1504A538L9M0lmLKLKj1j2j2j1mmmmN8N8N7N8L2L3J2l3n2n2rrJ2J3l3l3%%LLk5K0O8O8J7k8
1498A796m8m7l0l0J6J6K1K1K2K1RQQQoooopqn2n3m1m2MMlmmmM0M0qn3p4k8K4O9M2M2jjL4L3
1493A716L4L4L5L6L5L6M8M8k9p5r8n2l2l3j8K8K7j8n6n6rL7K3K3j9j9j3j3j3j3J%M6M6RRR
1489A714RL6L6L5L6k6k6k6k5l2l2j5L0mm9j8j7J0N6P3P3L8on7n7m8m8m8m8j6j5j3j3l0J5L5
1484A527L5k2k2k2k1qqrqppL8L9LLOOj1L6Q0Q1L8l8k0K4L4L3rj0L7L7rrnnK1k5n4n5j1j2l
1479A668lllKLLKj6j7j6j6L8L8L8L8N3N2PPmlllk6k5k5k5lml0J7M4M5%m6nL9N7N7k8k7k8k8
$$ y = [1528, 1565, 1603, 1641, 1659, 1631, 1620, 1609, 1596, 1582, 1571, 1561, 1550, 1539, 1584, 1628, 1673, 1718, 1703, 1688, 1672, 1657, 1670, 1683, 1651, 1618, 1540, 1462, 1434, 1452, 1482, 1513, 1473, 1434, 1427, 1466, 1505, 1499, 1494, 1490, 1528, 1566, 1607, 1648, 1714, 1735, 1690, 1644, 1645, 1693, 1724, 1755, 1746, 1737, 1747, 1802, 1831, 1861, 1834, 1806, 1799, 1837, 1864, 1891, 1920, 1950, 1905, 1861, 1817, 1772, 1692, 1612, 1552, 1538, 1577, 1617, 1614, 1610, 1613, 1615, 1618, 1620, 1609, 1597, 1585, 1574, 1570, 1566, 1562, 1558, 1616, 1674, 1731, 1789, 1821, 1854, 1866, 1833, 1781, 1729, 1720, 1711, 1723, 1736, 1703, 1670, 1670, 1670, 1673, 1676, 1651, 1671, 1739, 1807, 1824, 1796, 1748, 1701, 1671, 1641, 1657, 1673, 1694, 1715, 1737, 1758, 1767, 1775, 1783, 1791, 1785, 1779, 1773, 1767, 1760, 1752, 1700, 1647, 1606, 1564, 1568, 1572, 1569, 1565, 1561, 1557, 1597, 1637, 1629, 1576, 1502, 1474, 1498, 1567, 1609, 1651, 1650, 1649, 1683, 1716, 1750, 1784, 1819, 1855, 1890, 1926, 1974, 2022, 1993, 1918, 1820, 1768, 1736, 1703, 1685, 1713, 1740, 1722, 1666, 1610, 1601, 1638, 1661, 1684, 1665, 1646, 1633, 1620, 1607, 1594, 1595, 1595, 1641, 1687, 1696, 1705, 1714, 1723, 1759, 1795, 1830, 1866, 1840, 1814, 1788, 1763, 1731, 1699, 1684, 1714, 1710, 1661, 1643, 1626, 1636, 1692, 1765, 1838, 1876, 1870, 1813, 1756, 1708, 1660, 1612, 1564, 1548, 1533, 1520, 1507, 1477, 1492, 1527, 1562, 1540, 1518, 1496, 1475, 1467, 1459, 1450, 1442, 1435, 1428, 1466, 1505, 1508, 1511, 1517, 1523, 1512, 1548, 1628, 1709, 1747, 1709, 1689, 1713, 1747, 1780, 1771, 1761, 1798, 1835, 1826, 1817, 1812, 1807, 1828, 1803, 1749, 1694, 1683, 1671, 1668, 1665, 1662, 1659, 1661, 1664, 1667, 1669, 1653, 1636, 1620, 1604, 1642, 1680, 1718, 1756, 1809, 1861, 1868, 1875, 1871, 1868, 1865, 1862, 1836, 1811, 1786, 1761, 1758, 1754, 1724, 1741, 1785, 1830, 1830, 1784, 1779, 1818, 1875, 1932, 1904, 1877, 1849, 1821]
1474A821n0n0n1n0k1k1mM2M8Km2m3k4K1M1M1RRQRJ7J8J4J4m1q7q4l8K4P1M8M7rrooK0O6J16
1469A870J16J00J00R7R8K5k0NNk9k9k9l0n5n6n6n6k2k2k1k2jkp6p7k7k6M9N0M1M2l4l4j4j4
1465A846L2L1MNMMQ0Q1L5L5qrqrJ4J4N9N9M0M1P0J47J72J26Q6Q6J38K15K43J98J90J89J82
1461D392J83J10L4k9k9m4m5R2R3Q9Q9Q9R0Q5Q4k1k1n6n5N1N0J34J33J33J33J90J90K47K92
1457F683L45M50O59R47J249J536J766J842J713J335P04m0p90j411j762j899j821j623j336
1455H547j048p97o61n78m71l65k89k44j99j35j35j31j32j06j05j06j06j02j02n6n6k9k9J6
1452B581J6K5K5K5K5N2N2OOM5M4M4M4K6K6M8R4J58K03K25K26K60K59K40J95J51J52J49J48
1448E550K00K00K00K00J56J55J03N6M2mm5j20j78j77k55k55k47k01j51j51j99j99k45k44k49
$$ y = [1821, 1771, 1721, 1670, 1620, 1599, 1578, 1574, 1616, 1664, 1666, 1624, 1581, 1557, 1578, 1619, 1660, 1669, 1678, 1686, 1695, 1712, 1730, 1744, 1758, 1717, 1630, 1546, 1508, 1532, 1603, 1651, 1698, 1689, 1680, 1674, 1668, 1688, 1754, 1870, 1986, 2086, 2186, 2283, 2381, 2406, 2386, 2391, 2396, 2367, 2338, 2309, 2279, 2224, 2168, 2112, 2056, 2034, 2012, 1991, 1969, 1968, 1966, 1890, 1813, 1786, 1760, 1809, 1859, 1900, 1942, 1908, 1874, 1860, 1846, 1878, 1909, 1913, 1918, 1922, 1926, 2006, 2087, 2122, 2157, 2149, 2140, 2132, 2123, 2137, 2151, 2210, 2269, 2309, 2350, 2420, 2567, 2739, 2865, 2951, 3037, 3175, 3390, 3633, 3831, 4021, 4210, 4392, 4575, 4685, 4719, 4690, 4661, 4617, 4572, 4664, 4757, 4846, 4935, 5024, 5114, 5199, 5283, 5262, 5241, 5185, 5130, 5181, 5231, 5365, 5498, 5631, 5764, 5954, 6144, 6391, 6683, 7028, 7478, 8137, 9084, 10333, 11869, 13635, 15477, 17190, 18525, 19229, 19189, 18399, 16988, 15226, 13327, 11506, 9883, 8547, 7499, 6702, 6041, 5463, 4992, 4627, 4338, 4094, 3895, 3760, 3625, 3494, 3362, 3256, 3151, 3045, 2939, 2837, 2735, 2679, 2623, 2594, 2565, 2581, 2597, 2622, 2647, 2672, 2697, 2749, 2801, 2807, 2813, 2858, 2902, 2946, 2990, 3016, 3042, 3090, 3184, 3342, 3545, 3770, 3996, 4256, 4515, 4755, 4950, 5101, 5253, 5402, 5550, 5750, 5950, 6150, 6350, 6506, 6661, 6764, 6820, 6862, 6858, 6813, 6693, 6515, 6338, 6083, 5828, 5581, 5380, 5229, 5078, 4879, 4680, 4435, 4191, 3942]
1445C942k49k27j80j19p2r6r5j53j52j50j49j32q7l5J0pn3r8r7l1J4L4L5N6N6L7rNOKLj2j1
1441A986j1j2K0K0J7J7K8j9o5o5l1J6j1j0n2n2p8l2J7J6M7Lk4K2M0L9K1K2k5k4k2k1k2k2M
1437A737MMMm0m0l7l6j5L2N1N1M6M5M6M5j8j8j8j8LL%%m5r1r0m4j8MnoJ8J9M8P0N9J3k1m4
1432A698k7mK7K7pppp%jM5M6M9M9LMrrn4n4l7l7l4l4n8j2M1Q7J13R1N5Rj3l5k5k6j2j2j1j2
1427A800n8n7j2j2J6J6j4l7mM2J4J5jkJ4rj3L2J8nrrqrk3%O5J11P8L2m5m6k1k2k2k1j1j0j0
1423A763j0l6l5RJ0L2L3L2L2j2j2j2j3j5j5j5j5QRQROOM9M9lm8k2k2j5j5j5j6qrk5p1p1k6
1418A499K2K2L5L5J5l1m7m8%M5N2N2N5N4L3L2L2L3l4l5l4l4l6l6l7l6QQQRK5K6k0k0j5j5j6
1413A606j5RQQRK5K6K5K6KJKK%jjjK6K5Ol9l3l3l3l3j5L1N0N1j0j0L6L5L7L6rrk3k3lM2N4
$$ y = [3942, 3693, 3466, 3286, 3167, 3095, 2999, 2904, 2751, 2599, 2449, 2300, 2168, 2081, 2046, 2056, 2049, 1996, 1898, 1801, 1770, 1784, 1818, 1853, 1909, 1965, 2002, 1993, 1998, 2004, 2006, 2009, 1997, 1986, 1975, 1963, 1983, 2003, 2020, 2037, 2065, 2046, 1981, 1916, 1885, 1901, 1890, 1880, 1828, 1776, 1698, 1666, 1683, 1699, 1746, 1749, 1725, 1747, 1787, 1826, 1847, 1869, 1844, 1820, 1798, 1777, 1755, 1733, 1737, 1741, 1745, 1749, 1709, 1669, 1632, 1596, 1581, 1613, 1664, 1715, 1761, 1806, 1852, 1897, 1879, 1861, 1843, 1825, 1828, 1831, 1831, 1831, 1786, 1695, 1605, 1561, 1543, 1547, 1542, 1536, 1554, 1573, 1621, 1691, 1750, 1763, 1742, 1698, 1671, 1667, 1694, 1721, 1714, 1707, 1700, 1693, 1693, 1692, 1737, 1783, 1832, 1881, 1884, 1888, 1879, 1870, 1816, 1762, 1725, 1688, 1654, 1620, 1562, 1550, 1591, 1678, 1791, 1882, 1937, 1946, 1933, 1898, 1873, 1847, 1835, 1823, 1812, 1800, 1742, 1685, 1673, 1661, 1677, 1693, 1679, 1642, 1638, 1680, 1694, 1709, 1708, 1706, 1720, 1711, 1698, 1730, 1748, 1743, 1734, 1725, 1717, 1708, 1685, 1685, 1750, 1861, 1939, 1971, 1926, 1880, 1859, 1837, 1815, 1794, 1783, 1773, 1763, 1753, 1717, 1682, 1691, 1701, 1733, 1766, 1798, 1830, 1818, 1806, 1794, 1781, 1766, 1751, 1736, 1721, 1729, 1738, 1746, 1755, 1761, 1767, 1816, 1865, 1862, 1814, 1792, 1770, 1755, 1740, 1725, 1709, 1701, 1692, 1667, 1596, 1525, 1499, 1521, 1543, 1578, 1613, 1628, 1597, 1550, 1502, 1502, 1547, 1599, 1651, 1706, 1760, 1793, 1825, 1857, 1890, 1856, 1821, 1787, 1753, 1717, 1681, 1644, 1608, 1616, 1624, 1632, 1641, 1666, 1692, 1672, 1652, 1637, 1622, 1606, 1591, 1600, 1608, 1616, 1625, 1650, 1676, 1701, 1727, 1729, 1730, 1732, 1734, 1734, 1733, 1732, 1731, 1757, 1782, 1788, 1749, 1716, 1683, 1650, 1617, 1602, 1633, 1683, 1734, 1724, 1714, 1750, 1785, 1822, 1858, 1849, 1840, 1817, 1794, 1791, 1833, 1887]
1408A887N5J2J2ppppj2j2j1j2l0l0l0l0k2k1K4K4m2m1k2K4J6J6J9J9k6k6k6k5PQNM%m5o3o2
1403A516oL9O0N9j3j4j3j4J3J2J3J2j2j2j2j2POPOK0J9K0K0k6k7k6k7N1N0N0N1K0K0l0p5n5
1399A697n4n5n4qL7J2J1l9l9k3K3J7k9m3m4kM3O3O3K4K4K0J9K3n3j11j11j8N9O1O1K0K0J9
1395A633K0rqL4L4K2k4KKK4K3k2k2n1n2m8m9J2N8N7J2l3l4l6l6lkkkL4L5L5L5K0K1k2k2l9
1390A597PN7N6O0O0M0nMMkkk1o6q3q4j09o3rL7K8K7L1L1J8J8J9J8j%lmOl9l9O%%LLK6K7K6
1385A679K7rrn5n5k9k9J6J6J0Rj2j3M4M5M1M2j9o4l6l6J5O1L5L6jjjjj6j6j8K7O2O3J6l0k8
1380A766k7ppn1n0l4J3J6k9m6m6k9k8qL7K5K4K8K8L9L9L7L6K9j6l6l6m0m1o0o0nM1L9L8K6
1376A605K5j9k0L5L6j0j0j9j9JM6P5P5K8j8k0k0J%nmk8k7k2k1k2k1l2l2n7j2RRJ2J2K0K0K1
$$ y = [1887, 1942, 1954, 1966, 1959, 1952, 1945, 1938, 1926, 1914, 1903, 1891, 1861, 1831, 1801, 1771, 1749, 1728, 1752, 1776, 1734, 1693, 1671, 1695, 1711, 1727, 1746, 1765, 1739, 1713, 1687, 1662, 1669, 1677, 1682, 1686, 1686, 1641, 1578, 1516, 1510, 1549, 1609, 1668, 1655, 1641, 1628, 1614, 1627, 1639, 1652, 1664, 1652, 1640, 1628, 1616, 1623, 1629, 1636, 1642, 1662, 1681, 1701, 1721, 1695, 1668, 1642, 1615, 1666, 1716, 1766, 1817, 1837, 1857, 1827, 1752, 1697, 1643, 1588, 1534, 1526, 1563, 1575, 1586, 1547, 1508, 1485, 1508, 1525, 1496, 1453, 1409, 1407, 1450, 1513, 1576, 1600, 1624, 1644, 1663, 1686, 1633, 1522, 1411, 1393, 1452, 1513, 1574, 1594, 1614, 1633, 1653, 1644, 1636, 1670, 1704, 1726, 1702, 1704, 1706, 1730, 1753, 1731, 1709, 1658, 1606, 1558, 1509, 1521, 1579, 1636, 1648, 1615, 1581, 1545, 1509, 1506, 1504, 1502, 1500, 1534, 1569, 1604, 1639, 1659, 1680, 1658, 1636, 1597, 1604, 1661, 1717, 1777, 1837, 1877, 1872, 1876, 1880, 1878, 1876, 1855, 1789, 1706, 1622, 1513, 1450, 1441, 1478, 1506, 1533, 1564, 1595, 1613, 1631, 1650, 1668, 1667, 1667, 1664, 1660, 1666, 1627, 1588, 1594, 1594, 1594, 1597, 1600, 1626, 1653, 1679, 1706, 1697, 1688, 1633, 1578, 1549, 1520, 1536, 1552, 1562, 1571, 1559, 1546, 1590, 1635, 1676, 1718, 1699, 1635, 1599, 1563, 1578, 1639, 1674, 1710, 1709, 1708, 1707, 1706, 1690, 1674, 1656, 1683, 1745, 1808, 1824, 1794, 1766, 1739, 1732, 1725, 1674, 1624, 1590, 1603, 1619, 1590, 1544, 1498, 1469, 1441, 1433, 1470, 1495, 1519, 1547, 1575, 1614, 1653, 1690, 1726, 1755, 1739, 1703, 1667, 1627, 1586, 1526, 1466, 1461, 1502, 1541, 1579, 1605, 1630, 1611, 1591, 1626, 1662, 1652, 1642, 1623, 1604, 1605, 1651, 1726, 1801, 1829, 1811, 1791, 1771, 1772, 1772, 1767, 1763, 1735, 1708, 1686, 1665, 1643, 1622, 1590, 1558, 1501, 1489, 1498, 1507, 1519, 1531, 1551, 1571, 1592]
1371A592K0M0M0nnj9j9m2m1n9n8qL7R0R0L2m3m1NJ9K0J0RRJ0K3K3K3K3k6k6k6k6j7j8j7j7
1367A602opJ7J6L2L2j4j4K8K7NNOOK8K9mmk7k7n5n6l5J0M5M6K9j6n8n7l5l4MN0M8M7J0J1j3
1362A671j2l8l9l5l6j3L2K9L0OOl7l6j0L6Q2L6k1k1k4k3j1j1j0j1J1J2J1J1m4m5k4K1J9K0
1358A532K2K2M1M2M2M1%%llj1n5l1l0JJJJk2k3k3k2k0k0j7j7j1L4N1N1J2l3qpJ8J8J8J8L2
1353A642L2L0K9K4k2o9o9l4J1L2L1L9L8ppj2j1J3J4L7Q3O0J4n3n3j3j3m3q9o0J6P6P6L0j5
1349A757k4k4mmk2k2JKQRL2L2K2K2k4k3o3o2m3LO0O0M3ll4l5j5j4QQl8l7m8m8k5k5J3J4L7
1344A494L6L2L2m2m1l1J4O7J12J13O7Np1r1m6L0L0K2K3%%JJ%Jm3m3m3m3OPj6j6k4k4K1K1N6
1339A617N7P6P6N0Mk0o6p2p2n1n2k7k7M9M9O6O6K0K1PPj5j6m1m2L1L2L3j2o3o2n6n6l3l3j
$$ y = [1592, 1612, 1652, 1692, 1687, 1682, 1663, 1644, 1602, 1561, 1502, 1444, 1436, 1473, 1563, 1653, 1685, 1642, 1601, 1606, 1625, 1645, 1655, 1664, 1673, 1683, 1706, 1729, 1752, 1775, 1749, 1723, 1697, 1671, 1654, 1636, 1619, 1602, 1596, 1589, 1606, 1622, 1654, 1686, 1672, 1658, 1686, 1713, 1718, 1723, 1729, 1735, 1763, 1792, 1788, 1784, 1757, 1730, 1675, 1619, 1584, 1594, 1639, 1685, 1714, 1698, 1640, 1583, 1548, 1514, 1518, 1568, 1616, 1663, 1673, 1684, 1671, 1659, 1621, 1582, 1547, 1511, 1498, 1530, 1559, 1589, 1595, 1601, 1564, 1528, 1518, 1554, 1636, 1672, 1651, 1630, 1606, 1583, 1572, 1561, 1551, 1540, 1551, 1563, 1574, 1585, 1541, 1496, 1472, 1493, 1512, 1532, 1554, 1576, 1617, 1659, 1701, 1742, 1742, 1742, 1739, 1736, 1725, 1670, 1639, 1609, 1610, 1611, 1612, 1613, 1591, 1568, 1545, 1523, 1503, 1483, 1466, 1449, 1438, 1472, 1523, 1574, 1586, 1553, 1545, 1538, 1556, 1574, 1592, 1610, 1642, 1674, 1704, 1733, 1757, 1735, 1666, 1597, 1563, 1574, 1606, 1637, 1676, 1714, 1707, 1700, 1688, 1677, 1690, 1704, 1741, 1824, 1884, 1898, 1845, 1792, 1779, 1766, 1723, 1634, 1574, 1590, 1666, 1742, 1772, 1757, 1733, 1709, 1705, 1701, 1679, 1657, 1658, 1660, 1668, 1677, 1709, 1741, 1763, 1785, 1761, 1738, 1675, 1613, 1570, 1573, 1633, 1693, 1736, 1733, 1699, 1664, 1649, 1635, 1643, 1651, 1613, 1576, 1528, 1480, 1455, 1430, 1443, 1457, 1494, 1530, 1562, 1594, 1552, 1511, 1480, 1494, 1561, 1673, 1786, 1853, 1858, 1787, 1696, 1650, 1680, 1710, 1732, 1755, 1755, 1755, 1756, 1757, 1757, 1758, 1715, 1672, 1629, 1586, 1592, 1599, 1583, 1567, 1543, 1519, 1540, 1561, 1617, 1674, 1750, 1826, 1876, 1880, 1860, 1794, 1722, 1650, 1599, 1547, 1520, 1493, 1542, 1591, 1657, 1723, 1743, 1764, 1771, 1778, 1763, 1747, 1706, 1664, 1695, 1727, 1760, 1748, 1685, 1623, 1567, 1511, 1478, 1445, 1444]
1335A444jK2K2J2J1L5L5l2l2j2L4J8J8K1K0K4K3K0K1J4l1l0J4jjJKK1K0K1K0lmmmmmlml1l1
1330A661l1l1j2j2j2j2L6L5L6L6J5J5J5J6j2j2l2l1k0K6P3P3N0Om5m5n0m9nmo5o5m5%k1k2
1325A460j8j9M0M1L8L7J0l6n7n6J3J3J5J6K3O8Q4Q3L3m2m6m6J2J3J2J2j6j7j6j6nnnnk8k9
1321A561n3rL8L9L8L8Nm0m0OJ2J2l2p8j00n5K3K4J3J4L1P6P7L2j7j6jkM3M4M8M7LKK9K8k1
1316A819o7l0l0l0l0k9J7L6L6ppppk3k3k3k3kjkkJJKJqpJ3N8J01J01K3k2m6m7lmK9K9K9K8
1311A844k2k2k2k2NMNMl3l4l3l4K3K3K4K3j3j3j1j2K1M3J2l4l8j6J4J4jkkjj4j4j4j4ONNN
1307A659J2J2J2J2j1j2j1j2l3l4RQnn2l7j4J4L8O9O9O2J6k0m4m7m7m6m7m3k0J8O3P3P4L1L1
1302A747j9j8j9j8J9K0J9K0lkklj1j1n5n5o0l8jM4N5L3j4l6j2J1K2k3l2l1l5l4K2K2K4K4J6
$$ y = [1444, 1443, 1465, 1487, 1499, 1510, 1545, 1580, 1548, 1516, 1504, 1538, 1556, 1574, 1595, 1615, 1639, 1662, 1682, 1703, 1717, 1686, 1656, 1670, 1669, 1668, 1669, 1671, 1692, 1712, 1733, 1753, 1750, 1746, 1742, 1738, 1734, 1730, 1727, 1723, 1692, 1661, 1630, 1599, 1587, 1575, 1563, 1551, 1587, 1622, 1658, 1694, 1709, 1724, 1739, 1755, 1743, 1731, 1699, 1668, 1648, 1674, 1747, 1820, 1870, 1876, 1831, 1786, 1736, 1687, 1682, 1678, 1613, 1548, 1503, 1503, 1482, 1460, 1442, 1423, 1463, 1504, 1542, 1579, 1589, 1553, 1496, 1440, 1453, 1466, 1481, 1497, 1520, 1588, 1672, 1755, 1788, 1746, 1700, 1654, 1666, 1679, 1691, 1703, 1687, 1670, 1654, 1638, 1633, 1628, 1623, 1618, 1590, 1561, 1508, 1499, 1537, 1576, 1614, 1652, 1657, 1617, 1577, 1583, 1595, 1607, 1575, 1497, 1397, 1342, 1365, 1389, 1402, 1416, 1447, 1523, 1600, 1632, 1615, 1599, 1598, 1596, 1639, 1683, 1731, 1778, 1781, 1783, 1812, 1840, 1819, 1752, 1722, 1692, 1662, 1632, 1603, 1620, 1656, 1692, 1685, 1678, 1671, 1664, 1641, 1618, 1595, 1572, 1570, 1569, 1567, 1565, 1566, 1567, 1569, 1570, 1562, 1555, 1568, 1626, 1727, 1828, 1851, 1829, 1783, 1736, 1733, 1729, 1758, 1787, 1816, 1844, 1822, 1800, 1778, 1756, 1761, 1765, 1770, 1774, 1741, 1707, 1674, 1640, 1663, 1686, 1710, 1733, 1720, 1707, 1696, 1684, 1705, 1748, 1760, 1726, 1688, 1672, 1686, 1700, 1699, 1697, 1695, 1694, 1680, 1666, 1652, 1638, 1644, 1649, 1654, 1659, 1671, 1683, 1695, 1707, 1696, 1684, 1673, 1661, 1628, 1594, 1603, 1611, 1606, 1554, 1517, 1503, 1517, 1555, 1624, 1693, 1755, 1771, 1751, 1707, 1660, 1613, 1567, 1520, 1477, 1457, 1475, 1538, 1611, 1685, 1716, 1747, 1728, 1710, 1691, 1673, 1692, 1712, 1731, 1751, 1748, 1746, 1744, 1741, 1730, 1719, 1664, 1609, 1549, 1511, 1510, 1554, 1609, 1642, 1628, 1592, 1580, 1591, 1613, 1590, 1558, 1527, 1492, 1458, 1480, 1502, 1526, 1550, 1566]
1298A566L8N2Ol3l3J1N7K9j6J2J2J6J6l0l0j2j2L4L3j6j6n9n8n6j1J0RK7K8P0P0N2Pj3j3m4
1293A703m4p0k4M6M6MMJ7J8J8J8%J%%K4K3Lm2k2k2Jm5l0l0l4l3l0l1J5J5L9L9L9L8LLLL%J
1288A667%%M6M5J%m3m3MN0M8Kj5j4j0j0l5J0N7N7j8o3q6l9PQLKK3O8J08J07J7n9n8n9j8j7
1284A743J2J3J2J3m0l9m0m0PPM9N0K3k2LML7L8L8L7KJKJj9k0o5o5m9n0k9J6MNo6o5l7Qj7j7
1279A445MNN0N0K6K6K6K6N4N4RRlmllj3j2L2L3J7J7J7J7j2j1j2j1j3j3L2L3k7k7k8k7QPQP
1274A793l1l2k8k9j3L3N3N2k4k4k4k4noL8L7rn4n5rM0L9M0L9Om1j4j5K5K4k1k1L1L0j6j5k2
1269A748k3k2k3m9m9m9m9J1J1N4N4L8pk8k7NNONJ4J4J4J4J9J8J9J9J2J3k9l0l2J4L3L4onm8
1265A698m8j3L3N2N3qpppj6j5j3j2J6O1O2J6m5m6m8m8J4J3J4J4j4j4n9n9j0j0j0j0m3m3PN3
$$ y = [1566, 1604, 1656, 1662, 1629, 1596, 1607, 1664, 1693, 1677, 1689, 1701, 1717, 1733, 1703, 1673, 1661, 1649, 1683, 1716, 1700, 1684, 1625, 1567, 1511, 1500, 1510, 1519, 1546, 1574, 1644, 1714, 1766, 1773, 1760, 1747, 1703, 1659, 1589, 1565, 1611, 1657, 1661, 1665, 1682, 1700, 1718, 1736, 1736, 1737, 1737, 1737, 1761, 1784, 1787, 1745, 1723, 1701, 1702, 1657, 1627, 1597, 1563, 1530, 1500, 1469, 1484, 1499, 1538, 1577, 1616, 1654, 1657, 1660, 1663, 1666, 1666, 1667, 1667, 1667, 1713, 1758, 1759, 1759, 1716, 1673, 1677, 1727, 1775, 1777, 1762, 1748, 1738, 1728, 1693, 1703, 1760, 1817, 1799, 1736, 1650, 1611, 1618, 1626, 1629, 1631, 1654, 1722, 1830, 1937, 1954, 1895, 1837, 1778, 1760, 1743, 1755, 1768, 1780, 1793, 1753, 1714, 1674, 1634, 1641, 1648, 1697, 1747, 1770, 1748, 1751, 1755, 1792, 1830, 1868, 1905, 1907, 1908, 1910, 1911, 1892, 1872, 1807, 1742, 1693, 1643, 1614, 1630, 1634, 1639, 1573, 1508, 1471, 1479, 1462, 1445, 1449, 1454, 1504, 1554, 1580, 1606, 1632, 1658, 1712, 1766, 1775, 1784, 1781, 1777, 1774, 1771, 1758, 1746, 1778, 1811, 1828, 1845, 1862, 1879, 1867, 1856, 1844, 1833, 1820, 1807, 1839, 1872, 1845, 1818, 1790, 1763, 1771, 1778, 1786, 1793, 1762, 1730, 1702, 1673, 1660, 1693, 1746, 1798, 1774, 1750, 1726, 1702, 1697, 1691, 1729, 1766, 1757, 1703, 1648, 1639, 1679, 1718, 1758, 1797, 1803, 1762, 1748, 1733, 1758, 1782, 1761, 1740, 1771, 1801, 1785, 1770, 1748, 1725, 1703, 1680, 1631, 1582, 1533, 1484, 1495, 1506, 1560, 1614, 1652, 1645, 1617, 1590, 1595, 1600, 1606, 1611, 1625, 1639, 1653, 1667, 1686, 1704, 1723, 1742, 1754, 1767, 1738, 1708, 1676, 1690, 1723, 1757, 1751, 1746, 1698, 1650, 1637, 1670, 1722, 1775, 1767, 1760, 1753, 1746, 1730, 1715, 1702, 1690, 1706, 1767, 1829, 1845, 1800, 1754, 1706, 1658, 1672, 1685, 1699, 1713, 1699, 1685, 1626, 1567, 1557, 1547, 1537, 1527, 1484, 1441, 1448, 1501]
1260A501P4P5L2L2kjkjjkjkK2K2O5O4J3l3pqopm9m9m0ON3N3K5k0p1p1J1J1l5q0r7k1O7O7L9
1255A626pk7k7L8L7K1k5l4J2N9O0K6K7K7K6J0J0OPpn4p0p0p4k9K2K2L2L1ON2P1P0K3k2m9m9
1251A777m9m9lM3J7J7L0L0J0l5j6j5j9j8m7m7kjj9j9K7K7M0M0N0K7k4o3q5q5j6L7N3N3K8K7
1246A721K8K8KKKKJ9J8J8J8K8K8j7j8m1m1m1m1J8J8J9J8J5J5m6o8o5k6NM2L4L3L6L6k8k7k8
1242A716k8K8K8L8J5rm7m9j0J9J9Pm5p8n4MLKk2k9QL3L4L6L6k9k8k8k9j5j4j5j5J9K0O5O4
1237A650P1P0K5k8o6o6k4k4J9J9J9J9l8l8QQmmmmjjjkk0k0k0k0K2K2K1K2j1j0j1j0J6J6J6
1232A616J6J2J1J2J2J2J2J1J2lmmln6n6j0j0L4L5L4L4OOOOj3j3L3L2J8J9J8J8j8j9j8j9o5
1228A714o5r0m6J4J3J6J6m1m1k0K4L9L9L9L8J6k9m6m7j1L4N4N4ooqrj1n7n7j2J8J8K0K1R4
$$ y = [1501, 1575, 1650, 1682, 1714, 1712, 1711, 1709, 1708, 1707, 1705, 1704, 1702, 1724, 1746, 1811, 1875, 1888, 1855, 1848, 1840, 1834, 1827, 1778, 1729, 1689, 1695, 1748, 1801, 1826, 1806, 1735, 1664, 1675, 1686, 1651, 1571, 1474, 1453, 1520, 1587, 1626, 1619, 1592, 1565, 1603, 1640, 1661, 1636, 1602, 1614, 1673, 1733, 1759, 1786, 1813, 1839, 1849, 1859, 1865, 1872, 1865, 1811, 1741, 1671, 1597, 1568, 1590, 1612, 1644, 1675, 1681, 1733, 1804, 1874, 1897, 1875, 1826, 1777, 1728, 1679, 1676, 1719, 1736, 1753, 1783, 1813, 1823, 1788, 1772, 1757, 1738, 1720, 1673, 1626, 1624, 1623, 1604, 1585, 1612, 1639, 1679, 1719, 1769, 1796, 1772, 1709, 1624, 1539, 1523, 1560, 1613, 1666, 1694, 1721, 1749, 1777, 1779, 1781, 1783, 1785, 1804, 1822, 1840, 1858, 1886, 1914, 1897, 1879, 1838, 1797, 1756, 1715, 1733, 1751, 1770, 1788, 1803, 1818, 1772, 1704, 1639, 1613, 1618, 1660, 1694, 1727, 1763, 1799, 1771, 1744, 1716, 1688, 1716, 1744, 1782, 1797, 1788, 1741, 1692, 1682, 1701, 1720, 1727, 1682, 1604, 1550, 1554, 1557, 1559, 1537, 1508, 1516, 1549, 1583, 1619, 1655, 1626, 1598, 1570, 1541, 1526, 1512, 1497, 1482, 1501, 1521, 1586, 1650, 1721, 1791, 1816, 1788, 1722, 1656, 1632, 1608, 1627, 1646, 1665, 1684, 1646, 1608, 1616, 1624, 1620, 1616, 1612, 1608, 1607, 1606, 1605, 1603, 1583, 1563, 1543, 1523, 1545, 1567, 1588, 1610, 1599, 1589, 1578, 1568, 1584, 1600, 1616, 1632, 1644, 1655, 1667, 1679, 1691, 1703, 1714, 1726, 1723, 1719, 1715, 1712, 1656, 1600, 1590, 1580, 1614, 1649, 1683, 1717, 1723, 1729, 1735, 1741, 1728, 1715, 1748, 1780, 1798, 1817, 1835, 1853, 1835, 1816, 1798, 1779, 1714, 1649, 1559, 1513, 1527, 1540, 1556, 1572, 1531, 1490, 1470, 1494, 1533, 1572, 1611, 1649, 1665, 1636, 1590, 1543, 1532, 1566, 1620, 1674, 1668, 1662, 1654, 1645, 1634, 1577, 1520, 1508, 1526, 1544, 1564, 1585, 1679]
1223A679R3J4l3m2m1m5m5l4l4l4l3K3K2K3K3L8L8O3J8m9m9jM4K2K1k1k2n2n3p8l3J8J8K1K1
1219A500M0M0M0L9K9L0K9K9J5J5J5J5RRl7l6n3n3ppk0k0kM2P7L1k1o6n4n3n7n7oopoPPQPL4
1214A499L3Q0P9O7O7J7k9n7n8o0o0m3m4KKM4M4kkJ0J0L6j0m7m7mmj3j2j3j3L8L7pqk6k6oL9
1209A513M4M5k6k6l7RN6N6O0J6l5l5n7n7n4n4l8PK7K8K1K1K0K1J9J9J9J9M4M4mm9l2J4Q8Q8
1205A794N5J0L2L2pn3k8k7m7m6k9J6K7j8l5l5m4m5m4m4L2L3L2L2OOOON8N8N5N5L3j2o3o3n7
1200A681n7n6n7NNNNk2k1k1k2K5K4K5K4N9N8N9N9j6j6j6j5J9J9J7J6J5l1q1j27q5rK1K1m1
1196A469m1NMNONNJ3J3N9N8L3L3L3L3m7m7m7m6m7m7m6m7K3K4K3K4L8L8nnJM7K2K1J9J8J9J8
1191A684JJj6o2o2j6JJM3M3M3M3RRqn4p5l0J7J8k2k1kM4M8M8M7M8K5k1m0m0j5j5L0L1J6J6
$$ y = [1679, 1772, 1786, 1753, 1711, 1670, 1625, 1580, 1546, 1512, 1478, 1445, 1468, 1490, 1513, 1536, 1574, 1612, 1675, 1693, 1644, 1595, 1594, 1638, 1660, 1681, 1660, 1638, 1586, 1533, 1455, 1422, 1440, 1458, 1479, 1500, 1540, 1580, 1620, 1659, 1688, 1718, 1747, 1776, 1791, 1806, 1821, 1836, 1845, 1854, 1817, 1781, 1728, 1675, 1668, 1661, 1641, 1621, 1619, 1661, 1738, 1769, 1748, 1682, 1628, 1575, 1518, 1461, 1455, 1449, 1442, 1436, 1443, 1450, 1458, 1465, 1499, 1532, 1612, 1691, 1758, 1825, 1842, 1813, 1756, 1698, 1638, 1578, 1535, 1491, 1493, 1495, 1539, 1583, 1581, 1579, 1589, 1599, 1635, 1625, 1578, 1531, 1527, 1523, 1510, 1498, 1485, 1472, 1510, 1547, 1540, 1532, 1506, 1480, 1474, 1513, 1557, 1602, 1576, 1550, 1513, 1522, 1578, 1634, 1694, 1710, 1675, 1640, 1583, 1526, 1472, 1418, 1380, 1387, 1414, 1442, 1463, 1484, 1504, 1525, 1544, 1563, 1582, 1601, 1645, 1689, 1685, 1636, 1604, 1618, 1706, 1794, 1849, 1859, 1891, 1923, 1916, 1863, 1835, 1808, 1761, 1715, 1686, 1702, 1729, 1711, 1676, 1641, 1597, 1552, 1508, 1464, 1496, 1529, 1561, 1593, 1599, 1605, 1611, 1617, 1675, 1733, 1788, 1843, 1876, 1864, 1801, 1738, 1681, 1624, 1568, 1511, 1516, 1521, 1526, 1531, 1509, 1488, 1467, 1445, 1470, 1494, 1519, 1543, 1602, 1660, 1719, 1778, 1762, 1746, 1730, 1715, 1734, 1753, 1770, 1786, 1801, 1770, 1689, 1562, 1477, 1468, 1489, 1510, 1469, 1428, 1433, 1437, 1442, 1448, 1453, 1458, 1471, 1484, 1543, 1601, 1634, 1667, 1700, 1733, 1686, 1639, 1592, 1546, 1499, 1452, 1406, 1359, 1382, 1406, 1429, 1453, 1491, 1529, 1524, 1519, 1520, 1567, 1589, 1610, 1629, 1647, 1666, 1684, 1685, 1686, 1670, 1608, 1546, 1530, 1531, 1532, 1575, 1618, 1661, 1704, 1713, 1722, 1714, 1660, 1585, 1555, 1572, 1590, 1568, 1547, 1545, 1589, 1637, 1685, 1732, 1780, 1805, 1784, 1744, 1704, 1689, 1674, 1704, 1735, 1751, 1767]
1186A767k9k9m6m5m5m6m7m7kjqqqql7l6o2j7K0J9K2K3L3L4L4L4K7K8K7K7j4j4j1j2J6O2O2
1182A663J6j7j7k0k0m6m5k6K0O4O3M6Jj2j3J0l6n0m9pqJ9K0J9J9J3J3J4J3k9k9j0L6L3L2j0
1178A670j1n4n5l4J1N4N5J2J2j1j1j1j2l9m0OOK3K3K2K3j9j9K7K6k0k0k0k0j4j4j5j4l3l4
1173A450J2J2M8M8M8M8N7N7L7qm7m7K8P3P3K8n0n0n9n8j4j3k7k8J5J5j4n9n6j1K1O6M4M3j0
1169A672j1j0j1j5j5j5j6M7M6M6M7J0J1l5l5p3p4n4qJ6J7J9J9k3k2K3K3K3K3K4K3qqJ2N8L5
1165A761L6L6L5L0j5o3o3m2LK3K3J0J0RJ0llM0L9O3J7lll0l0p6p6q0q0o1j5L8L8j0n5m1m1
1160A431k1K4P6J21J21P6pn4k7k8L2P6N2N1NMNNm6m6m5m6J6J6l1p7p9l3j6j7J4J3J3J3qpq
1155A568qk7k6k7k7qpqqONN1N1M6M5%%j3j3j4j3MMk5K1N2Om0m1JJJJJ0J1J0J1jjp3p4n0mM5
$$ y = [1767, 1738, 1709, 1663, 1618, 1573, 1527, 1480, 1433, 1431, 1430, 1422, 1414, 1406, 1398, 1361, 1325, 1263, 1246, 1266, 1285, 1307, 1330, 1363, 1397, 1431, 1465, 1492, 1520, 1547, 1574, 1560, 1546, 1535, 1523, 1539, 1601, 1663, 1679, 1662, 1645, 1625, 1605, 1559, 1514, 1488, 1508, 1572, 1635, 1681, 1682, 1670, 1657, 1667, 1631, 1581, 1532, 1525, 1517, 1536, 1556, 1575, 1594, 1607, 1620, 1634, 1647, 1618, 1589, 1579, 1615, 1648, 1680, 1670, 1659, 1605, 1550, 1516, 1527, 1581, 1636, 1648, 1660, 1649, 1638, 1627, 1615, 1576, 1536, 1542, 1548, 1571, 1594, 1616, 1639, 1620, 1601, 1628, 1654, 1634, 1614, 1594, 1574, 1560, 1546, 1531, 1517, 1484, 1450, 1462, 1474, 1522, 1570, 1618, 1666, 1723, 1780, 1817, 1809, 1762, 1715, 1743, 1816, 1889, 1917, 1867, 1817, 1758, 1700, 1686, 1673, 1646, 1618, 1633, 1648, 1634, 1575, 1519, 1508, 1529, 1595, 1639, 1682, 1672, 1661, 1651, 1640, 1625, 1610, 1595, 1579, 1626, 1672, 1718, 1765, 1775, 1786, 1751, 1716, 1643, 1569, 1515, 1507, 1523, 1540, 1559, 1578, 1555, 1533, 1556, 1579, 1602, 1625, 1649, 1672, 1664, 1656, 1668, 1726, 1761, 1797, 1833, 1868, 1898, 1883, 1820, 1757, 1715, 1718, 1741, 1764, 1774, 1784, 1793, 1803, 1800, 1797, 1837, 1876, 1939, 1956, 1953, 1950, 1920, 1890, 1814, 1738, 1658, 1578, 1517, 1502, 1540, 1578, 1568, 1513, 1472, 1431, 1410, 1434, 1510, 1631, 1752, 1828, 1821, 1767, 1740, 1712, 1744, 1820, 1872, 1923, 1928, 1932, 1937, 1942, 1896, 1850, 1805, 1759, 1775, 1791, 1760, 1683, 1604, 1571, 1555, 1538, 1552, 1565, 1578, 1591, 1583, 1576, 1568, 1560, 1533, 1507, 1480, 1453, 1445, 1438, 1430, 1422, 1428, 1433, 1484, 1535, 1581, 1626, 1626, 1626, 1613, 1600, 1586, 1573, 1577, 1581, 1556, 1577, 1629, 1635, 1595, 1554, 1555, 1556, 1557, 1558, 1568, 1579, 1589, 1600, 1599, 1598, 1525, 1451, 1401, 1397, 1442]
1150A442M6M3M3M3M3P0P0N1Nl8l7l8l7n0mJ5J6m8m7m5m5j8K7KJJ0J1L5rn4n3n6n6l9l8OPj0
1145A264j0L6L5O9O8O9O9O9O9R1M6k7p2n0n0l7l6RRL9M0L7L6N4Qm2m2o8o9m8lK3K4K6K7N1
1141A714N1Km5o6o6k3k4k2k2m9kK1K1N0Mm6m6p4k8L0L0L3L3L6L6j0j0j0j1n3n3m4JN1N2L5
1137A496L6L5L5K5K5K5K5m4m4LM9Ql7n4n4k6k6oM0L6L6oprrn5n5k8k7k5k5M2Q7O1O2OPPPL2
1132A648L2j3j3K4K3K4K3KKKJm0m0l8l8PN2O8O8P0no6o5k2K3klLLLKK0K0%m6l6l7l9l9j6j5
1127A547j6j6l3l3l0l0o1j6O1O2O1J4nnJ3J3J3J3J9J9J8J9L1L1K8K8N7J2m4q9n8n9j6j6K5
1122A557K4K5K4j1j2rqj4L1N2N1J%m5m5o1o0j5j5k2k2K6P1P1K5QRk2k1k1k1M6M5M6M6J4J5
1118A763l1l1l6l6l7l6K6K5K5K6MMMMl4l3J3J2l3l4l3l4J1J1J1J1OOLML7qn9n8k2k2m7kL0
$$ y = [1442, 1488, 1531, 1574, 1617, 1660, 1730, 1800, 1851, 1856, 1818, 1781, 1743, 1706, 1656, 1652, 1667, 1683, 1635, 1588, 1543, 1498, 1480, 1507, 1509, 1510, 1520, 1531, 1566, 1557, 1503, 1450, 1394, 1338, 1299, 1261, 1267, 1274, 1264, 1254, 1290, 1325, 1394, 1462, 1531, 1600, 1669, 1738, 1829, 1875, 1848, 1776, 1726, 1676, 1639, 1603, 1612, 1621, 1660, 1700, 1737, 1773, 1827, 1835, 1793, 1751, 1683, 1614, 1566, 1563, 1586, 1610, 1636, 1663, 1714, 1765, 1767, 1722, 1656, 1590, 1567, 1543, 1521, 1499, 1450, 1448, 1469, 1490, 1540, 1544, 1498, 1452, 1378, 1350, 1380, 1410, 1443, 1476, 1512, 1548, 1538, 1528, 1518, 1507, 1454, 1401, 1357, 1358, 1409, 1461, 1496, 1532, 1567, 1602, 1627, 1652, 1677, 1702, 1658, 1614, 1617, 1666, 1674, 1637, 1583, 1529, 1503, 1477, 1471, 1511, 1547, 1583, 1577, 1570, 1561, 1552, 1497, 1442, 1414, 1387, 1362, 1337, 1379, 1466, 1527, 1589, 1595, 1602, 1609, 1616, 1648, 1680, 1667, 1654, 1678, 1701, 1725, 1748, 1750, 1752, 1754, 1755, 1715, 1675, 1637, 1599, 1606, 1658, 1726, 1794, 1864, 1859, 1793, 1728, 1706, 1729, 1727, 1724, 1727, 1730, 1733, 1735, 1755, 1775, 1775, 1729, 1693, 1656, 1617, 1578, 1562, 1547, 1531, 1515, 1482, 1449, 1419, 1389, 1328, 1312, 1373, 1435, 1496, 1510, 1505, 1500, 1513, 1526, 1539, 1552, 1571, 1590, 1608, 1627, 1658, 1689, 1717, 1745, 1802, 1814, 1770, 1681, 1623, 1564, 1548, 1532, 1557, 1581, 1606, 1630, 1619, 1607, 1598, 1590, 1576, 1607, 1659, 1710, 1711, 1711, 1666, 1621, 1560, 1500, 1485, 1470, 1448, 1426, 1452, 1523, 1594, 1619, 1627, 1636, 1614, 1593, 1572, 1551, 1597, 1642, 1688, 1734, 1748, 1763, 1732, 1701, 1665, 1629, 1592, 1556, 1582, 1607, 1632, 1658, 1662, 1666, 1670, 1674, 1640, 1607, 1620, 1632, 1599, 1565, 1532, 1498, 1509, 1520, 1531, 1542, 1548, 1554, 1557, 1561, 1598, 1590, 1531, 1473, 1451, 1429, 1382, 1380, 1410]
1113A410L0m1m1MM9K4K3J9J9J9J9j1j1L5L4M3M3kkPPj2n8m7m7jjJ3N9L3L3J4J4L9oo6o6MM
1108A586j9o4o5j9LKK3O8O6K0k7k7jjkjK0K1K0K1K4K5K2K2Jm5o1o2l0J5j0j1m7m7k8J8N7N7
1104A524M0om2m1%JL0K9K6K7pn2o8o7K8J03Q6M1MMJJLLLLKLLLo3o2o2o3J0J0RJ0llklj7j7
1098A429K8K9LLLLk0j9K3K3j1n6n6j0J8J9k4k3OOM9M9L8qk8k8onllJ1N5P3P3j1n7j04j04j08
1094A257o3j2j2J2J2N7N8M5M5M5M6M4M5j%m0m0l6l7lM3J7J7l4l4n9j4L4L4L8L7OON1N2O6O7
1089A749O4O4k1o6m0m1n7n8j00j00o6j9L5Q1Q2Q3L9M0k3k3k2k3llllJ3J3on2m9m9kM4O5O4
1085A607K0k5k8J8L5L5l1l2k9k8j8K7M8M7j2j3L3L4K7K8K4K5jm7o3o4l4J1j5j5k9k9k9k9J0
1080A458J0l6l5j7j7K9K9M4M5M4M4K1K1K1K0K6K5K5K5m6m7m7m6j0j0rj0j2j3j2j3m5m5%Jk2
$$ y = [1410, 1440, 1399, 1358, 1362, 1411, 1435, 1458, 1477, 1496, 1515, 1534, 1523, 1512, 1547, 1581, 1624, 1667, 1665, 1663, 1670, 1677, 1665, 1607, 1560, 1513, 1512, 1511, 1524, 1583, 1616, 1649, 1663, 1677, 1716, 1710, 1644, 1578, 1582, 1586, 1567, 1503, 1438, 1419, 1422, 1424, 1447, 1515, 1581, 1601, 1574, 1547, 1546, 1545, 1543, 1542, 1562, 1583, 1603, 1624, 1648, 1673, 1695, 1717, 1718, 1673, 1612, 1550, 1520, 1535, 1525, 1514, 1467, 1420, 1392, 1410, 1467, 1524, 1564, 1558, 1516, 1475, 1475, 1476, 1506, 1535, 1561, 1588, 1581, 1529, 1461, 1394, 1422, 1525, 1611, 1652, 1656, 1660, 1661, 1662, 1665, 1668, 1671, 1674, 1676, 1679, 1682, 1685, 1622, 1560, 1498, 1435, 1445, 1455, 1464, 1474, 1471, 1468, 1466, 1463, 1446, 1429, 1457, 1486, 1489, 1492, 1495, 1498, 1478, 1459, 1482, 1505, 1494, 1438, 1382, 1372, 1390, 1409, 1385, 1362, 1368, 1374, 1423, 1472, 1510, 1502, 1474, 1446, 1440, 1435, 1432, 1429, 1440, 1495, 1568, 1641, 1630, 1573, 1469, 1365, 1257, 1194, 1182, 1170, 1182, 1194, 1251, 1309, 1354, 1399, 1444, 1490, 1534, 1579, 1578, 1578, 1538, 1498, 1462, 1425, 1422, 1465, 1482, 1499, 1465, 1431, 1372, 1358, 1392, 1426, 1464, 1501, 1507, 1513, 1564, 1616, 1682, 1749, 1813, 1877, 1856, 1790, 1750, 1709, 1652, 1594, 1494, 1394, 1328, 1309, 1344, 1425, 1507, 1590, 1629, 1669, 1646, 1623, 1601, 1578, 1575, 1572, 1569, 1566, 1579, 1592, 1586, 1534, 1485, 1436, 1434, 1478, 1543, 1607, 1627, 1602, 1574, 1592, 1627, 1662, 1631, 1599, 1570, 1542, 1524, 1551, 1599, 1646, 1634, 1621, 1654, 1688, 1715, 1743, 1767, 1792, 1791, 1744, 1681, 1617, 1583, 1594, 1579, 1564, 1535, 1506, 1477, 1448, 1458, 1468, 1432, 1397, 1380, 1363, 1392, 1421, 1465, 1510, 1554, 1598, 1619, 1640, 1661, 1681, 1707, 1732, 1757, 1782, 1736, 1689, 1642, 1596, 1586, 1576, 1567, 1557, 1545, 1532, 1520, 1507, 1462, 1417, 1417, 1418, 1396]
1076A396k1jM4K6K6K8K9j0j0j0j0J8J8J9J8J5J5qpL0K9P3P2J01N6NNQPj5j5j8j8o1o1n9j3
1072A701L7L7K9K8j6j7LMM8M9ONj8j7LLk0j9k5k4k5k4OOM6M7L3m2j03j03k8J8O5O6P5L0j7
1067A847j7k0K6K6k0l3l3RJ0j7j7j7j7rqrqL2L3L2L3ONRl7m2m2K8K8rn5k9l0J0RRRl0l0l6
1062A596J0K2k3l7l7k4K1M3Q9J15P0k2r9o9k3K2K2QQK8K8J4l1n2n1k2k2j9j9mM2N9N8k4p0
1058A607q9r0k1k1JKRJ0j1j0rL7N7N7L6L7j0rk5k5k6k5k2k2K8P4P4P5P5P4L6j0k9l0o6o6m4
1053A629m3RRN2N2K1k3m4m3j6j6j6j7QPQQJJKJL8L9J8k7m1m1JKMNj8j8j0j0j0j0J6J5J5J5
1048A573j8j9j8j9l4l5mP2J01N6J1J1k7k8k7k7M2M3K3k3%%M2M3J9J9jm6n2n2rj0k3k3k4k3
1044A513OOOOQQQQK4K3k2k1l0k9opK0J9K0J9J3J2J2J2J4J4J3J4J5J5L8L7O3O3j8o3p4p3p4
$$ y = [1396, 1375, 1374, 1418, 1444, 1470, 1498, 1527, 1517, 1507, 1497, 1487, 1505, 1523, 1542, 1560, 1575, 1590, 1582, 1575, 1605, 1634, 1707, 1779, 1880, 1936, 1941, 1946, 1954, 1961, 1946, 1931, 1913, 1895, 1834, 1773, 1714, 1701, 1738, 1775, 1804, 1832, 1816, 1799, 1802, 1806, 1854, 1903, 1909, 1914, 1896, 1879, 1882, 1885, 1865, 1846, 1821, 1797, 1772, 1748, 1754, 1760, 1806, 1853, 1886, 1844, 1741, 1638, 1610, 1628, 1693, 1759, 1834, 1864, 1847, 1830, 1810, 1836, 1862, 1842, 1809, 1776, 1785, 1795, 1778, 1761, 1744, 1727, 1718, 1710, 1701, 1693, 1725, 1758, 1790, 1823, 1829, 1834, 1843, 1806, 1764, 1722, 1750, 1778, 1769, 1714, 1685, 1655, 1665, 1674, 1683, 1692, 1662, 1632, 1596, 1606, 1628, 1605, 1568, 1531, 1507, 1528, 1571, 1660, 1775, 1845, 1823, 1724, 1655, 1632, 1654, 1676, 1684, 1692, 1720, 1748, 1762, 1731, 1679, 1628, 1606, 1584, 1565, 1546, 1542, 1584, 1643, 1701, 1677, 1607, 1518, 1428, 1407, 1386, 1387, 1389, 1398, 1408, 1397, 1387, 1378, 1415, 1472, 1529, 1565, 1602, 1592, 1583, 1558, 1533, 1507, 1482, 1460, 1438, 1466, 1540, 1614, 1689, 1764, 1838, 1874, 1864, 1835, 1805, 1739, 1673, 1629, 1586, 1595, 1604, 1656, 1708, 1729, 1706, 1662, 1619, 1603, 1587, 1571, 1554, 1562, 1569, 1577, 1585, 1586, 1587, 1589, 1590, 1628, 1667, 1685, 1658, 1617, 1576, 1577, 1579, 1583, 1588, 1570, 1552, 1542, 1532, 1522, 1512, 1528, 1543, 1558, 1573, 1555, 1536, 1518, 1499, 1465, 1430, 1426, 1498, 1599, 1655, 1666, 1677, 1650, 1622, 1595, 1568, 1610, 1653, 1676, 1653, 1653, 1653, 1695, 1738, 1757, 1776, 1775, 1729, 1677, 1625, 1616, 1606, 1583, 1560, 1536, 1513, 1519, 1525, 1531, 1537, 1545, 1553, 1561, 1569, 1593, 1616, 1594, 1573, 1543, 1514, 1508, 1501, 1521, 1540, 1560, 1579, 1592, 1604, 1616, 1628, 1642, 1656, 1669, 1683, 1698, 1713, 1751, 1788, 1851, 1914, 1896, 1833, 1759, 1686, 1612]
1039A612p3k4K1L8L9mm9o6o7j3L2P7L2l5l4j5j5K6K6M5M6K4k2j8j9L0L0j6j5popoj6j5j5j5
1035A506J1J0J0J0l4l4J1J1OONOQRQRM1M1M2M1L4L4j1j1l1l0qqJ7J7J7J7j4j3l7l6l0l1J6
1030A615J5rrrrL9L8mmj9K6K6k0p3p4n6j1K4K4K7K8L0L0L0L0k6k5k5k5J6J7J6J7l4l4l4l4
1025A514LLLLk9l0J6J6K4K4K5K4j8j8j6j5M4Q9O6K2k5k5J8J8n2n3poj4j4j7K9M4M4JJrj0l3
1021A640l2K7K7NMJJM4M4on1k5k5K6K7N0N0M8M8K8j7n0n0n2n3n7n6l7RL7L6qn4q6m2QN4N3
1016A566Pj0rm1m0k0K6J8J9k1k1PN2K7K7ppk9l0MMN0M9L8L7rqJ5J6l2p8j01n7qrJ8J9J9J8
1011A499k7k7k5k4K7P2P2K7L5L4N8J2k4k4k7k7j4j5L1L1l3l3l4l3PQN3N3N3N3QPk5k5k5k5
1007A673m0l9l9m0mlmmMNN0N0j7j7m3Lj4j5j1j2J7J7J7J7k2k2k2k2j2j1L4L4qpqpk4k3K2K3
$$ y = [1612, 1539, 1515, 1536, 1574, 1613, 1609, 1560, 1494, 1427, 1414, 1446, 1523, 1555, 1520, 1486, 1471, 1456, 1482, 1508, 1553, 1599, 1623, 1601, 1583, 1564, 1594, 1624, 1608, 1593, 1586, 1580, 1573, 1567, 1551, 1536, 1521, 1506, 1517, 1527, 1537, 1547, 1513, 1479, 1490, 1501, 1507, 1513, 1518, 1524, 1532, 1541, 1549, 1558, 1599, 1640, 1682, 1723, 1757, 1791, 1780, 1769, 1738, 1708, 1700, 1692, 1709, 1726, 1743, 1760, 1746, 1733, 1696, 1660, 1630, 1599, 1615, 1630, 1621, 1612, 1603, 1594, 1633, 1671, 1667, 1663, 1644, 1670, 1696, 1676, 1603, 1529, 1473, 1462, 1486, 1510, 1537, 1565, 1595, 1625, 1655, 1685, 1659, 1634, 1609, 1584, 1600, 1617, 1633, 1650, 1616, 1582, 1548, 1514, 1517, 1520, 1523, 1526, 1497, 1467, 1483, 1499, 1523, 1547, 1572, 1596, 1578, 1560, 1544, 1529, 1573, 1662, 1728, 1750, 1725, 1700, 1718, 1736, 1684, 1631, 1624, 1618, 1604, 1590, 1573, 1602, 1646, 1690, 1691, 1692, 1683, 1673, 1640, 1608, 1635, 1662, 1667, 1671, 1672, 1673, 1717, 1761, 1755, 1704, 1679, 1654, 1680, 1707, 1757, 1807, 1855, 1903, 1931, 1914, 1864, 1814, 1762, 1709, 1652, 1596, 1559, 1568, 1605, 1641, 1633, 1579, 1493, 1451, 1459, 1513, 1566, 1573, 1563, 1554, 1513, 1473, 1453, 1479, 1497, 1516, 1495, 1474, 1481, 1533, 1560, 1587, 1580, 1573, 1544, 1514, 1518, 1522, 1572, 1621, 1659, 1696, 1687, 1679, 1694, 1710, 1678, 1600, 1499, 1442, 1434, 1425, 1443, 1462, 1481, 1499, 1472, 1445, 1420, 1396, 1423, 1495, 1567, 1594, 1629, 1663, 1721, 1733, 1709, 1685, 1658, 1631, 1617, 1602, 1633, 1664, 1631, 1598, 1564, 1531, 1538, 1546, 1599, 1652, 1705, 1758, 1766, 1773, 1748, 1723, 1698, 1673, 1633, 1594, 1555, 1515, 1511, 1508, 1504, 1500, 1504, 1509, 1559, 1609, 1592, 1575, 1532, 1535, 1521, 1506, 1495, 1483, 1500, 1517, 1534, 1551, 1529, 1507, 1485, 1463, 1451, 1440, 1474, 1508, 1500, 1493, 1485, 1478, 1454, 1431, 1453, 1476]
1002A476M6M5M4M3Km4j8j8OONOK0J9K0J9l4l5o0j5K7K7K7K7J6k9p5k9J3J3J6J6NMNNk7k7J6
997A563J6K4k1o8o9j4L1L1j5m0m0m2m3%%J%L2L1P7P7M5M5M2M2L6rn9o0n0m9l0J5N2N1K2n5
993A569q8q9m2KN1N0N3N3K8K9j9o4p7l1j4j4ONP9P9Q1L5j5j5PQPQl4l4l4l4k0k0L0P6L1L1
988A674L2L1K1k5m5m5llllj2j3j2j3ppppK7K7K7K7K6K6j7j7j3L2L2j3l5l5QPmmn0n0k3k3J9
983A527K0K2k2m3m3KKKKl8l8l7l8k1k0N2N3N9J3l4l4l0J5L4L5Q4Q3Q7M1l7l7m0l9m3m3o3o3
978A370j9K7M7M6pqL5L6k4o9m4m3k7k7qL9M2M2jjklM3M3j3j2L0L0K6j9k0j9K1k4p4p4l0k9
974A280opK9K9P4P4M8M9K6K5PPL0K9L2L1j4j4ooooj0j0j0j0J%%%k0k0m0m0m9mM7M7N9N9J4
969A719J3lmL9M0K8j7l7l7k0k0k0k0l7l7j7K8N9N8J5J6nok8k8j9j9K4K4mn0m8m7j5j6j5j5
$$ y = [1476, 1522, 1567, 1611, 1654, 1656, 1612, 1594, 1576, 1582, 1588, 1593, 1599, 1619, 1638, 1658, 1677, 1643, 1608, 1548, 1533, 1560, 1587, 1614, 1641, 1657, 1628, 1553, 1524, 1537, 1550, 1566, 1582, 1587, 1591, 1596, 1601, 1574, 1547, 1563, 1579, 1603, 1582, 1514, 1445, 1431, 1462, 1493, 1478, 1438, 1398, 1356, 1313, 1313, 1313, 1314, 1314, 1346, 1377, 1454, 1531, 1576, 1621, 1663, 1705, 1741, 1732, 1673, 1613, 1563, 1514, 1484, 1499, 1551, 1602, 1624, 1569, 1481, 1392, 1350, 1352, 1403, 1453, 1506, 1559, 1587, 1616, 1597, 1533, 1456, 1425, 1411, 1397, 1403, 1408, 1487, 1566, 1647, 1682, 1667, 1652, 1659, 1667, 1674, 1682, 1648, 1614, 1580, 1546, 1526, 1506, 1536, 1612, 1643, 1674, 1706, 1737, 1758, 1733, 1688, 1643, 1640, 1637, 1634, 1631, 1619, 1606, 1594, 1581, 1574, 1567, 1560, 1553, 1580, 1607, 1634, 1661, 1687, 1713, 1696, 1679, 1666, 1698, 1730, 1717, 1682, 1647, 1655, 1662, 1658, 1654, 1604, 1554, 1531, 1508, 1527, 1547, 1569, 1547, 1504, 1461, 1463, 1465, 1467, 1469, 1431, 1393, 1356, 1318, 1297, 1277, 1329, 1382, 1441, 1454, 1420, 1386, 1356, 1371, 1405, 1440, 1524, 1607, 1694, 1735, 1698, 1661, 1621, 1582, 1539, 1496, 1433, 1370, 1351, 1378, 1425, 1471, 1464, 1456, 1491, 1527, 1503, 1434, 1390, 1347, 1320, 1293, 1285, 1324, 1366, 1408, 1407, 1406, 1404, 1401, 1444, 1487, 1474, 1462, 1492, 1522, 1548, 1529, 1509, 1490, 1511, 1487, 1413, 1339, 1309, 1280, 1274, 1267, 1296, 1325, 1399, 1473, 1521, 1570, 1596, 1621, 1628, 1635, 1665, 1694, 1726, 1757, 1743, 1729, 1723, 1717, 1711, 1705, 1695, 1685, 1675, 1665, 1666, 1666, 1666, 1666, 1646, 1626, 1586, 1546, 1497, 1493, 1540, 1587, 1646, 1705, 1719, 1732, 1729, 1725, 1764, 1804, 1832, 1815, 1778, 1741, 1721, 1701, 1681, 1661, 1624, 1587, 1570, 1598, 1657, 1715, 1730, 1746, 1741, 1735, 1707, 1679, 1660, 1641, 1665, 1689, 1685, 1635, 1587, 1540, 1525, 1509, 1494, 1479]
964A479K6K6K6K6L6L5rj0l3l2j3L3N1N1Mm1k7k7m9m9m3KK2K3J8J8J9J8nnnoL1L0L0L1J01J01
960A883O7qm9m9p4p4o5j9L1L1M6M7K7j9m5m5lkmllml0l0k7k7l0J6O3O3M1mjkL9L8J6J6m5m5
955A717m5m5l9m0l7l6k1K5j%j0rj0rRJ0N2N2N5J0l8l8l4J2RR%%%JK8K8K8K8lmmlj2j2j2j3
949A598k7k7J9J8L6L5j2n7l8QK5K5k9k9k9k9J2J3J0J0J7k9%jK5P0P1K5k4k3k6k7q3q3l7l7
945A370j1j1L6Q2O7K0MML1L1L1L1poppppopK7K7K7K7J6J5J6J6J4J4J4J4PQj0n5n6j0L7L8O4
940A881O3Q7M1k8p4n2n1m8m7k8J8M1M1l3l2k8k8k9k8MMNMN1N0P7L0J9J8J3J3J5l1l1J5L3L3
936A988L7L6k4k3k1k1m4KN2N1J2J2J2J2j3j3j3j2OOOOJ7J7J7J7J7J7J7J7k2k3k2k2mlL9L9
931B172K7j8o9o9n1n2ooJ4J4j2L4L7L8M1M0l7l7l8l7m6m5p2k6QRL9opM0J1J0J5J4J4J5l5l5
$$ y = [1479, 1505, 1531, 1557, 1583, 1619, 1654, 1645, 1635, 1602, 1570, 1557, 1590, 1641, 1692, 1696, 1655, 1628, 1601, 1552, 1503, 1460, 1462, 1484, 1507, 1525, 1543, 1562, 1580, 1575, 1570, 1565, 1559, 1590, 1620, 1650, 1681, 1782, 1883, 1950, 1942, 1893, 1844, 1770, 1696, 1631, 1612, 1643, 1674, 1720, 1767, 1794, 1775, 1730, 1685, 1682, 1680, 1676, 1673, 1670, 1666, 1636, 1606, 1579, 1552, 1522, 1538, 1601, 1664, 1705, 1701, 1700, 1698, 1737, 1775, 1791, 1807, 1762, 1717, 1672, 1627, 1588, 1548, 1511, 1475, 1454, 1479, 1478, 1478, 1468, 1459, 1449, 1440, 1449, 1459, 1511, 1563, 1618, 1628, 1590, 1552, 1518, 1530, 1539, 1548, 1548, 1548, 1548, 1549, 1577, 1605, 1633, 1661, 1658, 1654, 1650, 1647, 1635, 1623, 1611, 1598, 1571, 1544, 1563, 1581, 1617, 1652, 1640, 1583, 1545, 1553, 1578, 1603, 1574, 1545, 1516, 1487, 1499, 1512, 1522, 1532, 1549, 1520, 1520, 1519, 1544, 1614, 1685, 1710, 1686, 1663, 1637, 1610, 1527, 1444, 1407, 1370, 1359, 1348, 1384, 1466, 1533, 1553, 1557, 1561, 1592, 1623, 1654, 1685, 1678, 1672, 1665, 1658, 1651, 1644, 1638, 1631, 1658, 1685, 1712, 1739, 1755, 1770, 1786, 1802, 1816, 1830, 1844, 1858, 1865, 1873, 1863, 1808, 1752, 1742, 1779, 1817, 1881, 1944, 2031, 2072, 2044, 1970, 1918, 1867, 1819, 1772, 1744, 1762, 1803, 1844, 1811, 1779, 1751, 1723, 1694, 1666, 1670, 1674, 1679, 1683, 1734, 1784, 1861, 1891, 1910, 1928, 1941, 1954, 1969, 1938, 1907, 1922, 1955, 1988, 2025, 2061, 2037, 2014, 1993, 1972, 1928, 1930, 1982, 2033, 2045, 2057, 2069, 2081, 2068, 2055, 2042, 2030, 2036, 2042, 2048, 2054, 2071, 2088, 2105, 2122, 2139, 2156, 2173, 2190, 2168, 2145, 2123, 2101, 2097, 2094, 2133, 2172, 2199, 2181, 2112, 2043, 1992, 1940, 1934, 1928, 1942, 1956, 1944, 1978, 2015, 2053, 2094, 2134, 2097, 2060, 2022, 1985, 1939, 1894, 1822, 1796, 1804, 1813, 1852, 1846, 1839, 1879, 1890, 1900, 1915, 1929, 1943, 1958, 1923, 1888]
926A888l5l5K4K4K4K4N6N5Q1L5l1l2l4l4n4n3n3n3J5J6J5J6M9N0M6M7J2l3qqJ%JJQQRQk8k8
921A994n3qM5M4lm8k5k5J8J8L7L6L7L7L6L7L4L3L3j4l3l3l8l8o1o1n4n5l1l2J6J6mn0p6p6
917A653k8J7M8M8M9M8J8k7mmK4k2o8o9o3j8L3L2M1M0l5l5JKk1k2k8k9ooM3M4K3k2l2l1J0J1
912A615L4L4rrj0L6N5N6K2K2O7O7J11J10J34J33J45J45K26K71K55K56J79J80J64J19O8l9j36
909D301j36j47j48k22k99l22k77j98j23n6n6n8n9n9n9m2m3LMoorL6M4M4k7k6qL7L7qMMKJr
904B114rrrm5m6k2k3k4k5mM0L4L3J4J3J0J0N6N5K9K8OOK5K4KJm6m6m9mL8L8M1M1O9O9O9O9
900B573L2L1L2L2J3J2J3J3K0K1M6%n3n3n9j3J9K0M2Q7Q3Q2M0L9J4J4J4J4J1J1J1J1k9k9k8
895C086k9L3L3L3L3J6J6k9k9OPm1q6q4l9RRJ6J6k9k9l4l4l3l4j8j7j8j7rrrrl7l8ONJ0l6n2
$$ y = [1888, 1853, 1818, 1842, 1866, 1890, 1914, 1970, 2025, 2106, 2141, 2110, 2078, 2044, 2010, 1956, 1903, 1850, 1797, 1812, 1828, 1843, 1859, 1908, 1958, 2004, 2051, 2063, 2030, 2022, 2014, 2015, 2015, 2016, 2017, 2025, 2033, 2042, 2050, 2022, 1994, 1941, 1933, 1978, 2022, 2019, 1971, 1946, 1921, 1939, 1957, 1994, 2030, 2067, 2104, 2140, 2177, 2211, 2244, 2277, 2263, 2230, 2197, 2159, 2121, 2060, 1999, 1945, 1890, 1859, 1827, 1843, 1859, 1855, 1805, 1729, 1653, 1625, 1642, 1690, 1738, 1787, 1835, 1853, 1826, 1822, 1818, 1842, 1820, 1752, 1683, 1620, 1602, 1635, 1667, 1708, 1748, 1713, 1678, 1679, 1681, 1660, 1638, 1610, 1581, 1575, 1569, 1612, 1656, 1679, 1657, 1625, 1594, 1604, 1615, 1649, 1683, 1674, 1665, 1655, 1691, 1746, 1802, 1824, 1846, 1913, 1980, 2091, 2201, 2335, 2468, 2613, 2758, 2984, 3255, 3510, 3766, 3945, 4125, 4289, 4408, 4476, 4437, 4301, 4165, 4018, 3870, 3648, 3349, 3027, 2750, 2552, 2429, 2373, 2317, 2259, 2200, 2141, 2082, 2040, 1997, 2000, 2004, 1998, 1992, 1983, 2019, 2063, 2107, 2080, 2054, 2046, 2083, 2120, 2112, 2116, 2120, 2122, 2123, 2114, 2105, 2096, 2087, 2042, 1996, 1974, 1951, 1927, 1902, 1898, 1938, 1972, 2005, 2019, 2032, 2042, 2052, 2108, 2163, 2192, 2220, 2226, 2232, 2257, 2281, 2283, 2284, 2238, 2192, 2143, 2139, 2177, 2215, 2256, 2297, 2366, 2435, 2504, 2573, 2605, 2636, 2668, 2700, 2713, 2725, 2738, 2751, 2771, 2792, 2838, 2838, 2785, 2732, 2673, 2660, 2679, 2699, 2741, 2828, 2911, 2993, 3033, 3072, 3086, 3100, 3114, 3128, 3139, 3150, 3161, 3172, 3143, 3114, 3086, 3057, 3090, 3123, 3156, 3189, 3205, 3221, 3192, 3163, 3169, 3176, 3135, 3049, 2965, 2926, 2935, 2944, 2960, 2976, 2947, 2918, 2884, 2850, 2817, 2783, 2765, 2748, 2730, 2713, 2704, 2695, 2686, 2677, 2640, 2602, 2608, 2613, 2623, 2587, 2535]
890B535n3L5Q1N8J3j0j0rn6o2o3k0k1k1k2k2k1k2k1k2k2j5j5l2p8r5m9kkk0j9j9j9m1m0ON
886A810K3K2K3K2llm8m9n5n6j1j0rj0rrk2k2K4K3L7L7L7L7N6N6L6j0l8l7m1m1j0rj0ro1o1
881A600j0L5L7L8M0M0k4k5k4k4m1m0MNK1K1K1K1qpqpk2k2K4K4L0L0K8K7M8Kj8j8k3k3k3k2
877A707L4L4rqPN3N3PJKKJj1L3N4N4L2L2J2l4p3p2k6K0lmm3m3j1L5N5N5l2l2l3l2k8k7J7J8
872A797jjjkr4r5l2M5J02J03J07J07P0P0K5K5k9k9l2l2j7o3o3j7N2N1J0Rl3l2l0l0J5O0Q5
867B100J31J24J24P7L1M8M7M5M5P5P5P5P6Q1Q0J27J26J04J04N8N8P8P8P8P9J00J01J47J46
864D618J02J02J02J01R2R1R2R1J59J58J59J59J36J37J79J79J93J48J30J31J83K28K03K02J81
861H256J81J05J05J33J33J34J33J19J20J20J20R9R9J42J43J09O5M7M7Q5J31J83K28K09J64
$$ y = [2535, 2482, 2517, 2598, 2656, 2669, 2659, 2649, 2640, 2584, 2522, 2459, 2439, 2418, 2397, 2375, 2353, 2332, 2310, 2289, 2267, 2245, 2230, 2215, 2183, 2105, 2010, 1961, 1959, 1957, 1937, 1918, 1899, 1880, 1839, 1799, 1805, 1810, 1833, 1855, 1878, 1900, 1897, 1894, 1846, 1797, 1742, 1686, 1675, 1665, 1656, 1646, 1637, 1628, 1606, 1584, 1608, 1631, 1668, 1705, 1742, 1779, 1835, 1891, 1927, 1917, 1879, 1842, 1801, 1760, 1750, 1741, 1731, 1722, 1661, 1600, 1590, 1625, 1662, 1700, 1740, 1780, 1756, 1731, 1707, 1683, 1642, 1602, 1606, 1611, 1632, 1653, 1674, 1695, 1687, 1680, 1672, 1665, 1643, 1621, 1645, 1669, 1699, 1729, 1757, 1784, 1832, 1834, 1816, 1798, 1775, 1752, 1729, 1707, 1741, 1775, 1766, 1758, 1765, 1818, 1871, 1878, 1879, 1881, 1883, 1884, 1873, 1906, 1960, 2014, 2046, 2078, 2090, 2056, 1983, 1911, 1885, 1905, 1902, 1898, 1855, 1812, 1801, 1836, 1891, 1946, 1914, 1882, 1849, 1817, 1789, 1762, 1779, 1797, 1796, 1795, 1794, 1792, 1698, 1603, 1571, 1616, 1718, 1821, 1928, 2035, 2105, 2175, 2200, 2225, 2196, 2167, 2135, 2103, 2086, 2023, 1960, 1943, 1995, 2046, 2056, 2065, 2032, 2000, 1970, 1940, 1955, 2015, 2100, 2231, 2355, 2479, 2556, 2587, 2635, 2682, 2727, 2772, 2847, 2922, 2997, 3073, 3154, 3234, 3361, 3487, 3591, 3695, 3753, 3811, 3889, 3967, 4045, 4124, 4224, 4325, 4472, 4618, 4720, 4822, 4924, 5025, 5117, 5208, 5300, 5391, 5550, 5708, 5867, 6026, 6162, 6299, 6478, 6657, 6850, 6998, 7128, 7259, 7442, 7670, 7873, 8075, 8256, 8437, 8542, 8647, 8780, 8913, 9047, 9180, 9299, 9419, 9539, 9659, 9758, 9857, 9999, 10142, 10251, 10316, 10363, 10410, 10495, 10626, 10809, 11037, 11246, 11410]
858A1410J89J90J70J25M0oJ4J4J1J1k5k4k5k5o4o3q4j29j98j99j81j35o8o7j15j61j51j52
854A0302j09j09j27j28j28j28j45j44j45j44j71j71j71j71j31j32j06j51j83j83j40j40j05
852G040j05q6l9m4m4q6q6o0n9n9o0l5l4n5j00j58j57j10o4m7m6jjqn3p3p3r2r1j14o8JM7O6
847E046O7N9J3l8q4q2l5J1J2j6j6j6j6K2K2K2K2m2m2k3K3JJMLK6K6M5R1J23J22J26J25J02
843E704J02J02J02J34J35J38J37K02K48K22K22K39K39K84K85L31L32L96M71N27N28N58O03
840A2241O32P23P85Q31Q79Q79Q39Q39P67Q12R37J029J138J228J335J425J500J590J667J817
838C3893J981K133K269K420K571K723K914L065L157L203L203L157L099K948K870K869K898
836H1373K988L014L013K983K983L025L115L329L601L882M155M462M796N126N399N530N576
$$ y = [11410, 11599, 11789, 11959, 12084, 12124, 12118, 12132, 12146, 12157, 12168, 12143, 12119, 12094, 12069, 12005, 11942, 11858, 11729, 11531, 11332, 11151, 11016, 10948, 10881, 10766, 10605, 10454, 10302, 10193, 10084, 9957, 9829, 9701, 9573, 9428, 9284, 9139, 8995, 8824, 8653, 8482, 8311, 8180, 8048, 7942, 7791, 7608, 7425, 7285, 7145, 7040, 6935, 6849, 6810, 6766, 6722, 6636, 6550, 6490, 6431, 6372, 6312, 6277, 6243, 6188, 6088, 5930, 5773, 5663, 5599, 5552, 5506, 5505, 5504, 5496, 5443, 5370, 5297, 5205, 5114, 5000, 4932, 4933, 4980, 5046, 5113, 5172, 5185, 5147, 5063, 4981, 4946, 4957, 4969, 4953, 4937, 4921, 4905, 4927, 4949, 4971, 4993, 4951, 4909, 4886, 4909, 4910, 4911, 4915, 4918, 4944, 4970, 5015, 5106, 5229, 5351, 5477, 5602, 5704, 5806, 5908, 6010, 6144, 6279, 6417, 6554, 6756, 7004, 7226, 7448, 7687, 7926, 8210, 8495, 8826, 9158, 9554, 10025, 10552, 11080, 11638, 12241, 12873, 13596, 14381, 15212, 16091, 16970, 17809, 18648, 19415, 20227, 21164, 22193, 23331, 24559, 25894, 27319, 28819, 30409, 32076, 33893, 35874, 38007, 40276, 42696, 45267, 47990, 50904, 53969, 57126, 60329, 63532, 66689, 69788, 72736, 75606, 78475, 81373, 84361, 87375, 90388, 93371, 96354, 99379, 102494, 105823, 109424, 113306, 117461, 121923, 126719, 131845, 137244, 142774, 148350]
834A48350N502N351N105M893M658M386M009L555L078K743K494K342K197K106K020J974K002
832B06765K093K257K469K719L052L376L710L948M099M083L931L670L275K673J915R37j24j161
830B53687j979k509k781k915k915k868k656k409k136j913j700j431j218j000q49p87p88q70
827B19963j021j190j342j565j838k188k401k419k146j676j160j034j793l701o338q670r731
825A69750r374q131o713n591m735m099l673l401l311l266l274l274l313l312l300l345l496
823I4142l709l854l944l891l800l678l466l268l116k977k824k628k475k309k158k010j859
821D2176j722j631j492j402j302j210j159j158j229j229j240j240j134j135j048j048r93r47
819A9857r06q15p48o57n93n93n39n39m66m20l91l01k60k61l01l00k53k52k07k07j51j51j52
$$ y = [148350, 153852, 159203, 164308, 169201, 173859, 178245, 182254, 185809, 188887, 191630, 194124, 196466, 198663, 200769, 202789, 204763, 206765, 208858, 211115, 213584, 216303, 219355, 222731, 226441, 230389, 234488, 238571, 242502, 246172, 249447, 252120, 254035, 254972, 254848, 253687, 251708, 249199, 246418, 243503, 240588, 237720, 235064, 232655, 230519, 228606, 226906, 225475, 224257, 223257, 222408, 221621, 220833, 219963, 218942, 217752, 216410, 214845, 213007, 210819, 208418, 205999, 203853, 202177, 201017, 199983, 198190, 194489, 188151, 179481, 169750, 160376, 152245, 145532, 139941, 135206, 131107, 127434, 124033, 120722, 117456, 114182, 110908, 107595, 104283, 100983, 97638, 94142, 90433, 86579, 82635, 78744, 74944, 71266, 67800, 64532, 61416, 58439, 55615, 52987, 50512, 48203, 46045, 44035, 42176, 40454, 38823, 37331, 35929, 34627, 33417, 32258, 31100, 29871, 28642, 27402, 26162, 25028, 23893, 22845, 21797, 20804, 19857, 18951, 18136, 17388, 16731, 16138, 15545, 15006, 14467, 14001, 13581, 13190, 12889, 12629, 12368, 12067, 11767, 11514, 11262, 11055, 10848, 10697, 10546, 10394]
816A0394j51j86j85j86j85j12j13l6l7l5l6J0J0J22J22P6P7K9L0L0L0Q0P9J50J50R4Mj3L2
813A0244Q9J34J57J56K39K38K38K39J75J76J29J30J73J72K18K18J80J80P3P4Q1Q1J26J27J34
809A4181J34Q9Q9J06J05J06J06J53J52J53J53J58J58K04K04J68J69J44R8M1l4p1p0o9o8q9
806A6470j33j51j51j51j51j24p9MM9M0nk3k3J0J1l6l5q5q5q4q5j30j29j29j30j15j15j41r5
803A4199mmjjN3N3P8L3POJ%m4q9j37j37j24p8k9k8n9n8n6n6n3pJ2J2J4J3N9N9J08J08J08J08
798A4066Q5Q4Q5Q4L2L3L2L2POP1J46J84J84J14J13J05J06J06J06J26J27J24J24R1M5K6K5N9
795A6528N9J08J07J38J83K03K03K23K24K43J99J36O1j1n6j04j05q5q5j27j26k03k02j91j92
792A7128j68j69r4r4r5r4r8r8j43j44j50j49j73j72j67j68k12k13k78k77l23l24l61l61l15
$$ y = [10394, 10243, 10057, 9872, 9686, 9501, 9389, 9276, 9240, 9203, 9168, 9132, 9142, 9152, 9274, 9396, 9472, 9549, 9578, 9608, 9638, 9668, 9748, 9827, 9977, 10127, 10221, 10225, 10212, 10244, 10333, 10467, 10624, 10780, 11019, 11257, 11495, 11734, 11909, 12085, 12214, 12344, 12517, 12689, 12907, 13125, 13305, 13485, 13558, 13632, 13713, 13794, 13920, 14047, 14181, 14315, 14404, 14493, 14599, 14704, 14810, 14916, 15069, 15221, 15374, 15527, 15685, 15843, 16047, 16251, 16419, 16588, 16732, 16830, 16871, 16837, 16766, 16696, 16627, 16559, 16470, 16337, 16186, 16035, 15884, 15733, 15609, 15530, 15534, 15583, 15623, 15618, 15595, 15572, 15582, 15593, 15557, 15522, 15437, 15352, 15268, 15183, 15053, 14924, 14795, 14665, 14550, 14435, 14294, 14199, 14195, 14191, 14190, 14189, 14242, 14295, 14373, 14406, 14413, 14419, 14420, 14420, 14376, 14287, 14150, 14013, 13889, 13811, 13782, 13754, 13695, 13637, 13581, 13525, 13472, 13465, 13477, 13489, 13503, 13516, 13575, 13634, 13742, 13850, 13958, 14066, 14151, 14235, 14320, 14404, 14436, 14469, 14501, 14533, 14540, 14546, 14617, 14763, 14947, 15131, 15245, 15358, 15463, 15569, 15675, 15781, 15907, 16034, 16158, 16282, 16373, 16418, 16444, 16469, 16528, 16587, 16695, 16802, 16940, 17123, 17326, 17529, 17752, 17976, 18219, 18418, 18554, 18615, 18604, 18548, 18444, 18339, 18254, 18169, 18042, 17916, 17713, 17511, 17320, 17128, 16960, 16791, 16697, 16603, 16508, 16414, 16316, 16218, 16075, 15931, 15781, 15632, 15459, 15287, 15120, 14952, 14740, 14527, 14249, 13972, 13649, 13325, 12964, 12603, 12288]
789A2288l16k57k56k12k11j93j93j47j48j29j30j05n9k5N1J13J12J31N5j13l10m72n17m28
786H529l21k56k57j74j75j56j57k02k02j79j79j03j04q8q8o5o5q1q1j26j26o9p0m7m8l2l2
782E046p8p8j02j02l1l1n7j32j65j66j64j64j01k4K9L0m1m2n7n7l4l5o5o4m3m2l0l0l0l0k9
779C081k9k9k9k4k5k5k5j8j7K7K8K5K5LKn0n0k8k7j6j7PPK9L0K9K9O6O6O6O6L9M0L9L9L2L2
774C398L2L2Q6Q6Q6Q6K8K8j8j8J%K3K4M2M3M3M2M6M6%JL7L8Q3Q4K1K1kjK4K5P1P0J4J3l2l2
770D571PPL0K9QRL0L1Q0Q0J02J02J13J13J13J13J78J78K24K24K21K22K15L07L97L97M31M31
766H963M70N62O35P87R62J175J341J553J819K091K336K487K591K590K612K520K402K129J787
764D1812J394R55N00P2l23o69r42j104j195j159j053r10p43n31l04o5J02K82M48N98P05P65
$$ y = [12288, 11972, 11715, 11459, 11247, 11036, 10843, 10650, 10503, 10355, 10226, 10096, 9991, 9932, 9907, 9958, 10071, 10183, 10314, 10369, 10256, 9946, 9474, 8957, 8529, 8208, 7952, 7695, 7521, 7346, 7190, 7033, 6831, 6629, 6450, 6271, 6168, 6064, 5976, 5888, 5823, 5758, 5677, 5596, 5470, 5344, 5275, 5205, 5158, 5110, 5078, 5046, 4968, 4890, 4788, 4686, 4655, 4624, 4567, 4435, 4270, 4104, 3940, 3776, 3675, 3651, 3680, 3710, 3669, 3627, 3570, 3513, 3479, 3444, 3379, 3315, 3272, 3230, 3200, 3170, 3140, 3110, 3081, 3052, 3023, 2994, 2970, 2945, 2920, 2895, 2877, 2860, 2887, 2915, 2940, 2965, 2968, 2970, 2920, 2870, 2842, 2815, 2799, 2782, 2789, 2796, 2825, 2855, 2884, 2913, 2979, 3045, 3111, 3177, 3216, 3256, 3295, 3334, 3366, 3398, 3430, 3462, 3548, 3634, 3720, 3806, 3834, 3862, 3844, 3826, 3827, 3827, 3850, 3874, 3916, 3959, 4002, 4044, 4090, 4136, 4136, 4137, 4174, 4212, 4295, 4379, 4400, 4421, 4419, 4418, 4442, 4467, 4538, 4608, 4622, 4635, 4603, 4571, 4578, 4585, 4615, 4644, 4652, 4661, 4691, 4722, 4802, 4882, 4984, 5086, 5199, 5312, 5425, 5538, 5716, 5894, 6118, 6342, 6563, 6785, 7000, 7307, 7704, 8101, 8532, 8963, 9433, 9995, 10630, 11417, 12379, 13554, 14895, 16448, 18267, 20358, 22694, 25181, 27772, 30362, 32974, 35494, 37896, 40025, 41812, 43206, 44161, 44661, 44733, 44410, 43741, 42799, 41695, 40500, 39341, 38288, 37378, 36635, 36104, 35800, 35735, 35837, 36119, 36567, 37165, 37870, 38635]
761C8635Q40Q18O82M38J51k20n98j017j396j731k020k180k256k270k271k222k115j912j685
759A7671j452j255j071r35q22o87n53m48l88l43k79k32j97j52r1m5mM2J02J47J88K33K90L36
756A0055L73L72L29L30L39L39L80L79K97K21J48J03N3k2o3j09j50j49j93j93j89j12m4Jml
753A2488KLM6R1J39J39J57J11P1op2j18j81k26l03l49l56l11k94l69m28m27m16l70l32k56
749H433k19k20k12k12k00j56j35j36j16j17p1p1m0l9k3K3Jm5r2r2j20j20j21j20q3q4q3q3
746E447j9j8j9j8o0o1o0o0n5n4n5n5k8k8k8k8k7k7k7k7l0l0l3l2j00j46j17m1J5J6k5k5k4
742D121k3k3k4o1o1o2o1q9r0k9M7O7K1k4k4MNm2m1m4m4q9r0n5n6n5n6rrL6L7J7J7O2O3M1M2
737C419mmm3m3KLK0K0K1K0LKm3m3J4J3O0N9N9N9N9O0L8L8L9L8J2J1N7N7O8O8O8O8J28J27R8
$$ y = [38635, 39475, 40293, 40975, 41413, 41564, 41344, 40746, 39729, 38333, 36602, 34582, 32402, 30146, 27876, 25605, 23383, 21268, 19356, 17671, 16219, 14964, 13893, 12958, 12136, 11449, 10896, 10448, 10060, 9717, 9438, 9206, 9009, 8857, 8766, 8721, 8717, 8759, 8861, 9008, 9196, 9429, 9719, 10055, 10428, 10800, 11129, 11459, 11798, 12137, 12517, 12896, 13193, 13414, 13562, 13665, 13718, 13696, 13633, 13524, 13374, 13225, 13032, 12839, 12650, 12538, 12494, 12495, 12491, 12488, 12490, 12493, 12539, 12630, 12769, 12908, 13065, 13176, 13247, 13241, 13169, 13051, 12870, 12644, 12341, 11992, 11636, 11325, 11031, 10662, 10234, 9807, 9391, 9021, 8689, 8433, 8214, 7994, 7782, 7570, 7370, 7214, 7079, 6943, 6827, 6710, 6639, 6568, 6528, 6489, 6466, 6489, 6490, 6445, 6353, 6261, 6141, 6021, 5900, 5780, 5697, 5613, 5530, 5447, 5428, 5410, 5391, 5373, 5313, 5252, 5192, 5132, 5077, 5023, 4968, 4913, 4885, 4857, 4829, 4801, 4774, 4747, 4720, 4693, 4663, 4633, 4600, 4568, 4468, 4322, 4205, 4164, 4179, 4195, 4170, 4145, 4121, 4098, 4075, 4051, 3990, 3929, 3867, 3806, 3717, 3627, 3598, 3645, 3712, 3733, 3709, 3685, 3689, 3694, 3652, 3611, 3567, 3523, 3434, 3344, 3289, 3233, 3178, 3122, 3113, 3104, 3140, 3177, 3194, 3211, 3273, 3336, 3377, 3419, 3415, 3411, 3368, 3325, 3327, 3330, 3350, 3370, 3391, 3411, 3414, 3416, 3373, 3330, 3344, 3357, 3417, 3476, 3535, 3594, 3653, 3713, 3751, 3789, 3828, 3866, 3878, 3889, 3946, 4003, 4071, 4139, 4207, 4275, 4403, 4530, 4628]
733D628K1J4N9P4P5L9M0L9L9P7P6P6P7K8K8K8K8j1j1l6RJ2J1J5J4J09J09J06J07R0M5P0P0
729F155R2R2J42J88K27K27K30K30K59K58K61K61L35L79M33M33M93N39N99O44P20P95R02J008
726A5902J095J232J362J529J651J757J882K049K226K394K495K571K638K638K696K802K913
724E1832L019L044K968K824K658K540K434K341K205K098K053K037J961J892J847J881J927
722I1561J987K032K138K275K367K413K377K300K212K076J886J660J375J117Q68N79K58n9m22
719A21000q01j196j544j823j989k077k152k212k288k320k319k267k162k074j969j846j710
717H8251j612j566j566j611j708j844j993k068k117k163k218k265k261k216k184k094k017
715E4748j926j815j663j557j345j107q33n79l07r8J75M37P09R97J330J644J979K304K638K983
$$ y = [4628, 4649, 4663, 4722, 4796, 4871, 4910, 4950, 4989, 5028, 5105, 5181, 5257, 5334, 5362, 5390, 5418, 5446, 5435, 5424, 5388, 5397, 5409, 5420, 5435, 5449, 5558, 5667, 5773, 5880, 5970, 6015, 6085, 6155, 6247, 6339, 6481, 6669, 6896, 7123, 7353, 7583, 7842, 8100, 8361, 8622, 8957, 9336, 9769, 10202, 10695, 11234, 11833, 12477, 13197, 13992, 14894, 15902, 16997, 18229, 19591, 21120, 22771, 24528, 26410, 28459, 30685, 33079, 35574, 38145, 40783, 43421, 46117, 48919, 51832, 54851, 57895, 60863, 63687, 66345, 68885, 71319, 73660, 75865, 77963, 80016, 82053, 84014, 85906, 87753, 89634, 91561, 93548, 95580, 97718, 99993, 102360, 104773, 107150, 109450, 111662, 113738, 115624, 117284, 118659, 119776, 120644, 121223, 121481, 121422, 121000, 120199, 119003, 117459, 115636, 113647, 111570, 109418, 107206, 104918, 102598, 100279, 98012, 95850, 93776, 91807, 89961, 88251, 86639, 85073, 83507, 81896, 80188, 78344, 76351, 74283, 72166, 70003, 67785, 65520, 63259, 61043, 58859, 56765, 54748, 52822, 51007, 49344, 47787, 46442, 45335, 44502, 43923, 43616, 43518, 43693, 44130, 44839, 45836, 47166, 48810, 50789, 53093, 55731, 58714]
713E8714L377L709M042M301M634M939N212N382N474N595N686N771N772N735N644N506N233
711A44726M865M470M057L663L405L314L375L527L695L908M101M253M471M623M780M872M879
709B14984M834M786M633M412L956L353K596J762J004K88m09j125j882k602l300l860m253m551
707B24626m703m767m768m647m436m218l884l555l221l003k852k800k709k665k664k735k886
704A64113l215l609m049m382m563m655m629m630m619m710m859n011n139n094m909m697m402
702H6941m069l674l281k930k658k362k090j822j549j321j110r15p03n69m79m14l70l90m81
700E5754o15p22q38r44j050j095j054j009r47r02q69q24p58o82n63m87m22l47k14m8R7K03
697D1664K80L56M17M62N54O61P71Q77R24J000J086J191J373J601J834K092K429K808L222L693
$$ y = [58714, 62091, 65800, 69842, 74143, 78777, 83716, 88928, 94310, 99784, 105379, 111065, 116836, 122608, 128343, 133987, 139493, 144726, 149591, 154061, 158118, 161781, 165186, 168500, 171875, 175402, 179097, 183005, 187106, 191359, 195830, 200453, 205233, 210105, 214984, 219818, 224604, 229237, 233649, 237605, 240958, 243554, 245316, 246320, 246608, 246199, 245074, 243192, 240590, 237290, 233430, 229177, 224626, 219923, 215156, 210388, 205741, 201305, 197087, 193203, 189648, 186427, 183424, 180572, 177772, 175063, 172398, 169734, 166999, 164113, 160898, 157289, 153240, 148858, 144295, 139640, 135011, 130381, 125762, 121052, 116193, 111182, 106043, 100949, 96040, 91343, 86941, 82872, 79198, 75917, 72987, 70329, 67967, 65877, 64055, 62506, 61185, 60075, 59160, 58457, 57888, 57409, 56995, 56625, 56235, 55754, 55139, 54417, 53579, 52635, 51585, 50490, 49436, 48427, 47480, 46578, 45709, 44885, 44127, 43445, 42882, 42395, 41973, 41626, 41412, 41364, 41461, 41664, 41944, 42300, 42717, 43179, 43733, 44394, 45165, 46042, 46966, 47966, 49052, 50243, 51616, 53217, 55051, 57143, 59572, 62380, 65602, 69295]
695F9295M183M775N423O196P095Q140R298J0585J2089J3832J5902J8404K1473K5249K9758
693B61697L4897M0230M5036M8467M9968M9795M8719M7361M5800M3658M0611L6691L2127K7039
691H52096K1414J5517R680M138j305o721j1528j4613j5053j2906r192n023j065K588O091R560
689H43678J2970J6235J9131K1057K1344J9637J6256J2055P884L925l06n426j1628j8564k5493
688I32755l1608l6234l8921l9755l9420l8890l8675l8447l7317l4571l0348k5572k1100j7354
686D64543j4293j1671r334p347n892n239n526o391p123p123o279n022l901l204l078l229l491
684C56400l885m446n326o435p557q403q796q782q630q569q781r200r594r840r750r459q883
682B20064q031o847n571m570m104m438n470p017q408r045q583p219n668m485m109m503n294
$$ y = [69295, 73478, 78253, 83676, 89872, 96967, 105107, 114405, 124990, 137079, 150911, 166813, 185217, 206690, 231939, 261697, 296594, 336824, 381860, 430327, 480295, 530090, 578809, 626170, 671970, 715628, 756239, 792930, 825057, 852096, 873510, 889027, 898707, 902845, 901540, 894819, 883291, 868678, 853625, 840719, 831527, 826504, 825439, 828027, 834118, 843678, 856648, 872883, 892014, 913071, 934415, 954052, 970308, 982363, 990247, 994172, 993866, 988440, 976812, 958248, 932755, 901147, 864913, 825992, 786237, 746817, 707927, 669252, 630805, 593488, 558917, 528569, 502997, 481897, 464543, 450250, 438579, 429245, 421898, 416006, 410767, 405241, 398850, 391727, 384604, 378325, 373303, 369402, 366198, 363120, 359891, 356400, 352515, 348069, 342743, 336308, 328751, 320348, 311552, 302770, 294140, 285571, 276790, 267590, 257996, 248156, 238406, 228947, 220064, 212033, 205186, 199615, 195045, 190941, 186503, 181033, 174016, 165608, 156563, 147980, 140761, 135093, 130608, 126499, 121996, 116702]
680A16702n993o263n930n308m611m127l855l740l590l365l031k599k084j534r58m09M6M63
677E9814P97R44J096J211J424J717K051K272K272J987J533J199J199J636K334L089L483L323
675I3381K626J631P52L65N17J099J919K680L256L563L655L457L184K872K599K411K259K193
673A34419K193K017J562R19K22l33p26r21r67q63p12m45j11K71M84L80j36r51j831k493k828
670A29150k942k896k805k714k583k372k176k025j946j901j854j702j508j295j220j417j998
668I3796k832l715m307m378l970l309k597k023j704j648j784j983k119k118k012j864j728
666D9705j624j549j504j504j486j440j382j277j158j053r38q32p69p69o94o18n45m69m35m36
664B9223m81n58o18o17n50n04n30n30n78n77n75n74n91n46m92m92m51m05l86l86l92l92l59
$$ y = [116702, 110709, 104446, 98516, 93208, 88597, 84470, 80615, 76875, 73285, 69920, 66889, 64290, 62206, 60672, 59714, 59305, 59351, 59814, 60611, 61555, 62651, 63862, 65286, 67003, 69054, 71326, 73598, 75585, 77118, 78317, 79516, 81152, 83486, 86575, 90058, 93381, 96007, 97638, 98390, 98755, 99272, 100371, 102290, 104970, 108226, 111789, 115444, 118901, 122085, 124957, 127556, 129967, 132226, 134419, 136612, 138629, 140191, 141110, 141332, 140999, 140273, 139352, 138385, 137522, 136810, 136365, 136254, 136525, 137009, 137389, 137253, 136302, 134471, 131978, 129150, 126208, 123312, 120507, 117793, 115210, 112838, 110662, 108637, 106691, 104790, 102936, 101234, 99726, 98431, 97211, 95794, 93796, 90964, 87249, 82942, 78564, 74594, 71285, 68688, 66665, 64961, 63313, 61529, 59546, 57427, 55309, 53297, 51433, 49705, 48081, 46532, 45028, 43524, 42038, 40598, 39216, 37939, 36781, 35728, 34790, 33958, 33189, 32420, 31726, 31108, 30563, 30094, 29659, 29223, 28742, 28184, 27566, 26949, 26399, 25895, 25365, 24835, 24257, 23680, 23105, 22531, 21940, 21394, 20902, 20410, 19959, 19554, 19168, 18782, 18390, 17998, 17639]
661A7639k84k64k64k57k57j94j48j28j28j43j44j43j44n4n3n4n4k7k7k7k8J7J8J7J7OON1N1
658A5000O5O5J10J10J61J60J61J61J90J90J91J90J51J52J52J51K11K12K11K11J92J92K37K38
655A9064K31K32K12J66J29J29J07O1K9L0K7K7K9K9K9K9%jN0R6Q0Q0J26J72J29K3o9j45j96
651B0905j96j83j39j05j50k36k81l09l54l77l77l43l44k98k98k88k88k39k39k01j55j35j35
648A5235j67j66j24j24j52j98j98j52j22j22j45j00k5k6r6r5l5J1j5j5k9l0K3O9J59K04K07
645A3772J62J33J34J30J30Q9Q8J08J54J82J82K11J65J20J19P0K4J1N6J36J81J81J34O7rj23
642A6607j68j45j44j20p4k6k7l8q4j11j56k14k59k82k82l26l25l51l06k63k63k60k61k50k51
639A1621k01j55j66j65j63j64k02k03k03k03k31k30k76k76l23l22k89k14j85j86j80j81j79
$$ y = [17639, 17355, 17091, 16827, 16570, 16313, 16119, 15971, 15843, 15715, 15572, 15428, 15285, 15141, 15087, 15034, 14980, 14926, 14899, 14872, 14845, 14817, 14834, 14852, 14869, 14886, 14892, 14898, 14949, 15000, 15065, 15130, 15240, 15350, 15511, 15671, 15832, 15993, 16183, 16373, 16564, 16754, 16905, 17057, 17209, 17360, 17571, 17783, 17994, 18205, 18397, 18589, 18826, 19064, 19295, 19527, 19739, 19905, 20034, 20163, 20270, 20331, 20360, 20390, 20417, 20444, 20473, 20502, 20531, 20560, 20560, 20559, 20609, 20705, 20785, 20865, 20991, 21163, 21292, 21315, 21246, 21101, 20905, 20709, 20526, 20387, 20282, 20132, 19896, 19615, 19306, 18952, 18575, 18198, 17855, 17511, 17213, 16915, 16627, 16339, 16100, 15861, 15660, 15505, 15370, 15235, 15068, 14902, 14778, 14654, 14502, 14304, 14106, 13954, 13832, 13710, 13565, 13465, 13440, 13414, 13318, 13223, 13188, 13199, 13184, 13169, 13140, 13110, 13133, 13202, 13361, 13565, 13772, 13934, 14067, 14201, 14331, 14461, 14550, 14638, 14746, 14900, 15082, 15264, 15475, 15640, 15760, 15879, 15949, 15973, 15984, 16040, 16176, 16357, 16538, 16672, 16739, 16730, 16607, 16439, 16294, 16150, 16030, 15956, 15930, 15903, 15865, 15781, 15670, 15514, 15300, 15041, 14759, 14477, 14151, 13826, 13475, 13169, 12906, 12643, 12383, 12122, 11872, 11621, 11420, 11265, 11099, 10934, 10771, 10607, 10405, 10202, 9999, 9796, 9565, 9335, 9059, 8783, 8460, 8138, 7849, 7635, 7450, 7264, 7084, 6903, 6724]
636F724j80k02j57j07o2j2j1Lm3o3o2k0k0K6K6M0M1Q4Q3N3Qj2j3L1L0j2j2nM1O0O1J02J03
632F523N6N7K9K8L1L1Q7J32J32Q7J02J02R9R9R9R9R9R9R0R1R1R1J27J28J02J48J94J95J98
628I446J98K32K32K32K32K24K24K25K24K25K24K25K24K27K26K04K49K85L30M14N20N85N86
625A5993O81Q48J086J343J715K216K783L497M463N812P475R218J0602J0707Q429L410l015
623H7263q397j0982j0755r097p262n707m479l547k865k345j906j576j348j179j011q43p07
621A3257n87m81l47k71k18k18j68j68j25j25j25j25q3q3%jP3J79K93L39L56M02M52N27O50
618A3403P86R63J099J238J343J451J588J752J888J951J952J869J793J733J657J557J421J231
616D0675J003P53N85M46L09J74L7k3k3K5J61L05M43N74P42Q85R91J086J086J049R74Q62O96
$$ y = [6724, 6544, 6342, 6185, 6078, 6016, 6004, 5993, 5996, 5953, 5890, 5828, 5808, 5788, 5814, 5840, 5880, 5921, 6005, 6088, 6141, 6149, 6137, 6124, 6155, 6185, 6173, 6161, 6156, 6197, 6257, 6318, 6420, 6523, 6579, 6636, 6665, 6693, 6724, 6755, 6842, 6974, 7106, 7193, 7295, 7397, 7496, 7595, 7694, 7793, 7892, 7991, 8081, 8172, 8263, 8354, 8481, 8609, 8711, 8859, 9053, 9248, 9446, 9644, 9876, 10108, 10340, 10572, 10796, 11020, 11245, 11469, 11694, 11918, 12143, 12367, 12594, 12820, 13024, 13273, 13558, 13888, 14302, 14822, 15407, 15993, 16674, 17522, 18608, 19951, 21666, 23882, 26665, 30162, 34625, 40437, 47912, 57130, 67732, 78439, 86868, 90278, 87263, 78866, 67884, 57129, 48032, 40770, 35063, 30584, 27037, 24172, 21827, 19921, 18345, 16997, 15818, 14807, 13964, 13257, 12670, 12189, 11842, 11571, 11353, 11135, 10967, 10799, 10674, 10549, 10424, 10299, 10216, 10133, 10133, 10132, 10205, 10384, 10677, 11016, 11372, 11774, 12226, 12753, 13403, 14189, 15152, 16251, 17489, 18832, 20283, 21871, 23623, 25511, 27462, 29414, 31283, 33076, 34809, 36466, 38023, 39444, 40675, 41678, 42431, 43016, 43462, 43771, 43945, 43982, 43959, 43936, 43961, 44122, 44427, 44870, 45444, 46186, 47071, 48062, 49148, 50234, 51283, 52257, 53119, 53815]
613E3815M87K00j18m36p79j068j315j543j718j885j992j992j964j889j831j755j588j421j216
611B9992j050r14q39p67p20o69o68o75p20p58q33q90q90q94q94r24r24q75q76q44p98p45o38
608A1187n85n38n22m45l85l38k84k84k70k69k25k24j47j47m1m0J3J3l7q2r0r0r3r3r1r2m4
605E757Kj5o0j05j05r8n3l3l4q7q7q7q7n8n7n7n8n0n1n4n3m9r5j42j42j08o2J8J8K2K2K2K2
601C996n1n1n2n1j0j0j0j0JKJJkknmj6o0p8p8n4rJ2J1j0j0n6n6k8k7p0p0q2l6J5J4LMMLK0
596C089J9K0K0j4j4j4j4K3K3K0K0M8Km8m8j9j9k0j9j8j8j7j8N7N7L7qj0j0L3L3L0L0j6j5j8
591C184j9j8j8kkkkj3j4j3j4N1N1L1j4k9k9l1l2l1l2l1l2l6l6J0J0J2J2l3l3k5k5K0K1J6J5
587B867J6J6qrn1n0k2K4jkj5j5L1L1poopj0j1j1j1M7M6M6M6N5N4Q1L4k4k4p2p2m9m8m9m8o5
$$ y = [53815, 54302, 54502, 54384, 53948, 53169, 52101, 50786, 49243, 47525, 45640, 43648, 41656, 39692, 37803, 35972, 34217, 32629, 31208, 29992, 28942, 28028, 27189, 26422, 25702, 25033, 24365, 23690, 22970, 22212, 21379, 20489, 19599, 18705, 17811, 16887, 15963, 15088, 14212, 13368, 12570, 11825, 11187, 10602, 10064, 9542, 9097, 8712, 8374, 8090, 7806, 7536, 7267, 7042, 6818, 6671, 6524, 6483, 6443, 6456, 6469, 6432, 6350, 6260, 6170, 6077, 5984, 5893, 5801, 5757, 5759, 5744, 5684, 5579, 5474, 5376, 5323, 5290, 5256, 5169, 5082, 4995, 4908, 4850, 4793, 4736, 4678, 4628, 4577, 4523, 4470, 4421, 4326, 4184, 4042, 3934, 3872, 3890, 3908, 3930, 3952, 3974, 3996, 3945, 3894, 3842, 3791, 3781, 3771, 3761, 3751, 3752, 3754, 3755, 3756, 3754, 3752, 3747, 3743, 3727, 3667, 3589, 3511, 3457, 3448, 3460, 3471, 3461, 3451, 3395, 3339, 3311, 3284, 3214, 3144, 3062, 3026, 3041, 3055, 3058, 3062, 3066, 3069, 3089, 3108, 3128, 3148, 3134, 3120, 3106, 3092, 3115, 3138, 3158, 3178, 3226, 3228, 3180, 3132, 3113, 3094, 3074, 3055, 3037, 3019, 3002, 2984, 3041, 3098, 3135, 3127, 3117, 3107, 3140, 3173, 3203, 3233, 3217, 3202, 3184, 3165, 3147, 3129, 3127, 3125, 3123, 3121, 3108, 3094, 3081, 3067, 3118, 3169, 3200, 3186, 3157, 3128, 3097, 3065, 3034, 3002, 2971, 2939, 2903, 2867, 2877, 2887, 2899, 2911, 2878, 2845, 2820, 2795, 2815, 2836, 2852, 2867, 2883, 2899, 2891, 2882, 2831, 2781, 2759, 2783, 2782, 2780, 2765, 2750, 2781, 2812, 2805, 2799, 2793, 2786, 2776, 2765, 2754, 2743, 2790, 2836, 2882, 2928, 2983, 3037, 3118, 3152, 3128, 3104, 3032, 2960, 2911, 2863, 2814, 2766, 2701]
582B701o4j5L1N4N3N6N6NMMMJ7J7M3ln8n9J4J5KLM8M8N3N4k2k2l7l6J0RLLLKL0L0j5j5l5l4
577B957l2l1kM4R4R4N8N7N7N7L6L5N5J01J44J45J47J47J94J93J93J94J92J93K17K64L23M15
574F541O20Q32J094J488J962K598L217L612L236J811l91k484l668l668l039k282j718j264
571H497r64o91n20l68l06k60j96j51j44j45j42j42j32j32j32j32j21j21p5p5q2q3l7l7nnn0
568C249n0p2p2k7k7PPOPj9k0o4o5nmnnk9k9k9k9qpppK7K7P2P3%Jm5m5J6J6J6J6K5K4K5K4J9
563B987J9J9J9m3m3m3m3lmM1M2OPj00j00o7o7k2k2n3n3qpj9j8j9j8J5J6J5J6Q0Q1O0J5KKM4
558B734M5N8N8Ql8m7m7o7j12j16o9QQQQRQL9L9l3l4k2K3P4P3P4P4K3k2j4j3j7j6mmmmk7k6
554B635pL9M7M7N0N0M9M8j3q8p4k9J6J7m1m1MNJKK2O8Q7Q7Rl6n7n8q6m1RJ0l3l3l8l8l8l8
$$ y = [2701, 2637, 2622, 2653, 2707, 2760, 2816, 2872, 2877, 2881, 2885, 2889, 2906, 2923, 2966, 2963, 2905, 2846, 2860, 2875, 2877, 2880, 2928, 2976, 3029, 3083, 3061, 3039, 3002, 2966, 2976, 2985, 2988, 2991, 2994, 2996, 3026, 3056, 3041, 3026, 2991, 2957, 2925, 2894, 2892, 2936, 3030, 3124, 3182, 3239, 3296, 3353, 3389, 3424, 3479, 3580, 3724, 3869, 4016, 4163, 4357, 4550, 4743, 4937, 5129, 5322, 5539, 5803, 6126, 6541, 7161, 7993, 9087, 10575, 12537, 15135, 18352, 21964, 25200, 27011, 26620, 24136, 20468, 16800, 13761, 11479, 9761, 8497, 7533, 6842, 6322, 5954, 5648, 5388, 5192, 5041, 4897, 4752, 4610, 4468, 4336, 4204, 4072, 3940, 3819, 3698, 3623, 3548, 3466, 3383, 3346, 3309, 3304, 3299, 3249, 3199, 3127, 3055, 3028, 3001, 3008, 3015, 3021, 3028, 3009, 2989, 2925, 2860, 2855, 2851, 2846, 2841, 2812, 2783, 2754, 2725, 2717, 2710, 2703, 2696, 2723, 2750, 2822, 2895, 2895, 2896, 2851, 2806, 2822, 2838, 2854, 2870, 2895, 2919, 2944, 2968, 2987, 3006, 3025, 3044, 3001, 2958, 2915, 2872, 2869, 2865, 2906, 2948, 2954, 2961, 2861, 2761, 2694, 2627, 2605, 2583, 2530, 2477, 2469, 2462, 2443, 2425, 2406, 2388, 2403, 2419, 2434, 2450, 2530, 2611, 2671, 2686, 2688, 2690, 2734, 2779, 2837, 2895, 2903, 2865, 2818, 2771, 2704, 2592, 2476, 2407, 2415, 2423, 2431, 2439, 2448, 2456, 2495, 2534, 2501, 2467, 2445, 2468, 2542, 2615, 2689, 2763, 2786, 2764, 2750, 2737, 2720, 2704, 2700, 2696, 2692, 2688, 2661, 2635, 2628, 2667, 2714, 2761, 2811, 2861, 2910, 2958, 2945, 2857, 2783, 2754, 2770, 2787, 2746, 2705, 2709, 2714, 2715, 2717, 2739, 2807, 2894, 2981, 2990, 2954, 2897, 2839, 2753, 2712, 2721, 2731, 2698, 2665, 2627, 2589, 2551, 2513]
549B513J1J1J4J5j9K7M7M7mmM2M1L7L7qqJ3J4on2n8n9j1L5M9M9M6l0p3j18j20p5l9OK8K9L5
544B462L6L5L5%jm6m6j9j9j9j8j1j0j0j1ONNOk1k2j8j8L8Q4N9N8NMNMj2j3j0rK1O7M2M1po
539B672pol1l0l0l1lmM2M1L1L0L0L1l6l5j9K7J3l2n0n0nnM2Q8J00N5k5p1n4rQQL7L7J7k9o7
535B680o7k4k4K7K7K7K7N6N7N6N7N3N4P9L4j6j6j9j9J0Rl6l6p2p2n2pOPl4l3jM4J8J9L0L0
530B879K9L0L8L8L8L8MLMMQ0P9Q0P9J19J18J19J18J04J05J80J80J86J86K12K58L09M14N33
527F564O38P50Q56R80J116J136J061Q58N40J83j95n23q11r92r93r56r10q45p69o24m89l78
524F197l33l04l04k51k52k31j86j68j68j46j00l8l8l6l6l9m0m0m0k0k1k1k1j4j4j5j4m0m0
520C227NOj7j8j8j7j%m6m6ONONj3j4j3j4k3k3oL9L8qn3n2j1L6J0RK5K5N1Nm0m1M6J22J39O3
$$ y = [2513, 2524, 2535, 2549, 2564, 2545, 2572, 2619, 2666, 2662, 2658, 2700, 2741, 2778, 2815, 2807, 2799, 2812, 2826, 2820, 2768, 2710, 2651, 2640, 2675, 2724, 2773, 2819, 2789, 2716, 2598, 2478, 2403, 2364, 2370, 2398, 2427, 2462, 2498, 2533, 2568, 2568, 2567, 2521, 2475, 2456, 2437, 2418, 2400, 2389, 2379, 2369, 2358, 2364, 2369, 2374, 2380, 2359, 2337, 2319, 2301, 2339, 2423, 2482, 2540, 2545, 2549, 2554, 2558, 2546, 2533, 2523, 2514, 2535, 2602, 2644, 2685, 2678, 2672, 2665, 2659, 2628, 2598, 2568, 2537, 2534, 2530, 2572, 2613, 2644, 2674, 2704, 2735, 2699, 2664, 2645, 2672, 2685, 2653, 2603, 2553, 2548, 2543, 2585, 2673, 2773, 2828, 2803, 2732, 2678, 2669, 2677, 2685, 2722, 2759, 2776, 2747, 2680, 2613, 2589, 2565, 2592, 2619, 2646, 2673, 2729, 2786, 2842, 2899, 2952, 3006, 3085, 3119, 3103, 3087, 3068, 3049, 3059, 3068, 3032, 2996, 2924, 2852, 2800, 2793, 2799, 2806, 2772, 2739, 2738, 2782, 2800, 2819, 2849, 2879, 2908, 2938, 2976, 3014, 3052, 3090, 3094, 3097, 3101, 3105, 3185, 3264, 3344, 3423, 3542, 3660, 3779, 3897, 4001, 4106, 4286, 4466, 4652, 4838, 5050, 5308, 5617, 6031, 6564, 7202, 7952, 8808, 9788, 10904, 12040, 13101, 13959, 14499, 14682, 14487, 13964, 13153, 12161, 11168, 10212, 9302, 8457, 7688, 7064, 6575, 6197, 5864, 5560, 5256, 5005, 4753, 4522, 4336, 4168, 4000, 3854, 3754, 3716, 3678, 3642, 3606, 3567, 3527, 3487, 3447, 3427, 3406, 3385, 3364, 3350, 3336, 3321, 3307, 3267, 3227, 3232, 3238, 3221, 3203, 3185, 3168, 3167, 3167, 3121, 3075, 3081, 3086, 3092, 3097, 3084, 3070, 3057, 3043, 3020, 2997, 2991, 3030, 3068, 3060, 3007, 2955, 2944, 2980, 2990, 2999, 3024, 3049, 3100, 3105, 3065, 3024, 3070, 3192, 3331, 3394]
515C394l1p7o9o9k6k6k9k8k8k8M3M3M3M3P2P2J14J14N4Rj2j1j6j5o1o1k5k4kkK2K2k3k3n1
511C308n0noQRQQk2k1k2k1J6J5J6J5o0n9j5j4k1k1k1k1J6J7J6J6l6l6l6l6L3L4j3j2J3J3N8
507C071N8ook9k8J6J7O2O2O3O3L9M0N6N5J1J0n2n1L4J25J53J53J12J13P5P6P5P5J41J40J66
503D889J66K03K49L03L94M26L34J32q0k46k47j54j54n8n8n8n8q8q8j95j94k23k22k00k00k35
499D338k35j59j60j00j00OOn5n4j00j01o6o6m4m4k7k7J8J9K7K8MNj0rJ3J3J07J07J52J53J72
495C811J72K33L85N48O99P25N75K19k35o33p85p20n07l09k17j61j60j32j32j00j00n4n5j2
493C055j1O4O5j%p6p6l9l9L7L7nnj11j11k0k0K6K5M3M3M2M3KKLKk0j9k0j9L8L8J14J13J80
488C380J79K52K52K94K48O9j43l22m13l75k84k54j64r8n2n2n1m9m9N5N4N4N4l0l0l1l0J7J7
$$ y = [3394, 3363, 3286, 3217, 3148, 3122, 3096, 3067, 3039, 3011, 2983, 3026, 3069, 3112, 3155, 3227, 3299, 3413, 3527, 3581, 3590, 3578, 3567, 3551, 3536, 3475, 3414, 3389, 3365, 3363, 3361, 3383, 3405, 3382, 3359, 3308, 3258, 3253, 3247, 3255, 3264, 3272, 3280, 3258, 3237, 3215, 3194, 3210, 3225, 3241, 3256, 3196, 3137, 3122, 3108, 3087, 3066, 3045, 3024, 3040, 3057, 3073, 3089, 3053, 3017, 2981, 2945, 2978, 3012, 2999, 2987, 3000, 3013, 3071, 3129, 3123, 3117, 3088, 3060, 3076, 3093, 3155, 3217, 3280, 3343, 3382, 3422, 3478, 3533, 3544, 3554, 3502, 3451, 3485, 3610, 3763, 3916, 4028, 4141, 4216, 4292, 4367, 4442, 4583, 4723, 4889, 5055, 5258, 5507, 5810, 6204, 6630, 6964, 7096, 7016, 6770, 6523, 6369, 6215, 6157, 6099, 6041, 5983, 5895, 5807, 5612, 5418, 5195, 4973, 4773, 4573, 4338, 4103, 3944, 3784, 3684, 3584, 3590, 3596, 3541, 3487, 3387, 3286, 3220, 3154, 3110, 3066, 3039, 3012, 3030, 3049, 3076, 3104, 3108, 3113, 3103, 3094, 3107, 3120, 3227, 3334, 3486, 3639, 3811, 3983, 4216, 4601, 5149, 5848, 6573, 7148, 7367, 7132, 6499, 5714, 4994, 4487, 4178, 3961, 3800, 3640, 3508, 3376, 3276, 3176, 3122, 3067, 3055, 3044, 3108, 3173, 3172, 3172, 3096, 3020, 2981, 2942, 2979, 3016, 3011, 3006, 2895, 2784, 2764, 2744, 2770, 2795, 2838, 2881, 2923, 2966, 2968, 2970, 2973, 2975, 2955, 2936, 2916, 2897, 2935, 2973, 3087, 3200, 3380, 3559, 3811, 4063, 4357, 4605, 4674, 4531, 4209, 3796, 3421, 3137, 2883, 2719, 2621, 2569, 2517, 2466, 2417, 2368, 2423, 2477, 2531, 2585, 2555, 2525, 2494, 2464, 2481, 2498]
485B498n9n9m3m3L2L3L2L2j3j3MMK7K7k0k0k0k0j8j8K8K8j1j2j1j1j4j4j4j4rrj0rJ7J8J7
480B313J7k6k6k7k6J2J3J2J3PQl8l8MMMMK1K1Mm2p2k8K4O9N7L4L6N8O3M0pl0j8MKk0n2n2n4
475B288n4m2m2m1m2j3j2j3j2k1k1QL2L0j5j4L1N4N4J1J1J0J0J0J0PPPPK5K4k1k2k6k7J9J9
471B236L5L5rrJ9M1N4Rm6m6kM4M8Ll1n4k8nk0j9l3l3l4l3LLM8M8O2O2J7J7OOl9m0k1k1k2k1
466B230j5j6L0L0L6L6L5L6l1l1J4J4K1K1k4k5MMMMN8N8N6N5%m6o3o3p3k7qpmlmlRJ0N2N3L2
461B459j3l5q0q6m1OOL7L7J7k9l6l6j8K6N3N2N5N5KKJKo3o3m3LJ5J4J8J7NMm1m2j4j4j5j4
456B203QQl4l5LM8K3K3l9l9QN4N1Nj1j2J3J2l1l0m5KN1N1L4L5j2j1j0j1j0j1kjm5m5n4j0L8
451B172L8N0Mj6j6K1K0k4k5l9l9j9K7L7L6K0k6l9l9MLJ9J8J8J9K1K2K1K1j4j4j4j4j0j0O3
$$ y = [2498, 2439, 2380, 2337, 2294, 2326, 2359, 2391, 2423, 2410, 2397, 2401, 2405, 2432, 2459, 2439, 2419, 2399, 2379, 2361, 2343, 2371, 2399, 2388, 2376, 2365, 2354, 2340, 2326, 2312, 2298, 2289, 2280, 2270, 2261, 2278, 2296, 2313, 2330, 2304, 2278, 2251, 2225, 2237, 2250, 2262, 2275, 2282, 2290, 2252, 2214, 2218, 2222, 2226, 2230, 2251, 2272, 2276, 2234, 2162, 2134, 2158, 2227, 2284, 2318, 2354, 2412, 2475, 2515, 2508, 2478, 2460, 2464, 2466, 2446, 2394, 2342, 2288, 2234, 2192, 2150, 2109, 2067, 2054, 2042, 2029, 2017, 1996, 1975, 1983, 2015, 2045, 2030, 2016, 2047, 2101, 2155, 2166, 2177, 2187, 2197, 2207, 2217, 2224, 2231, 2238, 2245, 2270, 2294, 2273, 2251, 2225, 2198, 2217, 2236, 2271, 2306, 2297, 2288, 2307, 2348, 2402, 2411, 2365, 2319, 2317, 2361, 2409, 2412, 2381, 2327, 2299, 2294, 2274, 2255, 2222, 2189, 2155, 2122, 2125, 2128, 2176, 2224, 2286, 2348, 2365, 2382, 2388, 2394, 2355, 2315, 2294, 2273, 2251, 2230, 2215, 2199, 2229, 2259, 2295, 2331, 2366, 2402, 2371, 2340, 2354, 2368, 2389, 2410, 2386, 2361, 2365, 2369, 2373, 2377, 2435, 2493, 2549, 2604, 2604, 2558, 2495, 2432, 2359, 2332, 2324, 2317, 2313, 2310, 2306, 2303, 2312, 2322, 2374, 2427, 2459, 2446, 2411, 2331, 2245, 2204, 2210, 2216, 2253, 2290, 2307, 2278, 2242, 2206, 2188, 2214, 2267, 2319, 2374, 2429, 2431, 2433, 2434, 2436, 2373, 2310, 2267, 2270, 2285, 2299, 2317, 2334, 2339, 2343, 2302, 2260, 2246, 2232, 2217, 2203, 2211, 2219, 2185, 2150, 2153, 2201, 2224, 2247, 2208, 2169, 2177, 2231, 2282, 2287, 2276, 2264, 2277, 2289, 2258, 2228, 2183, 2185, 2236, 2287, 2321, 2356, 2344, 2333, 2323, 2312, 2302, 2291, 2289, 2288, 2243, 2198, 2144, 2134, 2172, 2210, 2260, 2264, 2248, 2232, 2253, 2273, 2249, 2224, 2185, 2146, 2127, 2154, 2191, 2227, 2247, 2221, 2182, 2143, 2147, 2150, 2169, 2187, 2205, 2224, 2245, 2267, 2288, 2309, 2295, 2281, 2267, 2253, 2243, 2233, 2296]
447B296O2N5Rj3j4qn3j01j00m3MN0N1N7J2noJ2N7L1L2L3L3N5N6l2l2j1L3N1N2QRL3L3L3L3
442B772L4L4N6N6L2L2j3j3l0k9l0k9QQj4j4l9l8PPj2j1j1j2opm9m9%M5O2O3K4k0m1m0m9m8
438B636k6k6m2m2m1m2rj0j0rj0rj0j0J%%%%%J%k8k8k8k7oomlJ5O1P7P8J7k8m8m8RQJ1l4k1
432B309k2jkj3j4J0Rm0m0k0k0l8q3o0j5L8L7M0M0L0L0j5j6k1k2JKL7L8L5L5j5o1l5l5OOK3
428B138O9O8K3n5n4k6k6k6k6l4l4J1J1J1J1l4l4pqJ6J5L3L3N8J2k9l0n7j3N3N3N6N6M3M4p
423B314n2o8o8ONJ5J5J2N8N9O0j3j4j1j0J4l1o0n9j7j8rrJ4J4L2L2j4j3k6k5oM0O4O3J6l0
419B280n6n6j4j3j0j0rj0j8j8j9j8JJJJl8l8l8l7ppL8L9L9L8opK3K4K4K4k9k8k9k8j%j%k7
414A961k8k7k7klJ%k7J8L6L5J8k9m8m8k1k2jM4Q4Q5O8K2K7K6K4K4l0l0l0l0j0rL6L6M3M2K3
$$ y = [2296, 2358, 2413, 2422, 2409, 2395, 2387, 2334, 2233, 2133, 2090, 2094, 2144, 2195, 2252, 2264, 2259, 2253, 2265, 2322, 2353, 2385, 2418, 2451, 2506, 2562, 2530, 2498, 2487, 2520, 2571, 2623, 2631, 2640, 2673, 2706, 2739, 2772, 2806, 2840, 2896, 2952, 2984, 3016, 3003, 2990, 2960, 2931, 2901, 2872, 2880, 2888, 2874, 2860, 2821, 2783, 2790, 2797, 2785, 2774, 2763, 2751, 2745, 2738, 2689, 2640, 2640, 2685, 2747, 2810, 2834, 2814, 2773, 2733, 2684, 2636, 2610, 2584, 2542, 2500, 2459, 2417, 2408, 2398, 2388, 2379, 2369, 2360, 2350, 2340, 2341, 2341, 2341, 2341, 2341, 2341, 2342, 2342, 2314, 2286, 2258, 2231, 2225, 2219, 2215, 2212, 2227, 2288, 2365, 2443, 2460, 2432, 2384, 2336, 2345, 2353, 2364, 2330, 2309, 2287, 2286, 2284, 2271, 2257, 2267, 2276, 2236, 2196, 2176, 2156, 2118, 2035, 1975, 1960, 1998, 2035, 2075, 2115, 2145, 2175, 2160, 2144, 2123, 2101, 2102, 2104, 2141, 2179, 2214, 2249, 2234, 2173, 2138, 2103, 2109, 2115, 2138, 2207, 2275, 2298, 2243, 2189, 2163, 2137, 2111, 2085, 2051, 2017, 2028, 2039, 2050, 2061, 2027, 1993, 1986, 1978, 1994, 2009, 2042, 2075, 2133, 2145, 2116, 2086, 2029, 2016, 2069, 2122, 2178, 2234, 2277, 2321, 2314, 2262, 2194, 2126, 2132, 2137, 2152, 2167, 2179, 2237, 2296, 2356, 2343, 2329, 2318, 2308, 2322, 2291, 2231, 2172, 2155, 2137, 2128, 2119, 2133, 2147, 2179, 2211, 2197, 2184, 2158, 2133, 2127, 2167, 2231, 2294, 2310, 2280, 2224, 2168, 2154, 2141, 2131, 2121, 2112, 2102, 2084, 2066, 2047, 2029, 2030, 2031, 2032, 2033, 1995, 1957, 1919, 1882, 1875, 1868, 1906, 1945, 1984, 2022, 2016, 2009, 2032, 2056, 2080, 2104, 2075, 2047, 2018, 1990, 1989, 1989, 1988, 1988, 1961, 1933, 1906, 1879, 1877, 1874, 1875, 1875, 1848, 1866, 1902, 1937, 1955, 1926, 1878, 1830, 1809, 1787, 1786, 1830, 1914, 1999, 2067, 2089, 2116, 2142, 2166, 2190, 2160, 2130, 2100, 2070, 2060, 2051, 2087, 2123, 2166, 2208, 2231]
409B231k2o9o8r6n1K1K2K1K2j0n5k9l0J3J2J6J5P7J23J36O1on2p6p7m9n0K3K3L1j4l4l5k3
405B001k4K1K2K1K1k5k4J0J1l2l2J7O3L8L7k7k7k7k6j2j2j2j2j%j%j2j2j2j2K2K2K2K3J9J9
400B047K0J9mnm6m7MN0K4K4n6n5l6J0K9K9L2L1ppppJ2J2J3J2k2k2k1k2j8j7j4j5M5Q9R0M4
396B208KKjjrj0O6O7L4L4L2L1j0n6n6j0rrn2n2K3K3K3K3K2K2K1K2K1K2K1K2j9j9j9j9l8l8
391B314l8l8l8l8l5l5l9ON7N7O6O7O6O6j%J9O4N8N9O1O1J00J01M8Kp9j26j45j45r5n1%%J2
387B381J2l3l4llK3k3m6m6lmL1L1J1l5q6q6p0k3ll%%K8K9P4P4M6M5M3M3j5o0q1q0l9l8l6l6
382A985J5O1L5L5MLMMl3l4l0l1QN4K6K5pn2k7k7k8k9J7J7J4J3J4J4j7j8j7j8llk9J7M7M8k5
377B032k5K4K4m7m7l8L7O6K0J2J2RJ0K3K4K3K4j3j4j3j3k2k2K9P4Q4Q5L9M0J5k9p8p7m5%K1
$$ y = [2231, 2209, 2140, 2072, 1976, 1925, 1946, 1968, 1989, 2011, 2001, 1946, 1917, 1887, 1900, 1912, 1928, 1943, 2020, 2143, 2279, 2340, 2334, 2282, 2206, 2129, 2080, 2030, 2053, 2076, 2107, 2093, 2059, 2024, 2001, 1977, 1998, 2020, 2041, 2062, 2037, 2013, 2023, 2034, 2002, 1970, 1987, 2050, 2088, 2125, 2098, 2071, 2044, 2018, 2006, 1994, 1982, 1970, 1969, 1969, 1968, 1968, 1956, 1944, 1932, 1920, 1942, 1964, 1986, 2009, 2028, 2047, 2067, 2086, 2082, 2077, 2031, 1984, 1988, 2038, 2062, 2086, 2030, 1975, 1939, 1949, 1978, 2007, 2039, 2070, 2063, 2056, 2049, 2042, 2054, 2066, 2079, 2091, 2069, 2047, 2026, 2004, 1986, 1969, 1955, 1940, 1985, 2074, 2164, 2208, 2210, 2212, 2211, 2210, 2201, 2191, 2257, 2324, 2358, 2392, 2424, 2455, 2445, 2389, 2333, 2323, 2314, 2305, 2253, 2201, 2224, 2247, 2270, 2293, 2315, 2337, 2358, 2380, 2401, 2423, 2444, 2466, 2447, 2428, 2409, 2390, 2352, 2314, 2276, 2238, 2200, 2162, 2127, 2092, 2053, 2059, 2116, 2173, 2239, 2306, 2372, 2438, 2437, 2437, 2456, 2520, 2578, 2637, 2698, 2759, 2859, 2960, 3008, 3010, 2931, 2805, 2660, 2515, 2420, 2369, 2369, 2369, 2381, 2393, 2360, 2326, 2323, 2320, 2343, 2320, 2274, 2228, 2225, 2221, 2252, 2283, 2294, 2259, 2173, 2087, 2017, 1994, 1991, 1988, 1988, 1988, 2016, 2045, 2119, 2193, 2239, 2284, 2327, 2370, 2355, 2295, 2214, 2134, 2095, 2057, 2021, 1985, 2000, 2061, 2096, 2131, 2135, 2138, 2142, 2146, 2113, 2079, 2049, 2018, 2026, 2080, 2106, 2131, 2124, 2072, 2045, 2018, 1990, 1961, 1978, 1995, 2009, 2022, 2036, 2050, 2033, 2015, 1998, 1980, 1977, 1974, 1945, 1962, 2009, 2057, 2032, 2007, 2031, 2055, 2008, 1961, 1923, 1960, 2026, 2046, 2058, 2070, 2079, 2089, 2112, 2136, 2159, 2183, 2170, 2156, 2143, 2130, 2108, 2086, 2115, 2189, 2273, 2358, 2397, 2437, 2452, 2423, 2345, 2268, 2223, 2223, 2244]
373B244K0J2J2J1J2pqj1j0j1n7j03j02l9L7M0M0nmm8m7m1MK6P1P2K6j9j9J1N6N6J1ppj1j0
368B195K8K7K8K7K9K8j9o4m6jJ7J6n2n3ppJKM5M4pn2k6k7NNM7M8N6J0m0l9j6j5j3j3K2O6M2
364B291M1L9L8L9L8j0j1j1j0k1k0m3LL6Q1Q4L8LLJ%j9j9j8j9J6J6J7J6n1n1l1J4MMl8l9J6
359B427J6J7J6M8M7M5M5pn2m9mL6Q1Q3L9L2L3K7K6l2p8n2n2k7k7jm6o3o2J0J1j6j6K9L0L9
355B553M0J4O0N8N9N8N9M2mn3n4k7k7mmlmlmkkkkK4K4K4K4NNNNl1l0l0l0n1n1m7m8MN0K7j8
349B609n2n2rrNNONK4K4j9j9k4K2J8J9k4k5kjK7K7M7M7%m6m6%L3L4L6L7J5J6l0l0j1j2L4L4
344B713rj0l2l2m1m0o0o1o3j7L2L3L5L5j0j0nnM2Q7Q0L3J2l3k5k5qL7O1O0J3l3n9n9j6j7j0
340B593j0j0j0o1o2j3L1L9pk4k3l8l8l5l6K1O7L8L9lm8m8lM1M1M3M3L8L7m3q9n6n6l6l6j3
$$ y = [2244, 2264, 2276, 2288, 2299, 2311, 2304, 2296, 2285, 2275, 2264, 2207, 2104, 2002, 1963, 2000, 2040, 2080, 2075, 2071, 2023, 1976, 1935, 1939, 1965, 2036, 2108, 2134, 2115, 2096, 2107, 2163, 2219, 2230, 2223, 2216, 2205, 2195, 2223, 2250, 2278, 2305, 2334, 2362, 2343, 2279, 2233, 2232, 2249, 2265, 2213, 2160, 2153, 2146, 2147, 2149, 2194, 2238, 2231, 2179, 2153, 2126, 2131, 2136, 2183, 2231, 2287, 2297, 2257, 2218, 2202, 2187, 2174, 2161, 2183, 2249, 2291, 2332, 2371, 2409, 2448, 2486, 2476, 2465, 2454, 2444, 2423, 2403, 2360, 2363, 2399, 2480, 2564, 2602, 2605, 2608, 2609, 2609, 2590, 2571, 2553, 2534, 2550, 2566, 2583, 2599, 2548, 2497, 2466, 2480, 2484, 2488, 2450, 2411, 2427, 2443, 2460, 2476, 2524, 2571, 2616, 2661, 2654, 2602, 2553, 2549, 2585, 2666, 2749, 2788, 2820, 2853, 2880, 2906, 2874, 2796, 2744, 2692, 2665, 2638, 2637, 2591, 2528, 2466, 2476, 2487, 2471, 2455, 2484, 2514, 2553, 2593, 2607, 2667, 2725, 2784, 2842, 2901, 2943, 2939, 2886, 2832, 2805, 2778, 2774, 2770, 2767, 2763, 2760, 2756, 2754, 2752, 2750, 2748, 2772, 2796, 2820, 2844, 2849, 2854, 2859, 2864, 2833, 2803, 2773, 2743, 2692, 2641, 2594, 2546, 2550, 2600, 2627, 2609, 2557, 2505, 2496, 2487, 2492, 2497, 2503, 2508, 2532, 2556, 2537, 2518, 2494, 2516, 2534, 2553, 2529, 2504, 2502, 2501, 2528, 2555, 2602, 2649, 2649, 2603, 2557, 2557, 2590, 2624, 2660, 2697, 2712, 2728, 2698, 2668, 2657, 2645, 2679, 2713, 2704, 2694, 2662, 2630, 2589, 2549, 2489, 2428, 2365, 2348, 2380, 2413, 2448, 2483, 2473, 2463, 2458, 2453, 2495, 2582, 2662, 2695, 2707, 2674, 2649, 2624, 2616, 2653, 2714, 2774, 2787, 2754, 2695, 2636, 2620, 2603, 2593, 2583, 2573, 2563, 2502, 2440, 2427, 2458, 2497, 2490, 2466, 2443, 2405, 2367, 2332, 2296, 2317, 2384, 2422, 2461, 2458, 2410, 2362, 2359, 2400, 2441, 2484, 2527, 2565, 2602, 2559, 2470, 2414, 2358, 2322, 2286, 2273]
336B273j4j4j3k7k6k4k4nM0M0on1n1K2K2L2L1L2L1mmL9L8L8pl0J5K8K7m2m3k1K5K2K2k2k2
331B327k2k2k1k0k1k1M2M1M1M1MNMML5L6j1j0m0m1j8j7L0L1QQj6j5l9l8K0K1K3k3n5n5l5l5
326B146J4J4J3J4MMMLk4k5k5k5k5k5k5k4L9M0M0M0K8K8K9K8j0j0j1j0lmmlK6K7k4o9n0n0n3
322B042n4ONNNk8k9k6k6RN6N5J0k4k3k4k3m1NK4K5j3j2PN3O0O0J7J7K2K2k3k4j9j8j9j8m7
317B014m7k7J8L6L6J9k6p7p7k9J6J7J7J9K0kkkkM0M0M0M0K9K9K8K9J5J6J5J6PPPPl1l1J2J2
312B248l4q0q0l4j6j5j3j2j3j3j2j3%j%%j%j%K1K0K1K1ppJ3N9P9Q0L0j6m2q7q8m3J8M0L1L1
307B084J0J1J0J0K1K0k5k5ONk4m7k3K3K1k5k6k5k6k5MN1L5J4%k3j2j1k1k1k1k1l5l5J0J0L
303A877KJJl0n2o4j9L5N7M8M7K2K3K2K2jjkjj6j6M4O7L2j5jK2j7m0l8j6nnj9LQl8n3n4PN2
$$ y = [2273, 2259, 2245, 2232, 2205, 2179, 2155, 2131, 2126, 2166, 2206, 2200, 2149, 2098, 2120, 2142, 2174, 2205, 2237, 2268, 2264, 2260, 2299, 2337, 2375, 2368, 2338, 2353, 2381, 2408, 2366, 2323, 2302, 2327, 2349, 2371, 2349, 2327, 2305, 2283, 2262, 2242, 2221, 2200, 2242, 2283, 2324, 2365, 2369, 2374, 2378, 2382, 2417, 2453, 2442, 2432, 2392, 2351, 2333, 2316, 2346, 2377, 2385, 2393, 2377, 2362, 2323, 2285, 2305, 2326, 2349, 2326, 2271, 2216, 2181, 2146, 2160, 2174, 2187, 2201, 2205, 2209, 2213, 2216, 2192, 2167, 2142, 2117, 2092, 2067, 2042, 2018, 2057, 2097, 2137, 2177, 2205, 2233, 2262, 2290, 2280, 2270, 2259, 2249, 2246, 2242, 2238, 2235, 2261, 2288, 2264, 2195, 2145, 2095, 2042, 1988, 1994, 1999, 2004, 2009, 1981, 1952, 1926, 1900, 1909, 1965, 2020, 2030, 2006, 1983, 1959, 1936, 1895, 1900, 1924, 1949, 1936, 1924, 1931, 1984, 2044, 2104, 2121, 2138, 2160, 2182, 2159, 2135, 2116, 2098, 2079, 2061, 2014, 1967, 1940, 1958, 1994, 2030, 2049, 2023, 1946, 1869, 1840, 1856, 1873, 1890, 1909, 1929, 1927, 1925, 1923, 1921, 1961, 2001, 2041, 2081, 2110, 2139, 2167, 2196, 2211, 2227, 2242, 2258, 2265, 2272, 2279, 2286, 2255, 2224, 2236, 2248, 2214, 2134, 2054, 2020, 2004, 1989, 1976, 1964, 1951, 1938, 1926, 1913, 1913, 1912, 1912, 1912, 1911, 1911, 1910, 1910, 1931, 1951, 1972, 1993, 1986, 1979, 1992, 2051, 2130, 2210, 2240, 2224, 2182, 2095, 2007, 1964, 1982, 2022, 2053, 2084, 2094, 2105, 2115, 2125, 2146, 2166, 2141, 2116, 2122, 2127, 2103, 2056, 2033, 2056, 2077, 2052, 2026, 2001, 1975, 1950, 1954, 2005, 2040, 2054, 2054, 2031, 2019, 2008, 1987, 1966, 1945, 1924, 1889, 1854, 1864, 1874, 1877, 1879, 1880, 1881, 1851, 1799, 1735, 1716, 1751, 1808, 1856, 1903, 1925, 1948, 1970, 1992, 1991, 1990, 1988, 1987, 1971, 1955, 1999, 2066, 2098, 2083, 2082, 2104, 2087, 2047, 2009, 1993, 1988, 1983, 1964, 1967, 1975, 1937, 1884, 1830, 1837, 1889]
298A889K6K6MNMNj2j1n7n7q0q0j6O0P1P2K6k0jkmnJ2J1J1J2kkk8J8N2N2Pl8k4K2L8L9K7K6
293B076j8j9k9k9k9k9l4l3J2J2J0J1J0J0RRl7l7l7l6QRRQRQnmnnK8K8P1P1K4k1m1m1k8k7k7
288A861k8opL9L9lmllk0j9k0j9L5L5L5L5L4L4j2j1j%jjklM0M1Mm0j5j6j5j5j5j5PQPPJ9J9
283B005J8J9llllMMm2m2m4m4m4m4j1j1L4L5M6M7KJnmmnJ%%JK7K7K6K7l6l6l6l6J%JJk2k3K3
277A849K3J7J6J7J6KKKKk0k0j9k0J4J4l1l1m8m8KM7N2N2RJ0J1J1l4l4m4m3k4K3N0N0QQjjj
272A888kK8K7K4K5L1j4l1l1K0O6O5K0l8l7m1m1QRQRj5j5j5j4j5j5j5j5JJJKL2L2L2L3N2N3
267B113PPK0K0Mm3p9l3J5O1N4Qp0j15q1nK6K5qpJ7k7p6p6k8J7M7M6MML0L1L0L0K1K1K1K0L8
263B089L7m1q6j12o7J0J1O3O3Q6M1k0o4m2m2rrpoj7K8KKl7l7QRj8j7j7j7PPPPO3O4O4O4%%
$$ y = [1889, 1915, 1941, 1945, 1950, 1954, 1959, 1947, 1936, 1879, 1822, 1742, 1662, 1646, 1706, 1777, 1849, 1875, 1855, 1854, 1852, 1848, 1843, 1855, 1866, 1877, 1889, 1887, 1885, 1857, 1875, 1927, 1979, 1986, 1948, 1924, 1946, 1984, 2023, 2050, 2076, 2058, 2039, 2010, 1981, 1952, 1923, 1889, 1856, 1868, 1880, 1890, 1901, 1911, 1921, 1930, 1939, 1902, 1865, 1828, 1792, 1800, 1809, 1818, 1826, 1835, 1843, 1838, 1834, 1829, 1824, 1852, 1880, 1951, 2022, 2046, 2025, 1984, 1943, 1915, 1888, 1861, 1833, 1827, 1820, 1859, 1898, 1895, 1891, 1888, 1885, 1865, 1846, 1826, 1807, 1842, 1877, 1912, 1947, 1981, 2015, 2003, 1992, 1991, 1991, 1990, 1989, 1987, 1984, 2024, 2065, 2069, 2029, 2014, 1998, 1983, 1968, 1953, 1938, 1945, 1953, 1960, 1967, 1986, 2005, 2023, 2042, 2039, 2036, 2033, 2030, 2034, 2038, 1996, 1954, 1910, 1866, 1822, 1778, 1767, 1756, 1790, 1825, 1871, 1918, 1920, 1921, 1916, 1912, 1908, 1903, 1904, 1904, 1904, 1905, 1932, 1959, 1985, 2012, 1976, 1940, 1904, 1868, 1869, 1869, 1870, 1871, 1849, 1826, 1849, 1872, 1889, 1905, 1922, 1938, 1940, 1942, 1944, 1946, 1926, 1906, 1887, 1867, 1881, 1895, 1864, 1833, 1785, 1737, 1739, 1786, 1838, 1890, 1899, 1909, 1920, 1931, 1897, 1863, 1819, 1776, 1752, 1775, 1825, 1875, 1883, 1891, 1890, 1889, 1888, 1886, 1914, 1941, 1965, 1990, 2021, 2007, 1976, 1945, 1965, 2031, 2096, 2116, 2078, 2041, 2000, 1959, 1967, 1976, 1984, 1993, 1978, 1963, 1948, 1934, 1919, 1904, 1889, 1874, 1875, 1876, 1877, 1879, 1911, 1943, 1975, 2008, 2060, 2113, 2120, 2127, 2147, 2167, 2171, 2128, 2049, 2016, 2031, 2092, 2146, 2154, 2084, 1969, 1888, 1883, 1909, 1934, 1926, 1919, 1936, 1909, 1833, 1757, 1729, 1746, 1793, 1839, 1843, 1847, 1877, 1908, 1938, 1968, 1989, 2010, 2031, 2051, 2089, 2126, 2085, 1999, 1887, 1820, 1830, 1841, 1904, 1967, 2053, 2094, 2074, 2010, 1968, 1926, 1917, 1908, 1901, 1895, 1878, 1906, 1908, 1910, 1873, 1836, 1844, 1853, 1835, 1818, 1801, 1784, 1791, 1798, 1805, 1812, 1875, 1939, 2003, 2067, 2067, 2067]
258B067%%J%%%k9l0l0k9n3n2ppk1k1mM2N0Nm0m0%M5J9K0J7J8J7J8OOOOM0M0M0M0m7m7m4m4
253A958l1J5L5L4j2j2j3j2J1J1N4N4J8k7m7m8m7m7kjL0L1L0L1j3j4j3j3n3n4l4J2J8J7K1K0
248A907j3j4l9PK7K8L0L0L9L9j0rk0o5q6q5J5J5J5J5LLM8M8N0M9NMOOOOk4k4k5k4l0l1J4J5
243A931%J%%non1n1j3j4j4j4j6j7j7j6j2j2j1j2P2P3M0l7m0m1L0L0L3L2j3j4K3K3k3k3MMM9
238A873M9K8K7m8m9p7p8p8p7l2l1M4M5O2O1J6J6j5j6j6j5L0L1L1L1k6k5k5k6k5k6k0k1P1J47
234A836J44O9m5q9n2pl4p9n1n1K2K1K1K1j0j0j0j1K2K1O6O7J7J7J7J7NOONK5K4k1k2l0k9l0
230A868l0j6j5j3j3K3O9O6K0k7p3p6l0J6J6k6k7J8J8J8J7J8J8J8J7k0k0lM3O1J6jjLLKL%%
225A960%%k6k5k5k5j7j7j6j7L7L6J7k9n9n9j2L4N6N6N6N5K9j7p0j14r8n3N7J03P4K9j8j9K6
$$ y = [2067, 2067, 2067, 2068, 2068, 2068, 2068, 2039, 2009, 1979, 1950, 1897, 1845, 1838, 1831, 1810, 1789, 1785, 1827, 1877, 1882, 1842, 1802, 1802, 1847, 1866, 1886, 1903, 1921, 1938, 1956, 1962, 1968, 1974, 1980, 2020, 2060, 2100, 2140, 2093, 2046, 2002, 1958, 1927, 1942, 1977, 2011, 1999, 1987, 1974, 1962, 1973, 1984, 2038, 2092, 2110, 2083, 2036, 1988, 1941, 1894, 1892, 1891, 1921, 1952, 1982, 2013, 2000, 1986, 1973, 1960, 1907, 1853, 1819, 1831, 1849, 1866, 1887, 1907, 1894, 1880, 1841, 1848, 1875, 1903, 1933, 1963, 2002, 2041, 2031, 2022, 2002, 1937, 1851, 1766, 1781, 1796, 1811, 1826, 1829, 1832, 1880, 1928, 1978, 2027, 2032, 2036, 2042, 2048, 2054, 2060, 2036, 2012, 1987, 1963, 1933, 1902, 1916, 1931, 1931, 1932, 1932, 1932, 1927, 1921, 1870, 1819, 1806, 1792, 1778, 1764, 1748, 1731, 1714, 1698, 1686, 1674, 1663, 1651, 1723, 1796, 1836, 1799, 1759, 1718, 1748, 1778, 1811, 1843, 1830, 1816, 1839, 1862, 1839, 1816, 1820, 1824, 1873, 1922, 1950, 1977, 1929, 1880, 1803, 1725, 1647, 1570, 1538, 1507, 1551, 1596, 1658, 1719, 1735, 1751, 1736, 1720, 1704, 1689, 1719, 1750, 1781, 1812, 1786, 1761, 1736, 1710, 1685, 1659, 1639, 1618, 1689, 1836, 1980, 2049, 2004, 1915, 1863, 1856, 1822, 1743, 1692, 1641, 1663, 1684, 1705, 1726, 1716, 1706, 1696, 1685, 1707, 1728, 1794, 1861, 1878, 1895, 1912, 1929, 1934, 1940, 1946, 1951, 1976, 2000, 1979, 1957, 1927, 1898, 1868, 1838, 1822, 1807, 1794, 1781, 1804, 1873, 1939, 1959, 1932, 1859, 1783, 1753, 1769, 1785, 1759, 1732, 1750, 1768, 1786, 1803, 1821, 1839, 1857, 1874, 1854, 1834, 1831, 1874, 1935, 1951, 1950, 1949, 1952, 1955, 1957, 1960, 1960, 1960, 1960, 1960, 1934, 1909, 1884, 1859, 1842, 1825, 1809, 1792, 1829, 1865, 1882, 1853, 1794, 1735, 1723, 1757, 1813, 1869, 1925, 1980, 2009, 1992, 1922, 1808, 1710, 1657, 1714, 1817, 1891, 1920, 1902, 1883, 1909]
221A909K7K6K6QPPQN0N0MNj6j7j6j6o4o4m4KK0J9K0K0j5o0q0p9PPQPL2L3L2L2RRRQKKp0o9
215A795m8K8O1O2llllm8m7m5m4K8P3M8M7M0L9L9L9J7J7J6J7onk2o8p4k9J8J9k3k2o8o8k6k7
211A721J9J9O4O5Q7M1K1k4m7m7k2k2j9j8k8J7L8L8j5j5j4j5p1p2k2K4L4L3rrk6k5J9K0J0J0
206A760J0J1ppoppopoM0M0M1M0k1k1j9j8j8K8M8M8l7l7l6l7o7o7m7jL4L5L7L7K5K5K5K5k2
202A808k2k1k2l1l1J4J5J7J7k8k8k5k6K0K0K8K9K8K9PPN0N0N4Qj1j2J2J2pn4j03j04k6K0M5
197A739M6M5M5J4l3n2n2K2K3k3k3m0m0ONM5M4K5k0p2p2n5rQ0Q0O4J7qpj1j1N2N3M9N0J4l2
193A958m9m9mM1J5J6J9J8J9J8m4m5k4K1M6M7jm6r1r0p4k8nmM4M4P2P2K2k4o5o5m9lN5N5L7
188A859qK2K3J9K0J1J2N4N4K3k2m3m2l4l4l4l4k1k0k1k1J8J7km8n6n5qL7J1J0J3J3L2L1P4
$$ y = [1909, 1936, 1962, 1988, 1996, 2003, 2010, 2018, 2068, 2118, 2122, 2127, 2111, 2094, 2078, 2062, 1998, 1934, 1890, 1892, 1912, 1931, 1951, 1971, 1956, 1896, 1816, 1737, 1744, 1751, 1759, 1766, 1798, 1831, 1863, 1895, 1904, 1913, 1922, 1930, 1932, 1934, 1864, 1795, 1747, 1775, 1836, 1898, 1895, 1892, 1889, 1886, 1838, 1791, 1746, 1702, 1730, 1803, 1851, 1898, 1938, 1977, 2016, 2055, 2072, 2089, 2105, 2122, 2116, 2111, 2089, 2021, 1947, 1918, 1936, 1955, 1932, 1910, 1842, 1774, 1748, 1721, 1740, 1759, 1823, 1888, 1975, 2016, 2037, 2013, 1966, 1919, 1897, 1875, 1856, 1838, 1810, 1827, 1865, 1903, 1888, 1873, 1859, 1844, 1773, 1701, 1679, 1703, 1737, 1770, 1761, 1752, 1726, 1701, 1720, 1740, 1750, 1760, 1770, 1781, 1774, 1767, 1761, 1754, 1747, 1741, 1734, 1728, 1768, 1808, 1849, 1889, 1868, 1847, 1828, 1810, 1792, 1820, 1868, 1916, 1879, 1842, 1806, 1769, 1702, 1635, 1588, 1587, 1621, 1656, 1693, 1730, 1755, 1780, 1805, 1830, 1808, 1786, 1765, 1743, 1712, 1681, 1695, 1710, 1727, 1744, 1716, 1688, 1663, 1637, 1657, 1677, 1705, 1734, 1762, 1791, 1798, 1805, 1855, 1905, 1959, 1967, 1956, 1944, 1956, 1968, 1961, 1907, 1804, 1700, 1674, 1694, 1739, 1785, 1830, 1875, 1889, 1856, 1804, 1752, 1774, 1797, 1774, 1751, 1711, 1671, 1677, 1682, 1727, 1771, 1796, 1776, 1704, 1632, 1577, 1568, 1648, 1728, 1792, 1809, 1801, 1794, 1783, 1772, 1824, 1877, 1926, 1976, 1990, 1958, 1909, 1860, 1856, 1897, 1912, 1928, 1947, 1965, 1984, 2002, 1958, 1913, 1889, 1910, 1956, 2003, 2002, 1956, 1865, 1775, 1701, 1673, 1668, 1664, 1708, 1752, 1824, 1896, 1918, 1894, 1829, 1764, 1715, 1712, 1767, 1822, 1859, 1851, 1873, 1896, 1915, 1935, 1946, 1958, 2012, 2066, 2089, 2067, 2024, 1982, 1948, 1914, 1880, 1846, 1825, 1805, 1784, 1763, 1781, 1798, 1796, 1748, 1692, 1637, 1629, 1666, 1677, 1687, 1700, 1713, 1745, 1776, 1850]
184A850P4L5j0l0l0m3m4m3m3l8l8k0K6J5poJ7Jk3k1KK0K0mM1Q6Q5J3J3MMm1m1m5m5rJ4L4P9
179A852P8L3o1j07o4j9PPJ0J0N2N3N3N3j1j2j1j2J0J0PPpn1p2p2m7m8m5m5j9K6M7M6L3L4L3
174A758L3K5K5K3K4m2o5p6l1K9N2M2M2PPl8l9l9l9l9l9J4J4J4J4M3M4M3M4M6M7l0k9j3j3j3
170A845j3k8k8k7k8k8k7k8k7M5M5M5M5j2j1j2j2m3m4m1m1J4N8L3L4N6N6Q2L7k1k0lM2L4L5
166B012J8k8o9o8n2ooolmK6K7K3K3on2n2oM9N0L2j3k4k5p2p3o6o6j6K9P6P6L3L3K9K8OOk6
161A837k7llmmJ9J9L7L6L7L7L4L4j1j1k0j9o2o2m4KK1K1N6N7L6j0r2r3m6JK6K6j6j6K7K7M
156A851Mk4k4k4k5k2k2%JJ0J0l5l5k6k7K1O7Q2L6j1j1PPPP%%%%M2M1K2k4k3k3jm6n3n3oL9
151A739M0M0K0J9l1l2l2l2l8l8PQL3L4L4L4L2L1j9o4n3n2j1j0m3m3KKkjJJN4R9R7N1J1l5l5
$$ y = [1850, 1924, 1959, 1949, 1919, 1889, 1846, 1802, 1759, 1716, 1678, 1640, 1620, 1646, 1661, 1654, 1648, 1665, 1666, 1643, 1622, 1624, 1644, 1664, 1660, 1701, 1787, 1872, 1885, 1898, 1902, 1906, 1865, 1824, 1779, 1734, 1725, 1739, 1773, 1852, 1930, 1963, 1902, 1795, 1731, 1712, 1719, 1726, 1736, 1746, 1798, 1851, 1904, 1957, 1946, 1934, 1923, 1911, 1921, 1931, 1938, 1945, 1938, 1887, 1815, 1743, 1696, 1648, 1603, 1558, 1539, 1565, 1612, 1658, 1691, 1725, 1758, 1791, 1816, 1841, 1864, 1888, 1846, 1781, 1705, 1674, 1703, 1755, 1797, 1839, 1846, 1853, 1815, 1776, 1737, 1698, 1659, 1620, 1634, 1648, 1662, 1676, 1719, 1763, 1806, 1850, 1896, 1943, 1913, 1884, 1871, 1858, 1845, 1832, 1804, 1776, 1749, 1721, 1693, 1666, 1638, 1611, 1656, 1701, 1746, 1791, 1779, 1768, 1756, 1744, 1701, 1657, 1616, 1575, 1589, 1647, 1680, 1714, 1770, 1826, 1908, 1945, 1924, 1904, 1901, 1943, 1977, 2012, 2030, 2002, 1933, 1865, 1813, 1807, 1801, 1795, 1792, 1788, 1814, 1841, 1864, 1887, 1881, 1829, 1777, 1771, 1820, 1870, 1902, 1889, 1865, 1840, 1768, 1695, 1629, 1563, 1547, 1576, 1652, 1728, 1761, 1794, 1823, 1851, 1857, 1863, 1837, 1810, 1807, 1804, 1800, 1796, 1815, 1834, 1871, 1907, 1944, 1981, 2015, 2049, 2038, 2027, 2007, 1988, 1926, 1864, 1820, 1822, 1843, 1864, 1920, 1977, 2013, 2003, 1911, 1818, 1772, 1773, 1799, 1825, 1809, 1793, 1820, 1847, 1851, 1855, 1831, 1807, 1783, 1758, 1736, 1714, 1714, 1715, 1725, 1735, 1700, 1665, 1639, 1612, 1633, 1700, 1782, 1818, 1807, 1796, 1803, 1810, 1817, 1824, 1824, 1824, 1824, 1824, 1866, 1907, 1929, 1905, 1882, 1859, 1858, 1812, 1759, 1706, 1700, 1739, 1779, 1819, 1839, 1858, 1827, 1795, 1763, 1731, 1693, 1655, 1662, 1670, 1703, 1737, 1771, 1805, 1837, 1868, 1849, 1785, 1732, 1680, 1669, 1659, 1616, 1573, 1575, 1577, 1575, 1574, 1575, 1576, 1630, 1729, 1826, 1877, 1888, 1853, 1818]
147A818l5m9m9k9J7J9J9k4k4k9l0J6J6J8J8nmK7K7QPJ4O0Q0P9K8K9j7j8pqqpj0j0j0j0J5J5
142A947J5J6l1l0n0n0l7RK9K9j7j8K5K6Jm4o4o3n2n1kM4M1M0kkLMMLK0J9K0K0j3j2j3j2j3
137A739j2j3j3%jj%jjj%l3l3l0l1l2J4L3L4K0K1K0K0N0N0N0N0j9j9j9j9J0J1J0J1l9l9j9K6
132A794O4O5J7k9n9o0q5l9J9O5O8K2k4k4k6k7l8l8l8l8j1j1j1j1L6L5L6L5L9L9oo%J%%n8n9
128A637q5l9K8K7L0L1J9K0%m6p1p2p1p2MM9O9O9O2O2M3lp4p3%jj1j2j2j1j7j7m3LL5L4L7L7
123A566L4L4L4L3M5M4lm9l5J1N8N8ononl4l4l4l4mnmnk8k8J7J7MLLLm0m0l7l7M4R0Q7M1%m6
118A707k4k3j4j4ON2P5P4J5o2q3q3l8PK6K5K8K8OOl9l9k6k6K5P0N1N1RQj4j4j4j4ononKKK
113A726Jjjj%J8J8k7k7k4k4J8J9m3q9m3KJ%k2K3M2M3%jj3j4j3j4k0k0%M5Q1Q2L9L8POl9l9
$$ y = [1818, 1783, 1734, 1685, 1656, 1673, 1692, 1711, 1687, 1663, 1634, 1604, 1620, 1636, 1654, 1672, 1667, 1663, 1690, 1717, 1725, 1732, 1746, 1806, 1886, 1965, 1993, 2022, 2005, 1987, 1980, 1972, 1964, 1957, 1947, 1937, 1927, 1917, 1932, 1947, 1962, 1978, 1947, 1917, 1867, 1817, 1780, 1789, 1818, 1847, 1830, 1812, 1837, 1863, 1864, 1820, 1756, 1693, 1641, 1590, 1588, 1632, 1673, 1713, 1711, 1709, 1712, 1716, 1720, 1723, 1743, 1762, 1782, 1802, 1789, 1777, 1764, 1752, 1739, 1727, 1714, 1701, 1701, 1700, 1699, 1699, 1698, 1697, 1696, 1696, 1663, 1630, 1600, 1569, 1537, 1551, 1584, 1618, 1638, 1659, 1679, 1699, 1749, 1799, 1849, 1899, 1880, 1861, 1842, 1823, 1833, 1844, 1854, 1865, 1826, 1787, 1768, 1794, 1858, 1923, 1940, 1911, 1852, 1792, 1707, 1668, 1687, 1752, 1820, 1842, 1818, 1794, 1768, 1741, 1703, 1665, 1627, 1589, 1578, 1567, 1556, 1545, 1581, 1616, 1652, 1687, 1726, 1765, 1759, 1753, 1753, 1754, 1754, 1754, 1696, 1637, 1552, 1513, 1541, 1568, 1598, 1629, 1648, 1668, 1668, 1622, 1551, 1479, 1408, 1336, 1340, 1389, 1458, 1527, 1589, 1651, 1694, 1691, 1617, 1544, 1544, 1543, 1532, 1520, 1508, 1497, 1480, 1463, 1420, 1423, 1458, 1492, 1529, 1566, 1600, 1634, 1668, 1701, 1746, 1790, 1787, 1738, 1703, 1714, 1772, 1830, 1824, 1819, 1813, 1808, 1774, 1740, 1706, 1672, 1668, 1663, 1659, 1654, 1626, 1598, 1615, 1632, 1636, 1639, 1642, 1645, 1605, 1565, 1528, 1491, 1535, 1625, 1712, 1753, 1753, 1707, 1683, 1660, 1646, 1632, 1638, 1690, 1765, 1839, 1854, 1792, 1709, 1626, 1588, 1595, 1621, 1646, 1674, 1702, 1708, 1714, 1675, 1636, 1610, 1584, 1609, 1679, 1730, 1781, 1790, 1798, 1784, 1770, 1756, 1742, 1736, 1731, 1725, 1720, 1722, 1724, 1726, 1727, 1726, 1725, 1724, 1724, 1742, 1760, 1733, 1706, 1682, 1658, 1676, 1695, 1652, 1563, 1520, 1522, 1523, 1523, 1501, 1524, 1566, 1609, 1609, 1608, 1595, 1581, 1568, 1554, 1534, 1514, 1514, 1559, 1640, 1722, 1761, 1799, 1806, 1812, 1773, 1734]
108A734l0l1J5J5J4J3J4J4j0j0j0j1J5J4M0nl0k9J3J4k6k5K0K0K5K6k0k0m6m5k6J9K6K5K8
104A730K9N0N1k5k4m0l9o4k0L9L8K2k4j2j1j5j4J6J6l2p6o1j5L2L2L1L1J2l4k3k3K0K0L6L6
99A689O2J7m7m7n0n0k4k4J9J9K6k0m0m0k1k1k1k0J8J8J8J8OOPOL7L8L5L4L3j3l3l2k1k0K7
95A589P3O7K2k5k6J1J1pn1m2MK1K1mnnmrqqrnoklj8K7M7M8LMm2m2j4j3L2L1K3K2k3k3o5o4
89A533j4L1K0K0k2k3j1j1j1j0J3J2J3J3nnmnK1K2K2K1K9K9K9K9m6m6m5m6k0j9N3N3L5j1j1
85A633L4N4N4Ol9j7j6Rl6o6k0L3P7Q0Q0OPn0n0n0n0nnonOOOOOOOOk9k9k9k9kkk1o7q0q1l3
80A304J3L6L6L9L9J1J1J2J1L0L0L1L0RJ0RJ0k5k4k5k5mmmnK3K2K2K3L5L5L6L5OOOOK6K6k0
75A842k0ononm1m0m1m0m1m0m1m0KKKKL1L1j5j5j7j7K9K9O0N9J8J7K1O6Q4Pn5n4j5j4k3k4m9
$$ y = [1734, 1704, 1673, 1688, 1703, 1717, 1730, 1744, 1758, 1748, 1738, 1728, 1717, 1732, 1746, 1786, 1781, 1751, 1722, 1735, 1749, 1723, 1698, 1718, 1738, 1763, 1789, 1769, 1749, 1703, 1658, 1632, 1651, 1677, 1702, 1730, 1759, 1809, 1860, 1835, 1811, 1771, 1732, 1668, 1648, 1687, 1725, 1747, 1723, 1711, 1700, 1685, 1671, 1687, 1703, 1671, 1595, 1534, 1519, 1551, 1583, 1614, 1645, 1657, 1623, 1600, 1577, 1597, 1617, 1653, 1689, 1751, 1768, 1721, 1674, 1624, 1574, 1550, 1526, 1545, 1564, 1590, 1570, 1530, 1490, 1469, 1448, 1427, 1407, 1425, 1443, 1461, 1479, 1485, 1491, 1498, 1504, 1541, 1579, 1614, 1648, 1681, 1668, 1635, 1603, 1582, 1562, 1589, 1662, 1729, 1751, 1726, 1700, 1711, 1722, 1715, 1664, 1622, 1626, 1647, 1668, 1664, 1659, 1654, 1650, 1641, 1633, 1625, 1616, 1611, 1605, 1603, 1600, 1582, 1609, 1656, 1704, 1707, 1711, 1669, 1627, 1613, 1600, 1632, 1663, 1686, 1708, 1685, 1662, 1597, 1533, 1519, 1550, 1570, 1590, 1568, 1545, 1534, 1523, 1512, 1502, 1515, 1527, 1540, 1553, 1548, 1543, 1539, 1534, 1555, 1577, 1599, 1620, 1649, 1678, 1707, 1736, 1690, 1644, 1599, 1553, 1533, 1514, 1567, 1620, 1655, 1644, 1633, 1667, 1721, 1775, 1781, 1742, 1725, 1709, 1718, 1682, 1616, 1596, 1629, 1706, 1786, 1866, 1872, 1879, 1829, 1779, 1729, 1679, 1674, 1669, 1663, 1658, 1664, 1670, 1676, 1682, 1688, 1694, 1700, 1706, 1677, 1648, 1619, 1590, 1588, 1586, 1565, 1498, 1418, 1337, 1304, 1317, 1353, 1389, 1428, 1467, 1478, 1489, 1501, 1512, 1542, 1572, 1603, 1633, 1642, 1652, 1661, 1671, 1646, 1622, 1597, 1572, 1568, 1564, 1560, 1555, 1578, 1600, 1622, 1645, 1680, 1715, 1751, 1786, 1792, 1798, 1804, 1810, 1836, 1862, 1842, 1822, 1816, 1811, 1805, 1800, 1759, 1719, 1678, 1638, 1597, 1557, 1516, 1476, 1478, 1480, 1482, 1484, 1515, 1546, 1531, 1516, 1499, 1482, 1511, 1540, 1600, 1659, 1677, 1694, 1715, 1781, 1865, 1872, 1817, 1763, 1748, 1734, 1711, 1687, 1638]
70A638mL8L8M1M0NNMNppppNNMNPQPPk2k3K3K3J6J6J6J6qpqqk7k7k7k6k7k7k7k7j5j5j6j5J5
64A603J6J5J6K4K4K1K2on1o7o8o9k3JM7P3P4P4P3M4jm9m8l3J3j3j2oopoppn2n3l8l8PPJ2J3
59A519N8N7O2O2j4j5m9n0l0J5M3M2j%k7k6k6k6j8j7j8j7j5j4j2j1j7L0M9M9J0J1l5l4l1l0
55A474M6M6K1K1K1K1j1j1j1j1L8L8pql8l9l9l8J3J4J4J4L3L2L3L3j7j6j7j6o3o3o0o1kM3O3
50A490O4kjjkM1M1L8L8Nm1o0o1l7l7QRJ9K0k6k6k1k1K4K4J5J5J4J5NMNML0L1J0l6l1l1J1J2
45A558RJ0OPm3q8j05l0N8N8M2kJ6J6J3J3J6J6O1O2J2J3l4l3j3j2L0K9j2n9n2n3jM5O1O2O3
41A739J7l3l2m3m2LMppl3J3J6J6k7k7J0J0J1J0K3K3j9k0k3K3K0K0j3j2L4Q0J01N5k3k3k6k7
36A791m9m9l0l0ppk6k6klnmm8m7k2K3M4M3RRJ0Rj7j6K9K9L2L3j4j3j3j3L2L2K5K5k1k1l9l8
$$ y = [1638, 1634, 1672, 1710, 1751, 1791, 1796, 1801, 1805, 1810, 1803, 1796, 1789, 1782, 1787, 1792, 1796, 1801, 1808, 1816, 1823, 1830, 1808, 1785, 1808, 1831, 1847, 1863, 1879, 1895, 1887, 1880, 1872, 1864, 1837, 1810, 1783, 1757, 1730, 1703, 1676, 1649, 1634, 1619, 1603, 1588, 1603, 1619, 1634, 1650, 1674, 1698, 1719, 1741, 1735, 1684, 1617, 1549, 1480, 1457, 1458, 1505, 1578, 1652, 1726, 1799, 1843, 1842, 1793, 1745, 1712, 1725, 1712, 1700, 1694, 1688, 1681, 1675, 1668, 1661, 1609, 1556, 1518, 1480, 1487, 1494, 1506, 1519, 1577, 1634, 1696, 1758, 1744, 1729, 1680, 1630, 1600, 1615, 1658, 1700, 1699, 1699, 1672, 1646, 1620, 1594, 1576, 1559, 1541, 1524, 1509, 1495, 1483, 1472, 1455, 1485, 1534, 1583, 1593, 1604, 1569, 1535, 1504, 1474, 1520, 1566, 1587, 1608, 1629, 1650, 1639, 1628, 1617, 1606, 1644, 1682, 1675, 1667, 1629, 1590, 1551, 1513, 1526, 1540, 1554, 1568, 1601, 1633, 1666, 1699, 1682, 1666, 1649, 1633, 1570, 1507, 1447, 1386, 1384, 1427, 1490, 1554, 1552, 1551, 1550, 1548, 1589, 1630, 1668, 1706, 1711, 1670, 1610, 1549, 1512, 1475, 1483, 1492, 1511, 1531, 1505, 1479, 1458, 1437, 1461, 1485, 1500, 1515, 1529, 1544, 1549, 1553, 1558, 1562, 1592, 1623, 1633, 1597, 1566, 1535, 1546, 1558, 1567, 1577, 1583, 1590, 1547, 1459, 1354, 1324, 1382, 1440, 1482, 1480, 1496, 1512, 1525, 1538, 1554, 1570, 1631, 1693, 1705, 1718, 1684, 1651, 1638, 1626, 1656, 1685, 1673, 1614, 1562, 1509, 1508, 1553, 1614, 1676, 1739, 1756, 1723, 1691, 1648, 1606, 1609, 1613, 1606, 1599, 1566, 1579, 1595, 1611, 1584, 1557, 1567, 1577, 1588, 1598, 1621, 1644, 1625, 1605, 1582, 1605, 1625, 1645, 1632, 1620, 1654, 1734, 1835, 1890, 1867, 1844, 1818, 1791, 1742, 1693, 1663, 1633, 1626, 1619, 1593, 1567, 1565, 1562, 1557, 1553, 1505, 1458, 1436, 1459, 1503, 1546, 1555, 1564, 1574, 1583, 1566, 1550, 1579, 1608, 1640, 1673, 1659, 1646, 1633, 1620, 1652, 1684, 1709, 1734, 1713, 1692, 1653, 1615]
31A615j9K6P7P8K9j6k7k7J6J5J0J0J0J0j4j5LM8M7Km1m1RQ6J19J18N6N6L6L7O8J14K00K45
27B940K61K61K34J88P4r3k15k90k78k32j84j85j17p3n2n3j07j07o1o2n1n2ooklnM0N9N8J2
23A893l5m2m2%%j4j5l7l7j1j2ON1N3Pm0m1J7J6k9k9l0k9n0m9k9J6opmM2J6J6j9j8j8j9K1K0
19A512K1K0K1K0k4k5j5j5QQLKm0m0j8K7M8M7L3L2j3j3j2j1j1j1j3j3j3j3j0j0pqj0L5N5N5
14A602J3J2pn3o4o4J3N9K6K5OOkjjjK4K4K4K4ppppk7k6k6k6L9M0L9M0k8k8k8k8l1l2K9N1N0
9A645Mj1j1k3K2L9L9K0k5m3m4o0l8kM4L1Rk1k1j0j0j1j0JKJJm0m0OOJ7J7J7J7RRN5N4M0M1
4A726onK4K4Km3q2j05r3j6K8K9L3L3j3j3j3j3M4M4M4M4K2K2K2K3L3L3j3j2k4k3k4k4J4J5l2
-1A705l1m0m0l9m0J6J6J7J6J5J6km7m2MK1K0ooRj3j2L4L2j3m5m4kjj%%jl6l6o2j7K0K0K2K3
$$ y = [1615, 1596, 1622, 1699, 1777, 1806, 1790, 1763, 1736, 1752, 1767, 1777, 1787, 1797, 1807, 1793, 1778, 1781, 1829, 1876, 1878, 1837, 1796, 1805, 1891, 2010, 2128, 2184, 2240, 2276, 2313, 2381, 2495, 2695, 2940, 3201, 3462, 3696, 3884, 3958, 3865, 3650, 3360, 3082, 2850, 2666, 2481, 2364, 2291, 2239, 2186, 2079, 1972, 1911, 1849, 1798, 1746, 1740, 1734, 1732, 1729, 1724, 1764, 1823, 1881, 1893, 1858, 1816, 1774, 1774, 1774, 1760, 1745, 1708, 1671, 1660, 1648, 1654, 1705, 1758, 1765, 1725, 1684, 1701, 1717, 1688, 1659, 1629, 1600, 1550, 1501, 1472, 1488, 1482, 1475, 1471, 1513, 1529, 1545, 1526, 1508, 1490, 1471, 1492, 1512, 1533, 1553, 1574, 1594, 1570, 1545, 1530, 1515, 1523, 1531, 1534, 1536, 1496, 1456, 1438, 1465, 1513, 1560, 1593, 1625, 1612, 1599, 1587, 1576, 1565, 1554, 1541, 1528, 1515, 1502, 1492, 1482, 1475, 1467, 1457, 1492, 1547, 1602, 1615, 1627, 1620, 1567, 1503, 1439, 1452, 1511, 1537, 1562, 1568, 1574, 1572, 1571, 1570, 1569, 1593, 1617, 1641, 1665, 1658, 1651, 1644, 1637, 1610, 1584, 1558, 1532, 1571, 1611, 1650, 1690, 1662, 1634, 1606, 1578, 1547, 1515, 1544, 1595, 1645, 1649, 1638, 1627, 1604, 1626, 1665, 1704, 1724, 1699, 1656, 1612, 1552, 1514, 1512, 1556, 1587, 1596, 1575, 1554, 1544, 1534, 1523, 1513, 1514, 1516, 1517, 1518, 1478, 1438, 1444, 1450, 1467, 1484, 1501, 1518, 1527, 1536, 1591, 1645, 1685, 1726, 1720, 1715, 1739, 1763, 1765, 1722, 1640, 1535, 1442, 1426, 1454, 1483, 1516, 1549, 1536, 1523, 1510, 1497, 1541, 1585, 1629, 1673, 1695, 1717, 1739, 1762, 1795, 1828, 1815, 1803, 1779, 1756, 1732, 1708, 1722, 1737, 1705, 1674, 1634, 1594, 1555, 1515, 1531, 1547, 1564, 1580, 1595, 1611, 1609, 1562, 1520, 1524, 1545, 1565, 1559, 1553, 1562, 1549, 1537, 1571, 1603, 1590, 1545, 1501, 1499, 1498, 1497, 1497, 1497, 1496, 1460, 1424, 1362, 1345, 1365, 1385, 1407, 1430]
-6A430M6M6M3M3J4l1n2n1m6m6%jL1L1j2j1L0P5M7M7J6k9m9n0m6m6m4m4m5%P7P8M6JK6K6L6
-10A586L6N9J3m2q8r1m6ppnmK2K2K2K2K6K6K6K6%jj%J%JJM0M0l5l5J4J4on1n9n9n9n9n5j0
-15A277J0J0jjM4M4L7L8j3n8n7n6J6J7J9K0J9J9J0J0J0J0P1P2N1Ol0l0l3l3LMLMNNL1j4n4
-20A485n4J9J9KKm3m4m3m3m3m3J1J1J1J1%j%jJ1J1l0l0j3O3R4R3M7Jj8j9k2k2m8kL8L9on2
-25A391k9J7L4L3POOOrj0rj0J8J8km7m2m2K8K9K0k6%%L7L7L8L7mnmnj3j3j0j1J6O0J04N8L
-30A712m3k0j9j7j7j7j7j7j8K8K8LKLKj6j7j7j6K0K0Jm6k9l0J3J3K0K1O3O3J5l0n1n0j3j4
-34A513j3j3K5K6K5K6jjmml7q3q2l8J0RJ2J2N3N3k3k3%JK6j9n8n9j6j5L1L2L1L2P4P4J1o5
-39A522r2r2j5K9K0K0K2K3k5k5k1k2j7K8M6M5K2k3KKQRQRJ1J1J2J1l1l2J4J4L3L3j3j2l0k9
$$ y = [1430, 1476, 1522, 1565, 1608, 1622, 1591, 1539, 1488, 1442, 1396, 1396, 1395, 1426, 1457, 1445, 1434, 1464, 1539, 1586, 1633, 1649, 1620, 1571, 1521, 1475, 1429, 1385, 1341, 1296, 1296, 1373, 1451, 1497, 1498, 1524, 1550, 1586, 1622, 1681, 1694, 1652, 1564, 1473, 1427, 1420, 1413, 1408, 1404, 1426, 1448, 1470, 1492, 1518, 1544, 1570, 1596, 1596, 1595, 1594, 1594, 1595, 1595, 1596, 1597, 1637, 1677, 1642, 1607, 1621, 1635, 1629, 1578, 1519, 1460, 1401, 1342, 1287, 1277, 1287, 1297, 1296, 1295, 1339, 1383, 1420, 1458, 1445, 1387, 1330, 1274, 1290, 1307, 1326, 1346, 1365, 1384, 1394, 1404, 1414, 1424, 1495, 1567, 1618, 1624, 1594, 1564, 1531, 1498, 1501, 1505, 1508, 1512, 1517, 1522, 1553, 1539, 1485, 1431, 1450, 1469, 1471, 1473, 1430, 1386, 1343, 1300, 1257, 1214, 1225, 1236, 1247, 1258, 1258, 1257, 1257, 1256, 1267, 1278, 1248, 1218, 1205, 1268, 1362, 1455, 1502, 1503, 1485, 1466, 1444, 1422, 1374, 1372, 1410, 1449, 1443, 1391, 1362, 1379, 1413, 1446, 1453, 1459, 1465, 1471, 1462, 1452, 1443, 1433, 1451, 1469, 1467, 1420, 1378, 1336, 1364, 1393, 1413, 1387, 1387, 1387, 1424, 1461, 1499, 1536, 1532, 1527, 1523, 1518, 1505, 1492, 1482, 1471, 1487, 1547, 1651, 1709, 1712, 1669, 1649, 1630, 1613, 1596, 1579, 1562, 1545, 1527, 1555, 1583, 1586, 1588, 1591, 1593, 1577, 1560, 1543, 1527, 1547, 1567, 1568, 1522, 1493, 1463, 1476, 1489, 1509, 1530, 1593, 1656, 1671, 1641, 1590, 1540, 1527, 1513, 1500, 1487, 1512, 1538, 1563, 1589, 1588, 1587, 1583, 1579, 1542, 1459, 1377, 1339, 1349, 1358, 1370, 1382, 1435, 1488, 1465, 1442, 1442, 1443, 1469, 1450, 1392, 1333, 1317, 1302, 1333, 1365, 1396, 1428, 1502, 1576, 1587, 1522, 1430, 1338, 1323, 1352, 1372, 1392, 1414, 1437, 1412, 1387, 1366, 1344, 1327, 1355, 1401, 1446, 1468, 1445, 1447, 1449, 1457, 1466, 1474, 1483, 1494, 1505, 1517, 1528, 1497, 1465, 1479, 1493, 1526, 1559, 1546, 1534, 1504, 1475]
-44A475l0k9k4k3K1K2M0M0L9M0K9K8K8K9MNm1m1l4l4l4l5M1M2M1M1m3m4m0m0l9OK6K6kkm7
-48A441m8m1m1NNL6L6L6L6rrL6L6L9M0pom4m5k4K1JJMLLKKLj7j6j7j7jjjjJ5J5qqk8k8J8J7
-54A434J6J7l0k9k3k3k3k3rj0L6L6OPOORRJ0Rj6j5j6j5m4m4KJL1L0j5j6K5K4K5K5N1N2N2N2
-58A620n1n0n1n0J5J5J4J5MLMMqqqqmmm9n0k5k5N1N0N8N7J2J2L0L1L1L1LKm2m3l1l1n4n4m5
-64A371m6k2k3M9N0M9N0K9K9K9K9M1M1nmnonoj4j5j5j4j%%jm6m7jjk6k7k6k7lklkQRRRK0K1
-69A450K1K1KKKKl4l3l4l4J0J0N3N3N9J4ooJ3J3rrrrrrm9m9m7m6j5L0N0N0M9N0jm6o2o2m0
-74A336l9j1L5Q2Q2N2Oj4j4j3j2j3j3KK%jOl9m0ON4N4J1J1rj0j0j0j1j1QN4M6M5k7k8l0l1
-79A506l0l1K3K3K3K3K5K4M5M4J4l2n1n2K7K8k1o5o0j5LLooL7L6Rl8n7n7rrj0rK2K2K2K2J0
$$ y = [1475, 1445, 1416, 1392, 1369, 1390, 1412, 1452, 1492, 1531, 1571, 1600, 1628, 1656, 1685, 1689, 1694, 1653, 1612, 1578, 1544, 1510, 1475, 1516, 1558, 1599, 1640, 1597, 1553, 1513, 1473, 1434, 1440, 1466, 1492, 1490, 1488, 1441, 1393, 1352, 1311, 1316, 1321, 1357, 1393, 1429, 1465, 1456, 1447, 1483, 1519, 1558, 1598, 1591, 1585, 1541, 1496, 1472, 1493, 1494, 1495, 1499, 1502, 1505, 1507, 1509, 1512, 1495, 1479, 1462, 1445, 1444, 1443, 1442, 1441, 1456, 1471, 1463, 1455, 1427, 1399, 1417, 1434, 1450, 1467, 1437, 1408, 1385, 1362, 1339, 1316, 1307, 1297, 1333, 1369, 1375, 1382, 1388, 1394, 1403, 1412, 1422, 1431, 1415, 1400, 1384, 1369, 1325, 1281, 1283, 1284, 1315, 1345, 1330, 1314, 1339, 1363, 1388, 1413, 1464, 1516, 1568, 1620, 1569, 1519, 1468, 1418, 1433, 1448, 1462, 1477, 1481, 1484, 1488, 1492, 1484, 1476, 1468, 1460, 1456, 1452, 1403, 1353, 1328, 1303, 1354, 1404, 1462, 1519, 1531, 1543, 1573, 1604, 1635, 1666, 1669, 1671, 1629, 1586, 1555, 1524, 1470, 1416, 1371, 1325, 1303, 1280, 1329, 1379, 1428, 1478, 1507, 1536, 1565, 1594, 1635, 1676, 1671, 1667, 1662, 1656, 1651, 1645, 1631, 1616, 1601, 1587, 1586, 1586, 1586, 1585, 1539, 1492, 1491, 1490, 1464, 1437, 1411, 1384, 1381, 1379, 1376, 1374, 1382, 1391, 1400, 1409, 1429, 1450, 1471, 1492, 1494, 1496, 1498, 1500, 1466, 1433, 1399, 1365, 1375, 1385, 1438, 1491, 1550, 1564, 1558, 1552, 1565, 1578, 1569, 1560, 1551, 1542, 1533, 1524, 1475, 1426, 1379, 1333, 1318, 1348, 1398, 1448, 1497, 1547, 1546, 1500, 1438, 1376, 1336, 1297, 1286, 1321, 1403, 1485, 1537, 1543, 1529, 1515, 1502, 1490, 1477, 1464, 1466, 1468, 1468, 1467, 1473, 1434, 1394, 1400, 1454, 1508, 1519, 1530, 1521, 1511, 1501, 1491, 1480, 1469, 1477, 1531, 1577, 1622, 1595, 1567, 1537, 1506, 1476, 1445, 1468, 1491, 1514, 1537, 1562, 1586, 1631, 1675, 1689, 1657, 1606, 1554, 1581, 1609, 1588, 1523, 1463, 1448, 1451, 1454, 1448, 1442, 1479, 1515, 1524, 1486, 1429, 1372, 1363, 1354, 1344, 1335, 1357, 1379, 1401, 1423, 1433]
-84A433RJ0J0j7j7j7j7POOPL3L2L3L3l2l1l2l1J7J8J8J7l1l1l1l1k3k3K3K3LLONj3L3P9Q0
-88A567M6%j9k0n3n4n3n4m0m0j9K5N9N9K8m7n6n5rL6K7K7L3L3M5Q9Q8M1j9o5o7k2MLPPk3k3
-93A486k3k3qqn4n3l5l5J1J1L0L1K7K7K8j8l5l5j1L5N5N4N2N2OPJ6J6nm9o9o8k6k6j9k0j9
-98A305j9j6j6MN0O7O7K5K4K7K6K6K7l4l3l4l3JJ%Jkk%JL6Q3Q2L6k3k3k6k6m2m2m2m2k6k6
-102A382K0J9L9L8J9k7k6k6J6J7J5J5j1L5M0M1jkm8m9k8J7RRJ1J2nnmno2o3o2o2k8k9k8k8
-107A155K6K6K6K6M8M8M7M8N0N0k6k5j2j2L4L4J8J7km8n8n9m1NN6N7Q2L7j9o5m2m1k2k2k2
-111A374k1OPl6l6k2K3M2M3P4P4N4Rj5j5j8j8j8j8j7j8J5J5O1O0K7K7j9j9o6o5o3o3l4J1O1
-116A402O2M3M3klRRRRk1k1k2k1k8k8J5J4km9m8lK9K8L1L2j3j3j3j2K1K1K2K1k1k1m6jL7L8
$$ y = [1433, 1442, 1452, 1462, 1445, 1428, 1411, 1394, 1401, 1407, 1413, 1420, 1453, 1485, 1518, 1551, 1519, 1488, 1456, 1425, 1442, 1460, 1478, 1495, 1464, 1433, 1402, 1371, 1348, 1325, 1348, 1371, 1374, 1377, 1383, 1388, 1375, 1408, 1487, 1567, 1613, 1613, 1594, 1574, 1521, 1467, 1414, 1360, 1320, 1280, 1261, 1286, 1345, 1404, 1432, 1385, 1329, 1274, 1265, 1301, 1328, 1355, 1388, 1421, 1466, 1555, 1643, 1684, 1665, 1600, 1533, 1511, 1515, 1518, 1525, 1532, 1509, 1486, 1463, 1440, 1432, 1424, 1370, 1317, 1282, 1247, 1258, 1269, 1299, 1330, 1357, 1384, 1412, 1394, 1359, 1324, 1313, 1348, 1403, 1457, 1509, 1561, 1567, 1574, 1590, 1606, 1601, 1552, 1483, 1415, 1389, 1363, 1344, 1324, 1305, 1286, 1270, 1254, 1258, 1308, 1375, 1442, 1467, 1491, 1518, 1544, 1570, 1597, 1563, 1530, 1496, 1463, 1464, 1465, 1465, 1466, 1464, 1462, 1462, 1463, 1499, 1582, 1664, 1700, 1677, 1654, 1628, 1602, 1560, 1518, 1476, 1434, 1408, 1382, 1402, 1421, 1460, 1498, 1517, 1490, 1464, 1438, 1454, 1471, 1486, 1501, 1490, 1525, 1565, 1606, 1605, 1603, 1555, 1506, 1478, 1495, 1504, 1513, 1524, 1536, 1531, 1526, 1522, 1517, 1455, 1392, 1330, 1268, 1240, 1211, 1183, 1155, 1181, 1207, 1233, 1259, 1307, 1355, 1402, 1450, 1500, 1550, 1524, 1499, 1487, 1475, 1509, 1543, 1561, 1578, 1576, 1528, 1470, 1411, 1370, 1375, 1431, 1488, 1570, 1607, 1588, 1523, 1481, 1440, 1418, 1396, 1374, 1353, 1359, 1366, 1330, 1294, 1272, 1295, 1337, 1380, 1454, 1528, 1582, 1591, 1576, 1561, 1543, 1525, 1507, 1489, 1472, 1454, 1469, 1484, 1545, 1605, 1632, 1659, 1640, 1621, 1555, 1490, 1427, 1364, 1330, 1341, 1402, 1464, 1507, 1550, 1548, 1545, 1554, 1563, 1572, 1581, 1560, 1539, 1517, 1496, 1468, 1440, 1455, 1469, 1467, 1418, 1370, 1367, 1396, 1424, 1455, 1487, 1474, 1461, 1448, 1436, 1457, 1478, 1500, 1521, 1500, 1479, 1433, 1432, 1469, 1507]
-120A507K1k5k0k1k3k4QQQQJ3J3J3J3l6l6l6l6MNMNJ8J9k6k7KKKLk5k4k4k4l0k9J5J6M5M4
-125A330M5M4L1L1j2j2l0J4O5O5M7M6JKm9m8k8J7J6J7J6J7J8k7p5p4p2k5ooJ6J6J6J6J0J1
-130A443J0J1jjjjM3M3M0M1L9on7n6l5l5j5L1N1N2k2k1LML0j6m0m0LLkkkjk5k5K1K1MLLLm3
-135A455m3m3m4k7k8n3pK1K0K1K1M0nk5k5K7K7K7K7NOo8o7k0K7K6j9llnoj7j6K8K9LLM5M6
-140A380Jm3j8j8J5J5L5Q1J16J15O8K3j4j4o0o0o4j8KKj5j4j5j5k3k4k3k3jjjjO7O6M7Jp2
-144A497p1n5rRRJ1J2ONONONOOJ4J3J4J4k8k8k7k8NOONk8k9k8k8NNONl7l7J3N8M6M6LLm6m6
-150A325m3m3jM5J8J9mlM1M2L0L0K7K8k4p0o9k4L3L3J6k9m7m8j7N9O6O6onppppL6L7L6L6L4
-154A596L3L4L3l1l1p4p4m3LK3K3K1K1K1K1l6l5j6L0N5N6J3J3j3j2j3j2n9n8j3j3J1J1J1J1
$$ y = [1507, 1528, 1503, 1483, 1462, 1439, 1415, 1423, 1431, 1439, 1447, 1460, 1473, 1486, 1499, 1463, 1427, 1391, 1355, 1359, 1364, 1368, 1373, 1391, 1410, 1384, 1357, 1359, 1361, 1363, 1366, 1341, 1317, 1293, 1269, 1239, 1210, 1225, 1241, 1286, 1330, 1375, 1419, 1450, 1481, 1469, 1457, 1427, 1441, 1506, 1571, 1618, 1664, 1665, 1667, 1618, 1570, 1542, 1559, 1575, 1592, 1608, 1625, 1643, 1616, 1541, 1467, 1395, 1370, 1364, 1358, 1374, 1390, 1406, 1422, 1432, 1443, 1453, 1464, 1463, 1462, 1461, 1460, 1503, 1546, 1586, 1627, 1666, 1660, 1603, 1547, 1512, 1477, 1462, 1493, 1544, 1596, 1574, 1553, 1556, 1560, 1590, 1574, 1534, 1494, 1497, 1500, 1498, 1496, 1494, 1493, 1468, 1443, 1464, 1485, 1489, 1492, 1495, 1498, 1455, 1412, 1369, 1325, 1298, 1270, 1217, 1210, 1231, 1251, 1272, 1293, 1333, 1328, 1303, 1278, 1305, 1332, 1359, 1386, 1391, 1397, 1329, 1262, 1242, 1269, 1295, 1276, 1273, 1270, 1265, 1259, 1242, 1226, 1254, 1283, 1286, 1289, 1334, 1380, 1381, 1338, 1320, 1302, 1317, 1332, 1367, 1448, 1564, 1679, 1747, 1770, 1756, 1742, 1682, 1622, 1558, 1540, 1542, 1544, 1529, 1515, 1500, 1485, 1462, 1438, 1415, 1392, 1391, 1390, 1389, 1388, 1455, 1521, 1568, 1569, 1497, 1426, 1371, 1362, 1371, 1380, 1391, 1403, 1409, 1414, 1420, 1425, 1431, 1436, 1442, 1448, 1462, 1475, 1489, 1503, 1475, 1447, 1420, 1392, 1397, 1403, 1409, 1414, 1386, 1357, 1329, 1301, 1306, 1311, 1317, 1322, 1285, 1248, 1261, 1319, 1365, 1411, 1414, 1417, 1371, 1325, 1282, 1239, 1238, 1283, 1301, 1320, 1316, 1313, 1354, 1396, 1426, 1456, 1483, 1511, 1487, 1417, 1348, 1324, 1357, 1390, 1406, 1377, 1330, 1282, 1265, 1324, 1390, 1456, 1450, 1445, 1438, 1431, 1424, 1417, 1453, 1490, 1526, 1562, 1596, 1629, 1663, 1696, 1665, 1634, 1560, 1486, 1443, 1446, 1469, 1492, 1513, 1534, 1555, 1576, 1540, 1505, 1489, 1519, 1574, 1630, 1643, 1656, 1643, 1631, 1618, 1606, 1547, 1489, 1476, 1463, 1474, 1485, 1496, 1507]
-159A507pqpqnmnmj3j3L2L3kjk7J8J3J3J4J3k6p1m6m5j5j6j5j5J9J9J9J9J4J4J3J4P3P3K2
-164A589k3l1l2l4l4j3j2j3j2QRQRM0L9M0M0M8M9K8j7l8l8m0m1k3k3k3k3O4O4M4jm2m2m2m2
-168A440rL7N6N7NNNNj8j9j8j9k3k4k4k3kkkkn1n1l1J5LLm0l9j3j2L3L3M1M2mmJ4J5J4J5N8
-173A466N8Q4L8j1j2j4j5l5l5p8p8l5J0L1L0l2l3J4J3ononK3K3k3k2RQRRL8L8M0no9o8n2o
-178A296j0j0opJ1J1J2J1J1J2J1J1M4M3M3M3lmk6k7J%k0o5n2n2l2l2j7j8K7K8K5K4O7O7N1
-182A468Nj4j5q5q4q2oO2O1M7Jm8m8K6P2R5N0KKqpQN3M7k9q9q9n9n8j4j3K3K3%JK8K9L1j4
-187A372%JM0L9J5l1rL8M8M9OOj1j1l3l4j3j2j3j3m5m5p1k5M2M2M5M4N2N2N5J0k0k0o5o5p6
-192A344k9K0K1j2j2j2j2J9K0J9K0lmllk2k2k2k2lklklklkj4j4j5j4l4l4M4Q9P0K5k3k3J1
$$ y = [1507, 1500, 1492, 1485, 1477, 1472, 1468, 1463, 1459, 1446, 1433, 1465, 1498, 1496, 1495, 1468, 1486, 1499, 1512, 1526, 1539, 1513, 1442, 1396, 1351, 1336, 1320, 1305, 1290, 1309, 1328, 1347, 1366, 1380, 1394, 1407, 1421, 1494, 1567, 1589, 1566, 1535, 1503, 1469, 1435, 1422, 1410, 1397, 1385, 1393, 1402, 1410, 1419, 1459, 1498, 1538, 1578, 1626, 1675, 1703, 1686, 1648, 1610, 1570, 1529, 1506, 1483, 1460, 1437, 1501, 1565, 1609, 1608, 1566, 1524, 1482, 1440, 1431, 1468, 1524, 1581, 1586, 1591, 1596, 1601, 1583, 1564, 1546, 1527, 1504, 1480, 1456, 1433, 1431, 1429, 1427, 1425, 1374, 1323, 1292, 1307, 1310, 1313, 1273, 1234, 1221, 1209, 1242, 1275, 1316, 1358, 1354, 1350, 1364, 1379, 1393, 1408, 1466, 1524, 1608, 1646, 1635, 1623, 1609, 1594, 1559, 1524, 1446, 1368, 1333, 1343, 1374, 1404, 1372, 1339, 1353, 1366, 1360, 1355, 1349, 1344, 1367, 1390, 1367, 1345, 1354, 1362, 1371, 1380, 1418, 1456, 1496, 1491, 1422, 1354, 1302, 1296, 1286, 1276, 1270, 1263, 1274, 1285, 1297, 1308, 1319, 1331, 1342, 1353, 1397, 1440, 1483, 1526, 1523, 1519, 1493, 1466, 1467, 1467, 1447, 1382, 1330, 1278, 1246, 1214, 1197, 1179, 1206, 1234, 1259, 1283, 1350, 1417, 1468, 1473, 1459, 1444, 1359, 1275, 1193, 1187, 1249, 1310, 1357, 1358, 1310, 1262, 1288, 1360, 1455, 1505, 1507, 1509, 1501, 1494, 1502, 1555, 1602, 1573, 1484, 1395, 1336, 1278, 1264, 1251, 1274, 1297, 1297, 1298, 1326, 1355, 1386, 1372, 1372, 1373, 1413, 1452, 1467, 1436, 1427, 1465, 1513, 1562, 1568, 1574, 1563, 1552, 1519, 1485, 1472, 1460, 1447, 1434, 1389, 1344, 1273, 1248, 1290, 1332, 1377, 1421, 1473, 1525, 1580, 1590, 1570, 1550, 1485, 1420, 1344, 1315, 1335, 1356, 1344, 1332, 1320, 1308, 1327, 1347, 1366, 1386, 1383, 1379, 1376, 1373, 1351, 1329, 1307, 1285, 1282, 1280, 1277, 1275, 1272, 1270, 1267, 1265, 1251, 1237, 1222, 1208, 1174, 1140, 1184, 1273, 1343, 1368, 1345, 1322, 1333]
-197A333J0N3N3O6K0l5q0n5n6l5l6j3j3RJ0K7K7K8K7ONM8M8M8Mm7m7KKMNPN3P2P3j0rJ0J1
-201A625J4l1q1q1m0m0NONOj8j7K8K8NOOOj7j7l3l2J3J4M3M3lkl3l3p3p4o5J1J02J02Q4L8
-206A500j2j2j3j2l6l5n8n8j3j3J7J8J7J7J8J8J9J8J8J8J9J8k5k5n1nK9K9RRl6l6J8O2N2k3
-210A460o2o2j1j2j2j1j8j7L5L5O7O7J2l4n5j1L0K9jkkjJ9J8jjrL6O1O0ln0p4p3o0j5J4J3
-215A359J7J6J7J7J5J5J2J3m2q7q5q4j5j4K3K3kjkkMMl5l4j6j6L7L7M1M1M2M1j2j2j2j2m4
-220A247m3m3m3J7J7P1P0P9P9J1J1jjk4k5J2J2k6k6k0j9MMk2k1k2k1K8K9l0p5p0o9l0J5M6
-224A121M7K6K6J1J1J1J1J9J9J8J9M6M6L3j2n7n7l8l7qqqqJ2J2J2J3L1L2L2L1j9j9j9j9J2
-228A342J3j0j0L0L0rn6n3qJ6J7K5K4NNJ1N7L1L1jkjkopppk6k6KM7K0J9l1l1m5m5mP2O5O6
$$ y = [1333, 1343, 1396, 1449, 1515, 1535, 1500, 1420, 1365, 1309, 1274, 1238, 1225, 1212, 1221, 1231, 1258, 1285, 1313, 1340, 1346, 1351, 1399, 1447, 1495, 1499, 1452, 1405, 1407, 1409, 1413, 1418, 1425, 1478, 1550, 1623, 1613, 1604, 1614, 1625, 1639, 1608, 1527, 1446, 1406, 1366, 1371, 1377, 1382, 1388, 1370, 1353, 1381, 1409, 1414, 1420, 1426, 1432, 1415, 1398, 1365, 1333, 1346, 1360, 1403, 1446, 1443, 1441, 1408, 1375, 1302, 1228, 1163, 1174, 1276, 1378, 1462, 1500, 1488, 1476, 1463, 1451, 1415, 1380, 1322, 1264, 1251, 1238, 1255, 1273, 1290, 1307, 1325, 1343, 1362, 1380, 1398, 1416, 1435, 1453, 1428, 1403, 1352, 1347, 1376, 1405, 1414, 1423, 1387, 1351, 1369, 1431, 1483, 1460, 1398, 1336, 1325, 1313, 1301, 1290, 1272, 1255, 1290, 1325, 1392, 1459, 1471, 1437, 1382, 1371, 1401, 1430, 1429, 1427, 1425, 1424, 1443, 1461, 1460, 1459, 1450, 1486, 1547, 1607, 1604, 1554, 1480, 1407, 1347, 1332, 1346, 1359, 1376, 1392, 1409, 1426, 1441, 1456, 1468, 1481, 1439, 1352, 1267, 1183, 1168, 1154, 1177, 1200, 1198, 1197, 1195, 1193, 1197, 1201, 1166, 1132, 1116, 1100, 1137, 1174, 1215, 1256, 1298, 1339, 1327, 1315, 1303, 1291, 1247, 1204, 1161, 1118, 1135, 1152, 1223, 1293, 1372, 1451, 1462, 1473, 1472, 1471, 1447, 1422, 1434, 1446, 1420, 1394, 1374, 1355, 1359, 1363, 1341, 1320, 1298, 1277, 1305, 1334, 1304, 1229, 1159, 1090, 1060, 1075, 1121, 1168, 1194, 1220, 1231, 1242, 1253, 1264, 1283, 1302, 1320, 1339, 1385, 1431, 1464, 1452, 1395, 1338, 1300, 1263, 1255, 1247, 1239, 1231, 1243, 1255, 1267, 1280, 1311, 1343, 1375, 1406, 1387, 1368, 1349, 1330, 1342, 1355, 1345, 1335, 1365, 1395, 1386, 1330, 1277, 1269, 1285, 1302, 1327, 1351, 1356, 1361, 1372, 1429, 1460, 1491, 1490, 1488, 1487, 1485, 1479, 1472, 1465, 1458, 1432, 1406, 1408, 1455, 1475, 1494, 1463, 1432, 1387, 1342, 1338, 1410, 1475, 1541]
-233A541J2l3l6l5j2L5M9M9J0l7k6k7RQJ0J0lm8q4q4p4k9N3N4M4kk1k0M5M5O0O0L3j2l3l2
-238A479j3j3M1M0K8j8j4j4j6j7m4m3L2L2j0j1j0j1llllJ6J6M1mq5q5o8k2J3J4J6J6M1M1O6
-242A422K1m3m4m6m7J6J6mn0l8l8L4L5L6L5P8P8M9Lj7j6pon2n2l8l8l7l8l8l8j8K8O4O3K1
-247A294K1R1R0M5M5J6J6n8n7k8J7J7k8k1k1k1k1l2J4L4L3j6j5j6j6k4k5k5k5KKKKO4O5O4
-251A485O5J8J8k7k7j8j8j8j7k1k1k0k1LLLKLLLLmlmmm5m6%%n0n0m8K9Q5Q5J4J4KJK7j9n0
-256A335n0n2n3k2k2N1N1jm5k1k0K1K1K1K1O3O3M3ll0k9l3l2K1K1K2K1j5j5j5j5k6k7k6k6
-260A197qpppM6M7M7M6O3O3J7J7j0rrj0M1M1K1k5n6n5n6n6o6k0K9L0J4J3J4J3M8M7JKjjM4
-265A498M4j5j6o0o1n8n8j3j2J9J9K0J9j2j2j2j2J3J3J3J2QPl9l8l2l1J4J4J5J6k7k6l7J0
$$ y = [1541, 1553, 1520, 1484, 1449, 1437, 1472, 1521, 1570, 1580, 1543, 1517, 1490, 1499, 1507, 1517, 1527, 1524, 1476, 1392, 1308, 1234, 1205, 1258, 1312, 1356, 1354, 1333, 1313, 1358, 1403, 1463, 1523, 1556, 1544, 1511, 1479, 1466, 1453, 1494, 1534, 1562, 1544, 1530, 1516, 1500, 1483, 1439, 1396, 1428, 1460, 1450, 1439, 1429, 1418, 1415, 1412, 1409, 1406, 1422, 1438, 1479, 1475, 1390, 1305, 1237, 1215, 1228, 1242, 1258, 1274, 1315, 1356, 1422, 1443, 1400, 1356, 1310, 1263, 1279, 1295, 1291, 1241, 1203, 1165, 1199, 1234, 1270, 1305, 1383, 1461, 1510, 1513, 1496, 1480, 1473, 1467, 1415, 1363, 1325, 1287, 1250, 1212, 1174, 1136, 1118, 1146, 1210, 1273, 1294, 1315, 1406, 1496, 1541, 1586, 1602, 1618, 1560, 1503, 1475, 1492, 1509, 1481, 1460, 1439, 1418, 1397, 1365, 1379, 1413, 1446, 1430, 1415, 1399, 1383, 1359, 1334, 1309, 1284, 1286, 1288, 1290, 1292, 1356, 1421, 1485, 1550, 1568, 1586, 1559, 1532, 1514, 1496, 1478, 1461, 1440, 1419, 1399, 1378, 1381, 1384, 1387, 1389, 1392, 1395, 1398, 1401, 1397, 1394, 1390, 1386, 1341, 1295, 1295, 1295, 1245, 1195, 1147, 1176, 1261, 1346, 1360, 1374, 1376, 1377, 1404, 1385, 1335, 1285, 1233, 1180, 1158, 1136, 1187, 1238, 1237, 1192, 1171, 1151, 1172, 1193, 1214, 1235, 1298, 1361, 1404, 1401, 1371, 1342, 1309, 1277, 1298, 1319, 1341, 1362, 1347, 1332, 1317, 1302, 1276, 1249, 1223, 1197, 1189, 1182, 1175, 1168, 1214, 1261, 1308, 1354, 1417, 1480, 1497, 1514, 1504, 1495, 1486, 1476, 1517, 1558, 1579, 1554, 1498, 1443, 1387, 1331, 1265, 1245, 1274, 1304, 1318, 1331, 1345, 1358, 1406, 1453, 1454, 1456, 1455, 1454, 1498, 1542, 1527, 1511, 1451, 1390, 1332, 1274, 1261, 1249, 1268, 1287, 1307, 1326, 1314, 1302, 1290, 1278, 1291, 1304, 1317, 1329, 1337, 1344, 1305, 1267, 1235, 1204, 1218, 1232, 1247, 1263, 1236, 1210, 1173, 1183]
-270A183N7N7L1j4l5l4jkkjl8l7RN6O0J4l3l2n3n3l3J3J0J1J3J4K7K8K4K5k6p1p2k6j0j1j0
-274A038L5L9L9lmL5L5L5L4K0K0J9K0j5j4j5j4JJJ%m0m1m1m1rrl5J1M2M2KLj9K7P4P4R0M5
-279A482l6l6j4j5j4j4J3J3J3J4k5k5k5k5k5k5k5k5K0K0J9K0LKK2K2M7Jm9m9l4l3J2J2%%k8
-283A213J7O3J7k7k7%M6K0K0kjK2K1O0O0k1o6k9k9k8k8QO2N6J7K6O3R4P2J7l7n4n3n4n4rq
-288A447jkjjl7l7l7l7k3k2K3K2L0L0m5m6l1l0qqK4K4K4K3M3M3M3M3k2k1k2k2MMLMK7K8K7
-293A463K7J5J5l0l1m9m9mmOOOOJ3J3j0j0MMM6M7J7k0m5m5pqpqRRQRL8L7L8L7L2L1Pl1m9m9
-298A487LM1L4L4rj0l5l5l5l5J1J1J2J1%j%%j7j6PPM1M1mnn4n4n4n5l2l2J3J3N5N5N5N5LL
-303A509p2p3llmlj9j9j9j9K6K6K5K6k6k6K0J9QQl7l7MMMNl6l6J0J0K6K5K6K5m3m4m4m3J5
$$ y = [1183, 1240, 1297, 1328, 1314, 1279, 1245, 1244, 1242, 1240, 1239, 1201, 1164, 1173, 1229, 1289, 1303, 1270, 1238, 1185, 1132, 1099, 1112, 1122, 1133, 1146, 1160, 1187, 1215, 1239, 1264, 1238, 1167, 1095, 1069, 1059, 1048, 1038, 1073, 1112, 1151, 1148, 1144, 1179, 1214, 1249, 1283, 1303, 1323, 1342, 1362, 1347, 1333, 1318, 1304, 1305, 1306, 1307, 1307, 1267, 1226, 1185, 1144, 1135, 1126, 1091, 1102, 1144, 1186, 1188, 1191, 1172, 1199, 1273, 1347, 1437, 1482, 1446, 1410, 1396, 1381, 1367, 1353, 1366, 1379, 1392, 1406, 1381, 1356, 1331, 1306, 1281, 1256, 1231, 1206, 1226, 1246, 1265, 1285, 1288, 1290, 1312, 1334, 1381, 1382, 1333, 1284, 1250, 1217, 1229, 1241, 1241, 1241, 1213, 1230, 1293, 1310, 1283, 1256, 1256, 1302, 1322, 1342, 1340, 1339, 1361, 1382, 1442, 1502, 1481, 1415, 1386, 1357, 1329, 1301, 1309, 1371, 1427, 1444, 1470, 1533, 1627, 1699, 1716, 1679, 1625, 1572, 1518, 1464, 1455, 1447, 1446, 1444, 1443, 1442, 1405, 1368, 1331, 1294, 1271, 1249, 1272, 1294, 1324, 1354, 1309, 1263, 1232, 1202, 1194, 1186, 1210, 1234, 1258, 1281, 1324, 1367, 1410, 1453, 1431, 1410, 1388, 1366, 1370, 1374, 1377, 1381, 1408, 1436, 1463, 1490, 1505, 1520, 1490, 1459, 1410, 1361, 1357, 1353, 1359, 1365, 1371, 1377, 1390, 1403, 1393, 1383, 1387, 1391, 1437, 1484, 1501, 1481, 1436, 1391, 1384, 1376, 1369, 1361, 1370, 1379, 1387, 1396, 1434, 1471, 1509, 1546, 1578, 1609, 1616, 1585, 1536, 1487, 1490, 1531, 1565, 1599, 1590, 1580, 1545, 1510, 1475, 1440, 1451, 1462, 1474, 1485, 1485, 1484, 1484, 1484, 1467, 1451, 1458, 1465, 1506, 1547, 1543, 1538, 1484, 1430, 1376, 1321, 1289, 1257, 1270, 1283, 1338, 1393, 1448, 1503, 1506, 1509, 1437, 1364, 1361, 1358, 1354, 1351, 1332, 1313, 1294, 1275, 1301, 1327, 1352, 1378, 1352, 1326, 1346, 1365, 1373, 1381, 1344, 1307, 1311, 1315, 1319, 1324, 1288, 1252, 1262, 1272, 1298, 1323, 1349, 1374, 1331, 1287, 1243, 1200, 1215]
-308A215J6J6J5j0j1j1j1k0k1k0k0l9m0L7L6N1N1NORRRRj1j2j1j2J5J5J5J5J0J1J0J0J1J0
-312A357J0J1j2j1j1j2K9K9j7j7l2l2J4J3ooopK7K6j9j9PPOPj5j5j5j5j6j5j5j5K7K7K6K7
-317A322k0k0j7j6l5J0K8K8k2o7k1K3N7N6L9pm2m2k6K0QQl2l2l7RN8N9P3P2nn1q6m0PPJ4J3
-321A293J3J4J3J4J1J0N5Rm2m1m3m3KKqqL8L7L1L1k0o5m8m9ook2k2k2k2j1j1L5L5RRRR%%k5
-326A165J9O7O6O9O9jkjjk1k0k0k1j5j4j5j4n2n2ooj6j6j7j6kkkkJ5J4J5J4k8k9K2O8M2M2
-331A296j%OOOOk5k5qL7K9j6l4l3l0l0j0L5Q5Q5O8K3m3m3m9lJ0J0J2J3M4M4jkk6k5llqrn3
-336A335n4l6l6n5n6l0J5O6O6O9O8ppj5j5QPj5j6o1o1l1l1J4J5L0K9QPL8L9ppl0k9k9k9M2
-341A199M3pn3m7m6K6K7L8L8L9L8M7M6K7j8m0m0m2m3m1m1o7k1M4M4O8O7P0K5k5k5J4J4nn1
$$ y = [1215, 1231, 1247, 1262, 1252, 1241, 1230, 1219, 1199, 1178, 1158, 1138, 1099, 1059, 1096, 1132, 1183, 1234, 1239, 1245, 1254, 1263, 1272, 1281, 1270, 1258, 1247, 1235, 1250, 1265, 1280, 1295, 1305, 1316, 1326, 1336, 1347, 1357, 1367, 1378, 1366, 1355, 1344, 1332, 1361, 1390, 1373, 1356, 1324, 1292, 1306, 1319, 1313, 1307, 1301, 1294, 1321, 1347, 1328, 1309, 1316, 1323, 1329, 1336, 1321, 1306, 1291, 1276, 1260, 1245, 1230, 1215, 1242, 1269, 1295, 1322, 1302, 1282, 1265, 1249, 1214, 1224, 1252, 1280, 1258, 1191, 1170, 1193, 1250, 1306, 1345, 1338, 1296, 1254, 1228, 1248, 1256, 1264, 1232, 1200, 1163, 1172, 1230, 1289, 1362, 1434, 1429, 1378, 1292, 1252, 1259, 1266, 1280, 1293, 1306, 1320, 1333, 1347, 1358, 1368, 1423, 1432, 1390, 1349, 1306, 1263, 1265, 1267, 1259, 1251, 1289, 1326, 1357, 1388, 1368, 1303, 1255, 1206, 1200, 1194, 1172, 1150, 1128, 1106, 1095, 1084, 1119, 1154, 1163, 1172, 1181, 1190, 1190, 1190, 1165, 1184, 1251, 1317, 1386, 1455, 1454, 1452, 1451, 1450, 1429, 1409, 1389, 1368, 1353, 1339, 1324, 1310, 1258, 1206, 1200, 1194, 1178, 1162, 1145, 1129, 1127, 1125, 1123, 1121, 1136, 1150, 1165, 1179, 1151, 1122, 1144, 1212, 1254, 1296, 1295, 1295, 1301, 1307, 1313, 1319, 1294, 1269, 1261, 1298, 1327, 1311, 1277, 1244, 1214, 1184, 1174, 1209, 1294, 1379, 1447, 1470, 1427, 1384, 1335, 1332, 1342, 1352, 1364, 1377, 1421, 1465, 1464, 1462, 1436, 1411, 1408, 1405, 1397, 1388, 1335, 1281, 1245, 1209, 1154, 1098, 1068, 1083, 1149, 1215, 1284, 1352, 1345, 1338, 1323, 1308, 1316, 1323, 1308, 1292, 1231, 1170, 1139, 1108, 1122, 1137, 1167, 1196, 1204, 1211, 1249, 1288, 1281, 1274, 1244, 1215, 1186, 1157, 1199, 1242, 1235, 1182, 1135, 1089, 1115, 1142, 1180, 1218, 1257, 1295, 1342, 1388, 1415, 1397, 1357, 1317, 1275, 1232, 1191, 1150, 1083, 1062, 1106, 1150, 1218, 1285, 1355, 1380, 1355, 1330, 1344, 1358, 1353, 1302]
-345A302p6p6KM8N3N2J0J0J9J8nmj1j1n3n3m6JK0K0M8M7l0p5r2m6ON1Q8Q8P1K6K3K2K3k3l7
-350A410l7j7j7J0J1J0J0k2k2j9k0RN5N5Rn5n5n5n5j3L3N3N2L0K9MMk6p2r2m6J6O2O5K0l3
-354A291l3l6l6l4l4l3l4l3l2j3L2R3R3P6L0%jk6k6p4p3k3K2O8O8M8M8J7J7J7J7lmlll9l9
-359A305l9l9l8l8PQL6L6L7L6NNNNQQPQJ6J6J6J6k8k8p0p1l4J2O2O2J1J1J1J0J5J4l1l1k1
-363A320k1k1k1ONONqrL5L4K6k0m0l9K1K1K2K1j5j6j5j6l3l2l3l3K4K4j9j8j8K8P8P8M4M4
-368A415on2o6o6k3k4QQpn3l9L6O7O7L3L2j2j3k0k0j9k0m8m9klk2k3k2k3qqL7L8N8N9Ql7m3
-373A138m3NN0K9K9j4j3J%JJl7l6RRM3M3M0M1M6%m7m7q4m0J3N8P8L2k0o6n0n1lM2P6P6J02
-377A411N6j3n8l6l6k5k4k5k5m1m1J0N4N4N3J1J1J4J5J4J5M1M1M2M1j%j%l2l2l1l2l4l3J1
$$ y = [1302, 1226, 1150, 1152, 1200, 1253, 1305, 1315, 1325, 1344, 1362, 1357, 1353, 1342, 1331, 1278, 1225, 1179, 1180, 1200, 1220, 1268, 1315, 1285, 1210, 1118, 1072, 1078, 1129, 1217, 1305, 1376, 1402, 1425, 1447, 1470, 1447, 1410, 1373, 1356, 1339, 1349, 1360, 1370, 1380, 1358, 1336, 1317, 1297, 1306, 1361, 1416, 1425, 1370, 1315, 1260, 1205, 1192, 1225, 1278, 1330, 1360, 1389, 1393, 1397, 1371, 1299, 1207, 1161, 1177, 1239, 1304, 1324, 1291, 1258, 1222, 1186, 1152, 1118, 1085, 1051, 1018, 986, 973, 1005, 1098, 1191, 1267, 1297, 1297, 1296, 1270, 1244, 1170, 1097, 1074, 1096, 1164, 1232, 1280, 1328, 1345, 1362, 1379, 1396, 1393, 1389, 1386, 1383, 1344, 1305, 1266, 1227, 1189, 1151, 1158, 1166, 1202, 1238, 1275, 1311, 1316, 1321, 1326, 1331, 1339, 1347, 1354, 1362, 1378, 1394, 1410, 1426, 1398, 1370, 1300, 1229, 1195, 1207, 1269, 1331, 1342, 1353, 1364, 1374, 1389, 1403, 1372, 1341, 1320, 1299, 1278, 1257, 1263, 1268, 1274, 1279, 1271, 1262, 1297, 1331, 1357, 1337, 1297, 1258, 1279, 1300, 1322, 1343, 1328, 1312, 1297, 1281, 1248, 1216, 1183, 1150, 1174, 1198, 1179, 1161, 1143, 1171, 1249, 1327, 1371, 1415, 1409, 1357, 1291, 1225, 1202, 1178, 1186, 1194, 1187, 1134, 1095, 1131, 1198, 1265, 1298, 1330, 1318, 1305, 1285, 1265, 1246, 1226, 1178, 1129, 1127, 1124, 1102, 1079, 1057, 1034, 1026, 1018, 1055, 1093, 1151, 1210, 1218, 1181, 1138, 1095, 1100, 1150, 1179, 1208, 1194, 1181, 1182, 1182, 1183, 1184, 1147, 1111, 1120, 1129, 1172, 1215, 1255, 1296, 1342, 1342, 1295, 1248, 1164, 1124, 1137, 1195, 1273, 1305, 1285, 1219, 1169, 1118, 1115, 1157, 1233, 1309, 1411, 1467, 1454, 1396, 1360, 1324, 1299, 1275, 1250, 1225, 1184, 1143, 1153, 1207, 1261, 1314, 1325, 1336, 1350, 1365, 1379, 1394, 1435, 1476, 1518, 1559, 1558, 1558, 1557, 1557, 1525, 1493, 1462, 1430, 1396, 1363, 1374]
-382A374J2J0J0l6l6n6n7l6RJ5J5J5J5%m6m6%KKm3q9m4%J8J8K0J9K0K0L7L6L4L4L3j3n9o0
-386A147n0mJ6J6OPN3N2N2N3L2j3LL%%llllk0k1k0k1M7M7K7j8l8l7NNj2j2j2j2l5l5l5l4l4
-391A096l4j4L2Q6Q5O9K3k5k5k8k8MNNMm4m5k5K1L2L2L5L5M6M6K6j9n9n9k9M7P9P8QPk0j9
-396A428o5o6k5k5k6k5J5J6J5J6kkM4M4L4L5J4l1k9k9J4J3L4L5L1L2Nm1n7n8o5k0N8N8K2k2
-400A375m3m2kjkjl6l5l3l2l1J5L3L2k7p2p2k6K4K4K7K8K2K3K2K3L8L9l7l7l1l1J4J4L1L0
-405A223L1L0m3m4o9k3M3M2M6M6N2N2L2j3k6k6J6J7MMJJL9pk7k7nmmmkklkL5L5j1j0k0k0j9
-410A338k0j9j9o1o2o6k2L0K9K0K1K0K1k4k3k3k4J9J8J8J9j2j2j1j2QPQPJ4J5J4J4nnpqk4
-414A181p1o8k4L5N8M8M8P5P5L0K9k4k4k5k4rrrrJ3J2J3J3m4m4KJK2K2l7n9k5N1Q0Q0N2Oj4
$$ y = [1374, 1386, 1396, 1406, 1370, 1334, 1278, 1221, 1185, 1194, 1209, 1224, 1239, 1254, 1254, 1208, 1162, 1162, 1164, 1166, 1123, 1034, 990, 990, 1008, 1026, 1046, 1065, 1085, 1105, 1142, 1178, 1212, 1246, 1279, 1266, 1207, 1147, 1097, 1093, 1109, 1125, 1131, 1138, 1191, 1243, 1295, 1348, 1380, 1367, 1370, 1373, 1373, 1373, 1370, 1367, 1364, 1361, 1341, 1320, 1300, 1279, 1326, 1373, 1400, 1382, 1344, 1307, 1312, 1317, 1305, 1293, 1281, 1269, 1234, 1199, 1164, 1130, 1096, 1062, 1048, 1080, 1166, 1251, 1320, 1343, 1318, 1293, 1265, 1237, 1241, 1246, 1251, 1255, 1211, 1166, 1141, 1162, 1194, 1226, 1261, 1296, 1342, 1388, 1414, 1395, 1336, 1277, 1248, 1295, 1374, 1452, 1460, 1467, 1447, 1428, 1363, 1297, 1272, 1247, 1221, 1196, 1211, 1227, 1242, 1258, 1256, 1254, 1298, 1342, 1376, 1411, 1425, 1394, 1365, 1336, 1350, 1363, 1397, 1432, 1463, 1495, 1500, 1459, 1402, 1344, 1279, 1259, 1317, 1375, 1397, 1375, 1332, 1290, 1288, 1287, 1285, 1284, 1248, 1213, 1180, 1148, 1117, 1132, 1165, 1197, 1170, 1098, 1026, 1000, 1024, 1048, 1075, 1103, 1125, 1148, 1170, 1193, 1231, 1270, 1233, 1196, 1165, 1134, 1148, 1162, 1193, 1223, 1254, 1284, 1241, 1197, 1128, 1105, 1148, 1190, 1236, 1282, 1334, 1386, 1418, 1405, 1379, 1353, 1369, 1386, 1390, 1394, 1395, 1396, 1435, 1428, 1401, 1374, 1369, 1365, 1361, 1357, 1355, 1353, 1350, 1348, 1383, 1418, 1407, 1397, 1377, 1357, 1338, 1318, 1299, 1280, 1219, 1157, 1091, 1069, 1099, 1128, 1148, 1169, 1189, 1210, 1186, 1163, 1140, 1116, 1135, 1153, 1171, 1190, 1178, 1166, 1155, 1143, 1151, 1158, 1166, 1173, 1187, 1202, 1216, 1230, 1225, 1220, 1213, 1205, 1181, 1110, 1042, 1018, 1053, 1111, 1159, 1207, 1282, 1357, 1387, 1416, 1392, 1368, 1343, 1319, 1310, 1301, 1292, 1283, 1296, 1308, 1321, 1334, 1290, 1246, 1248, 1249, 1271, 1293, 1256, 1197, 1172, 1223, 1303, 1383, 1435, 1441, 1427]
-419A427j4k6k6p1p2l5l5J0J0L4L4j1j1OOONJ5J4J4J4k6k6LK7J8k7p3p3nM1M2lk2JO1O1K8
-423A321K9K8K8OOl9m0lkllJ%J%m1m1K0M2J4l1j7NK1K0k1k1kM3J7J8LMj4n9o2j6L1L1NMj9
-429A264j8j3j3L3L2M0M0ooj0j1n3n4o6k1K7K7%m5m2m3PPj6j5rqL7L8P2P1K2k4n0n0l3J2Q2
-433A205Q1O5J9l5l6l8l8m5m5k5K0O6O7O9O9Q1Q1%m5n0n0k9l0%jM3M3L4j1n9n9m2LN3N3j4
-438A400j5j4j5l6l6l7l6mmlmj8j8KM7N0N0QPk1k1kjpn2p1p2oonoK4K5K4K5KLLKN8N9J2J3
-443A304QQL0L1PQL0L0kkk8J8M6M6J9n7p0k4qrl6l7RJ0J3J3J3J3rrl5J2K9L0OPon1o9o8n6
-448A164j1M0M0M1M0l5l6%jjjL0L0L2j3m9m9ppnnnom5m5ON0N1N0PQj0rO3O4M4jn1n2l6l6l6
-453A208l7M3M3K3k2k6k6ooK6K6K6K6K4K4N0Nl5l6l8l8l9l9J1N7K7K6j6j6j4j4L1L2L8L7p
$$ y = [1427, 1413, 1387, 1361, 1290, 1218, 1183, 1148, 1158, 1168, 1202, 1236, 1225, 1214, 1220, 1226, 1232, 1237, 1252, 1266, 1280, 1294, 1268, 1242, 1245, 1272, 1290, 1263, 1190, 1117, 1112, 1153, 1195, 1192, 1170, 1171, 1232, 1293, 1321, 1350, 1378, 1406, 1412, 1418, 1379, 1339, 1336, 1334, 1331, 1328, 1329, 1329, 1330, 1330, 1289, 1248, 1268, 1310, 1324, 1293, 1276, 1281, 1302, 1322, 1301, 1280, 1278, 1321, 1338, 1356, 1359, 1363, 1349, 1290, 1228, 1212, 1243, 1274, 1279, 1283, 1264, 1246, 1233, 1220, 1253, 1285, 1325, 1365, 1359, 1353, 1343, 1332, 1279, 1225, 1159, 1138, 1165, 1192, 1192, 1147, 1105, 1062, 1069, 1076, 1060, 1045, 1036, 1028, 1065, 1103, 1175, 1246, 1268, 1244, 1194, 1144, 1111, 1123, 1205, 1286, 1351, 1370, 1335, 1299, 1261, 1223, 1178, 1133, 1108, 1128, 1194, 1261, 1330, 1399, 1480, 1561, 1561, 1516, 1466, 1416, 1387, 1357, 1357, 1356, 1399, 1442, 1476, 1465, 1406, 1347, 1305, 1308, 1361, 1414, 1400, 1385, 1371, 1356, 1320, 1284, 1247, 1211, 1207, 1203, 1200, 1196, 1178, 1160, 1162, 1209, 1259, 1309, 1317, 1324, 1303, 1282, 1280, 1279, 1272, 1220, 1149, 1077, 1071, 1065, 1060, 1054, 1078, 1103, 1127, 1152, 1154, 1157, 1160, 1162, 1220, 1279, 1291, 1304, 1312, 1320, 1350, 1381, 1388, 1396, 1426, 1456, 1454, 1452, 1424, 1442, 1488, 1534, 1553, 1496, 1426, 1402, 1394, 1385, 1349, 1312, 1321, 1331, 1344, 1357, 1370, 1383, 1374, 1365, 1330, 1342, 1371, 1401, 1407, 1414, 1408, 1357, 1288, 1220, 1164, 1153, 1193, 1233, 1274, 1314, 1279, 1243, 1243, 1242, 1241, 1240, 1270, 1300, 1332, 1319, 1270, 1221, 1214, 1207, 1202, 1197, 1192, 1186, 1141, 1096, 1102, 1152, 1203, 1253, 1260, 1268, 1258, 1249, 1312, 1376, 1420, 1419, 1368, 1316, 1280, 1244, 1208, 1171, 1214, 1257, 1280, 1258, 1232, 1206, 1200, 1194, 1220, 1246, 1272, 1298, 1322, 1346, 1396, 1401, 1366, 1330, 1292, 1254, 1215, 1176, 1187, 1244, 1271, 1297, 1281, 1265, 1251, 1237, 1268, 1300, 1338, 1375, 1368]
-457A368qj1j0j1j0ONM9M8L3j4l3l3rj0j0j0OPOOj2j2j2j2l1l1l1l1J0J0J1J0O4O4J4l1n3
-462A292n2l5J0O0N9M3lj5j5K8K7K3K3n2n3j9k0j9j9PQMNnn1p1p0j2j2L4L3L4L4j1j1J4J4
-467A207J4J4L1L1j4j5j2j3j2j3nnM0M0j1j2j2j2J5J5J5J5J8J8J8J8j6j6K7K7L4j2l2l2K2
-471A375K2K1K2pqpqk9k9l0k9j1j0j1j0J3J3L9pl3l3RRL5L5L5L5J9J9J6J5k7p3m7m7k0k0o5
-476A171o6o7o8j7K8Q1Q1L4j2j1j1L6Q2R5R5L7l8q8m2MMn0n0mmooonj5j4j5j4ooool3l3k9
-480A020l0%M5M5%oorrL5L4L5L5K0K1K0K1j6j5n7n8l9PN2N2K6n0p8l3j7j6ON1O2O2J9K0J0
-485A259J1J1J1j0rn5n4j3j3L2L2J5J5J4J5OOPOj0j0j0j0J3J3l0k9M5R0O2j4q0q0l5J1K8K8
-490A268L1L1KKKJk9l0k7k6j6K9K9j6m5m4K5K6k6p1m5m6K7K7K7K7J%J%J5J4J5J4nmnmJ1J1
$$ y = [1368, 1360, 1349, 1339, 1328, 1318, 1324, 1329, 1378, 1426, 1459, 1445, 1412, 1379, 1370, 1360, 1350, 1340, 1346, 1353, 1359, 1365, 1353, 1341, 1329, 1317, 1286, 1255, 1224, 1193, 1203, 1213, 1224, 1234, 1298, 1362, 1376, 1345, 1292, 1240, 1205, 1215, 1275, 1334, 1377, 1374, 1359, 1344, 1372, 1399, 1422, 1445, 1393, 1340, 1321, 1301, 1282, 1263, 1270, 1278, 1282, 1287, 1282, 1231, 1160, 1090, 1078, 1066, 1100, 1133, 1167, 1201, 1190, 1179, 1193, 1207, 1221, 1235, 1266, 1297, 1283, 1268, 1256, 1243, 1231, 1218, 1213, 1208, 1248, 1288, 1277, 1265, 1253, 1241, 1256, 1271, 1286, 1301, 1319, 1337, 1355, 1373, 1357, 1341, 1368, 1395, 1429, 1417, 1385, 1353, 1375, 1397, 1418, 1440, 1433, 1425, 1418, 1410, 1381, 1352, 1322, 1293, 1282, 1272, 1261, 1251, 1264, 1277, 1316, 1309, 1276, 1243, 1252, 1261, 1296, 1331, 1366, 1401, 1420, 1439, 1455, 1470, 1443, 1370, 1323, 1276, 1256, 1236, 1171, 1105, 1038, 970, 953, 981, 1062, 1143, 1177, 1165, 1154, 1143, 1179, 1261, 1356, 1451, 1488, 1450, 1362, 1320, 1324, 1328, 1278, 1228, 1224, 1220, 1214, 1208, 1202, 1197, 1182, 1168, 1153, 1139, 1133, 1127, 1121, 1115, 1082, 1049, 1020, 990, 990, 1035, 1080, 1080, 1074, 1068, 1059, 1050, 1085, 1119, 1154, 1189, 1209, 1230, 1250, 1271, 1255, 1240, 1183, 1125, 1086, 1093, 1145, 1197, 1223, 1173, 1095, 1062, 1045, 1029, 1035, 1086, 1148, 1210, 1229, 1249, 1259, 1270, 1281, 1292, 1282, 1273, 1218, 1164, 1151, 1138, 1170, 1202, 1217, 1232, 1246, 1261, 1267, 1273, 1280, 1286, 1276, 1266, 1256, 1246, 1259, 1272, 1242, 1213, 1258, 1348, 1410, 1396, 1316, 1236, 1201, 1212, 1240, 1268, 1299, 1330, 1332, 1334, 1336, 1337, 1308, 1278, 1251, 1225, 1209, 1238, 1267, 1251, 1206, 1162, 1187, 1213, 1187, 1116, 1071, 1025, 1052, 1079, 1106, 1133, 1134, 1134, 1135, 1135, 1150, 1164, 1179, 1193, 1188, 1184, 1179, 1175, 1186, 1197]
-495A197J0J1j1j1j0j1J1J0l4l5l1l2J4J3j7j8K8K8ONNNqql4J2O5O6M8Lj3j4m2LJ4J4J6J7
-499A272M8M8K8j7pqj1j0k4k4k4k3KLLKJ7J7J5J4l7q3n7n7ppL8L9O3O4J4l2k6k7k9k9K0K1
-504A189k4k5j5j6K7K7M0nn2n3k7J9pok0k0k0k1M7M7M7M7M2M3K4k3rj0j2j2k4k5K1K1L8L7
-508A290qqNMl8l8j7K9LLJ1J2N7N7J6J6J6J6l6l5l5l6J0J0N2N2P4K7k2k3m8m8KM8M5M6l2p7
-513A400r9j00n3n4j2L4N3N3j7j8j7j8k2k1K4K4LLKLM0L9M0M0L0L0K7K8k7p2m7m6m8m7m8m8
-517A059m1m0RN4N1N1RQk6k6k6k5j1j2j1j1l0l0l0l0M0M0M1M0R1R1M1mk9k8l1l1K8K9K8K9
-522A267RRJ0Rj5j5j4j5j2j1K6K6K5K5j3j2KLj9k0l4l3l4l3nnL4L3RRj4j3k0k1L3L3j0j0j0
-526A174rL1L1L1L2llllPQPPmnmmL3L3L3L3m7m7m6m7j9j8j9j9l0l0l0l0nonoK0J9K0K0N2N2
$$ y = [1197, 1207, 1218, 1207, 1196, 1186, 1175, 1186, 1196, 1162, 1127, 1096, 1064, 1078, 1091, 1074, 1056, 1084, 1112, 1118, 1123, 1128, 1133, 1125, 1117, 1083, 1095, 1160, 1226, 1274, 1277, 1264, 1250, 1208, 1211, 1225, 1239, 1255, 1272, 1320, 1368, 1396, 1379, 1372, 1364, 1353, 1343, 1319, 1295, 1271, 1248, 1250, 1253, 1256, 1258, 1275, 1292, 1307, 1321, 1284, 1201, 1144, 1087, 1080, 1073, 1111, 1150, 1213, 1277, 1291, 1259, 1233, 1206, 1177, 1148, 1168, 1189, 1165, 1140, 1125, 1109, 1136, 1163, 1203, 1198, 1146, 1093, 1066, 1085, 1078, 1072, 1052, 1032, 1012, 991, 1038, 1085, 1132, 1179, 1221, 1264, 1288, 1265, 1256, 1246, 1234, 1222, 1198, 1173, 1194, 1215, 1253, 1290, 1282, 1274, 1279, 1283, 1245, 1207, 1190, 1219, 1222, 1225, 1236, 1248, 1305, 1362, 1378, 1394, 1410, 1426, 1390, 1355, 1320, 1284, 1294, 1304, 1356, 1408, 1482, 1509, 1487, 1464, 1416, 1368, 1370, 1418, 1463, 1509, 1477, 1400, 1301, 1201, 1148, 1094, 1082, 1116, 1169, 1222, 1205, 1187, 1170, 1152, 1130, 1109, 1133, 1157, 1160, 1163, 1165, 1168, 1208, 1247, 1287, 1327, 1357, 1387, 1414, 1442, 1415, 1343, 1296, 1250, 1202, 1155, 1107, 1059, 1018, 978, 987, 1041, 1092, 1143, 1152, 1160, 1134, 1108, 1082, 1057, 1046, 1034, 1023, 1012, 982, 952, 922, 892, 932, 972, 1013, 1053, 1144, 1235, 1276, 1272, 1243, 1215, 1184, 1153, 1181, 1210, 1238, 1267, 1276, 1285, 1295, 1304, 1289, 1274, 1260, 1245, 1233, 1222, 1248, 1274, 1299, 1324, 1311, 1299, 1301, 1304, 1285, 1265, 1231, 1198, 1164, 1131, 1126, 1121, 1155, 1188, 1197, 1206, 1192, 1179, 1159, 1138, 1171, 1204, 1194, 1184, 1174, 1165, 1196, 1227, 1258, 1290, 1287, 1284, 1281, 1278, 1285, 1293, 1300, 1307, 1303, 1298, 1294, 1290, 1323, 1356, 1389, 1422, 1375, 1328, 1282, 1235, 1216, 1198, 1179, 1160, 1130, 1100, 1070, 1040, 1035, 1029, 1024, 1018, 1038, 1057, 1077, 1097, 1149, 1201]
-532A201L0K9%%L7L8j7j7n5n6J1J0k7k8jjK1K2nnJ7J8j4j4RRRRRRk0k0k1k0jjjkK7K7K7K6
-537A269J%%%l2l3l3l3l7l7KJJ7J8nnj7j6j6j7L3L3L3L2j6j6j7j6LLLLJ1J1J1J1N6N6MLk3
-542A245k2J5J5j1j1j2j1L9L9JJk2k3k2k3k7k7J1J1RJ0J0J0rrK8K9PQPPK9L0k4k3l2l2j0r
-547A202j4j4j5j4jkjkjkkjKJKKN6N6N7N6%Jl8l7NOK8K8n1n1n1n0j1j0j0j0k8k9o6o7K2K2
-552I68M4M5N8N9N8N9M1M1M1M1LLKLJ3J3l4q0j15o9k2k2NMNMk3k2N3R8O5j1m2m2J6J6J6J6
-556A308j7j8K6K5M5%k0k1K9K9N5Rn9n8o2o1l5l4j5L0N9N8N9N8J8k7m8m8J0J0L5j0k4k5k7
-561A254k7m4m3L2L3L2L3K9L0J8k8j05j05n1mJ5J5J2J3J2J3J5J5J6J5K4K4K4K4J0J0N6N5M
-565A426NMNJ3J3l5q0n3ql7l7p5p6l0l0MLMLO0O1O0O0K2K1k4k4kjkjK7K7j8j8l0k9J6J6PP
$$ y = [1201, 1231, 1260, 1260, 1260, 1297, 1335, 1318, 1301, 1246, 1190, 1201, 1211, 1184, 1156, 1155, 1154, 1175, 1197, 1192, 1187, 1204, 1222, 1208, 1194, 1203, 1212, 1221, 1230, 1239, 1248, 1228, 1208, 1187, 1167, 1166, 1165, 1164, 1162, 1189, 1216, 1243, 1269, 1270, 1270, 1270, 1270, 1238, 1205, 1172, 1139, 1102, 1065, 1067, 1068, 1085, 1103, 1098, 1093, 1076, 1060, 1044, 1027, 1060, 1093, 1126, 1158, 1142, 1126, 1109, 1093, 1096, 1099, 1102, 1105, 1116, 1127, 1138, 1149, 1205, 1261, 1265, 1268, 1245, 1223, 1238, 1253, 1242, 1231, 1219, 1208, 1247, 1286, 1287, 1288, 1266, 1243, 1221, 1198, 1171, 1144, 1155, 1166, 1175, 1185, 1195, 1205, 1196, 1187, 1215, 1244, 1251, 1259, 1266, 1273, 1302, 1332, 1308, 1285, 1253, 1221, 1211, 1202, 1188, 1174, 1159, 1145, 1144, 1142, 1141, 1139, 1138, 1136, 1134, 1133, 1135, 1136, 1138, 1140, 1196, 1252, 1309, 1365, 1365, 1366, 1328, 1291, 1296, 1302, 1330, 1358, 1307, 1256, 1205, 1155, 1144, 1134, 1124, 1114, 1086, 1057, 991, 924, 946, 968, 1012, 1057, 1115, 1174, 1232, 1291, 1332, 1373, 1414, 1455, 1458, 1461, 1463, 1466, 1479, 1492, 1458, 1378, 1263, 1194, 1172, 1150, 1155, 1159, 1164, 1168, 1145, 1123, 1176, 1274, 1339, 1328, 1286, 1244, 1260, 1276, 1292, 1308, 1291, 1273, 1299, 1324, 1369, 1369, 1349, 1328, 1357, 1386, 1441, 1450, 1391, 1333, 1271, 1210, 1175, 1141, 1126, 1156, 1215, 1273, 1332, 1390, 1408, 1381, 1333, 1285, 1295, 1305, 1340, 1330, 1306, 1281, 1254, 1227, 1183, 1140, 1172, 1205, 1237, 1270, 1299, 1329, 1347, 1319, 1214, 1109, 1058, 1054, 1069, 1084, 1096, 1109, 1121, 1134, 1149, 1164, 1180, 1195, 1219, 1243, 1267, 1291, 1301, 1311, 1367, 1422, 1426, 1431, 1435, 1440, 1453, 1466, 1431, 1351, 1298, 1290, 1253, 1216, 1141, 1065, 1035, 1005, 1009, 1012, 1016, 1019, 1079, 1140, 1200, 1260, 1282, 1303, 1279, 1255, 1253, 1252, 1250, 1249, 1276, 1303, 1285, 1267, 1237, 1208, 1224, 1240, 1247, 1254]
-570A254QPm0l9l8l7m5%P5P6K7m9o5m1k3k2K5K4L0L1L0L0%j%jJ8J9J8J9l0k9k9k9M0M0L9M0
$$ y = [1254, 1262, 1269, 1229, 1190, 1152, 1115, 1070, 1070, 1145, 1221, 1248, 1199, 1134, 1093, 1070, 1048, 1073, 1097, 1127, 1158, 1188, 1218, 1218, 1217, 1217, 1216, 1234, 1253, 1271, 1290, 1260, 1231, 1202, 1173, 1213, 1253, 1292, 1332]
$$ [...]
##$OBSERVED INTEGRALS=	(X Y Z)
(2.0307004702190121215, 2.1048747788873898301, 2.9422078706978544993)
(1.6479974420588658912, 1.8227393716825239789, 12.93871605480302911)
(9.3040634297182869261, 9.3299758519605173746, 0.11907607449911461472)
##END=	
##TITLE=	Aug25-2021.70.fid
##JCAMP-DX=	6.0	$$ MestReNova 14.1.0-24037
##BLOCK_ID=	3
##DATA TYPE=	NMR PEAK TABLE
##DATA CLASS=	PEAK TABLE
##CROSS REFERENCE=	NMR SPECTRUM: BLOCK_ID=2                                     
##.OBSERVE FREQUENCY=	400.4124024600000098
##.OBSERVE NUCLEUS=	^1H
##NPOINTS=	11
##FIRSTX=	1.6698613572125329263
##LASTX=	9.3178243009059080748
##XFACTOR=	1
##YFACTOR=	1
##FIRSTY=	256.28397304022746539
##XUNITS=	PPM
##YUNITS=	ARBITRARY UNITS
##PEAK TABLE=	(XYW..XYW)
1.6698613572125329263,256.28397304022746539,0.0093202303130721850244
1.6754947502080328459,401.6889892250312073,0.0088275170795896560488
1.6801054752933459735,681.57241176101024394,0.010460173562045899098
1.7182857069760826274,6572.9885392594896985,0.0094870299313862729157
1.7260470852086813309,5108.7166020609147381,0.0074951734557856877772
1.7669837508580266139,1581.7306056345205434,0.012287838812979843747
1.7900138486933583337,150.27331320488789856,0.0066161434267343593313
2.0622379192567286132,850.01385724795443366,0.008413072916793823755
2.0722496985127518698,1557.6652584930880039,0.010247667156400639202
2.0802606362015345631,905.10615447745817619,0.010098563122346694912
9.3178243009059080748,414.78142592243250419,0.0035436177889743704188
##$MNOVA/PEAK_DATA_TABLE=	(T,F,A,ST,SP,APT,APC)
$$ Complementary to PEAK TABLE
$$ T: Type
$$ F: Flags
$$ A: Annotation
$$ ST: Shape Type
$$ SP: Shape Parameter
$$ APT: Attached Peaks Type
$$ APC: Attached Peaks Count
Compound,None,,0,0,0,0
Compound,None,,0,0,0,0
Compound,None,,0,0,0,0
Compound,None,,0,0,0,0
Compound,None,,0,0,0,0
Compound,None,,0,0,0,0
Compound,None,,0,0,0,0
Compound,None,,0,0,0,0
Compound,None,,0,0,0,0
Compound,None,,0,0,0,0
Compound,None,,0,0,0,0
##END=	
##END=	
