##TITLE=	Aug25-2021.60.fid
KJO-20 H
##JCAMP-DX=	6.0	$$ MestReNova 14.1.0-24037
##DATA TYPE=	LINK
##BLOCK_ID=	1
##BLOCKS=	2    
##ORIGIN=	Mestrelab Research S.L.
##OWNER=	Chris
##$MNOVA/LINK_BLOCK_TYPE=	ITEM	$$ NMR Spectrum
##$MNOVA/ITEM/POLYGON=	(XY..XY)
5321,5835
8722,5835
8722,8208
5321,8208
5321,5835
##$MNOVA/ITEM/Z=	0
##$MNOVA/ITEM/ANGLE=	0
##TITLE=	Aug25-2021.60.fid
##JCAMP-DX=	6.0	$$ MestReNova 14.1.0-24037
##BLOCK_ID=	2
##DATA TYPE=	NMR SPECTRUM
##DATA CLASS=	XYDATA
##NUMDIM=	1
##ORIGIN=	Bruker BioSpin GmbH
##OWNER=	nmr
##.OBSERVE FREQUENCY=	400.4124024600000098
##.OBSERVE NUCLEUS=	^1H
##.SOLVENT NAME=	CDCl3
##.PULSE SEQUENCE=	zg30
##LONGDATE=	2021/08/25 16:54:00.000
##.ACQUISITIONMODE=	SIMULTANEOUS (DQD)
##$ORIGINAL FORMAT=	Bruker XWIN-NMR
##$MNOVA/SCALES_VERSION=	8
##$PARAMETER FILE=	(acqus, ASCII, c:/Users/Chris/Desktop/UROP/NMR/KJO-20-H/acqus, 0)
$$ ##TITLE= Parameter file, TOPSPIN		Version 3.2
$$ ##JCAMPDX= 5.0
$$ ##DATATYPE= Parameter Values
$$ ##NPOINTS= 11	$$ modification sequence number
$$ ##ORIGIN= Bruker BioSpin GmbH
$$ ##OWNER= nmr
$$ $$ 2021-08-25 16:54:26.923 +0100  nmr@CZC10666PP
$$ $$ /opt/topspin/data/brad/nmr/Aug25-2021/60/acqus
$$ $$ process /opt/topspin3.2/prog/mod/shimcntl
$$ ##$ACQT0= -2.36344537815126
$$ ##$AMP= (0..31)
$$ 100 100 100 100 100 100 100 100 100 100 100 100 100 100 100 100 100 100
$$ 100 100 100 100 100 100 100 100 100 100 100 100 100 100
$$ ##$AMPCOIL= (0..19)
$$ 0 0 0 0 0 0 0 0 0 0 0 0 0 0 0 0 0 0 0 0
$$ ##$ANAVPT= -1
$$ ##$AQSEQ= 0
$$ ##$AQ_mod= 3
$$ ##$AUNM= <au_zg>
$$ ##$AUTOPOS= <15 >
$$ ##$BF1= 400.41
$$ ##$BF2= 400.41
$$ ##$BF3= 400.41
$$ ##$BF4= 400.41
$$ ##$BF5= 400.41
$$ ##$BF6= 400.41
$$ ##$BF7= 400.41
$$ ##$BF8= 400.41
$$ ##$BYTORDA= 0
$$ ##$CAGPARS= (0..11)
$$ 0 0 0 0 0 0 0 0 0 0 0 0
$$ ##$CFDGTYP= 0
$$ ##$CFRGTYP= 9
$$ ##$CHEMSTR= <none>
$$ ##$CNST= (0..63)
$$ 1 1 145 1 1 1 1 1 1 1 1 1 1 1 1 1 1 1 1 1 1 1 1 1 1 1 1 1 1 1 1 1 1 1 1
$$ 1 1 1 1 1 1 1 1 1 1 1 1 1 1 1 1 1 1 1 1 1 1 1 1 1 1 1 1 1
$$ ##$CPDPRG= (0..8)
$$ <> <> <> <> <mlev> <mlev> <mlev> <mlev> <mlev>
$$ ##$D= (0..63)
$$ 0 1 0 0 0 0 0 0 0 0.06 0 0 0 0 0 0 0.0002 0 0 0 0 0 0 0 0 0 0 0 0 0 0 0
$$ 0 0 0 0 0 0 0 0 0 0 0 0 0 0 0 0 0 0 0 0 0 0 0 0 0 0 0 0 0 0 0 0
$$ ##$DATE= 1629906866
$$ ##$DE= 6.5
$$ ##$DECBNUC= <off>
$$ ##$DECIM= 2496
$$ ##$DECNUC= <off>
$$ ##$DECSTAT= 4
$$ ##$DIGMOD= 1
$$ ##$DIGTYP= 12
$$ ##$DQDMODE= 0
$$ ##$DR= 22
$$ ##$DS= 2
$$ ##$DSPFIRM= 0
$$ ##$DSPFVS= 20
$$ ##$DTYPA= 0
$$ ##$EXP= <proton>
$$ ##$F1LIST= <111111111111111>
$$ ##$F2LIST= <222222222222222>
$$ ##$F3LIST= <333333333333333>
$$ ##$FCUCHAN= (0..9)
$$ 0 2 0 0 0 0 0 0 0 0
$$ ##$FL1= 90
$$ ##$FL2= 90
$$ ##$FL3= 90
$$ ##$FL4= 90
$$ ##$FOV= 20
$$ ##$FQ1LIST= <freqlist>
$$ ##$FQ2LIST= <freqlist>
$$ ##$FQ3LIST= <freqlist>
$$ ##$FQ4LIST= <freqlist>
$$ ##$FQ5LIST= <freqlist>
$$ ##$FQ6LIST= <freqlist>
$$ ##$FQ7LIST= <freqlist>
$$ ##$FQ8LIST= <freqlist>
$$ ##$FRQLO3= 17285.0399999619
$$ ##$FRQLO3N= 2
$$ ##$FS= (0..7)
$$ 83 83 83 83 83 83 83 83
$$ ##$FTLPGN= 0
$$ [...]
$$ 90 74 58 42 26 10 0 0
$$ ##$Sgu3PowerLevels= (0..7)
$$ 0 0 0 0 0 0 0 0
$$ ##$Sgu4PowerLevels= (0..7)
$$ 0 0 0 0 0 0 0 0
$$ ##$Sgu5PowerLevels= (0..7)
$$ 0 0 0 0 0 0 0 0
$$ ##$Sgu6PowerLevels= (0..7)
$$ 0 0 0 0 0 0 0 0
$$ ##$Sgu7PowerLevels= (0..7)
$$ 0 0 0 0 0 0 0 0
$$ ##$Sgu8PowerLevels= (0..7)
$$ 0 0 0 0 0 0 0 0
$$ ##$SguType= 3
$$ ##$ShimPowMaxUA= (0..63)
$$ 130000 130000 130000 130000 130000 130000 130000 130000 130000 130000 130000
$$ 130000 130000 130000 130000 130000 130000 130000 130000 130000 0 0 0 0
$$ 0 0 0 0 0 0 0 0 0 0 0 0 0 0 0 0 0 0 0 0 0 0 0 0 0 0 0 0 0 0 0 0 0 0 0 0
$$ 0 0 0 0
$$ ##$ShimPowMaxUC= (0..63)
$$ 130000 130000 130000 130000 130000 130000 130000 130000 130000 130000 130000
$$ 130000 130000 130000 130000 130000 130000 130000 130000 130000 0 0 0 0
$$ 0 0 0 0 0 0 0 0 0 0 0 0 0 0 0 0 0 0 0 0 0 0 0 0 0 0 0 0 0 0 0 0 0 0 0 0
$$ 0 0 0 0
$$ ##$ShimPowMaxUG= (0..63)
$$ 524287 524287 524287 524287 524287 524287 524287 524287 524287 524287 524287
$$ 524287 524287 524287 524287 524287 524287 524287 524287 524287 0 0 0 0
$$ 0 0 0 0 0 0 0 0 0 0 0 0 0 0 0 0 0 0 0 0 0 0 0 0 0 0 0 0 0 0 0 0 0 0 0 0
$$ 0 0 0 0
$$ ##$ShimPowRcbType= 3
$$ ##$ShimPowRes= (0..63)
$$ 1e-20 1e-20 1e-20 1e-20 1e-20 1e-20 1e-20 1e-20 1e-20 1e-20 1e-20 1e-20
$$ 1e-20 1e-20 1e-20 1e-20 1e-20 1e-20 1e-20 1e-20 0 0 0 0 0 0 0 0 0 0 0 0
$$ 0 0 0 0 0 0 0 0 0 0 0 0 0 0 0 0 0 0 0 0 0 0 0 0 0 0 0 0 0 0 0 0
$$ ##$ShimPowRng0= (0..63)
$$ 1 1 1 1 1 1 1 1 1 1 1 1 1 1 1 1 1 1 1 1 0 0 0 0 0 0 0 0 0 0 0 0 0 0 0 0
$$ 0 0 0 0 0 0 0 0 0 0 0 0 0 0 0 0 0 0 0 0 0 0 0 0 0 0 0 0
$$ ##$ShimPowRng1= (0..63)
$$ 1 1 1 1 1 1 1 1 1 1 1 1 1 1 1 1 1 1 1 1 0 0 0 0 0 0 0 0 0 0 0 0 0 0 0 0
$$ 0 0 0 0 0 0 0 0 0 0 0 0 0 0 0 0 0 0 0 0 0 0 0 0 0 0 0 0
$$ ##$ShimPowRng2= (0..63)
$$ 1 1 1 1 1 1 1 1 1 1 1 1 1 1 1 1 1 1 1 1 0 0 0 0 0 0 0 0 0 0 0 0 0 0 0 0
$$ 0 0 0 0 0 0 0 0 0 0 0 0 0 0 0 0 0 0 0 0 0 0 0 0 0 0 0 0
$$ ##$ShimPowRng3= (0..63)
$$ 1 1 1 1 1 1 1 1 1 1 1 1 1 1 1 1 1 1 1 1 0 0 0 0 0 0 0 0 0 0 0 0 0 0 0 0
$$ 0 0 0 0 0 0 0 0 0 0 0 0 0 0 0 0 0 0 0 0 0 0 0 0 0 0 0 0
$$ ##$ShimSysFunc= (0..63)
$$ 1 2 3 4 5 7 9 11 15 16 8 10 12 14 6 17 13 18 19 20 0 0 0 0 0 0 0 0 0 0
$$ 0 0 0 0 0 0 0 0 0 0 0 0 0 0 0 0 0 0 0 0 0 0 0 0 0 0 0 0 0 0 0 0 0 0
$$ ##$ShimSysMatrix= 0
$$ ##$ShimSysType= 1
$$ ##$TFXNUM= 0
$$ ##$TRIPLO2= 0
$$ ##$VTU= 2
$$ ##$VTUETH= <149.236.99.20>
$$ ##$VTUTY= <no>
$$ ##$WBREFAM= (0..15)
$$ 135 116 100 100 100 100 100 100 100 100 100 100 100 100 100 100
$$ ##$WBREFLM= (0..15)
$$ 0 0 0 0 0 0 0 0 0 0 0 0 0 0 0 0
$$ ##$WBREFPH= (0..15)
$$ 71.66 -68.25 0 0 0 0 0 0 0 0 0 0 0 0 0 0
$$ ##$WBSGU= (0..15)
$$ 0 0 0 0 0 0 0 0 0 0 0 0 0 0 0 0
$$ ##$XFAC= 2
$$ ##END=
$$ 
##$DECIM=	2496
##$DSPFVS=	20
##XUNITS=	HZ
##YUNITS=	ARBITRARY UNITS
##FIRSTX=	6396.5426257272101793
##LASTX=	-1616.2778870932995687
##DELTAX=	-0.1222678036594264106
##XFACTOR=	1
##YFACTOR=	0.0070870096147165329015
##FIRSTY=	10.87258148193359375
##MINY=	2.1054129600524902344
##MAXY=	8525.0625
##NPOINTS=	65536
##XYDATA=	(X++(Y..Y))
$$ [...]
1723A566m9j9j8L6L6K5K5K5K5l7l6l6l6M5M5M5M5M5M5Nq6j16j16n7kJ7P2R6R5L7j9m3m3kl
1719A612n7n7q9r0l4l4LMN9N9N1N1m1m1l2l1l2l2J3J3J3J3M0M0M0M0K8K8Q0Q1K7k7n2n1k1
1715A574k0k1k0J2J2J3J2M0M0J4m1p3j01q5q5k9K7N1N0K9K9K9K9L3L2L2L3l1l1l1l0o9o9j3
1710A342j4L0L0L1L0qqpqOOPOO0O0NNk5k6k5k6LLMLL9M0M0L9k0j9k0k0l8l7l8l7nonnQRJ0
1705A419J1P2J01O1Nj5j6J2m4j03j02q1k5J7M5L3L3J6J5J5J6J1J1J1J1k1k1k1k2k9l0l0l0
1701A325MNN9O0N4N3jjjjN0N1J9k8n7n6J6J6J6J6J5J6J6J6KKKKk8k8k8k8k7k8k8k8j5j5j5
1696A402j5j8j8j9j8J9J8l6l6l8l7N4N5Q4Q5N6J0l9m0j5j5J8J8J7J8J9K0J9K0j4j3j4j3L7
1692A571L7L4L4rn5m5j7J6J5j0j0o7o8l8QL3L3L6L6J7J6l8l8l0l1l0l0j0rrj0NMMNK8K9K8
$$ plain form
1723 1566 1517 1498 1480 1516 1552 1577 1602 1627 1652 1615 1579 1543 1507 1552 1597 1642 1687 1732 1777 1782 1696 1580 1464 1407 1405 1422 1494 1590 1685 1722 1703 1660 1617 1615 1612
1719 1612 1555 1498 1409 1319 1285 1251 1254 1258 1317 1376 1427 1478 1437 1396 1364 1333 1301 1269 1282 1295 1308 1321 1361 1401 1441 1481 1509 1537 1617 1698 1725 1698 1646 1595 1574
1715 1574 1554 1533 1513 1525 1537 1550 1562 1602 1642 1656 1615 1542 1441 1356 1271 1242 1269 1320 1370 1399 1428 1457 1486 1519 1551 1583 1616 1585 1554 1523 1493 1424 1355 1342
1710 1342 1328 1358 1388 1419 1449 1441 1433 1426 1418 1424 1430 1437 1443 1503 1563 1568 1573 1548 1522 1497 1471 1474 1477 1481 1484 1523 1563 1603 1642 1622 1603 1583 1563 1525 1488 1450 1413 1408 1402 1397 1392 1400 1409 1419
1705 1419 1430 1502 1603 1664 1669 1654 1638 1650 1606 1503 1401 1320 1295 1312 1357 1390 1423 1439 1454 1469 1485 1496 1507 1518 1529 1508 1487 1466 1444 1415 1385 1355 1325
1701 1325 1329 1334 1393 1453 1507 1560 1559 1558 1557 1556 1606 1657 1676 1648 1591 1535 1551 1567 1583 1599 1614 1630 1646 1662 1664 1666 1668 1670 1642 1614 1586 1558 1531 1503 1475 1447 1432 1417 1402
1696 1402 1387 1369 1351 1332 1314 1333 1351 1315 1279 1241 1204 1258 1313 1397 1482 1538 1548 1509 1469 1454 1439 1457 1475 1492 1510 1529 1549 1568 1588 1574 1561 1547 1534 1571
1692 1571 1608 1642 1676 1667 1612 1567 1550 1566 1581 1571 1561 1494 1426 1388 1396 1429 1462 1498 1534 1551 1567 1529 1491 1461 1430 1400 1370 1360 1351 1342 1332 1337 1341 1345 1350 1378 1407 1435
1687A435K9mmlmN5N4O7M0lm8l4L1P2P2M6Jk8k8k9k8nM0L0Lk4k4k5k6OOm6m7l4J2M0M1J7J6
1683A669l9l8n0n0k3k3k5k5KKK4K3M8M8on3n2pK7K6L1L1J7M4N5Qm7m7m8m7rL6Q0N2nl2j8j9
1678A560j0j0j0j0LMLMk4k3k4k3j0j0j0j0RQRRj5j4j4j4KKKKK3K3K4K3K9K9JJl8l7j0L5M7
1673A536K0j7j7j3j3j3j3rj0K8N5O2J6j2j1K1K1l4l4n4n5n3pN4N3KJj6j7j4j5J8M5O1No1o2
1668A448m0J4K5K5k7k6ooooJ7J7J7J7K7K7rl7l0K4M7M7K9L0L0K9j8j8j8j8NNNNj2j1j1j2j1
1664A568j2j1j1o9o8o5o5m1J5N6Q4N5jJ6M4N8N8L4k1l2o0o6l7k0m8q1q2m9OO7O7L8L8L9L8
1659A442MMMMK4K4K3K4N6N5J%%%p2j01o4rN0N0mmmmOPOPj3j4j3j3m1m1J3J4L7L8n4n4l9l8
1654A311J6J7K1K1K1K1mnnmRRRRJ6J7J6J6l2l2K4K3L6L5j9j9j6j6M0L9k1k1j8j7%N6L8J0o
$$ plain form
1687 1435 1464 1460 1456 1453 1449 1504 1558 1625 1665 1662 1614 1580 1611 1683 1755 1801 1802 1774 1746 1717 1689 1684 1724 1754 1757 1733 1709 1684 1658 1664 1670 1624 1577 1543 1555 1595 1636 1653 1669
1683 1669 1630 1592 1542 1492 1469 1446 1421 1396 1398 1400 1424 1447 1495 1543 1537 1484 1432 1425 1452 1478 1509 1540 1557 1601 1656 1664 1617 1570 1522 1475 1466 1502 1582 1634 1629 1597 1579 1560
1678 1560 1550 1540 1530 1520 1523 1527 1530 1534 1510 1487 1463 1440 1430 1420 1410 1400 1409 1417 1426 1435 1420 1406 1392 1378 1380 1382 1384 1386 1409 1432 1456 1479 1508 1537 1538 1539 1501 1464 1454 1489 1536
1673 1536 1556 1539 1522 1509 1496 1483 1470 1461 1451 1479 1534 1596 1612 1600 1589 1610 1631 1597 1563 1509 1454 1401 1394 1448 1501 1503 1504 1488 1471 1457 1442 1460 1505 1566 1571 1510 1448
1668 1448 1408 1422 1447 1472 1445 1419 1413 1407 1401 1395 1412 1429 1446 1463 1490 1517 1508 1471 1441 1465 1512 1559 1588 1618 1648 1677 1659 1641 1623 1605 1610 1615 1620 1625 1613 1602 1591 1579 1568
1664 1568 1556 1545 1534 1465 1397 1332 1267 1226 1241 1297 1381 1436 1435 1451 1495 1553 1611 1645 1624 1592 1532 1466 1429 1409 1361 1280 1198 1149 1155 1222 1289 1327 1365 1404 1442
1659 1442 1446 1450 1454 1458 1482 1506 1529 1553 1609 1664 1665 1665 1665 1665 1593 1492 1428 1419 1469 1519 1515 1511 1507 1503 1509 1516 1522 1529 1516 1502 1489 1476 1435 1394 1407 1421 1458 1496 1442 1388 1349 1311
1654 1311 1327 1344 1365 1386 1407 1428 1424 1419 1414 1410 1419 1428 1437 1446 1462 1479 1495 1511 1479 1447 1471 1494 1530 1565 1546 1527 1511 1495 1535 1574 1553 1532 1514 1497 1497 1553 1591 1601 1595
1649A595l3n8q5q1n4j2M4L9J3J5M3M6M5M7M7KJL3k3n7n6o1o0K6K7Q1Q2P3P4P3P4j0j0j0j0
1645A860l9l9l8l9opO1L3m4r9j01m6jkLKKKKLqqpqL4L3L4L3l5l6l5l6OOOOK1K2K2K2K2K2K2
1640A645K2j2j2j3j2o3o3l9J6NMPQL4L4L4L4j4j3j4j3K7K8K8K7J6J6J5J6M9M8pok5k4LLM7
1635A836M6K0J9l7l8q9r0q1l5pom0m0j0L5N6N5M3J6k6p2o3l6j5j5j3j3N8N8N8N8kjk6k6J5
1631A592O0J02P5K0k5n6n6j7j7j7j6l5l4l4l4J8J8J8J7N0N0N0N0PPOPONJ7rm2q8q9m3k1k1
1626A521m6m6j7j7L8L8P2P1Pl9k9kL5L5mnl1l2m3m3J0J0k1m9l2J4L0L0ONl7l7l7l8kkkkK6
1622A335K7K6K7J5J5m0m0j2j1M4M3O4O3L5j2m8m8n0n1k6k6k4k3K7P3O3L5j2j1j3j4k3k4k3
1617A361k4L5L5Q6Q6M4k0l9l9jjkjm2m3m2m3l2l2K2K3K6K6k9k9LLL9O6P0Om8m8mnl2l2L4L3
$$ plain form
1649 1595 1562 1504 1419 1338 1284 1272 1316 1355 1368 1383 1426 1472 1517 1564 1611 1613 1614 1647 1624 1567 1511 1450 1390 1416 1443 1524 1606 1679 1753 1826 1900 1890 1880 1870 1860
1645 1860 1821 1782 1744 1705 1699 1692 1753 1786 1742 1643 1542 1496 1495 1493 1496 1498 1500 1502 1504 1507 1499 1491 1484 1476 1510 1543 1577 1610 1575 1539 1504 1468 1474 1480 1486 1492 1513 1535 1557 1579 1601 1623 1645
1640 1645 1667 1655 1643 1630 1618 1555 1492 1453 1469 1474 1478 1485 1493 1527 1561 1595 1629 1615 1602 1588 1575 1602 1630 1658 1685 1701 1717 1732 1748 1797 1845 1838 1832 1807 1783 1786 1789 1836
1635 1836 1882 1902 1921 1884 1846 1757 1667 1586 1551 1544 1538 1498 1458 1448 1483 1539 1594 1637 1653 1627 1555 1492 1456 1441 1426 1413 1400 1458 1516 1574 1632 1630 1629 1603 1577 1592
1631 1592 1652 1754 1829 1849 1824 1768 1712 1695 1678 1661 1645 1610 1576 1542 1508 1526 1544 1562 1579 1629 1679 1729 1779 1786 1793 1799 1806 1812 1817 1834 1825 1783 1695 1606 1563 1542 1521
1626 1521 1475 1429 1412 1395 1433 1471 1543 1614 1621 1582 1553 1551 1586 1621 1617 1612 1581 1549 1506 1463 1473 1483 1462 1413 1381 1395 1425 1455 1461 1466 1429 1392 1355 1317 1315 1313 1311 1309 1335
1622 1335 1362 1388 1415 1430 1445 1405 1365 1353 1342 1386 1429 1493 1556 1591 1579 1531 1483 1433 1382 1356 1330 1306 1283 1310 1383 1446 1481 1469 1458 1445 1431 1408 1384 1361
1617 1361 1337 1372 1407 1493 1579 1623 1603 1564 1525 1524 1523 1521 1520 1478 1435 1393 1350 1318 1286 1308 1331 1357 1383 1354 1325 1328 1331 1370 1436 1506 1512 1464 1416 1412 1407 1375 1343 1377 1410
1613A410L4L4mno0n9k9k9k8k9ononLLk5p0o2l5NNL4Q0Q1L4J0J0O2O2O3O2PPk3k3k4k3K4K4
1608A504K4K3k6k7k7k7ONONj8j8j8j8n2n3k6k5k0k0L6L5KJk5k6K0K0P2P2O4J9j1j1M5M5M5
1603A601M5k5k5l8j1J8O3O5J9k1k1k4k4qpqqK1K1K1K1jkn3n3m0PL5L6M5M5J6J6m9p7o0j3k3
1599A504k3k0k0j9j8j8j9MLLMk6k6n2nL2L3L5L6P0P1M3M3M6M7J7k9n8n8popoo2o1r1r0l5l5
1594A200K4K4K5K4J7J8J7J8j%N5N5N6N6KJOOL3L3j9k0k0j9l9l9o7o6k6k6K9K9M8M8J8k7m8
1589A425m8k3k4k5k6K9K9N2N2llQPjl0m8lM4P2O5L7J5j2j1j2J5J4j8j8m6m6k8k9k8k9QPQP
1585A383L1L0L1L0K5K5K4K5j7j6j7j6J7J7J7J6k4k4k5k4K4K3K4K3J0J0RJ0m6m6m6m6l3l2K2
1580A414K3N9N9nn1p0m2L2L1J0RRJ0K5K6K5K5jjn6n7rrM3M2L3j3m3m2n8n8n6n5kM3P3P3M4
$$ plain form
1613 1410 1444 1478 1474 1469 1409 1350 1321 1292 1264 1235 1229 1224 1218 1213 1216 1219 1194 1124 1062 1027 1032 1037 1071 1151 1232 1266 1276 1286 1348 1410 1473 1535 1542 1549 1526 1503 1479 1456 1480 1504
1608 1504 1528 1551 1525 1498 1471 1444 1450 1455 1461 1466 1448 1430 1412 1394 1342 1289 1263 1238 1218 1198 1234 1269 1271 1272 1247 1221 1241 1261 1333 1405 1469 1488 1477 1466 1511 1556 1601
1603 1601 1646 1621 1596 1558 1547 1565 1628 1693 1712 1691 1670 1646 1622 1614 1607 1599 1591 1612 1633 1654 1675 1674 1672 1619 1566 1526 1533 1568 1604 1649 1694 1710 1726 1677 1600 1540 1527 1504
1599 1504 1481 1461 1441 1422 1404 1386 1367 1371 1374 1377 1381 1355 1329 1277 1272 1304 1337 1372 1408 1478 1549 1592 1635 1681 1728 1745 1716 1658 1600 1593 1587 1580 1574 1512 1451 1360 1270 1235 1200
1594 1200 1224 1248 1273 1297 1314 1332 1349 1367 1366 1366 1421 1476 1532 1588 1590 1591 1597 1603 1636 1669 1650 1630 1610 1591 1552 1513 1446 1380 1354 1328 1357 1386 1434 1482 1500 1473 1425
1589 1425 1377 1354 1330 1305 1279 1308 1337 1389 1441 1438 1435 1443 1450 1449 1419 1371 1368 1412 1484 1549 1586 1601 1589 1578 1566 1581 1595 1577 1559 1513 1467 1439 1410 1382 1353 1361 1368 1376 1383
1585 1383 1414 1444 1475 1505 1530 1555 1579 1604 1587 1571 1554 1538 1555 1572 1589 1605 1581 1557 1532 1508 1532 1555 1579 1602 1612 1622 1631 1641 1595 1549 1503 1457 1424 1392 1414
1580 1414 1437 1496 1555 1550 1499 1429 1387 1419 1450 1460 1469 1478 1488 1513 1539 1564 1589 1588 1587 1531 1474 1465 1456 1499 1541 1574 1561 1518 1476 1418 1360 1304 1249 1247 1290 1363 1436 1480
1576A480M5M4M5j3j3j3j2k7k6k7k6onnnj3j3M2M2N7N6N7N7k7k8k7k7opopk0k1k0k0J7J6J7
1571A555J7pooom4m3o9k3M2M1j0j1l3l4l0l1L5Q1O8M1J1j7lmjkjkl0l1K5K5K5K6K3K3J5l2
1566A577k0Oj1j2j0j0ooook5k6q0q1m3m3m3m4L2L1L1L2N6N6N7N6M3M3J6l1qJ9%%j1j2j1j2
1562A498j0j1M5M5J0J0J0J1K5K5k9l0m3m4J2J1l5l6l5l5j9j8j8j8ONOOL8L8L8L9K8K9K8K9
1557A611k2k2k2k2j5j6j6j6k9l0k9l0K9L0K9K9k1k1k2k1rrrqMNNNJ6J7J7J6M0L9M0L9k6k7
1553A529k7k7m8m8o0l2K2P8P9K4j6j7j9k0KKN6N7L8L9J4m1r3r4JN5O4O4O7O7l2l2l3l2k8k9
1548A530k9k8k5k4L0L0L1L0k4k5ooool7l7j4M0J3j6MLj2j2j2j1K5K6k9l0k1k1k2k1K6K6K5
1544A365K6L4L4k2k1%%%jL2L1nl3l3J2P4P4L7ql8l8n4n3n4n4noK0O6R0M4l9o7l5pk5k4LLL
$$ plain form
1576 1480 1525 1569 1614 1601 1588 1575 1563 1536 1510 1483 1457 1451 1446 1441 1436 1423 1410 1452 1494 1551 1607 1664 1721 1694 1666 1639 1612 1606 1599 1593 1586 1566 1545 1525 1505 1522 1538 1555
1571 1555 1572 1565 1559 1553 1547 1503 1460 1391 1368 1410 1451 1441 1430 1397 1363 1333 1302 1337 1418 1486 1527 1538 1521 1518 1514 1513 1511 1510 1508 1478 1447 1472 1497 1522 1548 1571 1594 1609 1577
1566 1577 1557 1563 1552 1540 1530 1520 1514 1508 1502 1496 1471 1445 1365 1284 1241 1198 1155 1111 1143 1174 1205 1237 1293 1349 1406 1462 1505 1548 1564 1533 1525 1544 1544 1544 1533 1521 1510 1498
1562 1498 1488 1477 1522 1567 1577 1587 1597 1608 1633 1658 1629 1599 1556 1512 1524 1535 1500 1464 1429 1394 1375 1357 1339 1321 1327 1332 1338 1344 1382 1420 1458 1497 1525 1554 1582 1611
1557 1611 1589 1567 1545 1523 1508 1492 1476 1460 1431 1401 1372 1342 1371 1401 1430 1459 1438 1417 1395 1374 1365 1356 1347 1339 1343 1348 1353 1358 1374 1391 1408 1424 1464 1503 1543 1582 1556 1529
1553 1529 1502 1475 1427 1379 1319 1287 1309 1387 1466 1490 1474 1457 1438 1418 1420 1422 1478 1535 1573 1612 1626 1585 1492 1398 1399 1454 1518 1582 1649 1716 1684 1652 1619 1587 1559 1530
1548 1530 1501 1473 1448 1424 1454 1484 1515 1545 1521 1496 1490 1484 1478 1472 1435 1398 1384 1424 1437 1421 1425 1428 1416 1404 1392 1381 1406 1432 1403 1373 1352 1331 1309 1288 1314 1340 1365
1544 1365 1391 1425 1459 1437 1416 1416 1416 1416 1415 1447 1478 1473 1440 1407 1419 1493 1567 1604 1596 1558 1520 1466 1413 1359 1305 1300 1294 1314 1380 1470 1514 1475 1408 1373 1366 1341 1317 1320 1323 1326
1539A326LK3K2K3K2L2L2Nm2m5j7J9K0kjjkL5L4L4L4k4k4k4k4j3j4j4j3onn7n8ON1M1J4j9j9
1534A352k0k1L0L0L0L0QQQQl3l3l4l3J5J5J6J5J5J5J5J6J2J3J3J3J3J2J3J3J3J3J3J3j3j3
1530A580j4j3k4k3p6p5n9lN8N8J8J8J9J8klkkn0m9j01j01j8L8O2O2L8L7L8L8J0RRJ0m2m2m1
1525A380m2j8j9j9j8M5M5M5M6MMMMj0j0rj0J8J8j3M2R5R6Jn3n0n0JKj0j0j0j0k6k6k7k6m8
1520A336m8PPJ7J7J8J7K5K5K5K5k2k2k2k1L3L3Q5Q5M4j1p2p2o4o4qrM2M2M2M2poooJ2J1m1
1516A489m0J1O6L4L5LLLLMMMLN6N6oo0m1m1J0J1m9m9n0m9mnnnl5l6J9K0J3J3J2J3rro1o1j6
1511A254K9N9N9j1j0j1j1j7j8QN5R4M9j2j3J8M5Lm2m7%K6K5mnmnJ3J3J2J3J6J5J6J5jkkjP
1506A628Qm8m8l9m0m0l9j2j3j2j2opook2k1M3Q8P9N2L0Kj3j3j5j6K0J9p0o9k3K3K3k3m5m4
$$ plain form
1539 1326 1329 1352 1374 1397 1419 1451 1483 1488 1446 1401 1384 1403 1423 1421 1420 1419 1417 1452 1486 1520 1554 1530 1506 1482 1458 1445 1431 1417 1404 1398 1393 1336 1278 1284 1335 1376 1390 1371 1352
1534 1352 1332 1311 1341 1371 1401 1431 1439 1447 1455 1463 1430 1397 1363 1330 1345 1360 1376 1391 1406 1421 1436 1452 1464 1477 1490 1503 1516 1528 1541 1554 1567 1580 1593 1606 1593 1580
1530 1580 1566 1553 1529 1506 1430 1355 1296 1293 1351 1409 1427 1445 1464 1482 1480 1477 1475 1473 1423 1374 1273 1172 1154 1192 1254 1316 1354 1391 1429 1467 1477 1486 1495 1505 1463 1421 1380
1525 1380 1338 1320 1301 1282 1264 1309 1354 1399 1445 1449 1453 1457 1461 1451 1441 1432 1422 1440 1458 1445 1487 1582 1678 1679 1626 1576 1526 1527 1529 1519 1509 1499 1489 1463 1437 1410 1384 1336
1520 1336 1288 1295 1302 1319 1336 1354 1371 1396 1421 1446 1471 1449 1427 1405 1384 1417 1450 1535 1620 1664 1653 1581 1509 1445 1381 1373 1364 1406 1448 1490 1532 1525 1519 1513 1507 1519 1530 1489
1516 1489 1449 1460 1526 1560 1595 1598 1601 1604 1607 1611 1615 1619 1622 1678 1734 1728 1668 1627 1586 1596 1607 1558 1509 1459 1410 1406 1401 1396 1391 1356 1320 1339 1359 1372 1385 1397 1410 1401 1392 1331 1270 1254
1511 1254 1283 1342 1401 1390 1380 1369 1358 1341 1323 1331 1386 1480 1529 1517 1504 1522 1567 1570 1528 1481 1481 1507 1532 1528 1523 1519 1514 1527 1540 1552 1565 1581 1596 1612 1627 1626 1624 1622 1621 1628
1506 1628 1636 1588 1540 1501 1461 1421 1382 1370 1357 1345 1333 1327 1320 1314 1308 1286 1265 1308 1396 1475 1527 1557 1559 1546 1533 1518 1502 1522 1541 1471 1402 1379 1402 1425 1402 1357 1313
1501A313PQJ5J5J5J5J8J8rn4m9kK4K5K5K5j1l9l1J5M3M3l0l0l0l0qqqql9l9j4M0R4R4M3M2
1497A498QRQQk2k1k2k2l9l8J6J6L6L6L7L6RQO4O4J2J3J2J2j2j3j3j3o1o1ooK6K6K6K6M2M2
1492A741m9n0l9m0J4J5rl5%N6P4J9n8q6m3j5k9k9K8Q3O6L8nl2j9j9k1k0k1k1K6K7K6K6RRO0
1487A677O1Qm6j5j5l5l5l4l5L4L5Q6Q6K9k5m9n0l9m0l9l9k0k0k0k0k3k3k3k3L4L3L3L3O0O0
1483A601NNl9l8l9l9n0n0NNJ6J5J6J5mmmlJ9J9J9J9N7N8N4N4J5l1o0o0pqppK1K2K1K2j2j1
1478A610j2j1n7n6n3n4p4k9K0M8L0MK0K1j0j0j1j0j0j0j0j1L1L0L2L3K4N2J9m6o2l4J%M5M4
1474A494N8K9jm6l7rQL6K1K2nonnnnnnj7j6j6j6kkklj4j3j1j1lM4P0P0L8pl7l7nnonJ0J1J0
1468A559J0L3L3L3L4L4L4L4L4PQPQJ4J4j0o5n4n5L0L0J3m2j1j1NNNNk9k9k9k9j6j5j5j5j5
$$ plain form
1501 1313 1320 1328 1343 1358 1373 1388 1406 1424 1415 1361 1312 1310 1334 1359 1384 1409 1398 1359 1328 1343 1386 1429 1399 1369 1339 1309 1301 1293 1285 1277 1238 1199 1185 1225 1319 1413 1456 1498
1497 1498 1506 1515 1523 1531 1509 1488 1466 1444 1405 1367 1383 1399 1435 1471 1508 1544 1553 1561 1625 1689 1701 1714 1726 1738 1726 1713 1700 1687 1626 1565 1559 1553 1579 1605 1631 1657 1699 1741
1492 1741 1692 1642 1603 1563 1577 1592 1583 1548 1548 1604 1678 1697 1639 1553 1510 1495 1466 1437 1465 1548 1614 1652 1647 1615 1596 1577 1556 1536 1515 1494 1520 1547 1573 1599 1608 1617 1677
1487 1677 1738 1746 1700 1685 1670 1635 1600 1566 1531 1565 1600 1686 1772 1801 1776 1727 1677 1638 1598 1559 1520 1500 1480 1460 1440 1417 1394 1371 1348 1382 1415 1448 1481 1541 1601
1483 1601 1606 1611 1572 1534 1495 1456 1406 1356 1361 1366 1382 1397 1413 1428 1424 1420 1416 1413 1432 1451 1470 1489 1546 1604 1658 1712 1727 1696 1636 1576 1569 1561 1554 1547 1568 1590 1611 1633 1621 1610
1478 1610 1598 1587 1530 1474 1421 1367 1293 1264 1284 1332 1362 1366 1386 1407 1397 1387 1376 1366 1356 1346 1336 1325 1356 1386 1418 1451 1475 1527 1546 1500 1438 1404 1405 1405 1450 1494
1474 1494 1552 1581 1580 1534 1497 1488 1496 1532 1553 1575 1570 1564 1559 1554 1549 1544 1539 1534 1517 1501 1485 1469 1467 1465 1463 1460 1446 1433 1422 1411 1408 1452 1522 1592 1630 1623 1586 1549 1544 1539 1533 1528 1538 1549 1559
1468 1559 1569 1602 1635 1668 1702 1736 1770 1804 1838 1845 1853 1860 1868 1882 1896 1886 1821 1767 1712 1742 1772 1785 1743 1732 1721 1726 1731 1736 1741 1712 1683 1654 1625 1609 1594 1579 1564 1549
1464A549j4j4j5M6M5M5M6MMMMk8k8k8k9J4J4J4J4O0O1O1O1M6M7rrK3K2K2K2O4O4O3O4K8K8
1459B365K8K8O2O2J23J78K42K41K44K45J85J85K13K68L26L81M09M09M29M29M84M84N61N61
1456I142N50M57L52K24P6n1k34l98m78m79n08n09n08n09m98m98m38l82l43l42l67l11k11j56
1453C581j28j28r5r6r6r6q4q4j36j36o1okn8q6l1K3K3q1j27j14q8m8k1NL3K9K9L1L1nnnnm5
1449A918m5j7j8j5j5K2M9K7j9m6m6j5j4j5j4K7K7N3Qm5m5m8m8K3K3K2K3L3L3m0o8m1NNMJ%
1444A689%%l0l1k8k9L1N8O8K1k1m8n0k2L0N7O7K0m8r4r3m8JM7M0J2K4K4K2K2k6k5n1n2m6k0
1440A471L0P5O6L8on3m6jK6K6k1k1m5m5j6M8Q1N3K4mRJ0mmmmj0j1j1j1l5l5l6l5OOOOLLLL
1435A535POPPk0k0J7M4L8rl6l6L2L2k4k3m3m4j6j5L2L2L2L2j1j2rrJ7M4%m6n0n1KJj1j2j1
$$ plain form
1464 1549 1535 1521 1506 1552 1597 1642 1688 1692 1696 1700 1704 1676 1648 1620 1591 1605 1619 1633 1647 1707 1768 1829 1890 1936 1983 1974 1965 1988 2010 2032 2054 2118 2182 2245 2309 2337 2365
1459 2365 2393 2421 2483 2545 2668 2846 3088 3329 3573 3818 4003 4188 4401 4669 4995 5376 5785 6194 6623 7052 7536 8020 8581 9142
1456 9142 9692 10149 10501 10725 10801 10750 10516 10118 9640 9161 8653 8144 7636 7127 6629 6131 5693 5311 4968 4626 4259 3948 3737 3581
1453 3581 3453 3325 3230 3134 3038 2942 2858 2774 2638 2502 2441 2435 2433 2375 2289 2258 2281 2304 2223 2096 1982 1894 1846 1825 1830 1863 1892 1921 1952 1983 1978 1973 1968 1963 1918
1449 1918 1873 1856 1838 1823 1808 1830 1879 1906 1887 1841 1795 1780 1766 1751 1737 1764 1791 1844 1852 1807 1762 1714 1666 1689 1712 1734 1757 1790 1823 1783 1715 1674 1679 1684 1688 1689 1689
1444 1689 1689 1689 1659 1628 1600 1571 1602 1660 1728 1749 1728 1680 1630 1608 1638 1695 1762 1782 1734 1640 1547 1499 1500 1547 1587 1599 1623 1647 1669 1691 1665 1640 1589 1537 1491 1471
1440 1471 1501 1576 1642 1680 1674 1621 1575 1574 1600 1626 1605 1584 1539 1494 1478 1526 1607 1660 1684 1680 1689 1699 1695 1691 1687 1683 1673 1662 1651 1640 1605 1570 1534 1499 1505 1511 1517 1523 1526 1529 1532 1535
1435 1535 1542 1548 1555 1562 1542 1522 1539 1583 1621 1612 1576 1540 1572 1604 1580 1557 1514 1470 1454 1439 1471 1503 1535 1567 1556 1544 1535 1526 1543 1587 1587 1541 1491 1440 1442 1443 1432 1420 1409
1430A409j1l9l9J6J6K3K3K3K3O5O4O4O5J6J7l8l9l6l6l6l6k2k2L3L3J6J6J6J6NNMNk7k8k7
1426A537k8j1j2j1j2OONOp4p4m4JM8M8nmk4k4KM8M6%o3o3j3j2M3M2M1M0j4j5j8j8J9M6L4j2
1421A467k8%L1L1l0p7o9k3N0R7J20J20O2Pm9m8l1K5K8k6m7m7j6j6j6j6%jj%J3J3J3J3m6m7
1417A456m6m7m5m6J0J0K8K9K9K8J3J2m2m3K6K7K6K6j%%jPPL8j8m0m0J1J2L9M0M0M0l2l1l2
1412A490l1j3j4M2M2K1K1K1K1L2L3k2k2k4k3k4k3j6j5j6j6L2L1L2L1N3N2K9k7l4l3l7l7j5
1408A541j6j5j5m0l9J5J6O7O7O8O7M8M8M8M8K6K7K6K7M6M6N0M9M7J01J63J62J31J31J32J31
1404C203J62J62K17K17K11K11K35J79P1n7j58k14k22k22j34j34j61j60j37q2m4m3r6r5j26
1401B783j27j02m7LKOOk4k4k4k4N4N4N4N4J07J08J07J08R6R6J55J54K12K67L28L28L81L82
$$ plain form
1430 1409 1398 1359 1320 1336 1352 1375 1398 1421 1444 1509 1573 1637 1702 1718 1735 1697 1658 1622 1586 1550 1514 1492 1470 1503 1536 1552 1568 1584 1600 1605 1610 1614 1619 1592 1564 1537
1426 1537 1509 1498 1486 1475 1463 1469 1475 1480 1486 1412 1338 1294 1295 1343 1391 1386 1382 1358 1334 1336 1384 1430 1430 1367 1304 1291 1279 1322 1364 1405 1445 1431 1416 1398 1380 1399 1445 1479 1467
1421 1467 1439 1439 1470 1501 1471 1394 1325 1302 1352 1449 1569 1689 1751 1758 1709 1661 1630 1655 1683 1657 1610 1563 1547 1531 1515 1499 1499 1498 1497 1497 1510 1523 1536 1549 1503 1456
1417 1456 1410 1363 1318 1272 1282 1292 1320 1349 1378 1406 1419 1431 1389 1346 1372 1399 1425 1451 1450 1450 1450 1449 1456 1463 1501 1483 1443 1403 1414 1426 1465 1505 1545 1585 1553 1522 1490
1412 1490 1459 1446 1432 1474 1516 1537 1558 1579 1600 1632 1665 1643 1621 1597 1574 1550 1527 1511 1496 1480 1464 1496 1527 1559 1590 1643 1695 1724 1697 1663 1630 1593 1556 1541
1408 1541 1525 1510 1495 1455 1416 1431 1447 1514 1581 1649 1716 1764 1812 1860 1908 1934 1961 1987 2014 2060 2106 2156 2205 2252 2353 2516 2678 2809 2940 3072 3203
1404 3203 3365 3527 3744 3961 4172 4383 4618 4797 4868 4811 4653 4439 4217 3995 3861 3727 3566 3406 3269 3187 3143 3100 3004 2909 2783
1401 2783 2656 2554 2507 2510 2512 2518 2524 2500 2476 2452 2428 2482 2536 2590 2644 2751 2859 2966 3074 3170 3266 3421 3575 3787 4054 4382 4710 5091 5473
1398E473M36M37M85M84N49O04O72P28P12O56M96J84j72m47n98o52o39o38n95n95n67n12m29
1395F072l73l09l09k62k61k06k06j32j32j31j32j20j20r2l7j0M5O9P0L7j9j8L7J06J05J10
1392C782J09J85J86K44K44K83L39L62L62L63L64M22N52O67P22O94O93O81N89L42L0k82n22
1389A1411o47p03o95o39o10n55m68m13l86l85m07m06m04l50k85j94j50j50j43j42q7q7q7q7
1386B931r0l5K4K4k7k7k2k3ONj0j0K2K1N4J10J33J34J27J27J51K06K03K02J79J79J93J94J90
1382E171J34L9r0j91k47k60k61k40j85j54j54j50j51j86j86j83j83j32p7j7j6k8k7k8k8k9
1379B141k8q4q4o3o3qqjjjjj8j8j8j8L2L3L2L3l7l6l7l6mmnmL5L4L4L5j6j6j6j6k6k6k7k6
1374A663j5j6J8l6m1J4J1m4o4o3j3j2OONOj0j1j0j0K1K2P3P4K4k1k4k3j2j2j2j2ppM8M9L4
$$ plain form
1398 5473 5909 6346 6831 7315 7864 8468 9140 9868 10580 11236 11732 11916 11744 11297 10699 10047 9408 8770 8175 7580 7013 6501 6072
1395 6072 5699 5390 5081 4819 4558 4352 4146 4014 3882 3751 3619 3499 3379 3287 3250 3240 3285 3354 3424 3461 3442 3424 3461 3567 3672 3782
1392 3782 3891 4076 4262 4506 4750 5033 5372 5734 6096 6459 6823 7245 7797 8464 9186 9880 10573 11254 11843 12185 12215 11933 11411
1389 11411 10764 10061 9366 8727 8117 7562 7094 6681 6295 5910 5503 5097 4693 4343 4058 3864 3714 3564 3421 3279 3192 3105 3018 2931
1386 2931 2841 2806 2830 2854 2827 2800 2778 2755 2761 2766 2756 2746 2768 2789 2843 2953 3086 3220 3347 3474 3625 3831 4034 4236 4415 4594 4787 4981 5171
1382 5171 5305 5344 5254 5063 4816 4556 4295 4055 3870 3716 3562 3412 3261 3075 2889 2706 2523 2391 2314 2297 2281 2253 2226 2198 2170 2141
1379 2141 2113 2029 1945 1882 1819 1811 1803 1802 1801 1800 1799 1781 1763 1745 1727 1759 1792 1824 1857 1820 1784 1747 1711 1707 1703 1698 1694 1729 1763 1797 1832 1816 1800 1784 1768 1742 1716 1689 1663
1374 1663 1648 1632 1650 1614 1573 1587 1598 1554 1490 1427 1414 1402 1408 1414 1419 1425 1415 1404 1394 1384 1405 1427 1500 1574 1598 1577 1553 1530 1518 1506 1494 1482 1475 1468 1516 1565 1599
1370A599L4k1k1l4l5K0K1K5K6l0k9n9n9l1J4K3mm2m1JKJKm8m7PQO9O9O7O6K7k0l1n8m1MO9
1365A503O9K2K2K2K2L5L5Om0q0p9n5n4j8j8m1m2l1L3J25J26O7O8L7L7J7k8n5n5m4KL2L1k0
1361A651k1k0k0j9j8RN5O7L9on2n6k8l0n9m6m6PPK7K7K3K4k0o7n6k9PPRRn2n2LLN6N6N6N6
1356A501L8L7j8j8m4m4J1J1K4K4l1l1llmlj9j8j8j9j7j7L8L7M2M1M1M2L1L1L1L1j7j6j6j7
1352A638l0l0l0l0j5j5j6j5O3O2O3O3O0O0P3M5n3j00r1o4m2m2m0m0o1o2l2J4M5M5M8M9J07
1348A627J07M1mk0j9k2k2l6l6l4l4l3pM3Q8R9P1N1K2qqrj0J6J6P0P1P2P2P2P3Q3Q4K8K9J8
1343B551J8J8J8L2L2k3k4nmnnm6m6M3M4Qj9mmkjj7J0L7L8jk8o7o7n3q1j06j07o9m1j9j9j8
1339A968j7ooqqPk1o1o0n5n4p0m2J4J3J3J4K9Jl6l7k4LNk3j8J0ppk5k5k3k3l9j1J1L9K0qJ0
$$ plain form
1370 1599 1633 1612 1591 1557 1522 1542 1563 1588 1614 1584 1555 1496 1437 1406 1420 1443 1439 1397 1356 1357 1359 1360 1362 1314 1267 1274 1282 1351 1420 1487 1553 1580 1560 1529 1471 1430 1434 1503
1365 1503 1572 1594 1616 1638 1660 1695 1730 1736 1696 1616 1537 1482 1428 1410 1392 1351 1309 1278 1311 1436 1562 1629 1697 1734 1771 1788 1760 1705 1650 1606 1608 1640 1671 1651
1361 1651 1630 1610 1590 1571 1553 1562 1617 1684 1723 1717 1665 1609 1581 1551 1492 1446 1400 1407 1414 1441 1468 1491 1515 1495 1428 1372 1343 1350 1357 1366 1375 1323 1271 1274 1277 1333 1389 1445 1501
1356 1501 1539 1576 1558 1540 1496 1452 1463 1474 1498 1522 1491 1460 1457 1454 1450 1447 1428 1410 1392 1373 1356 1339 1377 1414 1456 1497 1538 1580 1611 1642 1673 1704 1687 1671 1655 1638
1352 1638 1608 1578 1548 1518 1503 1488 1472 1457 1520 1582 1645 1708 1768 1828 1901 1946 1893 1793 1702 1638 1596 1554 1514 1474 1413 1351 1319 1333 1378 1423 1471 1520 1627
1348 1627 1734 1775 1771 1751 1732 1710 1688 1652 1616 1582 1548 1515 1508 1551 1639 1738 1809 1860 1882 1874 1866 1857 1847 1863 1879 1949 2020 2092 2164 2236 2309 2392 2476 2504 2533 2551
1343 2551 2569 2587 2605 2637 2669 2646 2622 2617 2613 2608 2603 2557 2511 2554 2598 2606 2587 2583 2579 2577 2576 2559 2569 2606 2644 2643 2615 2548 2481 2428 2347 2241 2134 2065 2024 2005 1986 1968
1339 1968 1951 1945 1939 1931 1923 1930 1909 1848 1788 1733 1679 1609 1567 1581 1594 1607 1621 1650 1651 1615 1578 1554 1557 1562 1539 1521 1531 1524 1517 1492 1467 1444 1421 1382 1371 1382 1421 1441 1433 1443
1334A443RM2M1Kk6j1j2j3j3J1J2RJ0ol3l2oJ8J7L5Pl8l7l7l7RL6K2K2J0L7P5P5K4moK2ll0
1329A644j3j4qro3o2nK2POJ2J2J2J1j1j1j1j1J5J6J3J4nl2l2mK3K4l0k9OOO1O1L0L0o1o2n4
1324A498n5J%kjn7n7l4l4K2K1L6L6Ql8n6k8J1J1N0R5Q4N5rl6k3k3n8n9lmK2K1K2K2O5O6J0
1320A579J0m2m2m2m3l2l2K2K3KLKKN6N7K8j9o7o7j5j5L6L7Q8Q9N1Ol2p9o6l9klJ6J6P0P1N2
1315A679N1lln6n6n5n6j2j1j2j1nnM8M8L0j6m5m5l7l6l5l5j4J3K6k0l8QO9O8Rl8k9kMk5k3
1310A330NJ8J8J9K0NOOOM4M4N9L3j2j3j3j4QQQQl4l3l2l2J4M1K3K4J0j7j5J2L0N7N9L1kkm
1305A723mMLLLLLLMmmopl0p5o5l8mmkkklkkk8k7k7k8K0K0K0J9O4O3K4ll5l5l5l5J5M2K7K7
1300A583J5J5J5J5J7J8L3Nk3k4K9L0K6K6K6K6lkjjNL2L3NrrM2M2on1k4k3jK7J1J1J0J0k8n5
$$ plain form
1334 1443 1452 1494 1535 1537 1511 1500 1488 1475 1462 1473 1485 1494 1504 1498 1465 1433 1427 1445 1462 1497 1504 1466 1429 1392 1355 1364 1400 1422 1444 1454 1491 1566 1641 1665 1661 1655 1677 1674 1644
1329 1644 1631 1617 1609 1600 1537 1475 1470 1492 1499 1505 1517 1529 1541 1552 1541 1530 1519 1508 1523 1539 1552 1566 1561 1529 1497 1493 1516 1540 1510 1481 1487 1493 1554 1615 1645 1675 1614 1552 1498
1324 1498 1443 1444 1444 1442 1441 1384 1327 1293 1259 1281 1302 1338 1374 1382 1344 1288 1260 1271 1282 1332 1427 1511 1566 1557 1521 1498 1475 1417 1358 1355 1351 1373 1394 1416 1438 1503 1569 1579
1320 1579 1589 1547 1505 1463 1420 1388 1356 1378 1401 1403 1406 1408 1410 1466 1523 1551 1532 1465 1398 1383 1368 1404 1441 1529 1618 1669 1675 1643 1564 1498 1459 1457 1454 1470 1486 1556 1627 1679
1315 1679 1730 1727 1724 1668 1612 1557 1501 1489 1478 1466 1455 1450 1445 1493 1541 1571 1555 1510 1465 1428 1392 1357 1322 1308 1321 1347 1327 1289 1297 1366 1434 1443 1405 1376 1374 1378 1353 1330
1310 1330 1335 1353 1371 1390 1410 1415 1421 1427 1433 1477 1521 1580 1613 1601 1588 1575 1561 1569 1577 1585 1593 1559 1526 1494 1462 1476 1517 1540 1564 1574 1557 1542 1554 1584 1641 1700 1731 1729 1727 1723
1305 1723 1719 1723 1726 1729 1732 1735 1738 1741 1745 1741 1737 1731 1724 1694 1619 1554 1516 1512 1508 1506 1504 1502 1499 1497 1495 1467 1440 1413 1385 1405 1425 1445 1464 1528 1591 1615 1612 1577 1542 1507 1472 1487 1529 1556 1583
1300 1583 1598 1613 1628 1643 1660 1678 1711 1716 1693 1669 1698 1728 1754 1780 1806 1832 1829 1827 1826 1825 1830 1862 1895 1900 1891 1882 1924 1966 1960 1909 1885 1862 1861 1888 1899 1910 1920 1930 1902 1847
1295A847o0l3K6N4J9J9K1K1L3L4n9n8o9p0rM7M8M9llJ9J9K0J9L2L3k2k2j6j6j6j6j9j9j9k0
1291A811M0M0M0M0N8N7L3k2o6o7m6RM9M9N3N3O1O2O1O1L0K9K9L0P1P2P2P1P2P2P2P1L2L2L1
1286C162L2N1N2J06J06J16J15J15J16J45J45J46J45J75J74K30K30K64K64K94L49M55N46N95
1283H128N96O47P38Q04Q96R48J003J060J152J282J374J442J534J578J578J488J322J049O63
1281B9282K11k48n81q55j027j118j139j139j166j110r58p94o54n61m83l91k83j18M2J70K83
1279A7363M11N56O84P79Q70R86J114J248J413J626J901K193K468K760L109L526L912M295M680
1276E5894N139N635O141O637P188P756Q379Q947R447R832R991R864R418Q739P849O876N861
1274A89593M961M293L870L740L740L806L806L619L159K411J439K71r58k008k760l216l382
$$ plain form
1295 1847 1787 1754 1780 1834 1853 1872 1893 1914 1947 1981 1922 1864 1795 1725 1716 1763 1811 1860 1857 1854 1873 1892 1912 1931 1963 1996 1974 1952 1936 1920 1904 1888 1869 1850 1831 1811
1291 1811 1851 1891 1931 1971 2029 2086 2119 2097 2031 1964 1918 1927 1976 2025 2078 2131 2192 2254 2315 2376 2406 2435 2464 2494 2565 2637 2709 2780 2852 2924 2996 3067 3099 3131 3162
1286 3162 3194 3245 3297 3403 3509 3625 3740 3855 3971 4116 4261 4407 4552 4727 4901 5131 5361 5625 5889 6183 6532 6987 7533 8128
1283 8128 8724 9371 10109 10913 11809 12757 13760 14820 15972 17254 18628 20070 21604 23182 24760 26248 27570 28619 29282
1281 29282 29493 29245 28664 27809 26782 25664 24525 23386 22220 21110 20152 19358 18704 18143 17660 17269 16986 16868 16910 17080 17363
1279 17363 17774 18330 19014 19793 20663 21649 22763 24011 25424 27050 28951 31144 33612 36372 39481 43007 46919 51214 55894
1276 55894 61033 66668 72809 79446 86634 94390 102769 111716 121163 130995 140986 150850 160268 169007 176856 183732 189593
1274 189593 194554 198847 202717 206457 210197 214003 217809 221428 224587 226998 228437 228708 227750 225742 222982 219766 216384
1272B16384l368l314l322l452l842m484n363o372p355q253q960r419r646r554r249q864q375
1270A03192p843p251o682o133n639n159m737m358l974l574l189k843k567k327k087j905j739
1268C1185j608j480j374j282j173j081j009r55r15q60q36p80p06o52n88n33n08n09n13n68
1265A3255n65n10m46l90l64l63k79k80k79k80k55k54l10l09l20l20k95k39j59j31j42j42j09
1263F514q1q2j09j28j27r0o3m4m5j06j52j29q3q5q4q9q9q8q7p1m4m1p0p9n1j6j5k4n2q9q9
1259D112m1j4l8o6q2l6Pk1n0n0k5k5l0l0k9k8k2POk1m1m1m2m3k0j9k0k0l5l6l5l6l6l5l6l5
1254B994qqqql9l8n4k6RJ0K8Jk5LJ2J3n9n9k1Ok5n3l6RQl7o2o1l1J4M0M1L2j3m3m3o6o6n4
1250B277k7pponkkklj4j5J1J2K2nm2m3k7JL9L9K8Jm0l9J3J2Kk5l2nL2L1J5j2k5k4l9l8JK9
$$ plain form
1272 216384 213016 209702 206380 202928 199086 194602 189239 182867 175512 167259 158299 148880 139234 129680 120431 111567 103192
1270 103192 95349 88098 81416 75283 69644 64485 59748 55390 51416 47842 44653 41810 39243 36916 34829 32924 31185
1268 31185 29577 28097 26723 25441 24268 23187 22178 21223 20308 19448 18612 17832 17126 16474 15886 15353 14845 14336 13823 13255
1265 13255 12690 12180 11734 11344 10980 10617 10338 10058 9779 9499 9244 8990 8680 8371 8051 7731 7436 7197 7038 6907 6765 6623 6514
1263 6514 6433 6351 6242 6114 5987 5897 5834 5790 5745 5639 5487 5358 5275 5190 5106 5017 4928 4840 4753 4682 4638 4597 4527 4448 4397 4381 4366 4342 4290 4201 4112
1259 4112 4071 4057 4019 3953 3871 3835 3842 3821 3771 3721 3696 3671 3641 3611 3582 3554 3532 3539 3545 3524 3483 3442 3400 3357 3337 3318 3298 3278 3243 3207 3172 3136 3100 3065 3029 2994
1254 2994 2986 2978 2970 2962 2923 2885 2831 2805 2814 2824 2852 2853 2828 2831 2843 2856 2797 2738 2717 2723 2698 2645 2609 2618 2626 2589 2527 2466 2435 2449 2489 2530 2562 2549 2506 2463 2397 2331 2277
1250 2277 2250 2243 2236 2230 2225 2223 2221 2219 2216 2202 2187 2198 2210 2232 2227 2185 2142 2115 2116 2155 2194 2222 2223 2183 2144 2157 2169 2171 2146 2114 2109 2141 2172 2187 2175 2150 2126 2087 2049 2050 2079
1245B079K8K8LKj1j1j1j1j4j5j4j4RJ0l0n7m4m5j8j9LMK9K9M4J7pl5l0k9l2l1JJLLKL1J4J5
1240A877J9J9M5M5K7%k3n1m5j8J9J8Nk3qpLLl6o4n0n0j2J5M3M3Pk1kK5L4L4ql6l5pJ2M0N3
1235A890N4N5N6J6j2j1j0J3J3l2n9m4m4JJJJm6m6qK0J4j2k3k3J8J7j0l7l0J6N3N4L5L6QQn5
1230A878n5k8k7%%K5K5Lm2n6l0M4Q9P8N0ln0k5k5nmnnL1L0m1q6p7j3J2J3j6j6M9M8K7K6l8
1226A781l8l0l0L2L1J4l3n2n2rqN6N6O4O5l5l5m8k1L5Q2O9K3l1l0j4j3j3j3MMMLl9l8j1j2
1221A718%Jl6q1p5k8QL6Rj8jjRJ0RJ0L1L1L2L1M4M4k0m8j6L1K9j7k2k2k4k5m0m1K4K4L6L5
1217A687QQlmlll6l7l7l7NNMNJ9J9J8J9mmmlOOOOmnM2M2N1N0L6Rj7o2q0n2lK4J0J0K3K2K3
1211A765K2j7j7j8j7KJK9K9L7L8rqJ9J9qq%%k0o6r0r0l7RN5N5J1J2nnj5m2l3J3R2J39J11M7
$$ plain form
1245 2079 2107 2135 2138 2140 2129 2118 2107 2096 2082 2067 2053 2039 2048 2058 2028 1971 1927 1882 1864 1845 1848 1852 1881 1910 1954 1971 1964 1929 1899 1870 1838 1807 1808 1809 1812 1815 1817 1848 1862 1877
1240 1877 1896 1915 1960 2005 2032 2032 2009 1958 1913 1895 1914 1932 1937 1914 1906 1899 1902 1905 1869 1805 1755 1705 1693 1708 1751 1794 1801 1780 1778 1803 1837 1871 1863 1827 1792 1785 1797 1837 1890
1235 1890 1944 1999 2055 2071 2059 2048 2038 2051 2064 2032 1973 1929 1885 1886 1887 1888 1889 1843 1797 1789 1809 1823 1811 1788 1765 1783 1800 1790 1753 1723 1739 1792 1846 1881 1917 1925 1933 1878
1230 1878 1823 1795 1768 1768 1768 1793 1818 1821 1779 1723 1693 1737 1826 1904 1954 1951 1901 1876 1851 1846 1842 1837 1832 1863 1893 1852 1766 1689 1676 1688 1701 1685 1669 1718 1766 1793 1819 1781
1226 1781 1743 1713 1683 1715 1746 1760 1727 1675 1623 1614 1606 1662 1718 1782 1847 1812 1777 1729 1708 1743 1825 1894 1917 1886 1856 1842 1829 1816 1803 1807 1811 1815 1818 1779 1741 1730 1718
1221 1718 1718 1719 1683 1602 1527 1499 1507 1543 1552 1534 1533 1532 1541 1551 1560 1570 1601 1632 1664 1695 1739 1783 1763 1715 1699 1730 1759 1742 1720 1698 1674 1649 1609 1568 1592 1616 1652 1687
1217 1687 1695 1703 1700 1696 1693 1690 1654 1617 1580 1543 1548 1553 1557 1562 1581 1600 1618 1637 1633 1629 1625 1622 1628 1634 1640 1646 1642 1637 1679 1721 1772 1822 1858 1867 1850 1788 1708 1656 1653 1677 1687 1697 1720 1742 1765
1211 1765 1787 1770 1753 1735 1718 1720 1721 1750 1779 1816 1854 1845 1837 1856 1875 1867 1859 1859 1859 1839 1773 1683 1593 1556 1565 1620 1675 1686 1698 1693 1688 1673 1631 1598 1611 1703 1842 1953 2000
1206B000j5j5j2j2l9o6m7jL8O6Q2Q2Q4Q4P0P1P0P1J1J0J1J1O8O9O8O9J8J8J8J7k3k4k3k4%
1202B805j%jk5k4k5k5k5k4q5q5q1j7K9L0kjk9k9p7p7p7p8pqqqk1k1k2k1MMk3k4l9m0POj1j2
1197A832n8n8o3o3KJM0L9M0M0J3J3l3l3o0n9NNpopok2k2ONK8K8l6l6nonnNNMNoppoKLKKL4
1191A543L4L4L4m2m3j5j6%jm7m7KJO6O6P0O9L2j5k3k4K0J9rrl7l7k5k6KJqrrqK8K8K8K8j1
1186A644j1j1j1K9K9K7K8j0l8m8kN1N1QRj9j9j9j9KJJK%j%%LLk1k1n2LN4N4L5L4Jn4q0q0l2
1181A521K2K1K1M9M8M3j3k8k8k2k3k2k3L2L2L2L2J1J2J1J2j4j3j4j3poppopopK0J9K0K0QQ
1176A728MNm8j03j04m8K5K6K8K9K4K5K4K5M9M9j5j5mmnmJ5J5J5J5k1k0m8m9n4n5qrN2N2OO
1172A603j8j8j8j8k4k4n4%L6L6L9M0J0J1J1J0K7K6K7K7j0rrrrrrj0L0L0K9L0J5J5J4J5l4l4
$$ plain form
1206 2000 1985 1970 1958 1946 1907 1841 1794 1793 1831 1897 1979 2061 2145 2229 2299 2370 2440 2511 2522 2532 2543 2554 2622 2691 2759 2828 2846 2864 2882 2899 2876 2852 2829 2805 2805
1202 2805 2804 2804 2803 2778 2754 2729 2704 2679 2655 2570 2485 2404 2387 2416 2446 2444 2443 2414 2385 2308 2231 2154 2076 2069 2061 2053 2045 2024 2003 1981 1960 1964 1968 1945 1921 1882 1842 1849 1855 1844 1832
1197 1832 1774 1716 1653 1590 1592 1593 1633 1672 1712 1752 1765 1778 1745 1712 1652 1593 1598 1603 1596 1590 1583 1577 1555 1533 1539 1544 1572 1600 1564 1528 1523 1517 1512 1507 1512 1517 1521 1526 1520 1513 1506 1500 1502 1505 1507 1509 1543
1191 1543 1577 1611 1645 1603 1560 1545 1529 1529 1528 1481 1434 1436 1437 1503 1569 1639 1708 1740 1725 1702 1678 1698 1717 1708 1699 1662 1625 1600 1574 1576 1577 1569 1560 1551 1543 1571 1599 1627 1655 1644
1186 1644 1633 1622 1611 1640 1669 1696 1724 1714 1676 1628 1626 1677 1728 1736 1745 1726 1707 1688 1669 1671 1672 1673 1675 1675 1674 1674 1674 1677 1680 1659 1638 1586 1589 1643 1697 1732 1766 1767 1713 1633 1553 1521
1181 1521 1543 1564 1585 1634 1682 1725 1712 1684 1656 1634 1611 1589 1566 1598 1630 1662 1694 1705 1717 1728 1740 1726 1713 1699 1686 1679 1673 1666 1659 1653 1646 1640 1633 1653 1672 1692 1712 1720 1728
1176 1728 1732 1737 1689 1586 1482 1434 1459 1485 1513 1542 1566 1591 1615 1640 1689 1738 1723 1708 1704 1700 1695 1691 1706 1721 1736 1751 1730 1710 1662 1613 1559 1504 1496 1487 1539 1591 1597 1603
1172 1603 1585 1567 1549 1531 1507 1483 1429 1429 1465 1501 1540 1580 1590 1601 1612 1622 1649 1675 1702 1729 1719 1710 1701 1692 1683 1674 1665 1655 1685 1715 1744 1774 1789 1804 1818 1833 1799 1765
1167A765q5q6m5J1ml1l1mL5L4j3j3m9p6l7J7P3P4L6j9J3J2J3J4J3J3PONMm0o8q3k8RRJ3J3
1163A477n6n6jjN5N6%%j4j4M1M1K6K6k5k6QO3L3L2qqqqp9p9n5%L3L2L6L6MMMNL5L5L5L6K2
1157A737K3l2l3k6k7k6k7k4k4k3k4n5n5l1K5Q3Q3O2Ql1l0l4l4RJ0RRK5K6K5K5J1J0J0J0K7
1153A691K8K7K7j5j6o6o6j9M5O4O5N4N5j1n7p0o9o8o8k9L5R1R1%j%jjjjjo3o4o3o3j3j3j3
1148A421j3kkjkJ4J5J4J4J4J5J4J4K6K6K6K6n0m9J5O1P3M6j2m0m0l9m2m1K1K1K1K0l6l7l6
1144A475l7KKJKnnmmL1N8O8K2m3m3RRJ5J5J5J5L0K9L0L0K4K4K5K4QQQQj2j3j3j3j6j7j6j6
1139A730L6L6j9j9j7j8j8j8m6m6m6m7k3k3k4k3rj0rj0M1M1M1M1ppppj8j7j8j7k6k5L0L0L5
1135A487L6k0j9l3l2M0O8O8J3l1n8l9l9J4J4N0N0nnRQRRk1k1k1k1l1l1O1O1M0M1j5j5k5k4
$$ plain form
1167 1765 1680 1594 1549 1560 1556 1525 1494 1490 1525 1559 1546 1533 1484 1408 1371 1388 1461 1535 1571 1552 1565 1577 1590 1604 1617 1630 1637 1643 1648 1652 1612 1544 1461 1433 1442 1451 1464 1477
1163 1477 1421 1365 1364 1363 1418 1474 1474 1474 1460 1446 1487 1528 1554 1580 1555 1529 1537 1600 1633 1665 1657 1649 1641 1633 1554 1475 1420 1420 1453 1485 1521 1557 1561 1565 1569 1574 1609 1644 1679 1715 1737
1157 1737 1760 1728 1695 1669 1642 1616 1589 1565 1541 1518 1494 1439 1384 1353 1378 1461 1544 1606 1614 1583 1553 1519 1485 1494 1504 1513 1522 1547 1573 1598 1623 1634 1644 1654 1664 1691
1153 1691 1719 1746 1773 1758 1742 1676 1610 1591 1636 1700 1765 1819 1874 1863 1806 1736 1667 1599 1531 1502 1537 1628 1719 1719 1718 1718 1717 1716 1715 1714 1713 1650 1586 1523 1460 1447 1434 1421
1148 1421 1408 1406 1404 1403 1401 1415 1430 1444 1458 1472 1487 1501 1515 1541 1567 1593 1619 1569 1520 1535 1596 1669 1715 1703 1663 1623 1584 1542 1501 1522 1543 1564 1584 1548 1511 1475
1144 1475 1438 1440 1442 1443 1445 1440 1435 1431 1427 1458 1516 1584 1606 1563 1520 1529 1538 1553 1568 1583 1598 1628 1657 1687 1717 1741 1765 1790 1814 1822 1830 1838 1846 1834 1821 1808 1795 1779 1762 1746 1730
1139 1730 1766 1802 1783 1764 1747 1729 1711 1693 1647 1601 1555 1508 1485 1462 1438 1415 1406 1396 1387 1377 1418 1459 1500 1541 1534 1527 1520 1513 1495 1478 1460 1443 1417 1392 1422 1452 1487
1135 1487 1523 1503 1484 1451 1419 1459 1527 1595 1608 1577 1519 1480 1441 1455 1469 1519 1569 1564 1559 1568 1576 1585 1594 1573 1552 1531 1510 1479 1448 1509 1570 1610 1651 1636 1621 1596 1572
1130A572k5k4K8K8k9q5p9k4N5Q2O1O1N9N9J1m3k8%K2K2K3K4oonoRJ0rJ8Om9l2mPQm6m5%%%
1125A620JKLKLl7l6L7O4L6j9m1m2m7m6m7m7J9J8J9J8j1j1j1j1L1L0L0L1j2j1j1j1M8M8M9M8
1120A706j5j5j5j5j5j5j6j5NNNMm5m6m6m6M6M6M5M6L5L5j9k0n9n9n6n6l9QL7L6QRQQk1k2J5
1116A452M2J5m9r0m5K0M7O1J5%jllK9K9K9K9LLKLLKLLRRJ0RRRJ0Rrqrqm1m0m1m1rrrrL2L2
1110A504L2L3MMMMMMMMk6k6k7k6QQm7m7j2j2M4M3M3M2J7l0m8lO1O1k4k4k4k3LLLLk6k6k6k5
1105A438qrM7M7N5N6N5N6j4j3m1m1j8j9L4L3K6k1m9n0RQO4O4K5K5llj8j9m6m7m4m5n7l0J5
1100A462O0Q9Q8O1J5n0n1n9n9l1l2J0J1k7n4l9OL4L3J4J4J3J4N0N0onk9k9jjJ2J2k4n2l9O
1096A466L4L4L1L2MMk4k3k4k3k6k5k6k5M4M5M4M4K2K2nom3m3j4L3N7N7O0O1J7J7l8l8k7k8
$$ plain form
1130 1572 1547 1523 1551 1579 1550 1465 1386 1362 1417 1499 1560 1621 1680 1739 1750 1707 1679 1679 1701 1723 1746 1770 1764 1758 1753 1747 1756 1766 1757 1775 1781 1732 1700 1696 1703 1711 1665 1620 1620 1620 1620
1125 1620 1621 1623 1626 1628 1631 1594 1558 1595 1659 1695 1676 1635 1593 1546 1500 1453 1406 1425 1443 1462 1480 1469 1458 1447 1436 1467 1497 1527 1558 1546 1535 1524 1513 1561 1609 1658 1706
1120 1706 1691 1676 1661 1646 1631 1616 1600 1585 1590 1595 1600 1604 1559 1513 1467 1421 1467 1513 1558 1604 1639 1674 1655 1635 1576 1517 1461 1405 1366 1374 1411 1447 1455 1464 1472 1480 1459 1437 1452
1116 1452 1494 1509 1460 1370 1325 1345 1392 1453 1468 1468 1467 1464 1461 1490 1519 1548 1577 1580 1583 1585 1588 1591 1593 1596 1599 1608 1617 1627 1636 1645 1654 1664 1673 1664 1656 1647 1639 1598 1558 1517 1476 1467 1458 1449 1440 1472 1504
1110 1504 1536 1569 1573 1577 1581 1585 1589 1593 1597 1601 1575 1549 1522 1496 1504 1512 1465 1418 1406 1394 1438 1481 1524 1566 1583 1553 1505 1502 1563 1624 1600 1576 1552 1529 1532 1535 1538 1541 1515 1489 1463 1438
1105 1438 1430 1421 1468 1515 1570 1626 1681 1737 1723 1710 1669 1628 1610 1591 1625 1658 1684 1663 1614 1564 1573 1581 1645 1709 1734 1759 1756 1753 1735 1716 1670 1623 1579 1534 1477 1447 1462
1100 1462 1522 1611 1699 1760 1775 1725 1674 1615 1556 1525 1493 1503 1514 1487 1433 1394 1400 1434 1467 1481 1495 1508 1522 1572 1622 1616 1611 1582 1553 1552 1551 1563 1575 1551 1499 1460 1466
1096 1466 1500 1534 1565 1597 1601 1605 1581 1558 1534 1511 1485 1460 1434 1409 1453 1498 1542 1586 1608 1630 1625 1619 1576 1533 1519 1552 1609 1666 1726 1787 1804 1821 1783 1745 1718 1690
1091A690K8K8QQm7m7q3q3n9mL7L7J3J2L3L3k6q1r6o7l2l2j1j1P8P7J8l7j2M2P1J6n9q7o8j3
1087A274RRlmllM6M5M6M6j2j2K4N2N9Nl8o5n6k9pK1J2J2J4J3M4M3M2M1Q0N1Rm7n2k5J2J1l0
1082A634l0llj1j1J7J7M6M6rj0kkl0l0m6m6m7m6rqrrO2O2L4L4j%n3n2m0J5P6P6J7J7j0j1K
1077A627KJKn1n0n1n0JJJKL3L3L3L3j3j3j4j5l8o5p2k7K9P6O5L7Rl7o5o6l2J4J5J6J6J6M3
1073A446M4L3L3L4L3%Jn2n1j6L1N7N7P0K5l9m0k0QK0k6o0l2NNL2L1NMl3l3l3l3l4l3K2K2K2
1068A505K3M9N0N7N7JKjkjjj4j4o9o9o9o9j4j4J5J5J6J5K2K1K2K2j6j7L9L9N2N3K4k2n6n6
1063A595mmpoopJ8J8J8J8nonnm1m0m1m1J%J%l1l2l2l2RJ0RJ0J9J9K0J9j3j3M2M1L0K9KKj7
1058A542j7j7j7JJN5N4O8M1qn4n3k5nK4J1J2j5j4JKJKm9m9m9m9KJK9K9N7N6KJl2l2n9o0n1
$$ plain form
1091 1690 1718 1746 1754 1762 1715 1668 1585 1502 1443 1439 1476 1513 1526 1538 1571 1604 1578 1497 1401 1334 1302 1270 1259 1248 1326 1403 1421 1384 1372 1414 1485 1501 1442 1355 1287 1274
1087 1274 1283 1292 1289 1285 1282 1279 1325 1370 1416 1462 1450 1438 1462 1514 1573 1578 1540 1475 1419 1390 1383 1404 1416 1428 1442 1455 1499 1542 1584 1625 1705 1756 1765 1718 1666 1641 1653 1664 1634
1082 1634 1604 1601 1598 1587 1576 1593 1610 1656 1702 1693 1683 1681 1679 1649 1619 1573 1527 1480 1434 1425 1417 1408 1399 1461 1523 1557 1591 1590 1590 1537 1485 1445 1460 1536 1612 1629 1646 1636 1625 1627
1077 1627 1629 1630 1632 1581 1531 1480 1430 1431 1432 1433 1435 1468 1501 1534 1567 1554 1541 1527 1512 1474 1409 1337 1310 1339 1415 1480 1517 1526 1489 1424 1358 1326 1340 1355 1371 1387 1403 1446
1073 1446 1490 1523 1556 1590 1623 1623 1624 1572 1521 1505 1536 1593 1650 1720 1745 1706 1666 1646 1654 1674 1648 1588 1556 1561 1566 1598 1629 1634 1638 1605 1572 1539 1506 1472 1439 1461 1483 1505
1068 1505 1528 1577 1627 1684 1741 1742 1744 1743 1741 1740 1739 1725 1711 1642 1573 1504 1435 1421 1407 1422 1437 1453 1468 1490 1511 1533 1555 1539 1522 1561 1600 1652 1705 1729 1707 1651 1595
1063 1595 1591 1587 1580 1574 1568 1561 1579 1597 1615 1633 1628 1622 1617 1612 1571 1531 1490 1449 1450 1450 1451 1451 1420 1388 1356 1324 1333 1343 1352 1362 1381 1400 1420 1439 1426 1413 1455 1496 1526 1555 1557 1559 1542
1058 1542 1525 1508 1491 1492 1493 1548 1602 1670 1711 1703 1649 1596 1571 1566 1590 1601 1613 1598 1584 1585 1587 1588 1590 1541 1492 1443 1394 1396 1397 1426 1455 1512 1568 1570 1571 1539 1507 1448 1388 1337
1053A337n1k3k4K7K6KKN6J02P5K8QQMNk0k0k0k0%J%%k3k3N0P8P5K8j7m5mM2M1nl1l0l3l3l8
1048A535l8J7J8m2m2J4J3POm8m9k5k6K9K9%%%%M3M3J6J6ppM6M5%m6l5rJ9J8K0K0jkJJJ4M2
1043A635L5l0q5q4k5k5RRL4L4mn0l9j2J8J8K0J9J6J6m8m9KJKJj1j1j2j1l9m0jM5P8P8N4N3
1039A601MLL1N9M0nm1m2QQQQj5j5j5j6o1o1p3m6j7K9N1N1K9K8K8K8k3k3k4k3rj0rj0QPPPM
1034A509Mk1k1jM4Q3Q3J6J6J3J3k0o5o4k0K7K6K9K9L2L3l2l2j6j6j6j6j2j2L3L4L3L3l1l1
1029A664n9o0j4j4N0N0K2K2l0l0l1l0rrooK1O7O7K2j%lmj9k0k0j9J2J3RJ0j2n9l2l2nnmnk5
1024A466k4n2n2k4k4K1K2M9M8KLJ6J6O2O2K6K5k0k0j0j0j1j0n6n6j8K8J7J6K0J9k2k2k3k2
1020A442POPPKLm2m2j7J1K1k5n4n5NNJ9qPN4N2K5lkN4N4QQJ8J7J6l1m3m4%%K4K4k1k2qpL8
$$ plain form
1053 1337 1286 1263 1239 1266 1292 1294 1296 1352 1454 1529 1557 1565 1573 1577 1582 1562 1542 1522 1502 1502 1503 1503 1503 1480 1457 1507 1585 1660 1688 1671 1626 1622 1664 1705 1700 1669 1639 1606 1573 1535
1048 1535 1497 1514 1532 1490 1448 1462 1475 1482 1488 1440 1391 1366 1340 1369 1398 1398 1398 1398 1398 1441 1484 1500 1516 1509 1502 1548 1593 1593 1547 1512 1503 1522 1540 1560 1580 1579 1577 1578 1579 1593 1635
1043 1635 1670 1640 1555 1471 1446 1421 1430 1439 1473 1507 1503 1453 1414 1402 1420 1438 1458 1477 1493 1509 1461 1412 1414 1415 1417 1418 1407 1396 1384 1373 1334 1294 1293 1338 1416 1494 1548 1601
1039 1601 1605 1608 1639 1698 1738 1733 1692 1650 1658 1666 1674 1682 1667 1652 1637 1621 1560 1499 1426 1380 1363 1392 1443 1494 1523 1551 1579 1607 1584 1561 1537 1514 1505 1495 1486 1476 1484 1491 1498 1505 1509
1034 1509 1513 1492 1471 1470 1514 1597 1680 1696 1712 1725 1738 1718 1653 1589 1569 1596 1622 1651 1680 1712 1745 1713 1681 1665 1649 1633 1617 1605 1593 1626 1660 1693 1726 1695 1664
1029 1664 1605 1545 1531 1517 1567 1617 1639 1661 1631 1601 1570 1540 1531 1522 1516 1510 1531 1598 1665 1687 1686 1686 1683 1679 1660 1640 1620 1601 1613 1626 1635 1645 1633 1574 1542 1510 1505 1500 1496 1491 1466
1024 1466 1442 1390 1338 1314 1290 1311 1333 1382 1430 1432 1435 1451 1467 1529 1591 1617 1642 1622 1602 1592 1582 1571 1561 1505 1449 1431 1459 1476 1492 1512 1531 1509 1487 1464 1442
1020 1442 1449 1455 1462 1469 1471 1474 1432 1390 1373 1384 1405 1380 1326 1271 1276 1281 1300 1292 1299 1353 1405 1430 1427 1425 1479 1533 1541 1549 1567 1584 1600 1569 1526 1482 1482 1482 1506 1530 1509 1487 1479 1472 1510
1015A510L8N0N0L0j5o5o5l0J6N3N2K8K8J5J6J5J5m6m5m6m5KLn1n0o1l2k4L1P5P5K0l6k2Nj4
1011A480j4mmmnL2L1L2L1k8k8k9k8J6J6J6J6J5J6J8J7jK7M2j2n3n2jjL4L4L5L4l7l7l7l7q
1006A522pM8M7J6J5l9m0n7n7n4n4jN4K3K3J5J6J5J5k6k6k6k6M9M9M9M9L3L3k2k3n1n2LMj8
1001A499j7j7j8K8K8K7K8qqqqK7K7k7k8l5l4l5l5RQM5P2O4J0j3j3k9k8k9k9K8K7K5K5km7m7
997A462kL6L6J2l3l9ON3Q0N7K9Qk1k6k6k8k7J9J9J7J6k0o7o6k0kkJJN7N7KKN5N6qn3m1NO5
992A670O6j4o0l3l4J2J1J2J2j1j2j1j1rqrqJ2J3oK2L4j2m0l9k5k5k6k5nmnnJ2J3J2J3k6k5
987A426K9L0N2N3lkj1j2j1j1mmnmK0K1l5l4mmlmK8K7K7K8N6N5K6j9j3j3j6j6l0k9l0l0qqm4
982A471p2m7J7P1P1M2M3J4l3o0o1qrQQQQL5L4L4L5l4l4l3l4L5L6L5L5k6k6k5k6j%N1N2K1k5
$$ plain form
1015 1510 1548 1598 1648 1678 1663 1598 1533 1503 1519 1572 1624 1652 1680 1695 1711 1726 1741 1695 1650 1604 1559 1561 1564 1513 1463 1402 1370 1346 1377 1452 1527 1547 1511 1489 1494 1480
1011 1480 1466 1462 1458 1454 1449 1481 1512 1544 1575 1547 1519 1490 1462 1478 1494 1510 1526 1541 1557 1575 1592 1591 1618 1660 1648 1595 1543 1542 1541 1575 1609 1644 1678 1641 1604 1567 1530 1522
1006 1522 1515 1563 1610 1626 1641 1602 1562 1505 1448 1394 1340 1339 1393 1416 1439 1454 1470 1485 1500 1474 1448 1422 1396 1445 1494 1543 1592 1625 1658 1636 1613 1562 1510 1513 1517 1499
1001 1499 1482 1465 1447 1475 1503 1530 1558 1550 1542 1534 1526 1553 1580 1553 1525 1490 1456 1421 1386 1395 1403 1448 1520 1584 1594 1581 1568 1539 1511 1482 1453 1481 1508 1533 1558 1556 1509 1462
997 1462 1460 1496 1532 1544 1511 1472 1478 1531 1611 1668 1697 1705 1684 1658 1632 1604 1577 1596 1615 1632 1648 1628 1561 1495 1475 1473 1471 1472 1473 1530 1587 1589 1591 1646 1702 1694 1641 1600 1605 1670
992 1670 1736 1722 1662 1629 1595 1607 1618 1630 1642 1631 1619 1608 1597 1588 1580 1571 1563 1575 1588 1582 1604 1638 1626 1586 1547 1522 1497 1471 1446 1441 1437 1432 1427 1439 1452 1464 1477 1451 1426
987 1426 1455 1485 1537 1590 1587 1585 1574 1562 1551 1540 1536 1532 1527 1523 1543 1564 1529 1495 1491 1487 1484 1480 1508 1535 1562 1590 1646 1701 1727 1708 1695 1682 1666 1650 1620 1591 1561 1531 1523 1515 1471
982 1471 1399 1352 1369 1440 1511 1553 1596 1610 1577 1517 1456 1448 1439 1447 1455 1463 1471 1506 1540 1574 1609 1575 1541 1508 1474 1509 1545 1580 1615 1589 1563 1538 1512 1511 1511 1562 1614 1635 1610
977A610n3n4k5k4K7K8J4l1n8n9k9J7M4M4J2j5K8P3R4O6j7o3n8l1j0J8J5J6J7J8m6m5m5m5m
973A429mmmJ5J5J5J5M6M6N8L1m1q7p5m7l9PL8L8K3K4l1l1m2m1J3J4k7k6k7k6J8J8J9J8N1N1
969A450N1N1K8K8K8K8j8j8j7j8j4j4j4j4MLN9N9L2L3o0n9m9m9POL5L5L5L5L6L6j8j9J1J1m4
964A676m4j0rj0j0l1l0K4K4L4L3L4L3k2k3r4j22o6jN2N3M0M1M2M2K4N1O1J6m4m5m7m7rrj0
960A597rj6j6n2q0p6l1J7M4Kk5qql9l9j0L6M8M9N1N1J5J6J5J5kjkkL5L4k0k1%%%Jn7n6jko
955A447noom4m3j4L1N6N7MMj%k7K0O3O2J0J1QPQQMNMM%%%jk3k3k0k0J8O4N3K4j6m3l0l0l6
949A584l6J8J9K9K9K9K9LL%jj9o6n5k8l2l3kM5N9O0QPJJ%JQQO0N9mn1m0j3NMPOl2l1l2l1r
944A567rqrL0K9K9L0l4l3l4l3J1J1j3o0m0K4P4P4J9k8j6J0K8K8k5k5j4j4P8P9R7R7M1k3n3
$$ plain form
977 1610 1557 1503 1478 1454 1481 1509 1523 1492 1434 1375 1346 1363 1407 1451 1463 1448 1476 1549 1643 1709 1692 1629 1571 1540 1530 1548 1563 1579 1596 1614 1568 1523 1478 1433 1429
973 1429 1425 1421 1417 1432 1447 1462 1477 1523 1569 1627 1658 1617 1530 1455 1408 1369 1376 1414 1452 1475 1499 1468 1437 1395 1354 1367 1381 1354 1328 1301 1275 1293 1311 1330 1348 1399 1450
969 1450 1501 1552 1580 1608 1636 1664 1646 1628 1611 1593 1579 1565 1551 1537 1541 1544 1603 1662 1694 1727 1667 1608 1559 1510 1517 1523 1558 1593 1628 1663 1699 1735 1717 1698 1709 1720 1676
964 1676 1632 1622 1613 1603 1593 1562 1532 1556 1580 1614 1647 1681 1714 1692 1669 1575 1453 1387 1386 1438 1491 1531 1572 1614 1656 1680 1731 1792 1808 1764 1719 1672 1625 1616 1607 1597
960 1597 1588 1572 1556 1504 1424 1348 1317 1334 1378 1380 1355 1347 1339 1300 1261 1251 1287 1335 1384 1435 1486 1501 1517 1532 1547 1545 1544 1542 1540 1575 1609 1589 1568 1568 1568 1568 1569 1512 1456 1455 1453 1447
955 1447 1442 1436 1430 1386 1343 1329 1360 1416 1473 1477 1481 1480 1480 1453 1473 1536 1598 1608 1619 1627 1634 1642 1650 1654 1659 1663 1667 1667 1667 1667 1666 1643 1620 1600 1580 1598 1662 1715 1739 1723 1680 1650 1620 1584
949 1584 1548 1566 1585 1614 1643 1672 1701 1704 1707 1707 1706 1687 1621 1566 1538 1506 1473 1471 1516 1575 1635 1643 1650 1651 1652 1652 1653 1661 1669 1729 1788 1784 1733 1693 1680 1685 1689 1696 1702 1670 1639 1607 1576 1567
944 1567 1558 1550 1541 1571 1600 1629 1659 1625 1592 1558 1525 1536 1547 1534 1474 1434 1458 1532 1606 1625 1597 1581 1591 1619 1647 1622 1597 1583 1569 1647 1726 1823 1920 1961 1938 1885
939A885n4klk5k6k5k6j6j7j6j7POOPj8j8j8j9NNNNLLLLmlmml6l6l6l6NNNNO3O3O0O0L8pl6
934A745l7mmmmJ2J2O7O7N3N3O5L8k5p2j02j02m9m8OPK2K3K3K2kllkk3k2k2k2p1p1m0NM5P2
929A605O0N9O5O4RJ0QQQQn3n4n0n1m6%J4M1M9M8N1N0K2K2K2K2j4j3j3j4MMLMm3m4J2J1oon
924A871oRQRQnnnnl1l0l1l0l1l1l0l1j5j6j6j6K5K6K5K5LKKKKKKKj8j9j8j8k2k2k2k2k8k9
919A471K7K6J7J6l6l5m5RL4L3N9N9N9N8L2L1Pm8r2r2p1j5O5O6O6O6J3m2j1j1j0j0j1j0l6l7
914A602l3l3L2Q6N2l9r3r2j0j0j6p2p2j7O6O6O6O6M6ql3l2K7K7K7K7K5K5K5K5QQQPj4j4o6
910A667o6jN5K3K4J9J9l3l3k2L3N7N6J3J3J3J3n3n2m9m9J4P0O9J4J7J6J4J3K5K6K5K6k5k5
905A926n6jM2M2rj0m7m8QQM6M5j4p0m4m4m7m7l9l9l9l9jjN4N4K7K7K7K7L1L1L0L1JJKJJJK
$$ plain form
939 1885 1831 1829 1826 1801 1775 1750 1724 1708 1691 1675 1658 1665 1671 1677 1684 1666 1648 1630 1611 1616 1621 1626 1631 1634 1637 1640 1643 1639 1636 1632 1628 1592 1556 1520 1484 1489 1494 1499 1504 1567 1630 1690 1750 1788 1781 1745
934 1745 1708 1704 1700 1696 1692 1704 1716 1783 1850 1903 1956 2021 2059 2034 1962 1860 1758 1709 1661 1667 1674 1696 1719 1742 1764 1762 1759 1756 1754 1731 1709 1687 1665 1594 1523 1483 1488 1533 1605
929 1605 1665 1724 1789 1853 1862 1872 1880 1888 1896 1904 1851 1797 1747 1696 1650 1650 1664 1705 1754 1802 1853 1903 1925 1947 1969 1991 1977 1964 1951 1937 1941 1945 1948 1952 1909 1865 1877 1888 1882 1876 1871
924 1871 1865 1874 1882 1891 1899 1894 1889 1884 1879 1848 1818 1787 1757 1726 1695 1665 1634 1619 1603 1587 1571 1596 1622 1647 1672 1675 1677 1679 1681 1683 1685 1687 1689 1671 1652 1634 1616 1594 1572 1550 1528 1500 1471
919 1471 1498 1524 1541 1557 1521 1486 1441 1450 1484 1517 1576 1635 1694 1752 1784 1815 1822 1774 1682 1590 1519 1504 1569 1635 1701 1767 1780 1738 1727 1716 1706 1696 1685 1675 1639 1602
914 1602 1569 1536 1568 1654 1706 1667 1574 1482 1472 1462 1446 1374 1302 1285 1351 1417 1483 1549 1595 1587 1554 1522 1549 1576 1603 1630 1655 1680 1705 1730 1738 1746 1754 1761 1747 1733 1667
910 1667 1601 1600 1655 1678 1702 1721 1740 1707 1674 1652 1685 1742 1798 1811 1824 1837 1850 1797 1745 1696 1647 1661 1731 1800 1814 1831 1847 1861 1874 1899 1925 1950 1976 1951 1926
905 1926 1870 1869 1911 1953 1944 1934 1887 1839 1847 1855 1901 1946 1932 1862 1818 1774 1727 1680 1641 1602 1563 1524 1523 1522 1576 1630 1657 1684 1711 1738 1769 1800 1830 1861 1862 1863 1865 1866 1867 1868 1870
900A870Jk0j9k0j9k0j9j9k0l5l5l5l5JJ%JkkN1N0j3n8m7j9ML2J8J7J3J3J2J3J4J5J4J5M5M6
896A809j0rPQMNm0q6p4m6J2M1K3K4M7Jm6p4o7k2K5N2K2k5MLoppoL1L1L1L1M1M1j4j4p0p1p0
891A529p0J9K0J9J9OONOK0K1K0K0rqo1o0QN3K8K8j0j1j0j1l0l0K4K5L4L5O2O2N6N7JKp2p1
886A732p1p2l0l1l0l0K0K0K0K0kkjkM5M6P2K5k9k9l3l2RRm4m3j4L1O1O1K1K2ook0k1k0k1L8
881A663L7L8L7j9j9k0j9j9k0j9j9j0j0j0j0K6K5K6K6m9m9OOK6K6K5K6L3L2L3L3J9J9J9J9K
877A910JKKJ3J4j4j4m6m6RRNNNNL4L4k0k1q1q0k5M0N9O0L6L6L0L1L1L1O4O4RJ0k0j9k0j9Q
872B132PQQj0j0J5P0P7P8K7K6L8L7L8L8O6O5O6O6OOOPO3O4O4O4N0N0M8M8Rj8l2K3P7J04R3
867C574R2N9O0PQR2J47J22O6J7M4O7R4J11J39J53J52J52J52J24J24J15J15J16J15J26J26R0
$$ plain form
900 1870 1871 1851 1832 1812 1793 1773 1754 1735 1715 1680 1645 1610 1575 1576 1577 1577 1578 1576 1574 1625 1675 1662 1604 1557 1538 1542 1574 1592 1609 1622 1635 1647 1660 1674 1689 1703 1718 1763 1809
896 1809 1799 1790 1797 1805 1809 1814 1774 1688 1614 1568 1580 1621 1644 1668 1715 1716 1670 1596 1529 1507 1532 1584 1606 1581 1585 1588 1582 1575 1568 1562 1593 1624 1655 1686 1727 1768 1754 1740 1670 1599 1529
891 1529 1459 1478 1498 1517 1536 1542 1548 1553 1559 1579 1600 1620 1640 1631 1623 1562 1502 1510 1563 1591 1619 1609 1598 1588 1577 1547 1517 1541 1566 1600 1635 1697 1759 1815 1872 1873 1875 1803 1732
886 1732 1661 1589 1559 1528 1498 1468 1488 1508 1528 1548 1546 1544 1543 1541 1586 1632 1704 1729 1700 1671 1638 1606 1615 1624 1580 1537 1523 1554 1615 1676 1697 1719 1713 1707 1687 1666 1646 1625 1663
881 1663 1700 1738 1775 1756 1737 1717 1698 1679 1659 1640 1621 1611 1601 1591 1581 1607 1632 1658 1684 1635 1586 1592 1598 1624 1650 1675 1701 1734 1766 1799 1832 1851 1870 1889 1908 1910
877 1910 1911 1913 1915 1928 1942 1928 1914 1868 1822 1831 1840 1845 1850 1855 1860 1894 1928 1908 1887 1806 1726 1701 1741 1800 1860 1896 1932 1962 1993 2024 2055 2119 2183 2192 2202 2182 2163 2143 2124 2132
872 2132 2139 2147 2155 2145 2135 2150 2220 2297 2375 2402 2428 2466 2503 2541 2579 2645 2710 2776 2842 2848 2854 2860 2867 2930 2994 3058 3122 3172 3222 3270 3318 3327 3309 3277 3300 3377 3481 3574
867 3574 3666 3725 3785 3792 3800 3892 4039 4161 4227 4244 4288 4355 4449 4560 4699 4852 5004 5156 5308 5432 5556 5671 5786 5902 6017 6143 6269 6359
864F359O3Q1J36J58J58J15J14J42J42J47J48R2R2J26J27J26J26J55J54J83J82J74J75J39J11
861I725J25J80J89J61J15Q7J01J01J02J02J0J0L5L5L4L5P0P1P0P0O3O4O3O3M1M0M1M0J5J4
857A1872J5J4J3J3J3J3r0r0j14j14j02m7k4k3l7l8l6r1j47j76j80j53j63j91j74j74j79j80
854I430k07k07k00k01j45j45j58j57k13k12j97j98j42j42j43j44j16j16r3r3j21j20k02k02
851E556j75j21p6m8n7j11j60j60j10j11j15j42j56j01p0m2l7o5o5l8l7o5q5n7kK6k2p7r6r6
847C085q9l5RL7M0J3m7p4p0p0p2p1o3o3l5l5n8n9lmJ9J8J8J9j5j4k6JL6R1J28J01K8k8n4n3
843B605m0l9m0l9j1j1j0j1pqppl9l8j4M1M2M2j0rn3n3n3n3k4k4k3k4k3k4k3k4K0K0K0K0LL
838B075N7N8J1J0J0J0K6K6kkmmn9n9j1j1l5l5j0M4O9O8K2K3K2K2P9P9K4K4JJN6N6J9J9J9J9
$$ plain form
864 6359 6422 6503 6639 6797 6955 7070 7184 7326 7468 7615 7763 7855 7947 8073 8200 8326 8452 8607 8761 8944 9126 9300 9475 9614 9725
861 9725 9850 10030 10219 10380 10495 10582 10683 10784 10886 10988 10998 11008 11043 11078 11112 11147 11217 11288 11358 11428 11491 11555 11618 11681 11722 11762 11803 11843 11858 11872
857 11872 11887 11901 11914 11927 11940 11953 11863 11773 11659 11545 11443 11396 11372 11349 11312 11274 11238 11147 11000 10824 10644 10491 10328 10137 9963 9789 9610 9430
854 9430 9223 9016 8816 8615 8470 8325 8167 8010 7797 7585 7388 7190 7048 6906 6763 6619 6503 6387 6294 6201 6080 5960 5758 5556
851 5556 5381 5260 5184 5136 5079 4968 4808 4648 4538 4427 4312 4170 4014 3913 3843 3801 3764 3699 3634 3596 3559 3494 3409 3352 3350 3376 3354 3277 3181 3085
847 3085 2996 2961 2970 3007 3047 3060 3013 2939 2869 2799 2727 2656 2593 2530 2495 2460 2402 2343 2340 2336 2355 2373 2391 2410 2395 2381 2355 2356 2392 2483 2611 2712 2740 2712 2658 2605
843 2605 2565 2526 2486 2447 2436 2425 2415 2404 2397 2389 2382 2375 2336 2298 2284 2325 2367 2409 2399 2390 2337 2284 2231 2178 2154 2130 2107 2083 2060 2036 2013 1989 2009 2029 2049 2069 2072 2075
838 2075 2132 2190 2201 2211 2221 2231 2257 2283 2281 2279 2275 2271 2212 2153 2142 2131 2096 2061 2051 2095 2164 2232 2254 2277 2299 2321 2400 2479 2503 2527 2528 2529 2585 2641 2660 2679 2698 2717
833B717P9P9J8l6k5k6jjNNO0N9OOk2k2J0RRRL3L3L6j9m8m8MLM7M7qqn8n8l1l0K1K1K1K0RR
828B934RRk5k5k6k5J6J6J6J7J3J4J3J4n5n6n5n5K7K8K8K7J4J4J4J4M9M9M9N0N7N7KLJ4J5J4
824C274J5M3M3M3M4N2N3N3N2Q8Q9Q8Q8P3P3J28J28J38J38Q3Q3R3R3J47J48J73J72J73J73K08
820F249K08K08K08K08K08K08K08L07L08L07L08K90K90L45L46L47L48L47L48L52L52M07M07
817A3114M56M55M55M55M72M73M72M72M75M75M75M75N38N38M86M86N10N65N48N20M92M64M78
814B4349M78M67M67M68M67L71L71L71L71M35M34M35M35M58M58M58M58M53M54M50M50M43L88
812C4389L64L64K99K98K99K98L19L18K82K55K55L09L75M29M74M75M81M81N36N91O25O80P31
809D3927P86Q21Q77R22R50R81J009J063J119J168J260J333J361J385J440J535J701J858J987
$$ plain form
833 2717 2796 2875 2893 2857 2832 2806 2805 2804 2809 2814 2874 2933 2939 2945 2923 2901 2911 2920 2929 2938 2971 3004 3040 3021 2973 2925 2929 2932 2979 3026 3018 3010 2952 2894 2863 2833 2854 2875 2896 2916 2925 2934
828 2934 2943 2952 2927 2902 2876 2851 2867 2883 2899 2916 2929 2943 2956 2970 2915 2859 2804 2749 2776 2804 2832 2859 2873 2887 2901 2915 2964 3013 3062 3112 3169 3226 3228 3231 3245 3260 3274
824 3274 3289 3332 3375 3418 3462 3514 3567 3620 3672 3760 3849 3937 4025 4098 4171 4299 4427 4565 4703 4786 4869 4962 5055 5202 5350 5523 5695 5868 6041 6249
820 6249 6457 6665 6873 7081 7289 7497 7705 8012 8320 8627 8935 9225 9515 9860 10206 10553 10901 11248 11596 11948 12300 12707 13114
817 13114 13570 14025 14480 14935 15407 15880 16352 16824 17299 17774 18249 18724 19262 19800 20286 20772 21282 21847 22395 22915 23407 23871 24349
814 24349 24827 25294 25761 26229 26696 27067 27438 27809 28180 28615 29049 29484 29919 30377 30835 31293 31751 32204 32658 33108 33558 34001 34389
812 34389 34753 35117 35416 35714 36013 36311 36630 36948 37230 37485 37740 38049 38424 38853 39327 39802 40283 40764 41300 41891 42516 43196 43927
809 43927 44713 45534 46411 47333 48283 49264 50273 51336 52455 53623 54883 56216 57577 58962 60402 61937 63638 65496 67483
806F7483K147K276K425K553K679K845L039L242L383L511L589L718L835L963M052M145M206
804A23091M261M300M355M424M479M571M663M796M889M966N058N219N384N547N675N809N973
802B07460O169O297O391O447O417O418O341O250O106N941N747N546N313N075M876M711M580
800C06085M452M323M231M121M030L914L860L826L826L862L807L695L567L395L193K968K693
798C69848K316J895J426R32M13q2n89j011j366j678j917k119k217k309k387k479k542k598
796C53536k676k731k801k893l058l260l455l693l930m204m493m768n059n334n582n820o039
794B83740o204o341o434o454o428o358o231o090n961n842n712n608n479n383n329n324n269
792A83293n197n142n153n180n208n181n120n092n081n054m983m891m784m657m496m330m149
$$ plain form
806 67483 69630 71906 74331 76884 79563 82408 85447 88689 92072 95583 99172 102890 106725 110688 114740 118885 123091
804 123091 127352 131652 136007 140431 144910 149481 154144 158940 163829 168795 173853 179072 184456 190003 195678 201487 207460
802 207460 213629 219926 226317 232764 239181 245599 251940 258190 264296 270237 275984 281530 286843 291918 296794 301505 306085
800 306085 310537 314860 319091 323212 327242 331156 335016 338842 342668 346530 350337 354032 357599 360994 364187 367155 369848
798 369848 372164 374059 375485 376417 376830 376748 376159 375148 373782 372104 370187 368068 365851 363542 361155 358676 356134 353536
796 353536 350860 348129 345328 342435 339377 336117 332662 328969 325039 320835 316342 311574 306515 301181 295599 289779 283740
794 283740 277536 271195 264761 258307 251879 245521 239290 233200 227239 221397 215685 210077 204598 199215 193886 188562 183293
792 183293 178096 172954 167801 162621 157413 152232 147112 142020 136939 131885 126902 122011 117227 112570 108074 103744 99595
790I9595m020l905l777l591l426l263l135k973k844k716k624k528k435k363k271k188k097
788D9439j987j895j822j730j675j619j571j516j442j387j310j254j181j126j057j001r29q73
785B4064q41p85p12o56n95n39n67n67n51n51n23m69l95l40l67l68l20l21l17l17k76k22j24
783A3341j23j79j79j79j79j99j99j99j98j99j99j99j99j29j30j29j30q5q4q5q5j33j32p8p8
780I633o4o3j16j15o1opo3p2r9j19o4m8m9m5m6o2o2qpJ3J3J3J3j3j2j2j2J1J2O7O7R6R5R6
775H904R6J31J31J32J31J60J61J63J64J93K48K81L36L63M18M70N62O28O83P38P65P96Q52R60
772A8466J088J238J367J517J644J796J961K108K273K484K686K866L069L298L500L605L660
770E8626L688L660L558L392L243L041K749K401K035J686J359J009O48L36N2j86l40l95l90
$$ plain form
790 99595 95575 91670 87893 84302 80876 77613 74478 71505 68661 65945 63321 60793 58358 55995 53724 51536 49439
788 49439 47452 45557 43735 42005 40330 38711 37140 35624 34182 32795 31485 30231 29050 27924 26867 25866 24937 24064
785 24064 23223 22438 21726 21070 20475 19936 19369 18802 18251 17700 17177 16708 16313 15973 15606 15238 14918 14597 14280 13963 13687 13465 13341
783 13341 13218 13039 12860 12681 12502 12303 12104 11905 11707 11508 11309 11110 10911 10782 10652 10523 10393 10308 10224 10139 10054 9921 9789 9711 9633
780 9633 9569 9506 9390 9275 9214 9208 9201 9138 9066 8967 8848 8784 8736 8687 8642 8596 8534 8472 8464 8457 8470 8483 8496 8509 8496 8484 8472 8460 8471 8483 8550 8617 8713 8808 8904
775 8904 9000 9131 9262 9394 9525 9685 9846 10009 10173 10366 10614 10895 11231 11594 12012 12482 13044 13672 14355 15093 15858 16654 17506 18466
772 18466 19554 20792 22159 23676 25320 27116 29077 31185 33458 35942 38628 41494 44563 47861 51361 54966 58626
770 58626 62314 65974 69532 72924 76167 79208 81957 84358 86393 88079 89438 90447 91095 91431 91483 91297 90957 90562 90172
768I0172l63l19k64k13j21l6J9J04J31J00M6o7j94m13o51r04j142j426j702j991k193k358
765G6215k523k647k702k723k668k564k436k271k143k017j852j720j593j514j460j400j309
763D0673j242j150j079j052j032r77r09q18p66p10o59o03n71n15m81m81m75m74m31l75l52
761B5521l51l63l63m24m78n33n32o01o55p10p65p38p37o99o98o38n83n63n64n88n33m62m08
758A2535l74l75k98k07j66j67k23k22k20k19j35q0j11j12q4q5l0l0POO1O1J4J4J4J5m8m7k4
754I470L2O9P0P3P3J8J9P3P4O3O3QRKLN7N8N4N4LKM5R9O9O8P9P9P9P9K8K8k6k7k4k5k4k4L9
750A0889M0k2p6o6o6o9p0m2m1o6j22j13j13o1o1p2p1p2p1r1r1r1r1p3p2p1p1o6m0n6n7n8q6
746H641j26j25j25j25j25j25j25j25q5n8m9m8q5j12j28j00o0o0p1m3mlj4j4%k8p1r9q5q5q5
$$ plain form
768 90172 89809 89490 89226 89013 88892 88856 88875 88979 89110 89210 89256 89189 88995 88582 87931 87027 85885 84459 82757 80766 78573 76215
765 76215 73692 71045 68343 65620 62952 60388 57952 55681 53538 51521 49669 47949 46356 44842 43382 41982 40673
763 40673 39431 38281 37202 36150 35118 34141 33232 32414 31648 30938 30279 29676 29105 28590 28109 27628 27153 26679 26248 25873 25521
761 25521 25170 24807 24444 24020 23542 23009 22477 21876 21221 20511 19746 19008 18271 17572 16874 16236 15653 15090 14526 13938 13405 12943 12535
758 12535 12161 11786 11488 11281 11115 10948 10725 10503 10283 10064 9929 9849 9738 9626 9542 9457 9427 9397 9404 9410 9471 9532 9546 9560 9574 9589 9541 9494 9470
754 9470 9502 9571 9641 9714 9787 9805 9824 9897 9971 10034 10097 10105 10114 10116 10119 10176 10234 10288 10342 10345 10347 10392 10491 10560 10628 10707 10786 10865 10944 10972 11000 10974 10947 10923 10898 10874 10850 10889
750 10889 10929 10907 10831 10765 10699 10630 10560 10518 10477 10411 10289 10176 10063 10002 9941 9869 9798 9726 9655 9564 9473 9382 9291 9218 9146 9075 9004 8938 8898 8842 8785 8727 8641
746 8641 8515 8390 8265 8140 8015 7890 7765 7640 7555 7497 7448 7400 7315 7203 7075 6975 6915 6855 6784 6741 6737 6734 6720 6706 6706 6678 6607 6508 6423 6338 6253
742F253q5q4q5j00j00o1l3j5j6j3j4L1L1L2L1J3J4K9Km8m9m8m8p0m2llo9o9j6M9P7M9J3J4
737E567L8L9L6L7P3M7POL0K9K9K9N0N0N2N1M3P1N5N5K9K8L0L1N6Q3O8O8L7L7L7L7N6N7N6N7
733G161L4L4Q8J52J60J32J10Q3M7J9L3L4O0O0O0O0RJ0RRj4j3j4j4J7J6J7J6opopL4L4L5L4
729H486J8J8l7l7m1m1mK3K5k9r2j47j26r7r3l7QQm6j01j14n8nmk9q3j08j07n9n9n8n9q5q5
725F745q5q6n0n1n1n1m7m7m8m7n0m9NOl2l3l2l2MLMMj0j0j0j0J1J0J0J0k7k8K8K7J6J7J6J7
720F047K6K7K7K6N1N0N3N2P7J04O5J0o0o0mN1L7QJ4M1N2Q0J05J33J21J21O8O7LKL0L0N5N6
716G565l6l6k9k9k9k9l4l3j0M6R2R2P2J6J0RO1O2ml%%N1J06P4P5L4L5L4L5Q4Q5Q5Q5Q1Q1Q1
711H779Q1R0R0R0Q9J41J41J69J68K11K11K66K65K57K57K57L12L54M08M42M98N11N12N45O00
$$ plain form
742 6253 6168 6084 5999 5899 5799 5738 5705 5690 5674 5661 5647 5678 5709 5741 5772 5785 5799 5828 5830 5782 5733 5685 5637 5567 5525 5522 5519 5450 5381 5365 5414 5491 5540 5553 5567
737 5567 5605 5644 5680 5717 5790 5837 5844 5850 5880 5909 5938 5967 6017 6067 6119 6170 6213 6284 6339 6394 6423 6451 6481 6512 6568 6651 6719 6787 6824 6861 6898 6935 6991 7048 7104 7161
733 7161 7195 7229 7317 7469 7629 7761 7871 7954 8001 8020 8053 8087 8147 8207 8267 8327 8336 8346 8355 8364 8350 8337 8323 8309 8326 8342 8359 8375 8369 8362 8356 8349 8383 8417 8452 8486
729 8486 8504 8522 8485 8448 8407 8366 8362 8385 8410 8381 8289 8142 8016 7919 7826 7789 7797 7805 7759 7658 7544 7486 7481 7477 7448 7365 7257 7150 7091 7032 6974 6915 6830 6745
725 6745 6660 6574 6524 6473 6422 6371 6324 6277 6229 6182 6132 6083 6088 6094 6062 6029 5997 5965 5969 5972 5976 5980 5970 5960 5950 5940 5951 5961 5971 5981 5954 5926 5954 5981 5997 6014 6030 6047
720 6047 6073 6100 6127 6153 6204 6254 6307 6359 6436 6540 6605 6615 6555 6495 6491 6542 6579 6587 6601 6642 6694 6774 6879 7012 7133 7254 7322 7389 7392 7394 7424 7454 7509 7565
716 7565 7529 7493 7464 7435 7406 7377 7343 7310 7300 7346 7438 7530 7602 7618 7628 7637 7698 7760 7756 7753 7753 7753 7804 7910 7984 8059 8093 8128 8162 8197 8281 8366 8451 8536 8617 8698 8779
711 8779 8860 8950 9040 9130 9219 9360 9501 9670 9838 10049 10260 10526 10791 11048 11305 11562 11874 12228 12636 13078 13576 14087 14599 15144 15744
708A5744O86P78Q64R19R73R73J009J064J202J331J457J549J616J744J903K067K194K286K384
706D2743K512K695K859L024L153L312L476L602L731L850L978M088M143M167M222M283M283
704A04121M283M228M156M101M016L924L780L688L573L482L424L370L293L202L147L092L022
702A65902K931K875K820K747K655K524K323K079J804J565J327J074P62M21P2k29n40q89j238
699A90985j591j903k123k289k443k571k663k755k842k897k872k872k834k835k743k742k675
697A47335k675k582k583k513k512k511k455k397k306k213k086j958j793j625j424j206r30
695A11566o23l11kL10O23R70J304J652K035K421K814L163L553L938M386M808N241N663O047
693A59558O396O731P006P277P551P818Q057Q226Q317Q379Q433Q487Q488Q440Q349Q207Q042
$$ plain form
708 15744 16430 17208 18072 18991 19964 20937 21946 23010 24212 25543 27000 28549 30165 31909 33812 35879 38073 40359 42743
706 42743 45255 47950 50809 53833 56986 60298 63774 67376 71107 74957 78935 83023 87166 91333 95555 99838 104121
704 104121 108404 112632 116788 120889 124905 128829 132609 136297 139870 143352 146776 150146 153439 156641 159788 162880 165902
702 165902 168833 171708 174528 177275 179930 182454 184777 186856 188660 190225 191552 192626 193388 193809 193881 193652 193112 192223 190985
699 190985 189394 187491 185368 183079 180636 178065 175402 172647 169805 166908 164036 161164 158330 155495 152752 150010 147335
697 147335 144660 142078 139495 136982 134470 131959 129504 127107 124801 122588 120502 118544 116751 115126 113702 112496 111566
695 111566 110943 110632 110630 110940 111563 112533 113837 115489 117524 119945 122759 125922 129475 133413 137799 142607 147848 153511 159558
693 159558 165954 172685 179691 186968 194519 202337 210394 218620 226937 235316 243749 252236 260724 269164 277513 285720 293762
691B93762P934P842P728P599P437P345P253P162P035O907O838O747O595O356O086N811N511
689D11948N161M790M295L751L182K583J978J369P28J3p01j392k035k701l307l857m316m740
687D16749n162n596n945o211o413o642o844p053p255p420p511p582p673p787p880q003q169
684B97603q353q555q719q719q823q823q817q817q784q783q749q656q511q346q134p896p662
682A52456p386p093o818o540o228n877n529n274m998m722m447m153l878l639l364l109k908
680F6493k773k608k443k241k079j913j782j654j525j398j289j161j078r87r13q22o88o33n98
678C7908n98n43m52m38l84l26k71k70k71j87j88j32j32j62j61p0o9O8O8J60J60K57K57K86
675C4510L42M23N16N67O23O69P24P66Q20Q59R88J117J208J342J508J687J851J985K150K322
$$ plain form
691 293762 301696 309538 317266 324865 332302 339647 346900 354062 361097 368004 374842 381589 388184 394540 400626 406437 411948
689 411948 417109 421899 426194 429945 433127 435710 437688 439057 439785 439798 439097 437705 435670 432969 429662 425805 421489 416749
687 416749 411587 405991 400046 393835 387422 380780 373936 366883 359628 352208 344697 337115 329442 321655 313775 305772 297603
684 297603 289250 280695 271976 263257 254434 245611 236794 227977 219193 210410 201661 193005 184494 176148 168014 160118 152456
682 152456 145070 137977 131159 124619 118391 112514 106985 101711 96713 91991 87544 83391 79513 75874 72510 69401 66493
680 66493 63720 61112 58669 56428 54349 52436 50654 49000 47475 46077 44788 43627 42549 41562 40649 39827 39139 38506 37908
678 37908 37310 36767 36315 35877 35493 35167 34896 34626 34355 34168 33980 33848 33716 33554 33393 33323 33254 33322 33390 33550 33710 33967 34224 34510
675 34510 34852 35275 35791 36358 36981 37650 38374 39140 39960 40819 41807 42924 44132 45474 46982 48669 50520 52505 54655 56977
673E6977K524K777L088L463L811M121M396M641M880N111N386N643N919O246O558O790O919
670A39250O972P028P153P429P807Q266Q716Q991Q998Q723Q285P826P506P415P429P484P474
668B72752P382P261P132O979O815O669O505O356O191O001N835N654N379M937M294L503K715
666C72360K038J542J182Q71N60J76k72p30j190j760k409l088l680m249m755n214n622n934
664C39826o214o489o778p054p283p448p520p464p324p123o877o712o706o872p211p559p750
662B19442p695p403p055o762o633o584o584o580o452o256n943n604n254m927m578m213l864
660A17055l459k963k450j918j448r89n94k09J60M72P96J071J309J548J788J990K101K100K146
658A18506K273K459K697K892K983K920K791K645K516K507K562K720K923L141L307L376L376
$$ plain form
673 56977 59501 62278 65366 68829 72640 76761 81157 85798 90678 95789 101175 106818 112737 118983 125541 132331 139250
670 139250 146222 153250 160403 167832 175639 183905 192621 201612 210610 219333 227618 235444 242950 250365 257794 265278 272752
668 272752 280134 287395 294527 301506 308321 314990 321495 327851 334042 340043 345878 351532 356911 361848 366142 369645 372360
666 372360 374398 375940 377122 377993 378553 378729 378457 377727 376537 374777 372368 369280 365600 361351 356596 351382 345760 339826
664 339826 333612 327123 320345 313291 306008 298560 291040 283576 276252 269129 262252 255540 248834 241962 234751 227192 219442
662 219442 211747 204344 197289 190527 183894 177310 170726 164146 157694 151438 145495 139891 134637 129710 125132 120919 117055
660 117055 113596 110633 108183 106265 104817 103828 103234 103025 103185 103657 104453 105524 106833 108381 110169 112159 114260 116360 118506
658 118506 120779 123238 125935 128827 131810 134730 137521 140166 142682 145189 147751 150471 153394 156535 159842 163218 166594
656A66594L336L244L131K965K801K672K511K310K050J776J449J064O40K54l0k69m59n51o15
653A94873o71q05r71j165j403j699k048k332k498k635k763k858k950l007l062l112l168l204
651A54522l259l280l336l362l363l356l356l507l746l981m146m164m072l921l756l637l508
649I2772l391l336l293l293l235l070k865k699k552k460k329k201k104k013j900j808j702
647D8521j610j484j355j202j110j050r96r44q52p97p42o87n95n43m87m26l71l43l44l75l75
644C1833l15k59k17k16j58j58j17j18o2o3j01j02j01j02k9k9k9k9r6r5r5r6j09j09j09j09
641B8810j29j28r7j52k18k18k21k21j93j94j93j93k72k71k71k71k37k37k37k37k17k18k17
638B3968k18k53k53j65j65j68k24k47k48k21k20k21k21k02k01k01k02k32k33k33k32k43k43
$$ plain form
656 166594 169930 173174 176305 179270 182071 184743 187254 189564 191614 193390 194839 195903 196543 196797 196767 196498 196039 195488 194873
653 194873 194202 193397 192426 191261 189858 188159 186111 183779 181281 178646 175883 173025 170075 167068 164006 160894 157726 154522
651 154522 151263 147983 144647 141285 137922 134566 131210 127703 123957 119976 115830 111666 107594 103673 99917 96280 92772
649 92772 89381 86045 82752 79459 76224 73154 70289 67590 65038 62578 60249 58048 55944 53931 52031 50223 48521
647 48521 46911 45427 44072 42870 41760 40710 39714 38770 37918 37121 36379 35692 35097 34554 34067 33641 33270 32927 32583 32208 31833
644 31833 31518 31259 31042 30826 30668 30510 30393 30275 30213 30150 30049 29947 29846 29744 29715 29686 29657 29628 29532 29437 29342 29246 29137 29028 28919 28810
641 28810 28681 28553 28456 28304 28086 27868 27647 27426 27233 27039 26846 26653 26381 26110 25839 25568 25331 25094 24857 24620 24403 24185 23968
638 23968 23750 23497 23244 23079 22914 22746 22522 22275 22027 21806 21586 21365 21144 20942 20741 20540 20338 20106 19873 19640 19408 19165 18922
636A8922j51j52r6r6r6r6j10j10l8rn1j06j31p6k4k3p1p1o7j1J3J3NNMNj0rj0j0M1M0L9L9
631A7502J5j4k8K6O3O2O6O7L4L5L5L5J7J8J7J8P0P0J5J5N2N2P9Q0L6L6QRm3m3m3m3l4l4l3
627A8217l4j2j1J6J6J5J4m1m1k5k5n2n2k5k4k5k4q6q6q6q6o1o2o2o1o2o2o2o1l2l2l1l2l6
623A6887l6o3o3n2n3LLRJ0J0RK3K2nnJ9J8J11J10Q6Q6N5J10J64J64J68J68K31K31K62K61L10
619A9253L64M25M26M20M20M48N03N72O27O26O27O74O75P02P02O31O31O04O04O04O03N49N48
616C2238M80M79M24M24L65L65L05K49K23K23K20K19K94K93K93K93L35L35L34L35L36L37L37
613C9736L36K99K99K99K98K93K93L20L76M00M56N13O05P04Q33R44J071J191J357J521J723
611E3867J952K191K411K723L065L413L732M118M586N118N686O256O891P606Q414R350J0355
$$ plain form
636 18922 18771 18619 18523 18427 18331 18235 18125 18015 17977 17968 17917 17811 17680 17604 17580 17557 17486 17415 17348 17337 17350 17363 17368 17373 17377 17382 17372 17363 17353 17343 17384 17424 17463 17502
631 17502 17517 17503 17475 17501 17564 17626 17692 17759 17793 17828 17863 17898 17915 17933 17950 17968 18038 18108 18123 18138 18190 18242 18321 18401 18437 18473 18481 18490 18447 18404 18361 18318 18284 18250 18217
627 18217 18183 18171 18160 18176 18192 18207 18221 18180 18139 18114 18089 18037 17985 17960 17936 17911 17887 17801 17715 17629 17543 17482 17420 17358 17297 17235 17173 17111 17050 17018 16986 16955 16923 16887
623 16887 16851 16788 16725 16673 16620 16623 16626 16635 16645 16655 16664 16687 16709 16704 16699 16718 16736 16847 16957 17043 17129 17184 17294 17458 17622 17790 17958 18189 18420 18682 18943 19253
619 19253 19617 20042 20468 20888 21308 21756 22259 22831 23458 24084 24711 25385 26060 26762 27464 28095 28726 29330 29934 30538 31141 31690 32238
616 32238 32718 33197 33621 34045 34410 34775 35080 35329 35552 35775 35995 36214 36508 36801 37094 37387 37722 38057 38391 38726 39062 39399 39736
613 39736 40072 40371 40670 40969 41267 41560 41853 42173 42549 42949 43405 43918 44523 45227 46060 47004 48075 49266 50623 52144 53867
611 53867 55819 58010 60421 63144 66209 69622 73354 77472 82058 87176 92862 99118 106009 113615 122029 131379 141734
609A41734J1438J2674J4013J5502J7099J8787K0604K2534K4607K6789K9046L1407L3883L6414
607D56531L8965M1416M3564M5213M6333M6933M7025M6601M5702M4288M2324L9903L7094L3893
605A055785L0314K6518K2646J8821J5096J1484Q125N235K941J352L79k8j20nK33N62Q74J011
603A201223J011O79j46j617l838o593r694j3082j6734k0559k4394k8106l1610l4826l7708
601I74006m0127m2017m3423m4359m4852m4853m4324m3205m1584l9547l7283l4915l2525l0158
600D10834k7890k5705k3690k1799k0036j8367j6845j5433j4132j2976j1905j0969j0156r368
598A71563q670q028p493o998o498o040n630n246m878m566m284m046l805l603l442l278l112
596H1946k911k688k523k394k266k154k062j950j858j748j656j598j544j507j416j344j252
$$ plain form
609 141734 153172 165846 179859 195361 212460 231247 251851 274385 298992 325781 354827 386234 420117 456531
607 456531 495496 536912 580476 625689 672022 718955 765980 812581 858283 902571 944895 984798 1021892 1055785
605 1055785 1086099 1112617 1135263 1154084 1169180 1180664 1188789 1194024 1196965 1198317 1198696 1198668 1198548 1198543 1198776 1199338 1200212 1201223
603 1201223 1202234 1202913 1202767 1201150 1197312 1190719 1181025 1167943 1151209 1130650 1106256 1078150 1046540 1011714 974006
601 974006 933879 891862 848439 804080 759228 714375 670051 626846 585262 545715 508432 473517 440992 410834
600 410834 382944 357239 333549 311750 291714 273347 256502 241069 226937 213961 202056 191087 180931 171563
598 171563 162893 154865 147372 140374 133876 127836 122206 116960 112082 107516 103232 99186 95381 91778 88336 85058 81946
596 81946 79035 76347 73824 71430 69164 67010 64948 62998 61140 59392 57736 56138 54594 53087 51671 50327 49075
594D9075j173j080j025r71r41q87q49p95p74p20o92o92o94o94o67o66n53n52m92m92m77l85
591C2804l45l45m11m10m11m11l90l91l91l91l40l40l40l41l74l74l75l74l33l33l34l33l37
588B4380l37l49l22k89k43k12k12k04k04k04k03k69k69k70k69k21k20k21k21j94j94j39j39
585A8975j26j26j54j54j66j67j39r3r1j19j56j56j64j65j64j64j54j53j53j53j50j50j49j50
582A5459j40j39q8q7j28j75k04k03j47j47j20j19q2q2k7k8n1n1n4n4m4r0j20j19n4n5n4n4
579A2743r9r9r9r9m3m3m3m3KKn3n3o3o3o2o3o7o6o6o7PPPPo2o2o2o2o1o2o1o2o0o1l2J4N7
575A1008N7NNl9l9l9l9J5J5J4J5n4n4n4n4k1k0J1m5r5r5m3m4m1m0m1m1kkjko4o5rrn1n0n1
570I941n0n3n2k9K7L7L7j5j4j6j6j6j6q3q2k8k7k6k7k6k6k3k3k3k3k7k8k8k7j1j1j0j1K2K2
$$ plain form
594 49075 47902 46822 45797 44826 43885 42998 42149 41354 40580 39860 39168 38476 37782 37088 36421 35755 35202 34650 34158 33666 33189 32804
591 32804 32459 32114 31703 31293 30882 30471 30081 29690 29299 28908 28568 28228 27888 27547 27173 26799 26424 26050 25717 25384 25050 24717 24380
588 24380 24043 23694 23372 23083 22840 22628 22416 22212 22008 21804 21601 21332 21063 20793 20524 20303 20083 19862 19641 19447 19253 19114 18975
585 18975 18849 18723 18569 18415 18249 18082 17943 17850 17759 17640 17484 17328 17164 16999 16835 16671 16517 16364 16211 16058 15908 15758 15609 15459
582 15459 15319 15180 15092 15005 14877 14702 14498 14295 14148 14001 13881 13762 13680 13598 13571 13543 13492 13441 13387 13333 13289 13199 13079 12960 12906 12851 12797 12743
579 12743 12644 12545 12446 12347 12304 12261 12218 12175 12177 12179 12126 12073 12010 11947 11885 11822 11755 11689 11623 11556 11563 11570 11577 11584 11522 11460 11398 11336 11275 11213 11152 11090 11030 10969 10937 10951 11008
575 11008 11065 11070 11075 11036 10997 10958 10919 10934 10949 10963 10978 10924 10870 10816 10762 10741 10721 10732 10687 10592 10497 10454 10410 10369 10329 10288 10247 10245 10243 10242 10240 10176 10111 10102 10093 10042 9992 9941
570 9941 9891 9838 9786 9757 9784 9821 9858 9843 9829 9813 9797 9781 9765 9682 9600 9572 9545 9519 9492 9466 9440 9417 9394 9371 9348 9321 9293 9265 9238 9227 9216 9206 9195 9217 9239
566I239l6r0q1k5K8K9K3l3n6n6m7m6m6m6l1l2l1l2o9o9K2K2klllj1j1j1j1ONOOpqqqk3k3k2
561H406k3p7p6n3LM7M8K6k8m6m7n0n0p6p6k1k1L5L5L5L6k9k9k9k9n2n2m9m9k8J8Qk0l9m0J4
556G622J4K0K0K0K0J0J0J0Rppqpn4n5n4n5n0n0k1K6M9N0lkLKLKn5n4n5n5m8m7M4M4LLKLKK
551G306n4n3rqrrJ1J2J1J1lkllj4j4j4j5K7K7K7K7OOPOnmn6n7L1P7N2N1L7L6L7L7M5M5M5M5
546G690Q4Q3N4RqpK0O7J08J36J51J05Q2J10J67J95K14K13J87J40J33J32K22K22K22K23K23
542A1177K22J84J83J29J28P2P3P2P2P5P6P5P5N6N6JJllklooooQRRQn4n5j46j46j47j46j46
538A1886j46j34j35j61k08k46k19j85j85j96k42k68k67k17j52j00r9j55k00k00j54j19j20
535G778j17j16r1r0r0r0j13j12n8n7k3k3L2L3k0j9k2k1k6n3o4j8J7J7l5l6KKl4o3l9Oj9j8
$$ plain form
566 9239 9203 9113 9032 9007 9035 9064 9087 9054 8998 8942 8895 8849 8803 8757 8726 8694 8663 8631 8562 8493 8515 8537 8535 8532 8529 8526 8515 8504 8493 8482 8488 8493 8499 8505 8498 8490 8482 8474 8451 8428 8406
561 8406 8383 8306 8230 8177 8180 8227 8275 8301 8273 8227 8180 8130 8080 8004 7928 7907 7886 7921 7956 7991 8027 7998 7969 7940 7911 7859 7807 7758 7709 7681 7699 7707 7687 7648 7608 7622
556 7622 7636 7656 7676 7696 7716 7726 7736 7746 7755 7748 7741 7733 7726 7672 7617 7563 7508 7458 7408 7387 7413 7462 7512 7509 7507 7510 7512 7515 7517 7462 7408 7353 7298 7250 7203 7247 7291 7294 7297 7299 7302 7304 7306
551 7306 7252 7199 7190 7182 7173 7164 7175 7187 7198 7209 7206 7204 7201 7198 7184 7170 7156 7141 7168 7195 7222 7249 7255 7261 7268 7274 7269 7265 7209 7152 7183 7260 7312 7363 7400 7436 7473 7510 7555 7600 7645 7690
546 7690 7774 7857 7911 7920 7912 7905 7925 7992 8100 8236 8387 8492 8574 8684 8851 9046 9260 9473 9660 9800 9933 10065 10287 10509 10731 10954 11177
542 11177 11399 11583 11766 11895 12023 12095 12168 12240 12312 12387 12463 12538 12613 12669 12725 12726 12727 12724 12721 12719 12716 12710 12704 12698 12692 12700 12709 12718 12726 12672 12617 12471 12325 12178 12032 11886
538 11886 11740 11606 11471 11310 11102 10856 10637 10452 10267 10071 9829 9561 9294 9077 8925 8825 8726 8571 8371 8171 8017 7898 7778
535 7778 7661 7545 7454 7364 7274 7184 7071 6959 6901 6844 6821 6798 6830 6863 6843 6824 6802 6781 6755 6702 6638 6620 6637 6654 6619 6583 6585 6587 6553 6490 6451 6457 6438 6420
531F420k2K4Q6Q6M4k0l9l9o3o2o3o2m9m8POk7k8k8k8QQm7m7n8n8L5L4K2K2l3l3m7m7m7m7J5
527E775J4J4J4MMMMl6l7j4M2L9J2k4k5opppk0k1k0k1k6k6K8K9J7J7J7J7N4N3kkL0K9K9K9n6
522E918n7n6n7J8J8J8J8j4j4o9o9poooK7K6K7K6kkkkn5n4l1K5N9N9O2O2j7j8j8j7l2l1l1l2
517E658j0j1j0j1K7K7k6k6oK2L7j8o0o1j0rL0L1L0L0K0K0K0K0JKJKJ1J2J2J2l7l7J8J8NMN
512E743Mo4o3rrnmK2K3K8K8K5K5l4q1n4n5rqrrrrqrk5k5k5k5jkkkJ3J4J3J4j0rrj0l8l7l8
507E246l8oonoj5j5j6j5J9J8J9J9qrK0J9P7P6K1K1k7k8k7k7K8K9K9K9L1L0L1L1jkKJL9Q5P4
502E743M7L0L0N4N4O3L5j6o1o2o2o2o2m2Lpl4l9l9m1m1m8m8m9m8k5k6k5k5ppppqrrqkjk8k9
497E075k3k3L2L2O5O5L8L8OOOOP7P6P6P7N3N4N3N4NNNNP1P1R9R8O6O5J21J21J15J16J76K31
$$ plain form
531 6420 6398 6422 6508 6594 6638 6618 6579 6540 6477 6415 6352 6290 6241 6193 6200 6206 6179 6151 6123 6095 6103 6111 6064 6017 5959 5901 5936 5970 5992 6014 5981 5948 5901 5854 5807 5760 5775
527 5775 5789 5803 5817 5821 5825 5829 5833 5797 5760 5746 5788 5827 5839 5815 5790 5784 5777 5770 5763 5743 5722 5702 5681 5655 5629 5657 5686 5703 5720 5737 5754 5808 5861 5859 5857 5887 5916 5945 5974 5918
522 5918 5861 5805 5748 5766 5784 5802 5820 5806 5792 5723 5654 5647 5641 5635 5629 5656 5682 5709 5735 5733 5731 5729 5727 5672 5618 5587 5612 5671 5730 5792 5854 5837 5819 5801 5784 5752 5721 5690 5658
517 5658 5648 5637 5627 5616 5643 5670 5644 5618 5612 5634 5671 5653 5593 5532 5522 5513 5543 5574 5604 5634 5654 5674 5694 5714 5715 5717 5718 5720 5731 5743 5755 5767 5730 5693 5711 5729 5734 5738 5743
512 5743 5747 5683 5620 5611 5602 5597 5593 5615 5638 5666 5694 5719 5744 5710 5629 5575 5520 5511 5503 5494 5485 5476 5467 5459 5450 5425 5400 5375 5350 5349 5347 5345 5343 5356 5370 5383 5397 5387 5378 5369 5359 5321 5284 5246
507 5246 5208 5202 5196 5191 5185 5170 5155 5139 5124 5143 5161 5180 5199 5191 5182 5202 5221 5298 5374 5395 5416 5389 5361 5334 5307 5335 5364 5393 5422 5453 5483 5514 5545 5544 5542 5544 5545 5584 5669 5743
502 5743 5790 5820 5850 5904 5958 6021 6056 6040 5979 5917 5855 5793 5731 5689 5692 5685 5651 5612 5573 5532 5491 5443 5395 5346 5298 5273 5247 5222 5197 5190 5183 5176 5169 5161 5152 5143 5135 5133 5132 5104 5075
497 5075 5052 5029 5061 5093 5158 5223 5261 5299 5305 5311 5317 5323 5400 5476 5552 5629 5682 5736 5789 5843 5848 5853 5858 5863 5934 6005 6104 6202 6268 6333 6454 6575 6690 6806 6982 7213
492G213K91K91L18L73M36M37M98M98N47O01O68P22P20P19O66N00J92j58m63o65p17p16o69
490A2302o13n91n90m89m35l84l83l57l01k30k30j66j11r6r5l7l7kjK5K6N0M9M9N0J05J05J33
486G746J88K37K92L23L23L78M34N56O48P37P93Q33Q89R73J065J139J230J313J441J530J476
484B4544J119M78k47q53j208j372j404j403j324j232j092r99r23q30p80p79p48o56n54m63
481I274l84l29k91k35j92j36j23r5o0l1k8n6o9m1j9RL3L2O5O5P9J34J67K22K43K97L28L29
478I188L32L88M60N15N77O69P44P99P58N92L23o1l93n93o72p27p37o81o53n98n67n39m87m32
475H205m16l62k90k34j88j61j45j45j48j48j22j22j29j56j45q9m7m7J1J2J5J4m2m2q1j09r6
472D793m2KKk2k2j1j0J3J4po3q2q3p0j5RRk0k0p1p1j7L9O3O3L2L2K8K9j6p2p1j6nmn6n5l6
$$ plain form
492 7213 7504 7795 8113 8486 8922 9359 9857 10355 10902 11503 12171 12893 13613 14332 14998 15498 15690 15532 15069 14404 13687 12971 12302
490 12302 11689 11098 10508 10019 9584 9200 8817 8460 8159 7929 7699 7533 7422 7326 7231 7194 7157 7155 7154 7179 7205 7255 7304 7353 7403 7508 7613 7746
486 7746 7934 8171 8463 8786 9109 9487 9921 10477 11125 11862 12655 13488 14377 15350 16415 17554 18784 20097 21538 23068 24544
484 24544 25663 26141 25894 25041 23833 22461 21057 19654 18330 17098 16006 15007 14084 13254 12474 11695 10947 10291 9737 9274
481 9274 8890 8561 8270 8035 7843 7707 7584 7489 7429 7398 7370 7314 7245 7204 7185 7194 7227 7259 7324 7389 7468 7602 7769 7991 8234 8531 8859 9188
478 9188 9520 9908 10368 10883 11460 12129 12873 13672 14430 15022 15345 15284 14891 14298 13626 12899 12162 11481 10828 10230 9663 9124 8637 8205
475 8205 7789 7427 7137 6903 6715 6554 6409 6264 6116 5968 5846 5724 5595 5439 5294 5205 5158 5111 5122 5134 5149 5163 5121 5079 4998 4889 4793
472 4793 4751 4753 4755 4733 4711 4700 4690 4703 4717 4710 4647 4565 4482 4412 4397 4406 4415 4395 4375 4304 4233 4216 4255 4318 4381 4413 4445 4473 4502 4486 4414 4343 4327 4322 4318 4262 4207 4171
467D171l5pqK7K7k7k8J2J2J1J2NNNNJ6J6l9m0l9l9j2j1QRj9j9j3j4j4j3poK1K1L9L8j7j6o
462D031oK2K2K5K5M9M9Om9p3p4l5l5J9K0L5L4QPk9l0K6K5L6L5QQkkn7n7j8j9j8j8JJKJl3l2
457C908l2l3PPPQm8m8p1p2n5%K4K4NON7N7M3j2l6l7LLL1L0K0J9l5l5nnnnK6K6P7P8M4j2l5
452C929l5J3J2j4j5l8l7j0j0k9k9jkK4K4K4K3J9J9l7l6l0k9K5K6J4J4m1m1m1m0L3O0K4k2n0
448C696m9popoj0j0rj0L1L1L1L1j6j5j6j6lkN2N3N2N3lko3o2o3o2k8k8K7K7OPOOJ0J0J0J0
443C656K9K9K8K9j2j3j2j3k2k2k2k2llklL1L0Lm3m2j3j4m2l8QN1K4llnnj5j5j6j5NNk3K3O0
438C570L2j3n8n3pJ9J9l4l3l4l3k0k0L6L5oooon4n3k6J9J6j2OOO2O2N9N8L2k2q4q4poppN4
433C394N3L0k5m2m1m5m5K4K4K4K5k3k3k3k2KKN4N4N2kk7k6M6M5M6M6rqqqJ5J6J5J6k0k0k0
$$ plain form
467 4171 4136 4129 4121 4148 4175 4148 4120 4132 4144 4155 4167 4172 4177 4182 4187 4203 4219 4180 4140 4101 4062 4050 4039 4047 4056 4037 4018 4005 3991 3977 3964 3957 3951 3972 3993 4032 4070 4053 4037 4031
462 4031 4025 4047 4069 4094 4119 4168 4217 4223 4174 4101 4027 3992 3957 3976 3996 4031 4065 4073 4080 4051 4021 4047 4072 4108 4143 4151 4159 4157 4155 4098 4041 4023 4004 3986 3968 3969 3970 3972 3973 3940 3908
457 3908 3876 3843 3850 3857 3864 3872 3824 3776 3705 3633 3578 3578 3602 3626 3631 3637 3694 3751 3794 3782 3746 3709 3712 3715 3746 3776 3796 3815 3780 3745 3740 3735 3730 3725 3751 3777 3854 3932 3976 3964 3929
452 3929 3894 3907 3919 3905 3890 3852 3815 3805 3795 3766 3737 3736 3734 3758 3782 3806 3829 3848 3867 3830 3794 3764 3735 3760 3786 3800 3814 3773 3732 3691 3651 3684 3744 3768 3746 3696
448 3696 3647 3640 3634 3627 3621 3611 3601 3592 3582 3613 3644 3675 3706 3690 3675 3659 3643 3640 3638 3690 3743 3795 3848 3845 3843 3780 3718 3655 3593 3565 3537 3564 3591 3597 3604 3610 3616 3626 3636 3646 3656
443 3656 3685 3714 3742 3771 3759 3746 3734 3721 3699 3677 3655 3633 3630 3627 3625 3622 3653 3683 3686 3643 3601 3588 3574 3532 3494 3502 3553 3577 3574 3571 3566 3561 3546 3531 3515 3500 3505 3510 3487 3510 3570
438 3570 3602 3589 3531 3478 3471 3490 3509 3475 3442 3408 3375 3355 3335 3371 3406 3400 3394 3388 3382 3328 3275 3249 3268 3284 3272 3278 3284 3346 3408 3467 3525 3557 3535 3451 3367 3360 3354 3347 3340 3394
433 3394 3447 3477 3452 3410 3369 3324 3279 3303 3327 3351 3376 3353 3330 3307 3285 3287 3289 3343 3397 3449 3447 3420 3394 3440 3485 3531 3577 3568 3560 3552 3544 3559 3575 3590 3606 3586 3566 3546
428C546k0K6K7k9k8k1k1k0k1k2k2k2k2J0J0J1J0n2n1n2n1m1m1J4J4nonnQ0P9Q0P9M2M2j5p1
424C427r1l7j5j6J0J0J0J0J6J7J7J6J4J3m1m2K2K2K1K2nnnnK7K7K7K7J1J0J1J0k1k2k1k2m1
419C408m1m1m0j8j8j8j8J0RJ0J0l8l7l8l7m2m2J3J3NMNNM2M2M2M2P7P6N2kkjnnnno2j17j06
414C127n1OOM9M9M9M9QPL9j7n8n7poLKKLNOOOQQQRklkkL5L4k0k1n8n8n8n9J9J9J8J9mnmmN4
408C157N4N5N4j5j4j5j4n8n8n8n7j1j1M4M4j9j9k0j9L2L3k3k3l8l9J7J6NNNNj4j4j4j4J2J2
404B983J3J2k8k7K8K8mlllO3O3O4O3RJ0RRPPm9m8n5n6q6l1j1j2qpjjjjqqqpk2k1k2k1K2K2
398B860K2K2L6L6L6L6JJj%ql6n1MN0N0kjl0k9O3O2MMMMmmonql4n1NJ0J0J3J4L6L6j9j9k0k0
393C071k0k0K4K4K5K4P8P9K3K3J3J3J4J3K3K4K3K4LMLLl4l5l4l5m9m9OOK5K6K5K6J3J2J3J3
$$ plain form
428 3546 3526 3552 3579 3550 3522 3501 3480 3460 3439 3417 3395 3373 3351 3361 3371 3382 3392 3340 3289 3237 3186 3145 3104 3118 3132 3127 3121 3116 3111 3191 3270 3350 3429 3471 3513 3498 3427
424 3427 3336 3299 3284 3268 3278 3288 3298 3308 3324 3341 3358 3374 3388 3401 3360 3318 3340 3362 3383 3405 3400 3395 3390 3385 3412 3439 3466 3493 3504 3514 3525 3535 3514 3492 3471 3449 3408
419 3408 3367 3326 3286 3268 3250 3232 3214 3224 3233 3243 3253 3215 3178 3140 3103 3061 3019 3032 3045 3050 3054 3059 3064 3106 3148 3190 3232 3309 3385 3437 3435 3433 3432 3427 3422 3417 3412 3350 3233 3127
414 3127 3076 3082 3088 3137 3186 3235 3284 3292 3299 3338 3321 3263 3206 3199 3193 3196 3198 3200 3203 3208 3214 3220 3226 3234 3242 3250 3259 3257 3254 3252 3250 3285 3319 3299 3278 3220 3162 3104 3045 3064 3083 3101 3120 3116 3111 3107 3103 3157
408 3157 3211 3266 3320 3305 3291 3276 3262 3204 3146 3088 3031 3020 3009 3053 3097 3078 3059 3039 3020 3052 3085 3062 3039 3001 2962 2979 2995 3000 3005 3010 3015 3001 2987 2973 2959 2971 2983
404 2983 2996 3008 2980 2953 2981 3009 3005 3002 2999 2996 3059 3122 3186 3249 3258 3268 3277 3286 3293 3300 3251 3203 3148 3092 3006 2975 2964 2952 2944 2937 2936 2935 2934 2933 2925 2917 2909 2902 2880 2859 2837 2816 2838 2860
398 2860 2882 2904 2940 2976 3012 3048 3049 3050 3049 3049 3041 3005 2954 2958 3008 3058 3056 3055 3025 2996 3059 3121 3125 3129 3133 3137 3133 3129 3123 3118 3110 3076 3025 3030 3040 3050 3063 3077 3113 3149 3130 3111 3091 3071
393 3071 3051 3031 3055 3079 3104 3128 3206 3285 3308 3331 3344 3357 3371 3384 3407 3431 3454 3478 3481 3485 3488 3491 3457 3422 3388 3353 3304 3255 3261 3267 3292 3318 3343 3369 3382 3394 3407 3420
388C420poppm6m6RRjkkkL3L3j3j4m0m1m1m0j%k8n5j7K9K7j8m1m1LKk6k7oM0P0P0K7K7l3l3
383C158o0o0m2m3j5j5j5j5n5k8J5O2O3J7l4l4l7l7N8N8N8N9NOOOJ7J6j1j1k1k1K4K5KLKLN
378C114ONNJ5J5J3J3m8p5n8j2M7M8K2m2p4p5j4j5K5K5lln0n0n0n1J7J7M4M4J4J5n0n0J7J7
374B818J7J7j8j8m6m5l8l7K7K7J2J2J2J3%JJJL3L3L3L3L6L6L7L6K0K1k5k5j6j5j6j5l2l2l2
369B866l2nnnnnnnnQPPQPQPPJ7J7J6J7l4l4l0l0J0O5L5L4l1l1l1l1ppppN4N4N4N5j5j5J2J3
364B996J1J1l5l5KKK9L0M3M3M4M3j6j5j6j5J6J7J6J7K1K1K1K1l2l3l2l2k0k0o3o2n5%L3L4
359B990K3K4mmj4j5n6n7m0J6M9M9K7K7K7K7L7L7L7L7L4L5L4L4J1J1l6l5m1m2l8l9j2L3K3n
355C184rrj1j1M8M8M9M8J1J0m4m5k9l0l0l0J2J1J2J1l6l6j0L5N0Mk3k2ooonl3l2l2l2mnmm
$$ plain form
388 3420 3413 3407 3400 3393 3347 3301 3310 3319 3318 3316 3314 3312 3345 3378 3365 3351 3311 3270 3229 3189 3188 3188 3160 3105 3088 3117 3144 3126 3085 3044 3047 3049 3023 2996 2990 3030 3100 3170 3197 3224 3191 3158
383 3158 3098 3038 2996 2953 2938 2923 2908 2893 2838 2810 2825 2887 2950 2967 2933 2899 2862 2825 2883 2941 2999 3058 3063 3069 3075 3081 3098 3114 3103 3092 3071 3050 3074 3099 3101 3104 3106 3109 3114
378 3114 3120 3125 3130 3145 3160 3173 3186 3138 3063 3005 2993 3040 3088 3110 3068 2994 2919 2905 2890 2915 2940 2937 2934 2884 2834 2784 2733 2750 2767 2811 2855 2869 2884 2834 2784 2801 2818
374 2818 2835 2852 2834 2816 2770 2725 2687 2650 2677 2704 2716 2728 2740 2753 2753 2754 2755 2756 2789 2822 2855 2888 2924 2960 2997 3033 3053 3074 3049 3024 3008 2993 2977 2962 2930 2898 2866
369 2866 2834 2829 2824 2819 2814 2809 2804 2799 2794 2802 2809 2816 2824 2831 2839 2846 2853 2870 2887 2903 2920 2886 2852 2822 2792 2802 2867 2902 2936 2905 2874 2843 2812 2805 2798 2791 2784 2838 2892 2946 3001 2986 2971 2983 2996
364 2996 3007 3018 2983 2948 2950 2952 2981 3011 3054 3097 3141 3184 3168 3153 3137 3122 3138 3155 3171 3188 3209 3230 3251 3272 3240 3207 3175 3143 3123 3103 3040 2978 2923 2923 2956 2990
359 2990 3013 3037 3033 3029 3015 3000 2944 2887 2847 2863 2912 2961 2988 3015 3042 3069 3106 3143 3180 3217 3251 3286 3320 3354 3365 3376 3340 3305 3264 3222 3184 3145 3133 3166 3189 3184
355 3184 3175 3166 3155 3144 3192 3240 3289 3337 3348 3358 3314 3269 3240 3210 3180 3150 3162 3173 3185 3196 3160 3124 3114 3149 3199 3203 3180 3158 3152 3146 3140 3135 3102 3070 3038 3006 3002 2997 2993 2989
350B989j6j5m1NO3O3O6O6j6j5j6j5K5K6mm9n1n1o6l9J0N5N7J1k8k9l2l2K0K0K1K0k1k1k2k1
346B917pqqpl1l0l1l0J4J5J4J5M6M6J8k7m2j5K2K2j1j1j0j1K6K5K6K6J2J2J3J4M1O8P7L1j3
341C208m0l0l0m8p6q7m0k7k7k4k4J3J2J3J2J3J2J3J2j8j8j7j8NNNNMMNMJ8J8J8J8jjkjk4k4
336B840k4k4j8j7j8j7K4K4K4K3K4K3K3K3POOOJ3J4j5o0p3m5jM5N4Pn5n5%jj%OPPOL9L9L9L8
331B943lmmmmmmmj0j0j0j0n1n2n1n1j3j3j3j3K2K1l3l4j5j5L9M0NNNOk4k4k4k3qqM8M7N9N8
326B762MMl5l4l4l4K1K1l4l4noN0N0RRm6m6ooK2K1%%k8k7k6k6JKj4j5j4j4M7M8M7M7j3j3j2
321B643j3o3o4o3o3rqqqkjjkK6K7K6K6MLLML8L9L8L9K0K1l4l5n6n7k9k9J8J7J8J7M6M5qqo
316B551K2L2j4o2o1j0rj8j7j8j8K8K8K8K8oooorrj8m6m3KN1P9Q9Q9N9J3l1p8p9p8n4pK1K2
$$ plain form
350 2989 2973 2958 2917 2922 2985 3048 3114 3180 3164 3149 3133 3118 3143 3169 3165 3116 3065 3014 2948 2909 2919 2974 3031 3042 3014 2985 2953 2921 2941 2961 2982 3002 2981 2960 2938 2917
346 2917 2910 2902 2894 2887 2856 2826 2795 2765 2779 2794 2808 2823 2869 2915 2933 2906 2864 2849 2871 2893 2882 2871 2861 2850 2876 2901 2927 2953 2965 2977 2990 3004 3045 3113 3190 3221 3208
341 3208 3168 3138 3108 3060 2984 2897 2857 2830 2803 2779 2755 2768 2780 2793 2805 2818 2830 2843 2855 2837 2819 2802 2784 2789 2794 2799 2804 2808 2812 2817 2821 2839 2857 2875 2893 2892 2891 2889 2888 2864 2840
336 2840 2816 2792 2774 2757 2739 2722 2746 2770 2794 2817 2841 2864 2887 2910 2917 2923 2929 2935 2948 2962 2947 2887 2814 2769 2768 2813 2867 2874 2819 2764 2764 2763 2762 2762 2768 2775 2782 2788 2827 2866 2905 2943
331 2943 2940 2936 2932 2928 2924 2920 2916 2912 2902 2892 2882 2872 2821 2769 2718 2667 2654 2641 2628 2615 2637 2658 2625 2591 2576 2561 2600 2640 2645 2650 2655 2661 2637 2613 2589 2566 2558 2550 2598 2645 2704 2762
326 2762 2766 2770 2735 2701 2667 2633 2654 2675 2641 2607 2602 2596 2646 2696 2705 2714 2668 2622 2616 2610 2632 2653 2653 2653 2625 2598 2572 2546 2547 2549 2535 2520 2506 2492 2539 2587 2634 2681 2668 2655 2643
321 2643 2630 2567 2503 2440 2377 2368 2360 2352 2344 2342 2341 2340 2338 2364 2391 2417 2443 2447 2450 2453 2457 2495 2534 2572 2611 2631 2652 2618 2583 2527 2470 2441 2412 2430 2447 2465 2482 2528 2573 2565 2557 2551
316 2551 2573 2605 2591 2529 2468 2458 2449 2431 2414 2396 2378 2406 2434 2462 2490 2484 2478 2472 2466 2457 2448 2430 2384 2341 2343 2394 2473 2562 2651 2710 2723 2692 2614 2535 2457 2403 2396 2417 2439
311B439OONOj8j7j8j7J6J7J6J6NMPN2P5P5J2l4o3o4l9l9j0j0j0j0L8L8L8L8J6J5j2j2k9l0
306B508K6K5K1K0l4l5n3n2k5K1M2J4ONK7K7K7K7m3m3m2m2jK6L7j0m4m4j7j7K1O7J09Q1L5j1
302B659k7n4r3r3k8J7J3J3j1j2j2j1J6J5RRj8j9LKL0L1J8J8j0rL0L0pl5m1OO6O6M4km0q5q8
297B400m2K9P6M8K0J1J1J3J3m2m1J4J5J4J5l0l0l0l0J7J7J7J8K5K5K5K5N5N5l7l7m8m9POj6
293B539j6j5j6k7k6k6k6PPOPk0k1L4L5L0L0k5k5nmK3K3nnK3K3K8K8K9K8J6J5l9m0m4m3p1p1
288B361j0rRj9l1J5M2M2JJk7k6l1l0l1l0M8M8M8M9J4J5J4J5nnl2l2l4l4K1K1K8K8K8K7j9j9
283B451k0j9RQRRL1L2L1L2J1J1J2J1rrl6l7KKk5p2r2o5nK3K6N3R2R2K3k4k5k5j2j3j2j2j1
279B447j0j3j2n9q7m5JJ7l0q9r0k5K1N0N0L7L6j8j8l9l9J7J6N8N7LKj5j4L8L9j0l8k0K5M9
$$ plain form
311 2439 2445 2451 2456 2462 2444 2427 2409 2392 2408 2425 2441 2457 2462 2466 2473 2525 2600 2675 2687 2653 2590 2526 2487 2448 2438 2428 2418 2408 2446 2484 2522 2560 2576 2591 2579 2567 2538 2508
306 2508 2534 2559 2580 2600 2566 2531 2478 2426 2401 2422 2464 2478 2484 2489 2516 2543 2570 2597 2554 2511 2469 2427 2426 2452 2489 2479 2435 2391 2374 2357 2378 2445 2554 2635 2670 2659
302 2659 2632 2578 2485 2392 2364 2381 2394 2407 2396 2384 2372 2361 2377 2392 2401 2410 2392 2373 2376 2378 2408 2439 2457 2475 2465 2456 2486 2516 2509 2474 2433 2439 2505 2571 2615 2613 2573 2488 2400
297 2400 2358 2387 2463 2511 2531 2542 2553 2566 2579 2537 2496 2510 2525 2539 2554 2524 2494 2464 2434 2451 2468 2485 2503 2528 2553 2578 2603 2658 2713 2676 2639 2591 2542 2549 2555 2539
293 2539 2523 2508 2492 2465 2439 2413 2387 2394 2401 2407 2414 2394 2373 2407 2442 2472 2502 2477 2452 2447 2443 2466 2489 2484 2479 2502 2525 2553 2581 2610 2638 2654 2669 2630 2590 2546 2503 2432 2361
288 2361 2351 2342 2351 2332 2301 2316 2358 2400 2401 2402 2375 2349 2318 2288 2257 2227 2275 2323 2371 2420 2434 2449 2463 2478 2473 2468 2436 2404 2370 2336 2357 2378 2406 2434 2462 2489 2470 2451
283 2451 2431 2412 2421 2429 2438 2447 2478 2510 2541 2573 2584 2595 2607 2618 2609 2600 2564 2527 2529 2531 2506 2434 2342 2277 2272 2295 2321 2374 2466 2558 2581 2557 2532 2507 2495 2482 2470 2458 2447
279 2447 2437 2424 2412 2353 2266 2221 2222 2239 2209 2120 2030 2005 2026 2076 2126 2163 2199 2181 2163 2124 2085 2102 2118 2176 2233 2236 2238 2223 2209 2247 2286 2276 2238 2218 2243 2292
274B292M9llooL2N8Q0L3l1l0j1j1j0j1k7k8l8j2O8J31J20P5j2n7m9k2k7k6k5k5n6n6n6n6L
270B247MLMPQPQM8M9M9M9k6k6k6k7K5K4K5K4j3j3j3j2K8K8K9K8k7k7k7k7o5o4K7K7L0L1L0
265B446L1K2K3K2K3l6l6l6l6o3o3m4K0M0L9M4M3llmlJ5J4J5J5j7j7j7j8jkjkn2n2n2n2QQR
260B227Qj5j5m2m2MMN1N0L8L8J1J1popol1l2l1l1%%%%j0j0N4Q1P1J7l5o2m0j2%K9P6P6K8k7
255B413m2j5J6M2K5K5oo0p8n1k2PQQL8L7J5J4j3j3j6j7o2q9o3qOOK8K7N6N5JKJKM7M8M4M4
250B460Om8j8j8l1l1l1l1j8j7j4j4K0P5N7L0Pk1n5q1p5m6%%J2J3M0L9K0K0k2k2kN3O5L8J0
246B370RQQnml2l2l5l5J0J1%%k7k7l9l9j1j1k3k3NNP1P1M4M4J8J9rrj7j8J1J0k4k4M0M0L2
241B382L3l2l2l9m0j1j2l6l6l6l6L5L5L4L5K7K8N1Nl9o7p8l2J7M4K0pl2l1L8Q5N5Qrqm7m6
$$ plain form
274 2292 2341 2338 2335 2329 2323 2355 2413 2493 2526 2495 2465 2454 2443 2433 2422 2395 2367 2329 2317 2385 2516 2636 2711 2699 2642 2593 2571 2544 2518 2493 2468 2412 2356 2300 2244 2247
270 2247 2251 2254 2258 2265 2273 2280 2288 2336 2385 2434 2483 2457 2431 2405 2378 2403 2427 2452 2476 2463 2450 2437 2425 2453 2481 2510 2538 2511 2484 2457 2430 2365 2301 2328 2355 2385 2416 2446
265 2446 2477 2499 2522 2544 2567 2531 2495 2459 2423 2360 2297 2253 2273 2313 2352 2396 2439 2436 2433 2429 2426 2441 2455 2470 2485 2468 2451 2434 2416 2415 2413 2412 2410 2358 2306 2254 2202 2210 2218 2227
260 2227 2235 2220 2205 2163 2121 2125 2129 2180 2230 2268 2306 2317 2328 2321 2315 2308 2302 2271 2239 2208 2177 2177 2177 2177 2177 2167 2157 2211 2292 2363 2380 2345 2283 2243 2231 2231 2260 2336 2412 2440 2413
255 2413 2371 2356 2372 2414 2439 2464 2458 2398 2320 2269 2247 2254 2262 2270 2308 2345 2360 2374 2361 2348 2332 2315 2253 2164 2101 2093 2099 2105 2133 2160 2216 2271 2272 2274 2275 2277 2324 2372 2416 2460
250 2460 2466 2418 2400 2382 2351 2320 2289 2258 2240 2223 2209 2195 2215 2290 2347 2377 2384 2363 2308 2227 2152 2106 2106 2106 2118 2131 2171 2210 2230 2250 2228 2206 2204 2257 2322 2360 2370
246 2370 2379 2387 2395 2390 2386 2354 2322 2287 2252 2262 2273 2273 2273 2246 2219 2180 2141 2130 2119 2096 2073 2078 2083 2154 2225 2269 2313 2331 2350 2341 2332 2315 2297 2308 2318 2294 2270 2310 2350 2382
241 2382 2415 2383 2351 2312 2272 2261 2249 2213 2177 2141 2105 2140 2175 2209 2244 2271 2299 2350 2355 2316 2249 2171 2139 2156 2200 2220 2213 2181 2150 2188 2273 2328 2336 2327 2319 2272 2226
236B226m7m6K4K5M9N0K8j7n6n5l3l2nnK6K6K6K6rrj0rL8L8L7j0l4l3RRK3K3M8M7Ql9p2m4P
232B228N2M4J6jklkn0m9n0m9o4o5l0K4Q8Q7P7K1k1k2j1M3M9K2k4k4j6j7j6j7K1K1K0K1k6k7
227B248k7k6j3j3j3j2j3j2j3j2qqK0K0L7L7qrk0j9QQM3M3M3M3j5j5j5j5m3m4m2m2L7O5L7j9
223B213l5pJ9M7K5l0k5k5JJk7k6k9k9J7J8N8N8poKKK9K9k6k6n0n0MN8M3J5J5J5J4J3m6m7m6
218B159m6j7j7j6j7jkM5M4N9N9N9N9ppoprqrqlkl1l0p2p3qqrrrrN3N3J9l5n8n8PO2O1L3Lk4
212B160j8j9k0k0j3j2j3j2ooL9M0klkkL2L3L3L2NOJKJ4m2p2p1j6L9P3P2M2M1J4J4J3J3l3l3
207B303k8k8k8k8MLO5O4J0m5o0o0j8j8K7K8K6K5j9m7o0mM5P2J9l6o7o8j2j2L4L4L5L6j0l7
203B145l3K3N5N4N3N3K3K2j7p1r9p1kN2L8Rj6m4k6k7k1L4O3O4K1l3o7o7n5n6j0j0L2L1L2L1
$$ plain form
236 2226 2179 2133 2157 2182 2231 2281 2309 2292 2236 2181 2148 2116 2111 2106 2132 2158 2184 2210 2201 2192 2182 2173 2211 2249 2286 2276 2242 2209 2218 2227 2250 2273 2321 2368 2376 2337 2265 2221 2228
232 2228 2280 2324 2340 2339 2337 2334 2332 2282 2233 2183 2134 2070 2005 1975 1999 2087 2174 2251 2272 2251 2229 2218 2261 2310 2332 2308 2284 2268 2251 2235 2218 2239 2260 2280 2301 2275 2248
227 2248 2221 2195 2182 2169 2156 2144 2131 2119 2106 2094 2086 2078 2098 2118 2155 2192 2184 2175 2155 2136 2144 2152 2195 2238 2281 2324 2309 2294 2279 2264 2221 2177 2135 2093 2130 2195 2232 2213
223 2213 2178 2171 2190 2237 2262 2232 2207 2182 2183 2184 2157 2131 2102 2073 2090 2108 2166 2224 2217 2211 2213 2215 2244 2273 2247 2221 2171 2121 2125 2183 2226 2241 2256 2271 2285 2298 2252 2205 2159
218 2159 2113 2096 2079 2063 2046 2045 2043 2088 2132 2191 2250 2309 2368 2361 2354 2348 2341 2332 2324 2315 2307 2304 2302 2271 2241 2169 2096 2088 2080 2071 2062 2053 2044 2097 2150 2169 2134 2076 2018 2025 2087 2148 2181 2184 2160
212 2160 2142 2123 2103 2083 2070 2058 2045 2033 2027 2021 2060 2100 2098 2095 2093 2091 2123 2156 2189 2221 2226 2232 2233 2235 2249 2207 2135 2064 2048 2087 2160 2232 2274 2315 2329 2343 2356 2369 2336 2303
207 2303 2275 2247 2219 2191 2195 2198 2263 2327 2337 2292 2232 2172 2154 2136 2163 2191 2217 2242 2223 2176 2116 2112 2157 2229 2248 2212 2145 2077 2065 2053 2087 2121 2156 2192 2182 2145
203 2145 2112 2135 2190 2244 2297 2350 2373 2395 2378 2307 2208 2137 2135 2187 2225 2234 2218 2174 2148 2121 2100 2134 2197 2261 2282 2249 2182 2115 2060 2004 1994 1984 2016 2047 2079 2110
199B110M6M6rrl5l6K0J9L1L1MLj1j2l9l9J6J6J6J6j4j4j3j4k7k7k8k7KKLML2O0K7l7n7l0N
194B031ONNNNJ7J7J7J7ooopmnnnnnnnJ0RJ0RM3M2J5J5j0j0M5M5J2J1m4m3l3l3l3l2J4J4J6
188B133J6J4M2N2Om8m8MMJ0J1J0J0J4J4m1m1l5l6qqJ9J9M5M5m3o9n1nL3O0O0L3l2p8q0l4J6
184B013J5J8J9L2L2L2L3rql7l6k0k0L3L3ml2m2MPPJ0J0k3k2k2k2popok4k4k4k3NNm7m7j5L1
179A812O1O0M1M0J3J3J0J0L7L7%%%JN0N1N0N1J%k6k7o5o5j0j0rqrqjjL5O4O0J4o9r7p8n0j2
174A966j3K3K4K3K4K6K7K7K7L0L0K9K8m1o8n1oO0N9L3j3o0o0o3o3K5K6K5K5J1J2J1J2J5J5
169B175J5J5k2k3k3k2j4j4M2M1J2J2j6j5k4k4k4k4JJJ%n1n2LMnnnmm9m8m9m8k0k1RN5P1P0
165A925J9J8M7M6M6M6k1k0k0k0l4l4l4l4OPOOJ1J1m1m1m9kM6P3O7L8JJJ6J7J6J6j9j9j9k0
$$ plain form
199 2110 2156 2202 2193 2184 2149 2113 2133 2152 2183 2214 2218 2221 2210 2198 2159 2120 2136 2152 2168 2184 2170 2156 2143 2129 2102 2075 2047 2020 2022 2024 2027 2031 2063 2123 2150 2113 2056 2026 2031
194 2031 2037 2042 2047 2052 2057 2074 2091 2108 2125 2119 2113 2107 2100 2096 2091 2086 2081 2076 2071 2066 2061 2071 2080 2090 2099 2142 2184 2199 2214 2204 2194 2239 2284 2296 2307 2263 2220 2187 2154 2121 2089 2103 2117 2133
188 2133 2149 2163 2205 2257 2263 2215 2167 2171 2175 2185 2196 2206 2216 2230 2244 2203 2162 2127 2091 2083 2075 2094 2113 2158 2203 2160 2091 2040 2035 2068 2128 2188 2221 2189 2111 2031 1997 2013
184 2013 2028 2046 2065 2097 2129 2161 2194 2185 2177 2140 2104 2084 2064 2097 2130 2126 2094 2052 2056 2063 2070 2080 2090 2067 2045 2023 2001 1994 1988 1981 1975 1951 1927 1903 1880 1885 1890 1843 1796 1781 1812
179 1812 1873 1933 1974 2014 2027 2040 2050 2060 2097 2134 2134 2134 2134 2135 2185 2236 2286 2337 2338 2338 2312 2285 2220 2155 2145 2135 2126 2118 2109 2101 2100 2099 2134 2198 2258 2272 2203 2106 2028 1978 1966
174 1966 1953 1976 2000 2023 2047 2073 2100 2127 2154 2184 2214 2243 2271 2230 2162 2111 2105 2165 2224 2257 2244 2184 2124 2061 1998 2023 2049 2074 2099 2110 2122 2133 2145 2160 2175
169 2175 2190 2205 2183 2160 2137 2115 2101 2087 2129 2170 2182 2194 2178 2163 2139 2115 2091 2067 2068 2069 2070 2070 2019 1967 1970 1974 1969 1964 1959 1955 1906 1858 1809 1761 1741 1720 1729 1784 1855 1925
165 1925 1944 1962 2009 2055 2101 2147 2126 2106 2086 2066 2032 1998 1964 1930 1936 1943 1949 1955 1966 1977 1936 1895 1846 1844 1890 1963 2030 2068 2069 2070 2086 2103 2119 2135 2116 2097 2078 2058
160B058j5j6j5j6j5j6j5j6k7k7k7k7K0K0K0K0L4L5k1k1j3j3j2j3k1k0k1k0K6K7K6K7O1O0O
156B033OK3K3K2K3K4K5K4K4L4L4L5L4jjn6n6k6k5k5k5k6k7k6k6j2j2o4o4n1MO5O5J4J3J4J3
151B029oppoj8j8L7L7K1K1l4l3k3k2k2k2JJJJm0m0m1m0J8J8J7J8K5K4K5K4J6J6J6J6K3K3K3
146B072K2o2o3o3o3J0RJ3J3MN8Q0P9Nn1p4p4p3p3j2M3N7N7L6j9k2k3K9K9P0O9O9O9J4J5m1
142B209m1o4o4l9J5J0Rm2m1qqpqK9L0K9K9OOPOPQPPl3l4l4l4L4L4L0L1qo2l1l2l4l4l4l4M4
137A861M4M1M1l5q1o8m2J5M2Q0Q0M4ll2l2l9m0n3k5J5O0N1K5K8K9K7K7%%%Jk3k3k3k2m9m9
132A872m9m9M7M7M7M8K5K5K5K5ppppj2j1j2j2j8j9j8j9L8L9L6L7O4L7l7j02p3k7kkl5l4l5
128A818l5noM9N0J2J3J3J2JJp3j00o7k2K7N5M0M0L8L9J9k7k6J9M0M1j2j1m6m6m3m4k7J7M8
$$ plain form
160 2058 2043 2027 2012 1996 1981 1965 1950 1934 1907 1880 1853 1826 1846 1866 1886 1906 1940 1975 1954 1933 1920 1907 1895 1882 1861 1841 1820 1800 1826 1853 1879 1906 1967 2027 2033
156 2033 2039 2062 2085 2107 2130 2154 2179 2203 2227 2261 2295 2330 2364 2363 2362 2306 2250 2224 2199 2174 2149 2123 2096 2070 2044 2032 2020 1956 1892 1841 1845 1910 1975 1989 2002 2016 2029
151 2029 2023 2016 2009 2003 1985 1967 2004 2041 2062 2083 2049 2016 1993 1971 1949 1927 1928 1929 1930 1931 1891 1851 1810 1770 1788 1806 1823 1841 1866 1890 1915 1939 1955 1971 1987 2003 2026 2049 2072
146 2072 2094 2032 1969 1906 1843 1853 1862 1875 1888 1892 1950 2030 2109 2114 2063 1989 1915 1842 1769 1757 1800 1857 1914 1950 1931 1909 1886 1915 1944 2014 2083 2152 2221 2235 2250 2209
142 2209 2168 2104 2040 2001 2016 2026 2035 1993 1952 1944 1936 1929 1921 1950 1980 2009 2038 2044 2050 2057 2063 2070 2078 2085 2092 2059 2025 1991 1957 1991 2025 2055 2086 2078 2016 1985 1953 1919 1885 1851 1817 1861
137 1861 1905 1946 1987 1952 1871 1803 1761 1776 1818 1898 1978 2022 2019 1987 1955 1916 1876 1823 1798 1813 1873 1924 1949 1977 2006 2033 2060 2060 2060 2060 2061 2038 2015 1992 1970 1921 1872
132 1872 1823 1774 1821 1868 1915 1963 1988 2013 2038 2063 2056 2049 2042 2035 2023 2012 2000 1988 1970 1951 1933 1914 1952 1991 2027 2064 2128 2165 2128 2026 1953 1926 1924 1922 1887 1853 1818
128 1818 1783 1778 1772 1821 1871 1883 1896 1909 1921 1922 1923 1850 1750 1683 1661 1688 1743 1783 1823 1861 1900 1919 1892 1866 1885 1925 1966 1954 1943 1897 1851 1808 1764 1737 1754 1802
123A802M7mmmmM3M2M2M3J0J0J0J0RRL5j2p8p8q2q1m1m2J4J4j0rM8J03R0L5J4J4K4K4K4K5k3
119B069k2k2k3K5K4K5K5QRm7m6m3m3J2J2nno1o0l2l3l2l3J0J0J0J0L3L2L3L3j2j2j3j2KJK
114A829Jkllkj7j6j7j6L1L1L1L2j0j0j0j0J1J1J1J1%J%Jk3k4L2L2J5J4J5J4k7k8k8k7J4J3
109A877J1J0m9j05j01m5K1P7N0M9K5K4K4K5j3j4j3j4m5m5k2L4P2P1K0K0j9k0j9k0K1K1K0J9
105A947K3mn7j13j01p4k3L2Q4Q3K0l5n4JO4O3K7k9n8k9PL5L6J0QRQRJ2M0no0q6l0P2J00P5
101B007K0l0l0j5j4J2J3l0l1klLMLLL8L7L7L7l8l8l9l8o3o2l3l3j8J1M2R8Q8L3j2j3K2P6N9
96B101L1ql6k1k2j2j1j1j1j2j1j1j2m2m3m3m3RJ0RRJ2J1L9L9K6K7k0k0k9l0l0l0j6j6j6j7
91A750MMN0N0L8L8J0J1j4j4m1m1p6p5m2J2K5K4%%J2J3M0M0rrJ8J8J9J8j0rnnl3l3j5j4J3J3
$$ plain form
123 1802 1849 1845 1841 1837 1833 1876 1918 1960 2003 2013 2023 2033 2043 2052 2061 2096 2084 2006 1928 1846 1765 1724 1682 1696 1710 1700 1691 1739 1842 1932 1967 1981 1995 2019 2043 2067 2092 2069
119 2069 2047 2025 2002 2027 2051 2076 2101 2109 2118 2071 2025 1982 1939 1951 1963 1958 1953 1892 1832 1800 1767 1735 1702 1712 1722 1732 1742 1775 1807 1840 1873 1861 1849 1836 1824 1826 1827 1829
114 1829 1830 1828 1825 1822 1820 1803 1787 1770 1754 1785 1816 1847 1879 1869 1859 1849 1839 1850 1861 1872 1883 1883 1884 1884 1885 1862 1838 1870 1902 1917 1931 1946 1960 1933 1905 1877 1850 1864 1877
109 1877 1888 1898 1849 1744 1643 1598 1619 1696 1746 1795 1820 1844 1868 1893 1880 1866 1853 1839 1794 1749 1727 1761 1833 1904 1924 1944 1925 1905 1886 1866 1887 1908 1928 1947
105 1947 1970 1966 1909 1796 1695 1621 1598 1630 1714 1797 1817 1782 1728 1729 1793 1856 1883 1854 1796 1767 1774 1809 1845 1855 1863 1872 1880 1889 1901 1941 1936 1876 1790 1760 1832 1932 2007
101 2007 2027 1997 1967 1952 1938 1950 1963 1933 1902 1900 1897 1900 1904 1907 1910 1948 1985 2022 2059 2021 1983 1944 1906 1843 1781 1748 1715 1697 1708 1750 1848 1936 1969 1957 1944 1966 2042 2101
96 2101 2132 2124 2088 2067 2045 2033 2022 2011 2000 1988 1977 1966 1954 1912 1869 1826 1783 1792 1802 1811 1820 1832 1843 1882 1921 1947 1974 1954 1934 1905 1875 1845 1815 1799 1783 1767 1750
91 1750 1754 1758 1808 1858 1896 1934 1944 1955 1941 1927 1886 1845 1769 1694 1652 1664 1689 1713 1713 1713 1725 1738 1778 1818 1809 1800 1818 1836 1855 1873 1863 1854 1849 1844 1811 1778 1763 1749 1762 1775
87A775nnn0n1rj0J8J9KKk6n3m0OM3M3J0RJ0J0M6M6M6M6l6l6l5l6OONOJ4J5J4J4nnl3l3L1L1
81A805J3l3m7j9L0N8L9L9nnm2m1NMJ2J1J1J1j8j8j8j8rj0j0rMMMMj2j3j2j3jjO3O3M4M4jk
76A911kkm8m8k9l0L1L2km7m6%M9P7O1O1L7qm6m7qrqqJKJJmmmnL0L1k5k5k7k6K9K9QQQQJ7J6
71A940J7J7M8M9M9M9m4m3m4m3L7L8J4m1q7q7l5l5j6j6j6j5KKN4N3K1l4p2m4mK3O1O0K6l0j6
66A838J2K8%l7l8k1k2k2k2k4k4k4k3nmN0N1QQQRlkkkj2j2j1j2L9L8L9L9llllo8o8m4J0O8O7
61A798J0m5o8o8j6j7jkjkN8N8L8O6Q7L2j2l9l0l0l1l2J3J3m3m2jjKLlN3P3P3L8j6m1m0J0R
56A853J0Rl2l1l2l2m0m1J5J4lkllK5K5K4K5L2L1L2L1J3J2J3J2J3J2J3J2l2l2l2l3rrrj0k0
51A821k0k0k0l4l4l4l4K9L0K6K7L9j5p2p2j3M2J2J1mnnmNNONkjkjmmmmk1k1L3L4L4L5L4L4
$$ plain form
87 1775 1770 1765 1715 1664 1655 1645 1663 1682 1684 1686 1660 1607 1567 1573 1616 1659 1669 1678 1688 1698 1744 1790 1836 1882 1846 1810 1775 1739 1745 1751 1756 1762 1776 1791 1805 1819 1814 1809 1776 1743 1774 1805
81 1805 1818 1785 1738 1719 1749 1807 1846 1885 1880 1875 1833 1792 1797 1801 1813 1824 1835 1846 1828 1810 1792 1774 1765 1755 1745 1736 1740 1744 1748 1752 1740 1727 1715 1702 1701 1700 1763 1826 1870 1914 1913 1911
76 1911 1909 1907 1859 1811 1782 1752 1783 1815 1813 1766 1720 1720 1769 1846 1907 1968 2005 1997 1951 1904 1896 1887 1879 1871 1872 1874 1875 1876 1872 1868 1864 1859 1889 1920 1895 1870 1843 1817 1846 1875 1883 1891 1899 1907 1924 1940
71 1940 1957 1974 2022 2071 2120 2169 2125 2082 2038 1995 2032 2070 2084 2043 1956 1869 1834 1799 1783 1767 1751 1736 1738 1740 1794 1847 1868 1834 1762 1718 1714 1737 1798 1858 1884 1854 1838
66 1838 1850 1878 1878 1841 1803 1782 1760 1738 1716 1692 1668 1644 1621 1616 1612 1662 1713 1721 1729 1737 1746 1743 1741 1739 1737 1725 1713 1702 1690 1729 1767 1806 1845 1842 1839 1836 1833 1765 1697 1653 1663 1731 1798
61 1798 1808 1763 1695 1627 1611 1594 1593 1591 1590 1588 1646 1704 1742 1808 1895 1927 1915 1876 1846 1816 1785 1753 1766 1779 1736 1694 1693 1692 1694 1697 1694 1747 1820 1893 1931 1915 1874 1834 1844 1853
56 1853 1863 1872 1840 1809 1777 1745 1705 1664 1679 1693 1690 1688 1685 1682 1707 1732 1756 1781 1813 1844 1876 1907 1920 1932 1945 1957 1970 1982 1995 2007 1975 1943 1911 1878 1869 1860 1851 1841 1821
51 1821 1801 1781 1761 1727 1693 1659 1625 1654 1684 1710 1737 1776 1761 1689 1617 1604 1646 1658 1669 1665 1660 1655 1651 1656 1661 1667 1672 1670 1669 1667 1666 1662 1658 1654 1650 1629 1608 1641 1675 1709 1744 1778 1812
46A812RRRQl9m0j9L7M7qq3j11o5j0J3J2K8K7K7K8K6K5K6K6K2K2K3K2L0K9k5k6m4m5m5m5k3
41A689k2k3k2K8K8K8K8OOPOK6K6K6K6%%n4n5k4k5k5k5j8j8N5Q3P2K6k2m8m9k1J7J7j2j1j1
37A715j1mlllM2M2j4j3ppppJ3J2J3J2j9k0j9k0j3j4j4j3l1l0L4P9Q1N3Pl9k9jj9j9J8J8J8
32A778J8LLLLj1j1j1j1o3o4o0o1k7J8O7R3O6K0k8n6n0m9MMKJJJk0j9L6L5ononM8M8M9M8L0
27A816K9L0K9k1k1k1k1noonJ7J7J7J7n6n6n6n6oooojjkjn5n5l6K9P2P2M8Jl5l4l8l8%j%jj4
21A528j5j4j5KKk4K1Q7Q7L4L4j7j8j7j8J1J2J1J1L9L9L9L9m8m8m9m8PPOPj4j4M1M1L0L1k5
17A782k4k2k2k2k3%%j%%j%%onnnJ7J8J8J7k0k0k1k0j3j4j3j4ppqpJ0J0RJ0j3j4M2M1M2M1j3
11A717j4l5l6l6l6m9n0m6m7j9K8N6N7J8J8l7l7L2L2L2L1ONONJ7J7J7J8K8K9k7k6k6k6K9K9
$$ plain form
46 1812 1821 1830 1839 1847 1808 1768 1749 1786 1833 1825 1742 1631 1566 1556 1569 1581 1609 1636 1663 1691 1717 1742 1768 1794 1816 1838 1861 1883 1913 1942 1917 1891 1847 1802 1757 1712 1689
41 1689 1667 1644 1622 1650 1678 1706 1734 1740 1746 1753 1759 1785 1811 1837 1863 1863 1863 1809 1754 1730 1705 1680 1655 1637 1619 1674 1757 1829 1855 1833 1785 1736 1715 1732 1749 1737 1726 1715
37 1715 1704 1700 1697 1694 1691 1733 1775 1761 1748 1741 1734 1727 1720 1733 1745 1758 1770 1751 1731 1712 1692 1679 1665 1651 1638 1607 1577 1611 1690 1771 1824 1831 1792 1763 1762 1743 1724 1742 1760 1778
32 1778 1796 1799 1802 1805 1808 1797 1786 1775 1764 1701 1637 1577 1516 1489 1507 1574 1667 1733 1753 1725 1669 1619 1570 1574 1578 1580 1581 1582 1583 1563 1544 1580 1615 1609 1604 1598 1593 1641 1689 1738 1786 1816
27 1816 1845 1875 1904 1883 1862 1841 1820 1815 1809 1803 1798 1815 1832 1849 1866 1810 1754 1698 1642 1636 1630 1624 1618 1617 1616 1614 1613 1558 1503 1467 1496 1568 1640 1688 1689 1654 1620 1582 1544 1544 1543 1543 1542 1528
21 1528 1513 1499 1484 1486 1488 1464 1485 1572 1659 1693 1727 1710 1692 1675 1657 1668 1680 1691 1702 1741 1780 1819 1858 1810 1762 1713 1665 1672 1679 1685 1692 1678 1664 1705 1746 1776 1807 1782
17 1782 1758 1736 1714 1692 1669 1669 1669 1668 1668 1668 1667 1667 1667 1661 1656 1651 1646 1663 1681 1699 1716 1696 1676 1655 1635 1622 1608 1595 1581 1574 1567 1559 1552 1562 1572 1581 1591 1578 1564 1606 1647 1689 1730 1717
11 1717 1703 1668 1632 1596 1560 1511 1461 1415 1368 1349 1377 1433 1490 1508 1526 1489 1452 1484 1516 1548 1579 1585 1590 1596 1601 1618 1635 1652 1670 1698 1727 1700 1674 1648 1622 1651 1680
7A680l8l7l8l8j4j4j4j5J8J8J8J7L2L2L1L2l4l4l3l4k2k1L3L3N1N0mnl3l3K0J9Mk3l4J2N0
2A632N0N4N3k2k1k1k2l3l3J8J9j5o2o0j4M4P0N4N4L5l0q2q2p2k6J1N7O6K0k5n3j9Qrrj2j3
-2A510j3j3J5J5J5J5K8K9K9K8m0m1m1m0L7L7L5L4J0l6k4MKL0M2ll2l2pL9O8M1J9qrrj2j3Q
-7A717k0n7n6j7K8J6j2l8q3q3l7PL5K2K3K7K7K6K6K3nm2m3l4qJ5M3K6jJ8J8K7N5O6J9l7l7
-12A654J3J3Jk7l7RL7L8L9L9K6kl9m0j2J5%%l0l1l0l1l2l2oM0N4Qj7j6K4N2L6L6J2J2J0J0
-16A796l1n8m3m2k2k1k0j9K2N0L2L3L2No8o9l3J2Mk4k7Jj4j5nK2L5j0m7%K4K4rl7l6rrrqp
-21A400K9K9L1L1M3P2O4Jm7m6NMJ4J3J3J3k9k9l0k9k1k1l6rJ4J3J6J5J5J5J7J7NL2L4OK1N0
-26A735L0L0j3m1k6k6pqqqK3K2j5m3l9j2K6K6k4k3J6M3N6N5L0L0K5K5J2j7l8o6o6l9%K8K9
$$ plain form
7 1680 1642 1605 1567 1529 1515 1501 1487 1472 1490 1508 1526 1543 1575 1607 1638 1670 1636 1602 1569 1535 1513 1492 1525 1558 1609 1659 1655 1650 1617 1584 1604 1623 1627 1604 1570 1582 1632
2 1632 1682 1736 1789 1767 1746 1725 1703 1670 1637 1655 1674 1659 1597 1537 1523 1567 1637 1691 1745 1780 1750 1668 1586 1514 1488 1499 1556 1622 1642 1617 1564 1545 1553 1544 1535 1523 1510
-2 1510 1497 1484 1499 1514 1529 1544 1572 1601 1630 1658 1618 1577 1536 1496 1533 1570 1605 1639 1649 1613 1589 1593 1595 1625 1667 1664 1632 1600 1593 1632 1700 1741 1760 1752 1743 1734 1722 1709 1717
-7 1717 1697 1640 1584 1567 1595 1611 1599 1561 1478 1395 1358 1365 1400 1422 1445 1472 1499 1525 1551 1574 1569 1527 1484 1450 1442 1457 1500 1526 1525 1543 1561 1588 1643 1709 1728 1691 1654
-12 1654 1667 1680 1681 1654 1617 1626 1663 1701 1740 1779 1805 1803 1764 1724 1712 1727 1727 1727 1697 1666 1636 1605 1573 1541 1535 1575 1629 1637 1620 1604 1628 1680 1716 1752 1764 1776 1786 1796
-16 1796 1765 1707 1664 1622 1600 1579 1559 1540 1562 1612 1644 1677 1709 1714 1646 1577 1544 1556 1560 1536 1509 1510 1496 1481 1476 1498 1533 1523 1476 1476 1500 1524 1515 1478 1442 1433 1424 1415 1407 1400
-21 1400 1429 1458 1489 1520 1563 1635 1699 1700 1653 1607 1612 1616 1630 1643 1656 1669 1640 1611 1581 1552 1531 1510 1474 1465 1479 1492 1508 1523 1538 1553 1570 1587 1592 1624 1658 1664 1685 1735
-26 1735 1765 1795 1782 1741 1715 1689 1682 1674 1666 1658 1681 1703 1688 1645 1606 1594 1620 1646 1622 1599 1615 1658 1714 1769 1799 1829 1854 1879 1891 1874 1836 1770 1704 1665 1665 1693 1722
-30A722Kj0j0j0j0k3MM4M4K7K6M1J2k5n4n4k8KKn0n0l6rNNj0J8N5N6L0Kj0rk1k1k1k2j3j4
-35A587K6N4N1N2J4j4l7l8j1j2l1l0l1l0M3M2M3M3J4J4m1m0%%%Jm5m4J0J1m2m3k3M0N8N8L2
-40A681L1Mm3p2p1k6k6k6k6m0m0K5P0N6K8J9J9lmmmJ8J7J7J8J3J3J3J3K4K3K3K4K4K4mm9n5
-44A704k7qK0M4J6k1k2rqrqk1k1L3L4J7J6J7J7QRQRRQRQn2n3n3n3m3m2J2J3K8K9K8K8opl4
-49A627l4J1J1j7o2q2n4pL9M8M8K2k5m9m9k3K2L0L0L2L3k1k0k0k1l2l3rM7N6N5Kn3k5K9mn
-54A497POPPl1l1l1l1K8K9K9K8j0j1j1j0l8l8J6J7M9M8J00J00N3ko2o3m3m3J2J1M4M5m5m4
-58A589l9J6M0M0L4L4J0m4m6m6m9m9PPPPl0l0k9l0L9L9L9L9k3k3k4k3J8J8J8J8jkjjk1k1k1
-63A466k0o2o1l7J8K8K8L2L2K1K1P2P3N3kk6k6m7m7m8m7J4J5J5J4RQm6m7m4m4m1m2k7J9M9
$$ plain form
-30 1722 1724 1714 1704 1694 1684 1661 1665 1709 1753 1780 1806 1847 1859 1834 1780 1726 1698 1700 1702 1652 1602 1566 1557 1562 1567 1557 1575 1630 1686 1716 1718 1708 1699 1678 1657 1636 1614 1601 1587
-35 1587 1613 1667 1718 1770 1784 1770 1733 1695 1684 1672 1641 1611 1580 1550 1593 1635 1678 1721 1735 1749 1708 1668 1668 1668 1668 1669 1624 1580 1590 1601 1559 1516 1493 1533 1591 1649 1681
-40 1681 1712 1716 1673 1601 1530 1504 1478 1452 1426 1386 1346 1371 1441 1497 1525 1544 1563 1560 1556 1552 1548 1566 1583 1600 1618 1631 1644 1657 1670 1694 1717 1740 1764 1788 1812 1808 1759 1704
-44 1704 1677 1669 1689 1733 1749 1728 1706 1697 1689 1680 1672 1651 1630 1663 1697 1714 1730 1747 1764 1772 1781 1789 1798 1807 1815 1824 1832 1780 1727 1674 1621 1578 1536 1548 1561 1589 1618 1646 1674 1668 1661 1627
-49 1627 1593 1604 1615 1598 1536 1454 1400 1393 1432 1480 1528 1550 1525 1476 1427 1404 1426 1456 1486 1518 1551 1530 1510 1490 1469 1437 1404 1395 1442 1498 1553 1555 1502 1477 1506 1502 1497
-54 1497 1504 1510 1517 1524 1493 1462 1431 1400 1428 1457 1486 1514 1504 1493 1482 1472 1434 1396 1412 1429 1478 1526 1626 1726 1779 1777 1715 1652 1609 1566 1578 1589 1633 1678 1633 1589
-58 1589 1550 1566 1606 1646 1680 1714 1724 1680 1634 1588 1539 1490 1497 1504 1511 1518 1488 1458 1429 1399 1438 1477 1516 1555 1532 1509 1485 1462 1480 1498 1516 1534 1533 1531 1530 1529 1508 1487 1466
-63 1466 1446 1384 1323 1286 1304 1332 1360 1392 1424 1445 1466 1538 1611 1664 1662 1636 1610 1563 1516 1468 1421 1435 1450 1465 1479 1488 1496 1450 1403 1359 1315 1274 1232 1205 1224 1273
-67A273M8O5O6L6rl5l5J7J7OOOOl5l4l4l5l1l0l1l1mlN2N1N0M9M9N0K1K2l3l4l4l5l4l5j1
-72A327j2j1j1M2M3M1M1P9N3Lm2n7k9M4M4J0J0J0J0K8K7k8k8o4o5j0j0m9n0k2K4L0LML1L5
-76A451Ql1l0k0j9L5L5K4K4K4K4k9k8k8k8j1j0j1j1l2l1K4K4O1O2O1O2LLLL%%j%M2M1j3j3
-81A668n1n1n2n1OONOONONrj0j0j0j0j0j0rJKKKK5K5K5K5j1j0j1j0J2J3J3J2k7k6k7k7M2M2
-86A522M2M2J0J0RJ0m4m4m3m2L2O0J8k9l2nnl2l5J1P6P5N9O0MMk9l0jkj9j9j9j9J5J5M0M0
-91A705jm6p2p3p3k7K1M9L8J1K8K7K3K3K3K3k7k8k8k7J8J8J9J8%jK4K4J6k9p1m4J8O5L9pp
-96A669qJ8J7J2J2m3m3k9k8K6K7N4N4K5k1p4p4m9n0K8K8K8K8PPPPn3n3n3n3j6j6j6j6j3j2
-100A334j3j3l2l3K3K3M2M2M2M2j2j2j3j2JKJKL6L6M8K1j7p1p4j8M1M0M4M4O6O5Pm8o0l2K4
$$ plain form
-67 1273 1321 1386 1452 1488 1479 1444 1409 1426 1443 1449 1455 1461 1467 1432 1398 1364 1329 1298 1268 1237 1206 1202 1199 1251 1302 1352 1401 1450 1500 1521 1543 1510 1476 1442 1407 1373 1338 1327
-72 1327 1315 1304 1293 1335 1378 1419 1460 1539 1592 1595 1553 1496 1467 1511 1555 1565 1575 1585 1595 1623 1650 1622 1594 1530 1465 1455 1445 1396 1346 1324 1348 1378 1381 1385 1416 1451
-76 1451 1459 1428 1398 1378 1359 1394 1429 1453 1477 1501 1525 1496 1468 1440 1412 1401 1391 1380 1369 1337 1306 1330 1354 1415 1477 1538 1600 1603 1606 1609 1612 1612 1612 1611 1611 1653 1694 1681 1668
-81 1668 1617 1566 1514 1463 1469 1475 1480 1486 1492 1497 1503 1508 1499 1489 1479 1469 1459 1449 1439 1430 1431 1433 1435 1437 1462 1487 1512 1537 1526 1516 1505 1495 1507 1520 1533 1545 1518 1492 1465 1438 1480 1522
-86 1522 1564 1606 1616 1626 1635 1645 1601 1557 1514 1472 1504 1564 1582 1553 1521 1516 1511 1479 1444 1455 1531 1606 1665 1725 1729 1733 1704 1674 1673 1671 1652 1633 1614 1595 1610 1625 1665 1705
-91 1705 1704 1658 1586 1513 1440 1413 1434 1483 1521 1532 1560 1587 1610 1633 1656 1679 1652 1624 1596 1569 1587 1605 1624 1642 1642 1641 1665 1689 1705 1676 1605 1561 1579 1644 1683 1676 1669
-96 1669 1661 1679 1696 1708 1720 1677 1634 1605 1577 1603 1630 1684 1738 1763 1742 1668 1594 1545 1495 1523 1551 1579 1607 1614 1621 1628 1635 1582 1529 1476 1423 1407 1391 1375 1359 1346 1334
-100 1334 1321 1308 1276 1243 1266 1289 1331 1373 1415 1457 1445 1433 1420 1408 1409 1411 1412 1414 1450 1486 1534 1555 1538 1467 1393 1375 1416 1456 1500 1544 1610 1675 1682 1634 1574 1542 1566
-105A566N1M0J3k5k5J8J7J8J7j1j1o6o6o2o3ppJ6J6J6J6L0K9L3k3m3m4J1O5O0Mn3n3j4j5J3
-109A461J3rqrqppppJ4J4j7L9O6O7P0P0J0J0J0J0m0m1m0m0o8o7o7o7k6k6O6O6N4N5j%L6L6
-114A605L6L6ononk7k7m2j5MMQPNL1L0Lm1o8n4n5k4k4k4k4MMMMK7K6K7K7J7J7J7J7j5j5j5
-119A468j5k6k6k4k4rJ9J8rj4j4l2mJ1J1K8Jllj9J0N1P8P9N0J4j3l8o5n9l1qJ9K1K1K2K3n
-123A503mJ1j6m5m4pK0L0L0ol4l1lL4L4K3K2L9J0k2k2k4k4J7J7J8J7j2j3k7%PPRRk3k3k3k4
-128A430rrj0rJ5J5J5J5qqqql9l9m0l9LKKKjjjkjjjkN5N5N4N5j8j7j8j7r9r9l4J3N6N6N8N9
-134A422L2L2k3k3L1L1L1L1N1N2P6L0n2q1o7o7n1n2n1n1L6L7L6L6NOOOk6k5L0L0J7J8J7J8
-138A548l0k9l0l0j5j6j6j6J3J3J3J3L6L5j9j9k1k0k1k0j3j3j3j3M4M4J6k9m2j5M1O8M9Mk5
$$ plain form
-105 1566 1617 1657 1670 1645 1620 1638 1655 1673 1690 1679 1668 1602 1536 1474 1411 1404 1397 1413 1429 1445 1461 1491 1520 1553 1530 1487 1443 1454 1519 1579 1583 1530 1477 1463 1448 1461
-109 1461 1474 1465 1457 1448 1440 1433 1426 1419 1412 1426 1440 1423 1462 1528 1595 1665 1735 1745 1755 1765 1775 1735 1694 1654 1614 1546 1479 1412 1345 1319 1293 1359 1425 1479 1534 1533 1533 1569 1605
-114 1605 1641 1677 1671 1666 1660 1655 1628 1601 1559 1544 1548 1552 1560 1567 1572 1603 1633 1636 1595 1527 1473 1418 1394 1370 1346 1322 1326 1330 1334 1338 1365 1391 1418 1445 1462 1479 1496 1513 1498 1483 1468
-119 1468 1453 1427 1401 1377 1353 1344 1363 1381 1372 1358 1344 1312 1308 1319 1330 1358 1359 1356 1353 1334 1344 1395 1473 1552 1602 1616 1603 1565 1500 1441 1410 1402 1421 1442 1463 1485 1508 1503
-123 1503 1499 1510 1494 1449 1405 1398 1418 1448 1478 1472 1438 1407 1404 1438 1472 1495 1517 1556 1566 1544 1522 1498 1474 1491 1508 1526 1543 1531 1518 1491 1491 1498 1505 1514 1523 1500 1477 1454 1430
-128 1430 1421 1412 1402 1393 1408 1423 1438 1453 1445 1437 1429 1421 1382 1343 1303 1264 1267 1269 1271 1273 1272 1271 1270 1268 1267 1266 1265 1263 1318 1373 1427 1482 1464 1447 1429 1412 1313 1214 1180 1193 1249 1305 1363 1422
-134 1422 1454 1486 1463 1440 1471 1502 1533 1564 1615 1667 1743 1773 1721 1640 1573 1506 1455 1403 1352 1301 1337 1374 1410 1446 1451 1457 1463 1469 1443 1418 1448 1478 1495 1513 1530 1548
-138 1548 1518 1489 1459 1429 1414 1398 1382 1366 1379 1392 1405 1418 1454 1489 1470 1451 1430 1410 1389 1369 1356 1343 1330 1317 1361 1405 1421 1392 1350 1335 1376 1444 1493 1497 1472
-142A472k4L0L0L1L0j5j5j6j6l6o3p2k6J9M6L3L3K5K5K5K5qpppk0j9k0k0QPQPK5K4l9o6o7
-147A340j1K3N0M1M2M1M1M1J4l7r3p9k3OOl7l7l3l4NN9Q8O1Rj8mmJ2J2J2J3j1j1L5L5rj0J7
-152A552M4K5l1m3m4m2m1NMK2K2K3K2L9L9k5k6j9j8q0q0n2KJ8J7J4J4M2M1N9O0J3J3k1k1K5
-156A572K4M1M0k4k3n4n3n4n3QRRQO0N9N9N9m6m6m6m6kkkjm6m5k8K6N9Q6O2l1q4q5m0J4Rj9
-161A374m7m6nnK2K2K6K5k0k0l3l3J2J3K6K7N3N4K7K6jkL2L1MMqpqpl9l8l9l8k0j9K6K7%J
-166A397k7k7L1L1MMj2j1J2J3m1q7p5m7k3OL7L7M3M3ll1l7RO4R2P5K8J0J1l0k9k9k9J2J3J5
-170A449J4K1M9N8J3j8j9LLj1n7p8p7rrj0rL9L8L8L9j4j4j3j4l6l7l6l7L4L4L4L5L4L4L5L6
-175A542NL1M3mj7j8k0k0j1j1j1j2n8n8n8n8p8p9k3k3QRRRllK1P6O5O5O8O8PPPPQRj4p0p0
$$ plain form
-142 1472 1448 1478 1508 1539 1569 1554 1539 1523 1507 1471 1408 1336 1310 1329 1375 1408 1441 1466 1491 1516 1541 1533 1526 1519 1512 1492 1473 1453 1433 1441 1448 1456 1463 1488 1512 1473 1407 1340
-147 1340 1329 1352 1402 1443 1485 1526 1567 1608 1622 1585 1492 1413 1390 1396 1402 1365 1328 1295 1261 1266 1325 1413 1474 1483 1465 1461 1457 1469 1481 1493 1506 1495 1484 1519 1554 1545 1535 1552
-152 1552 1596 1621 1590 1547 1503 1461 1420 1425 1429 1451 1473 1496 1518 1557 1596 1571 1545 1526 1508 1428 1348 1296 1298 1316 1333 1347 1361 1403 1444 1503 1563 1576 1589 1568 1547 1572
-156 1572 1596 1637 1677 1653 1630 1576 1523 1469 1416 1424 1433 1442 1450 1510 1569 1628 1687 1641 1595 1549 1503 1501 1499 1497 1496 1450 1405 1377 1403 1462 1548 1610 1579 1495 1410 1370 1384 1393 1374
-161 1374 1327 1281 1276 1271 1293 1315 1341 1366 1346 1326 1293 1260 1272 1285 1311 1338 1391 1445 1472 1498 1497 1495 1527 1558 1562 1566 1558 1551 1543 1536 1497 1459 1420 1382 1362 1343 1369 1396 1396 1397
-166 1397 1370 1343 1374 1405 1409 1413 1401 1390 1402 1415 1374 1287 1212 1165 1142 1148 1185 1222 1265 1308 1305 1274 1237 1246 1310 1402 1477 1505 1515 1526 1496 1467 1438 1409 1421 1434 1449
-170 1449 1463 1484 1533 1591 1604 1586 1567 1570 1573 1562 1505 1427 1350 1341 1332 1322 1313 1352 1390 1428 1467 1453 1439 1426 1412 1376 1339 1303 1266 1300 1334 1368 1403 1437 1471 1506 1542
-175 1542 1547 1578 1621 1617 1600 1582 1562 1542 1531 1520 1509 1497 1439 1381 1323 1265 1187 1108 1085 1062 1070 1079 1088 1097 1094 1091 1112 1188 1253 1318 1386 1454 1461 1468 1475 1482 1490 1499 1485 1415 1345
-180A345m3J2M0K8JJ8J7J6J6J6J5ppppN1N1M7M8L7j8p8p9n7n8klK1K0K1K1NNNNl6l6l6l6M
-185A355MMMklllj2j3j3j2j8j7P4P5O5O4J0J0j7j7j7j7L7L7J5m1l7j0j3m0l8l7m0l9l8l8J7
-189A236J7L9M0L9M0K0K0K0K0K3K4K3K3%J%%l7l7l8l7k3k4k3k4%%j%n4n4l0K5Q8Q9L8L7j8
-194A462j8o9o9m4J1L6L5L4L3L3L3M2M3j3j3L8L8L8L7j6j6l8r3j20r1j5M0M9K2Jk6k4k4k6
-198A310k6MMLMO3O3O3O4j4j4j4j4m3m2m3m2j4j4M1M2N5N5%%lmlln1n2MMK0K1JL0J0m5m1J3
-203A392M0O8O8M0oo2m7k0j5j4j3j2n1n0MMJ2J1J1J1j1j2j2j1N6N6JJrrrj0%%%jL8L7n1n1
-208A374k4K2K3k4o0o0o4o3L1L0L1L1l3l3mM2P3P3K0K1M1M2M1M1j0j0j0j0k9k9QL5L0j6m4
-212A486m4l2l1l2l2L0L0m3p0k1M3P4M7Pk1ppJ8J7J8J8j7j7j6j7m5m5j5L0M6M5M8M9k7k6k6
$$ plain form
-180 1345 1302 1314 1354 1382 1383 1401 1418 1434 1450 1466 1481 1474 1467 1460 1453 1504 1555 1602 1650 1687 1669 1591 1512 1455 1397 1395 1392 1413 1433 1454 1475 1480 1485 1490 1495 1459 1423 1387 1351 1355
-185 1355 1359 1363 1367 1365 1362 1359 1356 1344 1331 1318 1306 1288 1271 1345 1420 1485 1549 1559 1569 1552 1535 1518 1501 1538 1575 1590 1549 1512 1502 1489 1449 1411 1374 1334 1295 1257 1219 1236
-189 1236 1253 1292 1332 1371 1411 1431 1451 1471 1491 1514 1538 1561 1584 1584 1585 1585 1585 1548 1511 1473 1436 1413 1389 1366 1342 1342 1342 1341 1341 1287 1233 1203 1228 1316 1405 1443 1480 1462
-194 1462 1444 1375 1306 1262 1273 1309 1344 1378 1411 1444 1477 1519 1562 1549 1536 1574 1612 1650 1687 1671 1655 1617 1524 1404 1313 1298 1338 1387 1409 1410 1384 1360 1336 1310
-198 1310 1284 1288 1292 1295 1299 1362 1425 1488 1552 1538 1524 1510 1496 1453 1411 1368 1326 1312 1298 1339 1381 1436 1491 1491 1491 1488 1484 1481 1478 1427 1375 1379 1383 1403 1424 1425 1455 1465 1420 1379 1392
-203 1392 1432 1500 1568 1608 1602 1540 1493 1473 1458 1444 1431 1419 1368 1318 1322 1326 1338 1349 1360 1371 1360 1348 1336 1325 1381 1437 1438 1439 1430 1421 1412 1402 1402 1402 1402 1401 1439 1476 1425 1374
-208 1374 1350 1372 1395 1371 1311 1251 1187 1124 1155 1185 1216 1247 1214 1181 1177 1219 1292 1365 1385 1406 1447 1489 1530 1571 1561 1551 1541 1531 1502 1473 1481 1516 1546 1530 1486
-212 1486 1442 1410 1379 1347 1315 1345 1375 1332 1262 1241 1284 1358 1405 1412 1391 1384 1377 1395 1412 1430 1448 1431 1414 1398 1381 1336 1291 1276 1306 1352 1397 1445 1494 1467 1441 1415
-217A415k6qqpqqpqpJ6J6J6J6J8J9l7l7j4j4M1M1j%%jK9K9K9K9lkp6j04r3m6KL0K8K8L1L0
-222A348QQQRoonomnnnk1k2L3L3JJJJM3M2M3M2J7J7l8l9k0k1k1k1k7k6k6k6OOOOK4K5K5K5
-227A428j0rM5M6N2N2K4k3r0r0r1r1q4n7oL9O8O8Q3N6nn1k7k7J1J2J1J1MLLLk0k0k0k0PPP
-232A299Pk5k6k5k5l3l3l0l0K9P6O5L7N9N8N5N4L8J0l6q3p8j3L9L9K1K1K1K2k1k0J6M4M1o
-236A567l3l3n2n2n3n2l6l6l6l6l0k9O3O2N8N8N6N5L0j5m5m5m6m7m7m7PQL5L6N4N4jjJ3J3
-240A397O8O8J7J7j3j2l3o1p6k2L4L3J4m0m6j8rj0j9k0L5L6M7M7qqMLMLj2j3j3j3k6k7k6k7
-245A275%%j%L2L2L2L2L1L2L1L2n9n9mmj9j8j9j9OOOOj7j6m1m1m8PO7O8M9M8M8M9j5j4j5j5
-250A465j9j9j9k0J3J3J3J3K0K0K0K0K4K3K3K4m7m6j0J7j9p4q3n5rJ9N7N7L5j9n9l2J3J2k1
$$ plain form
-217 1415 1389 1381 1373 1366 1358 1350 1343 1335 1328 1344 1360 1376 1392 1410 1429 1392 1355 1341 1327 1368 1409 1408 1408 1408 1407 1436 1465 1494 1523 1520 1518 1442 1338 1245 1199 1201 1231 1259 1287 1318 1348
-222 1348 1356 1364 1372 1381 1375 1369 1364 1358 1354 1349 1344 1339 1318 1296 1329 1362 1363 1364 1365 1366 1409 1451 1494 1536 1553 1570 1532 1493 1473 1452 1431 1410 1383 1357 1331 1305 1311 1317 1323 1329 1353 1378 1403 1428
-227 1428 1418 1409 1454 1500 1552 1604 1628 1605 1515 1425 1334 1243 1159 1102 1096 1135 1203 1271 1354 1410 1405 1354 1327 1300 1311 1323 1334 1345 1349 1352 1355 1358 1338 1318 1298 1278 1285 1292 1299
-232 1299 1306 1281 1255 1230 1205 1172 1139 1109 1079 1108 1184 1249 1286 1345 1403 1458 1512 1550 1560 1524 1441 1363 1350 1389 1428 1449 1470 1491 1513 1492 1472 1488 1532 1573 1567
-236 1567 1534 1501 1449 1397 1344 1292 1256 1220 1184 1148 1118 1089 1152 1214 1272 1330 1386 1441 1471 1456 1411 1366 1320 1273 1226 1179 1186 1194 1229 1265 1319 1373 1372 1371 1384 1397
-240 1397 1465 1533 1550 1567 1554 1542 1509 1448 1372 1350 1384 1417 1431 1391 1345 1327 1318 1308 1289 1269 1304 1340 1387 1434 1426 1418 1422 1425 1429 1432 1420 1407 1394 1381 1355 1328 1302 1275
-245 1275 1275 1275 1274 1274 1306 1338 1370 1402 1433 1465 1496 1528 1469 1410 1406 1402 1383 1365 1346 1327 1333 1339 1345 1351 1334 1318 1277 1236 1188 1195 1262 1330 1379 1427 1475 1524 1509 1495 1480 1465
-250 1465 1446 1427 1408 1388 1401 1414 1427 1440 1460 1480 1500 1520 1544 1567 1590 1614 1567 1521 1511 1528 1509 1435 1352 1297 1288 1307 1364 1421 1456 1437 1378 1346 1359 1371 1350
-254A350n0m2J2N7Q3O1O1k9l0l0l0k9l0k1k1OPK4K3l1l1j4j4J4J4onnnj%%%N1N2K8k7rqJ6
-259A391J6k7k6k6k6m2m2m2m2J8J8J8J7JJJ%j8j8L7L6M2M2J5J4j7j7j7j7RRRJ0k6k5L0L0P5
-264A411P5K0K0l2l2n6n6JN6P7P8L1k3m7m8m6m6m2m3k1L5N8N8RRRQL1L1k4k4l1l1mlj9j8R
-268A380RN4N5j%k1k0p2p2l7K0M3M3J2J2J2J2J6J7J4J5l6o3m5m6k1PK9N7K7%J7J7jkjkqqL2
-273A444N9L1L0L1L2jjl9o6n0k3jK7M9M9J0j8n0p8p7n1j0J8J9rk4k4k7k6J5J6J5J5J0RJ0J0
-278A324K0K0J8J8Kk6o2o2m1K3N7K9j5j6j7j7kjJ5j2LL1J3J3%%J5j3k0k0nl2k2OM1M2K4lJ0
-283A338J1l2o0m4m4l8l8l6l7NL2P1P2L1L2L1L1J6J5J6J5k0k0J8M6K6jk3n1o8o9oM0K5lJ6
-287A297J6kjjjj2j1j2j1p0o9m1OL5L6L6L6K3k2LMj3j4j3j3K8K8K8K7%jjjk7k8K4K5K1k4n4
$$ plain form
-254 1350 1300 1258 1270 1327 1410 1471 1532 1503 1473 1443 1413 1384 1354 1333 1312 1318 1325 1349 1372 1341 1310 1296 1282 1296 1310 1304 1299 1294 1289 1288 1288 1288 1288 1339 1391 1419 1392 1383 1375 1391
-259 1391 1407 1380 1354 1328 1302 1260 1218 1176 1134 1152 1170 1188 1205 1206 1207 1208 1208 1190 1172 1209 1245 1287 1329 1344 1358 1341 1324 1307 1290 1299 1308 1317 1327 1301 1276 1306 1336 1411
-264 1411 1486 1506 1526 1494 1462 1406 1350 1351 1407 1484 1562 1593 1570 1523 1475 1429 1383 1341 1298 1277 1312 1370 1428 1437 1446 1455 1463 1494 1525 1501 1477 1446 1415 1411 1408 1389 1371 1380
-268 1380 1389 1443 1498 1497 1497 1476 1456 1384 1312 1275 1295 1338 1381 1393 1405 1417 1429 1445 1462 1476 1491 1455 1392 1347 1301 1280 1287 1316 1373 1400 1400 1417 1434 1433 1431 1430 1428 1420 1412 1444
-273 1444 1503 1534 1564 1595 1627 1626 1625 1586 1520 1470 1447 1446 1473 1522 1571 1581 1563 1513 1435 1358 1307 1297 1315 1334 1325 1301 1277 1250 1224 1239 1255 1270 1285 1295 1304 1314 1324
-278 1324 1344 1364 1382 1400 1402 1376 1314 1252 1211 1234 1291 1320 1305 1289 1272 1255 1253 1252 1267 1255 1258 1289 1302 1315 1315 1315 1330 1317 1297 1277 1272 1240 1218 1224 1265 1307 1331 1328 1338
-283 1338 1349 1317 1257 1213 1169 1131 1093 1057 1020 1025 1057 1128 1200 1231 1263 1294 1325 1341 1356 1372 1387 1367 1347 1365 1411 1437 1436 1413 1362 1294 1225 1219 1259 1284 1281 1297
-287 1297 1313 1311 1310 1309 1308 1296 1285 1273 1262 1192 1123 1082 1088 1123 1159 1195 1231 1254 1232 1235 1239 1226 1212 1199 1186 1214 1242 1270 1297 1297 1296 1295 1294 1267 1239 1263 1288 1309 1285 1231
-292A231n3%%L7O5R0M4ml2l9l9m0m1j4j4j6j6nl2m2NO2Q9R1O3M1J4j0l7rK0KKk2k2k2k1k2
-297A304k2k1k2j7j8j7j7L8L9L9L9L6L6k0j9k0k1j7j8j5L1J9ql3o0o1l2KK9J6J5L1L2L1L1
-301A310J3J3J5J5O7R5O1lj9j8k2k2j4j3K3N0Lm3l0mJ3J3m1m0rrrrqpN6J01P2K5k2n0l0l0
-305A493l2l2m4m4m3m4k0k1j8j8K1O7N6K9J5J5J4J3PPOPm4m4m4m4j2j3j3j2LMN5N6M6Jk8k9
-310A316K6K6K6K6J2J1J2J1j9j9L3L3Km3l3nlln4n5l2nQl9o1l4J3O0Q8Q8K7j9qK0JKk8k7K8
-315A382K7N6N7N6N6j9j9j9j8l0k9k9l0m6m7QRK7K8K8K8k4k3k4k3L9M0j5j6KKKKjjkjk1k1
-320A391k1k1jkjjK1K1l4l4j7j7j7j7l8l8l8l8K5K5K5K4L4L3n8n9k1k0k1k0O1O1O1O1O0O0
-324A429NNj6j5j6j5N5N5Jo3q3n5j9j9j7j7L9L8KKKLnmL2O0K8j9m3m3J1N8M6K0qqj0rm2m2
$$ plain form
-292 1231 1178 1178 1178 1215 1280 1370 1414 1410 1378 1339 1300 1260 1219 1205 1191 1175 1159 1154 1122 1080 1085 1147 1236 1327 1390 1431 1445 1435 1398 1389 1409 1411 1413 1391 1369 1347 1326 1304
-297 1304 1282 1261 1239 1222 1204 1187 1170 1208 1247 1286 1325 1361 1397 1377 1358 1338 1317 1300 1282 1267 1298 1317 1309 1276 1216 1155 1123 1125 1154 1170 1185 1216 1248 1279 1310
-301 1310 1323 1336 1351 1366 1433 1528 1589 1586 1567 1549 1527 1505 1491 1478 1501 1551 1554 1511 1481 1477 1490 1503 1462 1422 1413 1404 1395 1386 1378 1371 1427 1528 1600 1625 1603 1553 1523 1493
-305 1493 1461 1429 1385 1341 1298 1254 1234 1213 1195 1177 1198 1265 1321 1350 1365 1380 1394 1407 1414 1421 1427 1434 1390 1346 1302 1258 1246 1233 1220 1208 1211 1215 1270 1326 1372 1373 1345 1316
-310 1316 1342 1368 1394 1420 1432 1443 1455 1466 1447 1428 1461 1494 1496 1453 1420 1415 1412 1409 1355 1300 1268 1263 1271 1232 1171 1137 1150 1210 1298 1386 1413 1394 1386 1406 1407 1409 1381 1354 1382
-315 1382 1409 1465 1522 1578 1634 1615 1596 1577 1559 1529 1500 1471 1441 1395 1348 1356 1365 1392 1420 1448 1476 1452 1429 1405 1382 1421 1461 1446 1430 1432 1434 1436 1438 1437 1436 1434 1433 1412 1391
-320 1391 1370 1349 1348 1346 1345 1344 1365 1386 1352 1318 1301 1284 1267 1250 1212 1174 1136 1098 1123 1148 1173 1197 1231 1264 1206 1147 1126 1106 1085 1065 1126 1187 1248 1309 1369 1429
-324 1429 1434 1439 1423 1408 1392 1377 1432 1487 1488 1425 1342 1287 1268 1249 1232 1215 1254 1292 1294 1296 1298 1301 1296 1292 1324 1384 1412 1393 1350 1307 1318 1376 1422 1442 1434 1426 1416 1407 1365 1323
-329A323m1m2J1J0J1J1J8J9l6l6j5j4j3j2n2k4K5P1O6L9KLj4j3j3j3j6j6Lk5k7J9O2L5j%k
-333A303lj8j9j8j8k5k5K9K9lk9j8L7Q0Q0K9K8KKJKl5l5l6l5K5K4K5K4J0J0J0J0mmmmj3j4
-338A400j3j4j4j3j4j4K5K5K5K5L6L5J1m4o5o5rM6L9J2MLK0K0ppk2k1J4M2M2j4p2p3k3k3L1
-343A328L2M2M2j4j3k9k9n6n6k3k3L2L2J2J2J1J2QPj9k0m9m9OOk4k4k4k4J1J2J1J2K7K7K7
-347A233K7J7J7J7J7rro1o1OO0L3k3m4m5QPOOL3L4L4L4k1k1J1J2J2J1QPPPK8K8k8k7n9o0m
-352A248mKLKLLLLLN1N1mml0l0K5K6J3J4J3J4ooooL8L7J0l5n5k7j7j8l1l0K5K5N6N6qn4l3
-357A320oL1L1L7L7L8L7J6J6J7J6KKk5k6m8m7PPj8j8j8j8n9n8l1J6J7j0j9j9j2j3o4o5j5L1
-362A089K2ol7j0K9K8PPPPJ6J5j1j2j3j3n0p7p3k8M4R1R9N3Pk0j2J5J7j1J1N7J00P2%Jkjn0
$$ plain form
-329 1323 1282 1240 1251 1261 1272 1283 1301 1320 1284 1248 1233 1219 1206 1194 1142 1118 1143 1214 1280 1319 1321 1324 1310 1297 1284 1271 1255 1239 1242 1217 1190 1209 1271 1306 1305 1305 1303
-333 1303 1300 1282 1263 1245 1227 1202 1177 1206 1235 1232 1203 1185 1222 1302 1382 1411 1439 1441 1443 1444 1446 1411 1376 1340 1305 1330 1354 1379 1403 1413 1423 1433 1443 1439 1435 1431 1427 1414 1400
-338 1400 1387 1373 1359 1346 1332 1318 1343 1368 1393 1418 1454 1489 1500 1456 1391 1326 1317 1363 1402 1414 1418 1421 1441 1461 1454 1447 1425 1404 1418 1460 1502 1488 1416 1343 1320 1297 1328
-343 1328 1360 1402 1444 1430 1417 1388 1359 1303 1247 1224 1201 1233 1265 1277 1289 1300 1312 1320 1327 1308 1288 1239 1190 1196 1202 1178 1154 1130 1106 1117 1129 1140 1152 1179 1206 1233
-347 1233 1260 1277 1294 1311 1328 1319 1310 1249 1188 1194 1254 1287 1264 1220 1175 1183 1190 1196 1202 1235 1269 1303 1337 1316 1295 1306 1318 1330 1341 1349 1356 1363 1370 1398 1426 1398 1371 1312 1252 1248
-352 1248 1244 1246 1249 1251 1254 1257 1260 1263 1266 1317 1368 1364 1360 1330 1300 1325 1351 1364 1378 1391 1405 1399 1393 1387 1381 1419 1456 1466 1431 1376 1349 1332 1314 1283 1253 1278 1303 1359 1415 1407 1353 1320
-357 1320 1314 1345 1376 1413 1450 1488 1525 1541 1557 1574 1590 1592 1594 1569 1543 1495 1448 1455 1462 1444 1426 1408 1390 1331 1273 1242 1258 1275 1265 1246 1227 1215 1202 1138 1073 1058 1089
-362 1089 1111 1105 1068 1058 1087 1115 1122 1129 1136 1143 1159 1174 1163 1151 1138 1125 1075 998 925 897 941 1032 1131 1184 1191 1171 1159 1174 1191 1180 1191 1248 1348 1420 1420 1421 1419 1418 1368
-366A368m9m9m9qqqqk4k5k1k1K3O9N9L1l2l2K1K1K3K2K2K2rrrrL3L2L2L3K1K0K1K1k0k0k1
-371A463k0OPOOo2o3o2o3POOPpqpqj7j7j8j7o2o2ppL7L7L7L7K6K7K7K7K4K5K5K5J0J1J1J1
-376A404llllj1j2M4M4QQQQo3o3o3o3n7n6jkK8K7K8K7J4J4J4J4l1l1K4K4nnk4Mk1o6o2j7K6
-381A103P2Q5K1j8j8k2k3JJ%JkjN3N4L4L4k1k1k8k8k8k8kjkkrrrqQQQRK5K6l0l0j0j1Pk0l2
-387A137J3M1M1J7J8J8J7k6k7JM7O5L8j9m6j6J2lmK5N3O3J7l3l3l6l6j8j8j8j8k8k8k9k8l2
-391A127l2K3K3K5K4K4K4NNNNrropJ6O2O2J6k7k8K2K1k1o7n6k7J0L9K4K5k1k0k0k0n2n1MM
-396A122j1j0j1j0J6J6J5J6QPMLmo0m3j5L5O2M7M6P9N1Qm7p7n0K8Q2R1O4Ok1opqqk7k8k8k7
-401A308NOLMml1m9PL2Nl2l1OOOOM9M9m3m2m2m1m1m2LLLLj1j1j1j1j4j4j2j2L7O6P9K3ml1
$$ plain form
-366 1368 1319 1270 1221 1213 1205 1197 1189 1165 1140 1119 1098 1121 1190 1249 1280 1248 1216 1237 1258 1281 1303 1325 1347 1338 1329 1320 1311 1344 1376 1408 1441 1462 1482 1503 1524 1504 1484 1463
-371 1463 1443 1449 1456 1462 1468 1406 1343 1281 1218 1225 1231 1237 1244 1237 1229 1222 1214 1197 1180 1162 1145 1083 1021 1014 1007 1044 1081 1118 1155 1181 1208 1235 1262 1286 1311 1336 1361 1371 1382 1393 1404
-376 1404 1401 1398 1395 1392 1381 1369 1413 1457 1465 1473 1481 1489 1426 1363 1300 1237 1180 1124 1123 1121 1149 1176 1204 1231 1245 1259 1273 1287 1256 1225 1249 1273 1268 1263 1239 1243 1222 1156 1094 1077 1103
-381 1103 1175 1260 1281 1263 1245 1223 1200 1201 1202 1202 1203 1201 1200 1253 1307 1341 1375 1354 1333 1305 1277 1249 1221 1219 1218 1216 1214 1205 1196 1187 1179 1187 1195 1203 1212 1237 1263 1233 1203 1193 1182 1189 1169 1137
-387 1137 1150 1191 1232 1249 1267 1285 1302 1276 1249 1250 1297 1362 1400 1381 1335 1319 1331 1328 1324 1349 1402 1465 1482 1449 1416 1380 1344 1326 1308 1290 1272 1244 1216 1187 1159 1127
-391 1127 1095 1118 1141 1166 1190 1214 1238 1243 1248 1253 1258 1249 1240 1234 1227 1243 1305 1367 1383 1356 1328 1350 1371 1350 1283 1227 1200 1210 1249 1273 1298 1277 1257 1237 1217 1165 1114 1118 1122
-396 1122 1111 1101 1090 1080 1096 1112 1127 1143 1151 1158 1162 1165 1161 1101 1058 1043 1078 1140 1187 1233 1312 1363 1371 1324 1247 1197 1225 1307 1398 1462 1468 1447 1441 1434 1426 1418 1391 1363 1335 1308
-401 1308 1313 1319 1322 1326 1322 1291 1242 1249 1281 1286 1254 1223 1229 1235 1241 1247 1296 1345 1302 1260 1218 1177 1136 1094 1097 1100 1103 1106 1095 1084 1073 1062 1048 1034 1022 1010 1047 1113 1192 1215 1211 1180
-406A180n0ML7L7Mk3j5M1P4M8Nn0l8j1j3m0k3k3kkjko1o2n7n8n1LM7P5M1J3L0L0K1K0K0K1
-410A169llllJ0J1J1J1j2j2j2j1j2j2j2j1PQQQK1K2K1K2PPQPooqqo6r3j02n6PL4K1K2O7O7
-415A125O7O8nonnJ1J1m5m4K8K8K8K7PPOPL5L6L5L5j2j3o7o8k3k3k1k1L8O6P6L1k9l0l2l2
-420A291j7j8j7j8K4K4K4K3K1K0J8J7J7l0p4m7ppnnRQRRP4P4J8m6j04j03n3n3j3j4j0j1J9
-425A047O6N4K8J6J6O7O7N1Ok4k4k2k2k3k2j2j2j2j2klJ5j3oK2KLj9m5k9k9j4J4%%K2N1L3
-429A235L3L3Nj7m5n2k5lK5M4M4N9L2l8o6m9n0l9PL6L7OPNNk4n1o0j4N2P9R1M5j4m2k9k9o0
-434A173n9k9J7M7P4N9N9M4jl1l1j1j1k7JL2L2pl3k0j9k1k1m6m6m6m6m6m5j7L0O0O1K3mJ4
-438A109J4J2J2J5J4L0Kpok4LM5M5J9k6n1k4K2O8N5K7Ok2k2k1k4k3J7J7M1mn8q6q8o1%%j4
$$ plain form
-406 1180 1130 1134 1171 1208 1212 1189 1174 1215 1289 1337 1342 1292 1254 1243 1230 1190 1167 1144 1142 1140 1139 1137 1076 1014 957 899 848 851 898 973 1014 1027 1057 1087 1108 1128 1148 1169
-410 1169 1166 1163 1160 1157 1167 1178 1189 1200 1188 1176 1164 1153 1141 1129 1117 1106 1113 1121 1129 1137 1158 1180 1201 1223 1230 1237 1245 1252 1246 1240 1232 1224 1158 1065 963 907 914 948 969 991 1058 1125
-415 1125 1192 1260 1255 1249 1244 1239 1250 1261 1216 1172 1200 1228 1256 1283 1290 1297 1303 1310 1345 1381 1416 1451 1439 1426 1359 1291 1268 1245 1224 1203 1241 1307 1383 1414 1385 1355 1323 1291
-420 1291 1274 1256 1239 1221 1245 1269 1293 1316 1337 1357 1375 1392 1409 1379 1305 1258 1251 1244 1239 1234 1243 1251 1260 1269 1343 1417 1435 1389 1285 1182 1129 1076 1063 1049 1039 1028 1047
-425 1047 1113 1167 1195 1211 1227 1294 1361 1412 1418 1394 1370 1348 1326 1303 1281 1269 1257 1245 1233 1231 1228 1243 1230 1224 1246 1248 1251 1232 1187 1158 1129 1115 1129 1129 1129 1151 1202 1235
-429 1235 1268 1301 1306 1289 1244 1192 1167 1164 1189 1233 1277 1336 1368 1330 1264 1215 1165 1126 1133 1169 1206 1212 1219 1224 1229 1205 1154 1094 1080 1132 1211 1302 1347 1333 1291 1262 1233 1173
-434 1173 1114 1085 1102 1149 1223 1282 1341 1385 1384 1353 1322 1311 1300 1273 1274 1306 1338 1331 1298 1278 1259 1238 1217 1171 1125 1079 1033 987 942 925 955 1015 1076 1099 1095 1109
-438 1109 1123 1135 1147 1162 1176 1206 1208 1201 1195 1171 1174 1219 1264 1283 1257 1206 1182 1204 1272 1327 1354 1360 1338 1316 1295 1271 1248 1265 1282 1323 1319 1261 1175 1087 1026 1026 1026 1012
-443A012J4N0N0J5j4J5M3K5K6MMNMk8k8K7K7J9J9J9J9k2k1k0k0l7j0K8K8L3Ol3l2NL2J5J5
-448A294J8j0l2o0m8k0J8J8K2K2PL5J9J8K1K1RJ0m5m6k4k4pl4o1l4K6N3M3M4Pk0j9QM5M5l
-452A316l0l0lnmllPQPPK0K0j8m6n9l2OOJ6J6J6J6mmnnj4m1m1j4L4L4kk9l9j0K7K7QQQRqq
-458A159qql1l1l0l1J3J2J3J3J2J3J3J2K2K2K2K2m2m1J4J4K1K1K1K1l5l5l5l5K9K9K9K9j2
-462A202j3M3M3N8N8KLn6n5n6n6k7k8lN1P9Q0j0rrj0l0q5p4j9KKj9k0L6L6M1M1j4j4k9k9k
-466A110jo5o5m1J4L9L9J9l5m6j9N7J12R6M1j6j6n6n5j6P5J07Q0Ln1l9m0j5j6mml1l2J0J0
-471A149J0J1onK1K2OOM2P0M5rm7k0M2M1J6J6m5m6p2p3k3k3L2L2j3j3m0m1J0J0L3L4K3l2n7
-475A106n6lklkJ9J9M7M7N1N0K7k8o8o7rM5N9N9QPl6l7l6l7l9l8j5M0P3P2N1lppj0j1k0k0
$$ plain form
-443 1012 1026 1076 1126 1141 1127 1142 1185 1210 1236 1240 1244 1249 1253 1225 1197 1224 1251 1270 1289 1308 1327 1305 1284 1264 1244 1207 1197 1225 1253 1286 1292 1259 1227 1232 1264 1279 1294
-448 1294 1312 1302 1270 1210 1162 1142 1160 1178 1200 1222 1229 1264 1283 1301 1322 1343 1352 1362 1317 1271 1247 1223 1216 1182 1121 1087 1113 1166 1209 1253 1260 1240 1221 1229 1274 1319 1316
-452 1316 1286 1256 1253 1248 1244 1241 1238 1245 1253 1260 1267 1287 1307 1289 1243 1184 1152 1158 1164 1180 1196 1212 1228 1224 1220 1215 1210 1196 1155 1114 1100 1134 1168 1166 1137 1098 1088 1115 1142 1150 1158 1166 1175 1167 1159
-458 1159 1151 1143 1112 1081 1051 1020 1033 1045 1058 1071 1083 1096 1109 1121 1143 1165 1187 1209 1167 1126 1140 1154 1175 1196 1217 1238 1203 1168 1133 1098 1127 1156 1185 1214 1202
-462 1202 1189 1232 1275 1333 1391 1393 1396 1340 1285 1229 1173 1146 1118 1115 1166 1245 1325 1315 1306 1297 1287 1257 1172 1098 1079 1081 1083 1064 1044 1080 1116 1157 1198 1184 1170 1141 1112 1110
-466 1110 1109 1044 979 938 952 991 1030 1049 1014 968 949 1006 1118 1214 1255 1239 1223 1167 1112 1096 1171 1278 1358 1361 1310 1271 1231 1216 1200 1196 1192 1161 1129 1139 1149
-471 1149 1159 1170 1164 1159 1180 1202 1208 1214 1256 1326 1371 1362 1315 1295 1337 1378 1394 1410 1365 1319 1247 1174 1151 1128 1160 1192 1179 1166 1126 1085 1095 1105 1138 1172 1195 1163 1106
-475 1106 1050 1047 1045 1042 1040 1059 1078 1125 1172 1223 1273 1300 1272 1204 1137 1128 1173 1232 1291 1299 1306 1270 1233 1197 1160 1121 1083 1068 1108 1181 1253 1304 1301 1294 1287 1277 1266 1246 1226
-480A226k1k0ONk2k2ppo3o2l4l3K1K1L5L5QPM2M2J7l7l0l0ooLMMLK8K7k8k8j0j1j1j0J3J4
-485A063J4J3K1K0K1K0KKKKo0n9nmOOL4L4M1M1j5j4%JK8K8j3j4j4j3MNNNl3l3l3l3qrM7M7
-490A152M4M4M1M1J7l7p7n0J%KKK3K3l2l3m6m6RRk6k6k6k7L2L1L1L1QQO3O3N2N3lkk6k7K9
-495A325K9M5M5M5M4l0l0l0l0KKKKm8m7m3m4pM7L2NMMKLK5K5K6K5k4k4k5k4m1m2J4J3j0j0
-500A257j0j0k9l0l1l1J4j3k9K7O2O3k6k6k7k7K7K8K3K4K3K3PQONJ6j2n6j11j21r4n2MO2O2
-504A006O6O5J02J02L9j6o8r5r9p1j3j2j1j1K1K2K1K1K5K6K5K5l4l5l4l4L7L7L7L7N9N9jn7
-508A241q4q3NMj1j1j1j2J7J6J7J6j5j6j6j5nmmnLLKLK3K3K3K3J9K0J9K0J7J7l8l8mlmlm2
-513A107m2J3J3K9K9K5K6L7j8m2m2M5M5M2M2Pm8l2njjJJM0L9L9L9J1J0m4m5pponJ6M3Nm9p8
$$ plain form
-480 1226 1205 1185 1191 1196 1174 1152 1145 1138 1075 1013 979 946 967 988 1023 1058 1066 1073 1115 1157 1174 1137 1107 1077 1071 1065 1068 1072 1076 1079 1107 1134 1106 1078 1068 1057 1046 1036 1049 1063
-485 1063 1077 1090 1111 1131 1152 1172 1174 1176 1178 1180 1120 1061 1056 1052 1058 1064 1098 1132 1173 1214 1199 1185 1185 1186 1214 1242 1229 1215 1201 1188 1192 1197 1202 1207 1174 1141 1108 1075 1067 1058 1105 1152
-490 1152 1196 1240 1281 1322 1339 1302 1225 1175 1176 1176 1178 1180 1203 1226 1194 1161 1115 1069 1078 1087 1061 1035 1009 982 1014 1045 1076 1107 1115 1123 1186 1249 1301 1354 1351 1349 1323 1296 1325
-495 1325 1354 1399 1444 1489 1533 1503 1473 1443 1413 1415 1417 1419 1421 1373 1326 1283 1239 1232 1279 1311 1316 1320 1324 1326 1329 1354 1379 1405 1430 1406 1382 1357 1333 1292 1250 1264 1277 1267 1257
-500 1257 1247 1237 1208 1178 1147 1116 1130 1117 1088 1115 1177 1240 1214 1188 1161 1134 1161 1189 1212 1236 1259 1282 1289 1297 1303 1308 1324 1312 1256 1145 1024 930 878 882 944 1006
-504 1006 1072 1137 1239 1341 1380 1364 1296 1201 1102 1031 1018 1006 995 984 1005 1027 1048 1069 1094 1120 1145 1170 1136 1101 1067 1033 1070 1107 1144 1181 1240 1299 1298 1241
-508 1241 1157 1074 1079 1083 1072 1061 1050 1038 1055 1071 1088 1104 1089 1073 1057 1042 1037 1033 1029 1024 1027 1030 1032 1035 1058 1081 1104 1127 1146 1166 1185 1205 1222 1239 1201 1163 1159 1156 1152 1149 1107
-513 1107 1065 1078 1091 1120 1149 1174 1200 1237 1219 1177 1135 1180 1225 1267 1309 1316 1268 1236 1231 1230 1229 1230 1231 1271 1310 1349 1388 1399 1409 1365 1320 1313 1306 1300 1295 1311 1354 1359 1310 1232
-518A232n1PL4J6J6J9J9J2L9N5%l7l6m0m0j5j5j5j5jjjkl5l6l2l2%N6R3O6Rj8nnj3j4j3j4
-523A187n4n5%%J1J0m4m5m3m3J1J2nonnk5k5L1L0J0J0O5O5N5N5N2N2K0l5r6r6q4q4k3L2Q9
-527A024R0L7L8K7K8N8Lm7m7n1n0K5K5K4K5K5K5K4K3j2l9n5%M0M0j2j1k7k6k7k7KLKKlllk
-532A148J4J5J4J4P8P8J7l8p9q0n8mJ8J7K1K1kkkjJ7J8l7l7m1m0J4J5K6K5Mn2m6j9J8J7J9
-537A090J9K0J9LLMLm3m3pK1po2m3j5J3M1M3J5%%jkP0P1P0P1qpqpj9j8j8j8mnmmL6L7L6L7
-542A379jjn7n6qrqrk6k5k6k6K5K4K5K4J0J0j1o6p8k2N5Q2O2L5J0j7n1p9q0n3n0n1k5L1O9
-546A006P0P0P0O7J1l1o0k1OqqnN0P4P4J1J0J1J1j2j2j3j2J6J5l9l9o3o2pqj6j7j7j7k3k4
-551A058jN4P1M5j3m1l8l8J5J5N6N6JKk1k0k1k1m1m2J4J3ppppK1K0l1l2K3O8N6K9ml1j8j7
$$ plain form
-518 1232 1181 1188 1222 1238 1254 1273 1292 1304 1343 1398 1398 1361 1325 1285 1245 1230 1215 1200 1185 1184 1183 1182 1180 1145 1109 1077 1045 1045 1101 1194 1260 1269 1251 1246 1241 1228 1214 1201 1187
-523 1187 1133 1078 1078 1078 1089 1099 1055 1010 967 924 935 947 942 936 931 926 901 876 907 937 947 957 1022 1087 1142 1197 1249 1301 1321 1286 1190 1094 1010 926 903 935 1024
-527 1024 1114 1151 1189 1216 1244 1302 1305 1258 1211 1160 1110 1135 1160 1184 1209 1234 1259 1283 1306 1294 1255 1200 1200 1240 1280 1268 1257 1230 1204 1177 1150 1152 1155 1157 1159 1156 1153 1150 1148
-532 1148 1162 1177 1191 1205 1283 1361 1378 1340 1261 1181 1123 1119 1137 1154 1175 1196 1194 1192 1190 1189 1206 1224 1187 1150 1109 1069 1083 1098 1124 1149 1153 1101 1055 1036 1054 1071 1090
-537 1090 1109 1129 1148 1151 1154 1158 1161 1118 1075 1068 1089 1082 1020 977 962 975 1016 1059 1074 1074 1074 1073 1071 1141 1212 1282 1353 1345 1338 1330 1323 1304 1286 1268 1250 1246 1241 1237 1233 1269 1306 1342 1379
-542 1379 1378 1377 1320 1264 1256 1247 1239 1230 1204 1179 1153 1127 1152 1176 1201 1225 1235 1245 1234 1168 1090 1068 1123 1205 1267 1302 1312 1295 1244 1165 1085 1032 982 931 906 937 1006
-546 1006 1076 1146 1216 1283 1294 1263 1203 1182 1188 1180 1172 1167 1217 1291 1365 1376 1386 1397 1408 1396 1384 1371 1359 1375 1390 1351 1312 1249 1187 1180 1172 1156 1139 1122 1105 1082 1058
-551 1058 1057 1111 1182 1227 1214 1173 1135 1097 1112 1127 1183 1239 1240 1242 1221 1201 1180 1159 1118 1076 1090 1103 1096 1089 1082 1075 1096 1116 1085 1053 1076 1144 1200 1229 1225 1194 1176 1159
-556A159l3l3l3l3opopM1M0M1M1J2J2j7o3o8o7j5j6JJK8K8O3O3PQj0j0J7J8j9j9j9j8L5L6
-560A152k0j9lkK5K5k4k5LKN3N4K5K6RRj9j8j2j2j2j1j0j0j1j0L2L2MMj1j2M1M1Ql7o7o6o3
-565A071o2qpQRRQK4K4K4K4K4K4K4K4KLKKj2j1j2j1K3K3L6Ql5q0q3l6j5j5j2j2K5K6K6K6N1
-570A139N2mmool3l3o5o4o1j5L0N8O0L3K3K4K1K2j1j1j0j1j6j6j6j6L4L4L5L4RJ0RJ0K3K3
-574A285K3K3l8l8l8l8j8j9j8j8rro4o4m1m1J4J4M3M2M3M3O9P0O7K2n8n8no%%k7k7NOOOJ7
-579A164J8M2M2J3l3o2o2n7n6kjL4L5L4L4N6N6pn2l9QK1nk3k2k4k4N0N1N1N1RRJ0Rlklln4
-584A263n3n3n4L6L6L6L5nonom2m3m2m3jjkjL1L0L1L0J7J7J7J7KLKLj2j1j1j2j6j7j7j7J4
-589A150J4J3J4L2L2NNo2o1ooonnoK7K7K4K3ln0p6p6m2NL3L4LKM0O7P5K9l5l5K8K8k5k5k9
$$ plain form
-556 1159 1126 1093 1060 1027 1021 1014 1008 1001 1042 1082 1123 1164 1176 1188 1171 1108 1040 973 958 942 943 944 972 1000 1063 1126 1133 1141 1131 1121 1138 1156 1137 1118 1099 1081 1116 1152
-560 1152 1132 1113 1110 1108 1133 1158 1134 1109 1112 1114 1167 1221 1246 1272 1281 1290 1271 1253 1241 1229 1217 1206 1196 1186 1175 1165 1197 1229 1233 1237 1226 1214 1255 1296 1304 1267 1200 1134 1071
-565 1071 1009 1001 994 1002 1011 1020 1028 1052 1076 1100 1124 1148 1172 1196 1220 1222 1225 1227 1229 1217 1206 1194 1183 1206 1229 1265 1273 1238 1158 1075 1039 1024 1009 997 985 1010 1036 1062 1088 1139
-570 1139 1191 1187 1183 1177 1171 1138 1105 1040 976 915 900 930 988 1048 1081 1104 1128 1149 1171 1160 1149 1139 1128 1112 1096 1080 1064 1098 1132 1167 1201 1210 1220 1229 1239 1262 1285
-574 1285 1308 1331 1293 1255 1217 1179 1161 1142 1124 1106 1097 1088 1024 960 919 878 892 906 949 991 1034 1077 1146 1216 1283 1305 1247 1189 1184 1178 1178 1178 1151 1124 1129 1135 1141 1147 1164
-579 1164 1182 1224 1266 1279 1246 1184 1122 1065 1009 1007 1006 1040 1075 1109 1143 1199 1255 1248 1196 1157 1165 1186 1181 1158 1136 1112 1088 1138 1189 1240 1291 1300 1309 1319 1328 1325 1323 1320 1317 1263
-584 1263 1210 1157 1103 1139 1175 1211 1246 1241 1235 1230 1224 1182 1139 1097 1054 1053 1052 1050 1049 1080 1110 1141 1171 1188 1205 1222 1239 1241 1244 1246 1249 1237 1226 1215 1203 1187 1170 1153 1136 1150
-589 1150 1164 1177 1191 1223 1255 1260 1265 1203 1142 1136 1130 1124 1119 1114 1108 1135 1162 1186 1209 1206 1156 1080 1004 962 967 1000 1034 1037 1039 1079 1146 1221 1250 1215 1180 1208 1236 1211 1186 1157
-594A157kRl6o4o4l7RN6N7L1L2j2j2J6J5rrl7l6k2k1k1k2RRRRj2j2j2j2K0K0K0K0oooo%%%
-599A022%n6n7NN9P7P6K5K5L0K9K9K9k6k5KKM6M6K2l3q4q4o4qL0L0L3L3J4J4J4J4l0l0l1l0
-604A148j1j2l5l5k7K8N2N2JKK9K9M9M9j2o7q0p9n8mL9L8M2M2l3l2l3l3K9K9K9K9J6J5J5J6
-608A227o7o6o7o6L0K9L0L0J6J5J6J6L7L6L7L7PQk1k0k5k6L0L0M8M7ppj4j4p0o9q3q3RRN2
-612A091N2mlk3k3n0n1o9p0j4j4K4K4K4K4J1J0J0J1L6L7j9j9k7k7k6k7LKLKR8R7O8K2J6J5
-617A214J3J3K1K0K1K1o5o4o5o5m1m2J3J4N0N0norj0rj0LLLKk8k8O4O3J0J0J0J0j7j7J9M8
-622A214K5k1m8m8k4k3k4k3k2k2k2k2K7K6K6K7K6K6K6K6P0P0M1nk7k8l0l1j2j2j2j2o4o4%
-626A034M6M5J8j9k0l8l9l9l9m9m9M3M2N6N6JJMMMNM1M1j3j4JJKJj7j7j7j7J9J9J8J9P0P1
$$ plain form
-594 1157 1155 1164 1128 1064 1000 963 972 1028 1085 1116 1148 1136 1124 1140 1155 1146 1137 1100 1064 1042 1021 1000 978 987 996 1005 1014 1002 990 978 966 986 1006 1026 1046 1040 1034 1028 1022 1022 1022 1022
-599 1022 1022 966 909 914 973 1050 1126 1151 1176 1206 1235 1264 1293 1267 1242 1244 1246 1292 1338 1360 1327 1243 1159 1095 1087 1117 1147 1180 1213 1227 1241 1255 1269 1239 1209 1178 1148
-604 1148 1137 1125 1090 1055 1028 1056 1108 1160 1161 1163 1192 1221 1270 1319 1307 1240 1160 1081 1023 1019 1058 1096 1138 1180 1147 1115 1082 1049 1078 1107 1136 1165 1181 1196 1211 1227
-608 1227 1160 1094 1027 961 991 1020 1050 1080 1096 1111 1127 1143 1180 1216 1253 1290 1297 1305 1284 1264 1239 1213 1243 1273 1321 1368 1361 1354 1340 1326 1256 1187 1104 1021 1030 1039 1091
-612 1091 1143 1139 1136 1113 1090 1040 989 920 850 836 822 846 870 894 918 929 939 949 960 996 1033 1014 995 968 941 915 888 891 893 896 898 996 1093 1161 1183 1199 1214
-617 1214 1227 1240 1261 1281 1302 1323 1258 1194 1129 1064 1023 981 994 1008 1058 1108 1103 1097 1088 1078 1069 1059 1062 1065 1068 1070 1042 1014 1078 1141 1151 1161 1171 1181 1164 1147 1166 1214
-622 1214 1239 1218 1170 1122 1098 1075 1051 1028 1006 984 962 940 967 993 1019 1046 1072 1098 1124 1150 1220 1290 1331 1326 1299 1271 1241 1210 1198 1186 1174 1162 1098 1034 1034
-626 1034 1080 1125 1143 1124 1104 1066 1027 988 949 900 851 894 936 992 1048 1049 1050 1054 1058 1062 1067 1108 1149 1136 1122 1123 1124 1126 1127 1110 1093 1076 1059 1078 1097 1115 1134 1204 1275
-631A275M6qn4n3kkOONOm8m8m8m9JJ%JL5L5L5L6J9J9N0nm0l9J2J2l3l3l4l3j4j3j4j4KJKJ
-636A022K5K6l0k9K8K8K9K8J6J7l8l9j7j7j7j7j7j7j7j8PPm5m5o2pN4N3M3M2M2M3J2J2l9l9
-640A024mN0N1nn4n4l3K2N0N1N1N0J0m6j5j5mnmmnmnmOPPOk3k3k3k4N8N7N7N8RRRJ0m7m7m7
-645A157m7JJJJj2j3j3j3k7k8K7K8J3J2J3J3J3J2J3J3n6n5j%K1K2K1K1lmmlJ2J3J2J3QRRR
-650A209k6k5k6k6ONNNk9k9K6K6K7K7k8k8rqM3M3m5r9q4n7k4k4k2k2O1O2N8N8N5Jn7n7KN7
-655A051K6K6M4M4M4M4k9k9m8k0j2o7o5j1P1P1K0J9L1L1L1L1K0K0l5l5n1n1MML4L4L4L4k5
-659A290k4k5k4%JJJPQQPJ7J7J7J7N8N8ln7j17j16j32j05n2MN0P8N2N2K9k5j6j5j9j8OPOP
-664A050k5k4L0L1J0J0J0J0M8M8m4m4o1o0onN9O0N7N6P0J4k9n7j2J6kkJ0J0m5m5l9l9l9l9
$$ plain form
-631 1275 1321 1313 1259 1206 1204 1202 1208 1214 1219 1225 1177 1129 1081 1032 1033 1034 1034 1035 1070 1105 1140 1176 1195 1214 1264 1259 1219 1180 1192 1204 1171 1138 1104 1071 1057 1044 1030 1016 1018 1019 1021 1022
-636 1022 1047 1073 1043 1014 1042 1070 1099 1127 1143 1160 1122 1083 1066 1049 1032 1015 998 981 964 946 953 960 915 870 808 801 855 908 951 993 1035 1078 1090 1102 1063 1024
-640 1024 1020 1070 1121 1116 1062 1008 975 997 1047 1098 1149 1199 1209 1163 1148 1133 1129 1124 1120 1116 1111 1107 1102 1098 1104 1111 1118 1124 1101 1078 1055 1031 1089 1146 1203 1261 1270 1279 1288 1298 1251 1204 1157
-645 1157 1110 1111 1112 1113 1114 1102 1089 1076 1063 1036 1008 1035 1063 1076 1088 1101 1114 1127 1139 1152 1165 1109 1054 1053 1053 1074 1096 1117 1138 1135 1131 1127 1124 1136 1149 1161 1174 1182 1191 1200 1209
-650 1209 1183 1158 1132 1106 1112 1117 1122 1127 1098 1069 1095 1121 1148 1175 1147 1119 1110 1102 1145 1188 1143 1044 960 903 879 855 833 811 872 934 992 1050 1105 1106 1049 992 994 1051
-655 1051 1077 1103 1147 1191 1235 1279 1250 1221 1173 1153 1141 1074 1009 998 1069 1140 1160 1179 1210 1241 1272 1303 1323 1343 1308 1273 1222 1171 1175 1179 1213 1247 1281 1315 1290
-659 1290 1266 1241 1217 1217 1218 1219 1220 1227 1235 1243 1250 1267 1284 1301 1318 1376 1434 1431 1374 1257 1141 1009 904 852 856 906 984 1036 1088 1117 1092 1076 1061 1042 1024 1030 1037 1043 1050
-664 1050 1025 1001 1031 1062 1072 1082 1092 1102 1150 1198 1154 1110 1049 989 983 978 1037 1097 1154 1210 1280 1294 1265 1208 1196 1212 1210 1208 1218 1228 1183 1138 1099 1060 1021 982
-669I82K5K5K6K5k2k3j9k0J8P3N8K9J5J4J7J6J1O7O5J0m7p4p5m8l3oml2o7o7j4j4j4j4M2M1
-673I66O9O9J4J3k5k5L0L0L0L0k5k5l1l1K5K4J1J0J1J1qqqqj9j9k0j9MMLMj0j0M5M5J2J2m3
-678A138m3n4n3JKK8K8K8K8RRo4r1n8lN6N6L4L4L5L4POPPOPPOl7l7l7l7j8j7L7L8OPOPK1K2
-683A168j4m1m5J0O6O5M4j1l5l5qrqqj2j1j2j2j6j6j6j6N6N6JJj1j0j1j0k8k7k8k8L4L4L3
-688A090L4J1J1J0J1j5j6j6j5j6j5j6j6J8J7J8J7K8K7N9Mj9j8k2k1l6l5l5l6j0j1j0j1l0l0
-692I06l0l0MMO0N9K9K8K9K8J6J5J6J6j3j3o5o6j3L3K5mkK5O2O3J%kkk1o6o7k0%JLMLMLMk6
-697A001k6k5k6K5K4K5K5MMMMj9j8L6L6O9P0Nm1o2l5KKk0j9J8M5J6l0j8Rppnnj9j9j9j9on
-702I74onM1M2M1M2K4K5lm9n8l0OOj9j9J7M5L6j0l8l8MMLMK3K3K4K3l6l7l6l6k2k3k2k3KK
$$ plain form
-669 982 1007 1032 1058 1083 1061 1038 1019 999 1017 1090 1148 1177 1192 1206 1223 1239 1250 1317 1382 1392 1345 1271 1196 1148 1115 1109 1105 1073 1006 939 925 911 897 883 925 966
-673 966 1035 1104 1118 1131 1106 1081 1111 1141 1171 1201 1176 1151 1120 1089 1114 1138 1149 1159 1170 1181 1173 1165 1157 1149 1130 1111 1091 1072 1076 1080 1083 1087 1077 1067 1112 1157 1169 1181 1138
-678 1138 1095 1041 988 989 991 1019 1047 1075 1103 1112 1121 1057 966 908 905 961 1017 1051 1085 1120 1154 1161 1167 1174 1181 1187 1194 1201 1207 1170 1133 1096 1059 1041 1024 1061 1099 1105 1112 1118 1125 1146 1168
-683 1168 1154 1113 1068 1078 1144 1209 1253 1242 1207 1172 1164 1155 1147 1139 1127 1116 1104 1092 1076 1060 1044 1028 1084 1140 1141 1142 1131 1121 1110 1100 1072 1045 1017 989 1023 1057 1090
-688 1090 1124 1135 1146 1156 1167 1152 1136 1120 1105 1089 1074 1058 1042 1060 1077 1095 1112 1140 1167 1226 1230 1211 1193 1171 1150 1114 1079 1044 1008 998 987 977 966 936 906
-692 906 876 846 850 854 914 973 1002 1030 1059 1087 1103 1118 1134 1150 1137 1124 1059 993 980 1013 1038 1034 1032 1057 1119 1182 1183 1183 1181 1179 1158 1092 1025 1005 1005 1006 1009 1013 1016 1020 1023 1027 1001
-697 1001 975 950 924 949 973 998 1023 1027 1031 1035 1039 1020 1002 1038 1074 1143 1213 1218 1177 1115 1080 1082 1084 1064 1045 1063 1108 1124 1094 1076 1085 1078 1071 1066 1061 1042 1023 1004 985 979 974
-702 974 968 963 1004 1046 1087 1129 1153 1178 1175 1126 1068 1038 1044 1050 1031 1012 1029 1074 1110 1100 1062 1024 1028 1032 1035 1039 1062 1085 1109 1132 1096 1059 1023 987 965 942 920 897 899 901
$$ [...]
##$OBSERVED INTEGRALS=	(X Y Z)
(3.1550889957052796753, 3.193473046604251131, 1)
(1.9536695012363223256, 2.0246862301937458284, 3.4341563707365603264)
(1.608366603551128815, 1.7716625551658014004, 8.107518755714412606)
(1.474412893242215139, 1.5318216262317485565, 6.7338726962262205333)
(3.193182836734652863, 3.2105392330967958969, 0.081697273624402169667)
##END=	
##TITLE=	Aug25-2021.60.fid
##JCAMP-DX=	6.0	$$ MestReNova 14.1.0-24037
##BLOCK_ID=	3
##DATA TYPE=	NMR PEAK TABLE
##DATA CLASS=	PEAK TABLE
##CROSS REFERENCE=	NMR SPECTRUM: BLOCK_ID=2                                     
##.OBSERVE FREQUENCY=	400.4124024600000098
##.OBSERVE NUCLEUS=	^1H
##NPOINTS=	14
##FIRSTX=	1.5035736893116151691
##LASTX=	3.199374745138710896
##XFACTOR=	1
##YFACTOR=	1
##FIRSTY=	6935.4886751555877709
##XUNITS=	PPM
##YUNITS=	ARBITRARY UNITS
##PEAK TABLE=	(XYW..XYW)
1.5035736893116151691,6935.4886751555877709,0.0097560505488117482686
1.5108483855130487861,6103.3045771965571475,0.0090199700919070344846
1.6247129772375428214,457.85700506334757165,0.012718343268202654539
1.6332897337705993834,1052.1698715614068078,0.014477486416962861288
1.6624628986638771977,2659.5810959874529544,0.019128023063597343612
1.7171221174715234348,3090.5349219531281051,0.021014667163336896855
1.7472448095154289316,1019.349702180596978,0.013895789271473790033
1.7546535342174560679,419.66945167851304177,0.011091023268665005375
1.9840359569795964489,1270.435696425174001,0.013500380825345095412
1.9921078148469120173,1442.6240542084715344,0.01387022963644746025
1.9994328105679075591,1234.6190047272211814,0.018166893662592671632
3.1747563000233234298,745.66064592649036058,0.0087328527422630627952
3.180071962450948142,1297.2901137126207232,0.0093055650794032288009
3.199374745138710896,158.3698793636816049,0.0059244228832490255024
##$MNOVA/PEAK_DATA_TABLE=	(T,F,A,ST,SP,APT,APC)
$$ Complementary to PEAK TABLE
$$ T: Type
$$ F: Flags
$$ A: Annotation
$$ ST: Shape Type
$$ SP: Shape Parameter
$$ APT: Attached Peaks Type
$$ APC: Attached Peaks Count
Compound,None,,1,0.63209544718628218885,0,0
Compound,None,,1,1.1070062384115577636,0,0
Compound,None,,1,0.29764246375196889982,0,0
Compound,None,,1,0.77835022067853087968,0,0
Compound,None,,1,0.78199502579583635153,0,0
Compound,None,,1,0.75941220432006417695,0,0
Solvent,2ry Solvent,,1,0.45273419805886039313,0,0
Solvent,2ry Solvent,,1,0.75583185724671098082,0,0
Compound,None,,1,0.60931174286152933739,0,0
Compound,None,,1,-0.077701543978811737912,0,0
Compound,None,,1,-0.20000000000000006661,0,0
Compound,None,,1,0.55528458851532880303,0,0
Compound,None,,1,1.0743186357166696343,0,0
Compound,None,,1,0.40000000000000007772,0,0
##END=	
##END=	
