##TITLE=	13C
##JCAMP-DX=	6.0	$$ MestReNova 14.3.3-33362
##DATA TYPE=	LINK
##BLOCKS=	1    
##ORIGIN=	Mestrelab Research S.L.
##OWNER=	hrzepa
##$MNOVA/METADATA=	(DOCUMENT,BASE64)
eyJuYW1lIjoiRG9jdW1lbnQgMSIsInBhZ2VzIjpbeyJpdGVtcyI6WyIxIiAgICAgXX1dfQ==
##TITLE=	13C
##JCAMP-DX=	6.0	$$ MestReNova 14.3.3-33362
##DATA TYPE=	NMR SPECTRUM
##DATA CLASS=	XYDATA
##BLOCK_ID=	1
##ORIGIN=	Varian
##OWNER=	hrzepa
##NUMDIM=	1
##$MNOVA/METADATA=	(ITEM,BASE64)
eyJhbmdsZSI6MCwiYXhlcyI6eyJ4Ijp7Im1heCI6MjM0LjI2NDY1NzgxNzc5Nzc0LCJtaW4iOi0xNC4
yNjE1NDgyMzExMTU2NjF9LCJ5Ijp7Im1heCI6MjEzLjAwMjg0MTk0OTQ2MjksIm1pbiI6LTIwLjk4MT
Q4MDQ3OTI0MDQxN319LCJwb2ludHMiOlt7IngiOjUzMjEsInkiOjU4MzV9LHsieCI6ODcyMiwieSI6N
TgzNX0seyJ4Ijo4NzIyLCJ5Ijo4MjA4fSx7IngiOjUzMjEsInkiOjgyMDh9LHsieCI6NTMyMSwieSI6
NTgzNX1dLCJ6IjowfQ==
##.OBSERVE FREQUENCY=	125.75317950000000167
##.OBSERVE NUCLEUS=	^13C
##.SOLVENT NAME=	cdcl3
##.PULSE SEQUENCE=	s2pul
##LONGDATE=	2019/05/10 00:53:47.000
##.ACQUISITIONMODE=	SIMULTANEOUS
##$ORIGINAL FORMAT=	Varian
##$MNOVA/SCALES_VERSION=	9
##$PARAMETER FILE=	(datafile, ASCII, /private/var/folders/bp/m_4195y96sx1d256lqvkcvym0000gq/T/yMmPIJt9RPOJ8H9YSsAkSA/13C/fid, 0)
$$ 
##$PARAMETER FILE=	(header, BASE64, /private/var/folders/bp/m_4195y96sx1d256lqvkcvym0000gq/T/yMmPIJt9RPOJ8H9YSsAkSA/13C/fid, 0)
AAAAAQAAAAEAAQAAAAAABAAEAAAABAAcAAAAyQAAAAE=
##$PARAMETER FILE=	(log, ASCII, /private/var/folders/bp/m_4195y96sx1d256lqvkcvym0000gq/T/yMmPIJt9RPOJ8H9YSsAkSA/13C/log, 0)
$$ Fri May 10 00:53:49 2019: Experiment started
$$ Fri May 10 00:56:10 2019: BS 1 completed
$$ Fri May 10 00:58:21 2019: BS 2 completed
$$ Fri May 10 01:00:33 2019: BS 3 completed
$$ Fri May 10 01:02:44 2019: BS 4 completed
$$ Fri May 10 01:04:55 2019: BS 5 completed
$$ Fri May 10 01:07:06 2019: BS 6 completed
$$ Fri May 10 01:09:17 2019: BS 7 completed
$$ Fri May 10 01:11:28 2019: BS 8 completed
$$ Fri May 10 01:13:39 2019: BS 9 completed
$$ Fri May 10 01:15:50 2019: BS 10 completed
$$ Fri May 10 01:18:01 2019: BS 11 completed
$$ Fri May 10 01:20:14 2019: BS 12 completed
$$ Fri May 10 01:22:24 2019: BS 13 completed
$$ Fri May 10 01:24:35 2019: BS 14 completed
$$ Fri May 10 01:26:46 2019: BS 15 completed
$$ Fri May 10 01:28:57 2019: BS 16 completed
$$ Fri May 10 01:31:09 2019: BS 17 completed
$$ Fri May 10 01:33:19 2019: BS 18 completed
$$ Fri May 10 01:35:30 2019: BS 19 completed
$$ Fri May 10 01:37:41 2019: BS 20 completed
$$ Fri May 10 01:39:52 2019: BS 21 completed
$$ Fri May 10 01:42:04 2019: BS 22 completed
$$ Fri May 10 01:44:15 2019: BS 23 completed
$$ Fri May 10 01:46:26 2019: BS 24 completed
$$ Fri May 10 01:48:37 2019: BS 25 completed
$$ Fri May 10 01:50:48 2019: BS 26 completed
$$ Fri May 10 01:52:59 2019: BS 27 completed
$$ Fri May 10 01:55:10 2019: BS 28 completed
$$ Fri May 10 01:57:21 2019: BS 29 completed
$$ Fri May 10 01:59:32 2019: BS 30 completed
$$ Fri May 10 02:01:44 2019: BS 31 completed
$$ Fri May 10 02:03:55 2019: BS 32 completed
$$ Fri May 10 02:06:06 2019: BS 33 completed
$$ [...]
$$ 0 
$$ wqinit 2 2 8 0 0 4 1 0 1 64
$$ 1 ""
$$ 0 
$$ wshim 4 2 4 0 0 2 1 1 1 64
$$ 1 "n"
$$ 15 "e" "f" "g" "n" "s" "0" "1" "2" "3" "4" "5" "6" "7" "8" "9" 
$$ wtfile1 2 2 15 0 0 3 2 1 1 64
$$ 1 ""
$$ 0 
$$ wtfile 2 2 15 0 0 3 1 1 1 64
$$ 1 ""
$$ 0 
$$ wtune 4 2 4 0 0 2 1 0 1 64
$$ 1 "st12"
$$ 11 "s" "t" "e" "i" "n" "o" "v" "1" "2" "3" "4" 
$$ xy 7 1 19 19 19 2 1 8192 1 64
$$ 1 681 
$$ 0 
$$ x3 7 1 19 19 19 2 1 8192 1 64
$$ 1 7587 
$$ 0 
$$ x2y2 7 1 19 19 19 2 1 8192 1 64
$$ 1 -284 
$$ 0 
$$ x4 7 1 19 19 19 2 1 8192 1 64
$$ 1 0 
$$ 0 
$$ xz2 7 1 19 19 19 2 1 8192 1 64
$$ 1 -1561 
$$ 0 
$$ xz 7 1 19 19 19 2 1 8192 1 64
$$ 1 6948 
$$ 0 
$$ y1 7 1 19 19 19 2 1 8192 1 64
$$ 1 797 
$$ 0 
$$ z3x 7 1 19 19 19 2 1 8192 1 64
$$ 1 476 
$$ 0 
$$ z2 7 1 19 19 19 2 1 8192 1 64
$$ 1 -949 
$$ 0 
$$ yz2 7 1 19 19 19 2 1 8192 1 64
$$ 1 -2835 
$$ 0 
$$ yz 7 1 19 19 19 2 1 8192 1 64
$$ 1 -2906 
$$ 0 
$$ y4 7 1 19 19 19 2 1 8192 1 64
$$ 1 0 
$$ 0 
$$ z1 7 1 19 19 19 2 1 8192 1 64
$$ 1 -17779 
$$ 0 
$$ z0_ 1 1 19 19 19 2 1 73744 1 64
$$ 1 3364 
$$ 0 
$$ z1c 7 1 19 19 19 2 1 8192 1 64
$$ 1 -1044 
$$ 0 
$$ z2xy 7 1 19 19 19 2 1 8192 1 64
$$ 1 5183 
$$ 0 
$$ z2x2y2 7 1 19 19 19 2 1 8192 1 64
$$ 1 -2701 
$$ 0 
$$ z2c 7 1 19 19 19 2 1 8192 1 64
$$ 1 196 
$$ 0 
$$ z2x3 7 1 19 19 19 2 1 8192 1 64
$$ 1 0 
$$ 0 
$$ z3 7 1 19 19 19 2 1 8192 1 64
$$ 1 2723 
$$ 0 
$$ z2y3 7 1 19 19 19 2 1 8192 1 64
$$ 1 0 
$$ 0 
$$ z3c 7 1 19 19 19 2 1 8192 1 64
$$ 1 0 
$$ 0 
$$ z4y 7 1 19 19 19 2 1 8192 1 64
$$ 1 4212 
$$ 0 
$$ z4c 7 1 19 19 19 2 1 8192 1 64
$$ 1 0 
$$ 0 
$$ z3xy 7 1 19 19 19 2 1 8192 1 64
$$ 1 0 
$$ 0 
$$ z3x3 7 1 19 19 19 2 1 8192 1 64
$$ 1 0 
$$ 0 
$$ z3x2y2 7 1 19 19 19 2 1 8192 1 64
$$ 1 0 
$$ 0 
$$ z3y3 7 1 19 19 19 2 1 8192 1 64
$$ 1 0 
$$ 0 
$$ z3y 7 1 19 19 19 2 1 8192 1 64
$$ 1 1029 
$$ 0 
$$ z4 7 1 19 19 19 2 1 8192 1 64
$$ 1 4585 
$$ 0 
$$ z4x2y2 7 1 19 19 19 2 1 8192 1 64
$$ 1 0 
$$ 0 
$$ z4x 7 1 19 19 19 2 1 8192 1 64
$$ 1 -13017 
$$ 0 
$$ z4xy 7 1 19 19 19 2 1 8192 1 64
$$ 1 0 
$$ 0 
$$ z8 7 1 19 19 19 2 1 8192 1 64
$$ 1 0 
$$ 0 
$$ z6 7 1 19 19 19 2 1 8192 1 64
$$ 1 -5568 
$$ 0 
$$ z5x 7 1 19 19 19 2 1 8192 1 64
$$ 1 0 
$$ 0 
$$ z5 7 1 19 19 19 2 1 8192 1 64
$$ 1 -6876 
$$ 0 
$$ z5y 7 1 19 19 19 2 1 8192 1 64
$$ 1 0 
$$ 0 
$$ z7 7 1 19 19 19 2 1 8192 1 64
$$ 1 339 
$$ 0 
$$ zx2y2 7 1 19 19 19 2 1 8192 1 64
$$ 1 698 
$$ 0 
$$ zoom 7 1 32767 0 0 4 1 0 1 64
$$ 1 0 
$$ 0 
$$ zxy 7 1 19 19 19 2 1 8192 1 64
$$ 1 -1576 
$$ 0 
$$ zx3 7 1 19 19 19 2 1 8192 1 64
$$ 1 4844 
$$ 0 
$$ zy3 7 1 19 19 19 2 1 8192 1 64
$$ 1 -2037 
$$ 0 
$$ 
##$PARAMETER FILE=	(text, ASCII, /private/var/folders/bp/m_4195y96sx1d256lqvkcvym0000gq/T/yMmPIJt9RPOJ8H9YSsAkSA/13C/text, 0)
$$ 
$$ 
##XUNITS=	HZ
##YUNITS=	ARBITRARY UNITS
##FIRSTX=	29456.285383729999012
##LASTX=	-1793.2377791117969537
##DELTAX=	-0.476837158203125
##XFACTOR=	1
##YFACTOR=	0.0059095720246956735464
##FIRSTY=	0.19659730792045593262
##MINY=	-1.6175850629806518555
##MAXY=	193.638946533203125
##NPOINTS=	65536
##XYDATA=	(X++(Y..Y))
$$ [...]
22391e8lj2J9K4J2l2L7J6k8j3j6rlj0M3M2o8J7j3%L9j4l3L3km0N7N3n0k8j2N7k0L1l8n8L5
22373d5L9k1LPM3qp9RP2m7%qKj4n2m8MR1Lm6K8J7M5k8J7l7j3J3k0M5M7n9NrnK2m1N6j1o0K2
22354f1J6LKm4M5K5Rl3j0L6K8lp9k0n2M8M1k9j5J7k0O9Mp3L0k2l7nMM4P1k1M8mj08N9N3j4
22336Bk2l4OKM2P6kom0Mo5n4M3M4mkK5n0K7k4PN5on6KK8JlJ0j2l6J5j5PN9l0j07pL7Q4j5k0
22316c4j5p1M6J3Ll8p2R5N2PRl2PQOK3QM7k2k5k8J8K4k8n4J4k2J1QJ6K1jj1j7K6R5q5l6m2
22297g6j4k3j0%J6L6K0MP1p3m2K5p4J6Q1J8l5JK3m3M0J4L1o0N3No7j2Pl5j5M5K4P5rl0o0p
22279h0J0m8O2J3j1RPM0j0L8m7J1Qj4op8PkL0j3RJQOL8J3K4K9n5k2j02M8L6M1m4n2N0J14r2
22260b4o0L4K9M8p8L9lm6L5qrplk0l2N8N0Pp4n3J07o7K4L4kL8k3k4L4kj0%k8j1Mj0L1j6L2
$$ y = [-58, -61, -73, -54, -30, -18, -50, -13, 3, -25, -38, -54, -63, -66, -76, -33, 9, -59, -42, -55, -55, -16, -30, -63, -30, -32, -72, -15, 38, -12, -40, -52, 5, -15, 16, -22, -80, -45, -6, -27, -24, -17, 26, 18, -61, -52, 20, -27, -27, -35, -33, -47, -99, -147, -143, -52, -49, -95, -67, -50, -5, -33, -16, -53, -66, -53, -73, -28, 19, -40, -35, -44, -49, -27, -68, -12, -23, -83, -61, -45, -42, -40, -84, -39, -14, -5, -38, -48, -12, 16, 13, -66, -86, -138, -90, -49, -78, -93, -76, -96, -27, -23, -96, -66, -88, -125, -130, -126, -82, -11, -32, 16, 12, -96, -37, 16, 2, -20, -54, -48, -46, -4, 72, 70, 64, 24, 28, -37, -91, -48, -4, -8, -10, 15, -35, -8, -32, -25, 30, 24, -32, -30, -2, -1, -4, 6, -6, -42, -27, -42, -35, 24, -6, -113, -120, -83, 1, -14, -34, -49, -120, -74, -61, -58, -96, -168, -73, -21, -14, -5, -37, -30, -22, -16, 7, 15, 62, 40, 15, -13, 5, 29, 1, -53, -39, -61, -50, -42, -26, -5, -6, -17, -34, -8, 87, 2, -34, -76, -90, -113, -123, -123, -107, -71, -51, -47, 24, -49, -91, -66, -140, -124, -43, -25, -60, -59, -36, -79, -39, -25, 6, -54, -1, 4, -63, -75, -68, -103, -118, -73, -49, 26, 17, -13, -73, -80, -70, -118, -56, -43, -54, -45, -38, 2, -8, 30, -17, -6, 2, -12, -18, -96, -89, -91, -61, -74, -65, -64, -56, -50, -12, 1, 25, 54, -1, -23, -125, -77, -41, 0, -44, -96, -46, 68, -24, -84, -50, -21, 27, -51, -12, -15, -61, -26, -34, -43, -50, -53, -73, -105, -47, 3, 10, -64, -117, -10, -77, -53, -19, -21, 17, -6, -30, 4, 2, -8, -8, -36, -47, -43, -53, -22, -38, -6]
22242fl1J2Kn8l2M4M1Nm7n9j2M7J3k2M8o8l5R6O3m0J4Rl7j06Q7J3n3M2L1j1k0Qk5P2k4J3L0
22224Dn8Om8j3J03J1k4Om7plJ05j0m8L2%j0J4k6n0rP5L2j8j9m0K6L5L0k4p0M2m2j6K4K5NM2
22206C5n6p1O5K2m9j8M4p3lj7O6L4K8LO4k7q4kK6L1m1K6K5o4KO2k5mm8o5O9j2J2lk0L8L6l4
22188b8K2j1pM5p6m5P8m8L2J4r6N0PK3K1l1J6j6kMoK3q2J1L1MN4K1l8K2j1j5K8l7k7L0PN2
22170A9k0l9K5J5J4m4qj5M2Mj2j9J3N0n4M0j5M1%m3q0J7N7k3M6k7o2m0L2R5k6q8m0J2O5N6
22153a2k3J7o3K2K4LN3j01nK2KrMPL9Qm0L0qL8n6ok1L3k1K7Pl6L0M5J0k4l6LJ7m0n2J01Q1
22134G0q5j28QM9N1K0j7K9K8mok3l6k6N6O1q3m7L3nK9j1k6rL6k1J0jJ8RpJ6RM3m1pl0P5k9
22115Hk7o0L2M4l4O3Jj09o8N4Q4m0k1L1qK0k0n5K1L1J0L9L9l5mM5r2ol3oN3Q2j5l2l6k7P2
$$ y = [-6, -37, -25, -23, -81, -113, -69, -28, -23, -70, -129, -141, -94, -81, -103, -55, -123, -158, -62, 1, -39, -25, -16, -53, -159, -72, -59, -112, -70, -39, -50, -70, -62, -87, -15, -39, -26, 4, -54, -48, -96, -109, -6, 5, -19, -13, -60, -67, -70, 35, 25, -23, 9, 9, -1, 13, -13, -63, -72, 3, 35, 17, -2, -42, -16, 19, 49, 25, -45, -3, -45, -61, -37, -12, -7, 35, -21, -92, -27, -5, -54, -72, -28, -101, -104, -121, -55, -21, 7, 10, 74, 47, -37, -39, -13, 18, -23, 3, 28, -36, -34, 28, 3, -1, -49, -114, -45, -57, -45, -48, -68, -30, 6, -28, -6, -17, -24, 21, -55, -100, -22, -70, -38, -24, -120, -70, -63, -40, -19, -50, -34, -50, -52, -48, -54, -31, -113, -102, -71, -67, -13, 8, -30, -8, -19, -34, -6, -43, -70, -40, -33, 19, -1, -40, -15, 0, 14, -30, -38, -53, -11, -7, -19, -38, -25, 25, -29, 11, -4, 37, 37, -6, -86, -69, -12, -35, 11, -16, -78, -118, -86, 9, -17, -105, -145, -133, -68, -12, -35, -18, -81, -59, -35, -32, 21, -80, -85, -63, -61, -70, -66, -59, -20, -12, -52, -22, -30, 8, -48, -54, -75, -42, -63, -36, -29, -65, -35, 10, 20, -4, -40, -37, -20, -60, -112, -11, 70, -15, -143, -135, -86, -35, -15, -32, -3, 25, 21, 15, -8, -44, -70, -14, 47, -36, -83, -50, -55, -26, -37, -63, -72, -36, -57, -47, -48, -30, -21, -28, -12, -3, 40, -1, -8, -38, 37, 8, -19, -79, -47, -3, -37, 26, 27, -82, -150, -96, -12, -52, -73, -42, -50, -30, -50, -105, -84, -53, -43, -4, 35, 0, -4, 41, -51, -57, -90, -96, -43, 39, 24, -8, -44, -71, 1]
22098Ano8K7O6j6Ll4Kk1jJ3n0o1O5J0J4n4K5l0L3Q2qo5L3Q9r5j1K8o4j5N6j6J8J2l8L0n2J6
22080h1K2K4K5n8l4M2K4Jk9P7pm7K9k4m1J0QP7k5n8M0M4J1k1k0J7l9J9l0l8O6J0K9o7l4K8
22062e0jn3N4n9l9L6Q3K2n3l1L5L7m3k8pM0l3p2N5O1nk4j9R9L0k3k9m2j9J0K7kJ02n9k7Rk8
22045d6j7J4j0j3Q4J1l5j1k1k9j4Q5N6k7m3j4J7j5l2j8L1K9m5J1QJ5l3L3Jlm0m8M3N1M9o6
22028d2l2L1L2MK6k8m5N9j7L1L5m5j16rM9J6J5M7k3j4pj9l1J1K1K8K7Kk7Nm5k6J5J8K3M8n8
22010d1KK2m3q6P5J2L2L9Jo0krK7N3pn8l8J38k6L0n2r%J0K8Kp3r1j3J9O1j8j3P1O1m3k5o8
21992i2l8J6J7j0j7P0r4K0M6qN6K3k1pN2k3l1J7M9J5r6O9M4r7j4L8Mp1M2MKN4J8l2k8K3k4
21974b4OM0J0n8O3j1K7m7o7P4n3%J8K5l5o5Q4L1km4l9L8K6l5j5MO3j8Nlk5o9l9R9L8n%J2l7
$$ y = [1, -4, -72, -45, 21, 5, 8, -26, -24, -45, -46, -33, -83, -144, -79, -69, -55, -109, -84, -114, -81, 1, -7, -72, -39, 50, -45, -56, -28, -92, -107, -51, -67, -49, -37, -75, -45, -97, -81, -59, -35, -10, -68, -102, -60, -36, -35, -64, 13, 6, -41, -12, -36, -77, -67, -59, 18, -7, -65, -25, 19, 30, 9, -11, 6, -33, -14, -44, -82, -16, -6, 23, -44, -78, -50, -51, -104, -50, -109, -148, -112, -29, -7, -60, -91, -56, -19, -62, -90, -97, -57, -90, -162, -107, -46, -51, -75, -94, 5, 35, 12, -17, -59, -78, -68, -41, -43, 59, 0, -27, -18, -46, -63, -49, -59, -72, 12, 23, -12, -23, -44, -73, -87, -2, 54, 27, -16, -30, -13, -28, -60, -78, -47, -18, -63, -52, -44, -29, -62, -29, -28, -31, -71, -119, -76, -25, 24, -42, -74, -43, -11, -7, 19, -9, -54, 5, -12, 19, 54, 9, -107, -116, -67, -51, -36, 11, -12, -26, -33, -52, -83, -72, -51, -23, 4, 6, -21, -16, -61, -87, -72, -54, -31, 17, -41, -39, -17, -60, -146, -71, -59, -27, 12, 13, -47, -49, -58, -31, 22, 15, -43, -81, 57, 31, 61, 9, 0, 0, 10, 38, 40, -33, -124, -137, -118, -57, -75, -88, -17, 44, 1, -24, -92, -130, -114, -97, -107, -124, -54, -148, -128, -82, -90, -34, -11, -32, -39, 13, -10, -41, -24, 25, 40, -56, 13, 57, -40, -54, -16, -12, -83, -41, -37, -35, 19, 37, 5, -23, 0, -24, -18, 22, 32, -26, 37, 26, 53, 6, -61, 13, -40, -40, -22, 3, -32, -97, -13, 18, 16, -28, -67, -29, -3, -38, -53, -49, 14, -4, 1, -2, -27, -96, -135, -36, 2, -3, -3, 9, -28]
21956b8Qk6J5om4q0M5K1R4M7M4j24j8N8O2Q1n7j34%PM6M0m9K3o2Qjj9J5m7P3j8j8j0O8K0j8
21938A6Nj8lK4l0oOJ9j9L4Jn8J5j7k8M7K9p7M4K2k9k4RM1q4J4J2L9k9Pm7K1L0k3K4k0L2n8
21920g9L3j9L6L4j4K4o0m2n1m1P6qP4K0%%l1J1L1l9QN2J6l6%j5lK0m4JL9m9k1N1P7p4K7m3
21902c9q1O4K4J0K1r5P7L0k2L2l3l0n7J13L9Kn0Km7k6L0k6m2M6K5J2Lq0K0QN7K0P1k2o3k0
21885b7K2J7n2J6o0J4Ok8jJ8l1m9Q9K2M8m5o0J0k4kO3K0L7l1K7n1k4l2NL7M9M6p7n6J1L5k7
21867h5l2P0j3j0K3K0J1o3NN7K8M1r3n3j6N4j9L0j8k0N1K7l8j8n5M6K7K7l4R4j6k6K5j3k6
21850a2k8M0k5K3j20l1R4Mm4M5J8L8mJ5m9J8nK5k6Jrj0K2m0m7K8K5k3L6L7k0l8m1J04L0mo9
21833d2L8k7p0K0J3K2j8%k4M2kj1ok8J6P9K6r1M9j7m6PL3J1M8q6j4k3J7JPj4K0L5j7K1k4L
$$ y = [-28, -20, -46, -31, -37, -81, -161, -116, -95, -1, 46, 90, -34, -52, 6, 68, 149, 92, -42, -42, -35, 11, 51, 2, 25, -37, -29, -30, -49, -34, -81, -8, -26, -44, -54, 14, 34, 16, 21, 3, 0, 24, -6, -12, -6, 13, -6, 28, 29, -29, -14, -31, -59, -12, 17, -60, -16, 6, -23, -47, -38, 3, -81, -67, -55, -16, -45, -38, -85, -64, -34, -57, -33, -53, -21, -79, -46, -65, -29, 5, -9, 15, -45, -87, -138, -179, -103, -111, -37, -17, -17, -17, -48, -37, -6, -45, -37, 15, 31, -5, -5, -20, -23, -3, -47, -46, -7, -56, -77, -26, 51, -23, 4, -39, -120, -56, -32, -22, -1, -96, -19, 11, -11, 21, -12, -42, -99, 14, 53, 55, 5, 7, -40, -66, -36, -62, -104, -58, -33, -21, -18, -98, -78, -70, -13, 7, 78, 56, -7, -27, -5, 12, -40, -24, -84, -70, -64, -92, -93, -75, -106, -155, -66, -44, 4, -41, -101, -91, -115, -117, -54, -34, 3, -28, -1, -52, -76, -108, -103, -66, -17, 29, -48, -104, -93, -58, -85, -117, -47, -60, -70, -47, -27, -16, -79, -74, -17, 11, 52, -41, -94, -110, -56, -75, -45, -63, -83, -32, -5, -43, -61, -116, -70, -43, -16, -50, 44, 28, 2, 27, 14, -12, -40, 0, -25, -2, -122, -153, -59, -55, -99, -54, -36, 2, -2, 13, -36, -18, -23, 2, -24, -23, -32, -42, -20, -60, -107, -79, -54, -77, -41, -4, -24, -62, -103, 1, 31, 27, -42, -4, -31, -101, -81, -68, -46, -64, -64, -88, -46, -48, -59, -65, -93, -77, 2, 28, -63, -14, -31, -77, -70, -37, -26, 22, -64, -78, -101, -84, -83, -76, -90, -70, -35, -52, -31, -55, -52]
21814e2K1mM5p5M1J00p9n2l5K5k0k2nP8K5k9p2Kj5J02Rp2M3r2o3L1O9j1l8Q3N0K1j6o2K9J7
21797b3o8l2K6J7M9l6rj5J8nj8P8J9j4l2n6O3JN2j0n8L3J1k8J%k7O0K0J1m1J4p6l2L5M5P3
21780D6j7r0pJ09On6j3M0pl8j2%l7L5j1Jj5M5j7l6j6Q0m1lJ2J5KLJ8j3m4N1k6j0l0PmL5j3
21761e1k5L0J6qO2n7k6K6k2J4L1k6l4N8M9n0n9L2M7m6o7O0L9j2j2Nl2Pn1K6J3OJ8j0qN1n1
21743e7QM7kl4l2j5rK3K0j3K7J5LM4j02J3M7N8k4r6J1O7Ql8l0k5L4L3l6M9l2J2L3k4j2Ok5
21726d8k6rK1L7n7j4K4j3K9J8pk8ql3L7M0K8l1k0J2qK4QL8j2L8p6p7L6K8J1J5%j4k6K9jK5
21708a0k1k1k3M1l1l5L5J8m3J0K7KN0n4N4k9J5plj1n6N7L6k8k6qrK8JK5J2j0K6jnnN3p4k6
21689d6J5QK6J6Nm1j8j1m5M3N4j3k0kom7M4r2K4N0L9j8rM6m5j8K8ql3MqNJ5m0J2J17l9o4J7
$$ y = [-52, -31, -35, 10, -65, -24, 76, -3, -55, -90, -65, -85, -107, -112, -34, -9, -38, -110, -108, -123, -21, -12, -84, -41, -133, -196, -165, -96, -107, -145, -62, -12, 9, -7, -69, -40, -23, -91, -123, -97, -80, -31, -67, -76, -91, -73, -78, -96, -18, 1, -13, -45, -101, -38, -37, 15, 5, -53, -20, -9, -37, -36, -36, -63, -3, 17, 28, -13, 1, -75, -107, -72, -27, 46, 29, -61, -68, 41, 47, -9, -22, 18, 11, -27, -39, -39, -76, -41, -52, -51, -66, -21, -38, -74, -90, -10, -51, -54, -42, -27, -25, -22, -4, -17, -61, -10, -36, -46, -76, -69, -73, -38, -51, -76, -46, -30, -38, 24, -33, -59, -33, -55, -41, -10, -36, -70, -12, 37, -13, -72, -40, 7, -39, -106, -46, -7, -19, -31, -26, -58, -51, -102, -76, -63, -57, -39, -49, -57, -6, -57, -49, -2, -4, -38, -70, -85, -94, -71, -51, -64, -37, -22, -19, 25, -77, -64, -17, 41, 17, -79, -68, -1, 7, -31, -61, -86, -52, -19, -55, -6, -38, -26, 7, -17, -29, -23, -48, -74, -83, -62, -25, -82, -96, -72, -85, -56, -38, -45, -73, -81, -114, -77, -37, -9, -40, -60, -48, -56, -32, -24, 14, 2, 40, -36, -113, -77, -49, -38, -23, -23, -37, -63, -34, -35, -10, -31, -52, -75, -34, -65, -100, -65, -47, -90, -80, -53, -51, -1, -55, -1, -30, -15, -22, -25, -36, -92, -35, 1, -27, -53, -61, -70, -42, -41, -16, -4, -14, 12, 11, 6, 1, 54, -20, -46, -31, -23, 3, 19, 24, -17, -35, -46, -91, -48, 6, -7, -27, -29, -35, -82, -38, -130, -106, -56, -17, -35, -44, 2, -43, -61, -33, -41, -74, -70, -78, -73, -58, -98, -86, 31, -8, -72, -55]
21670e5n7L2N8n3PK3ro2k9ML3l5M7O8k8J6K3N0o2m0J8Qm3oQm8N9NL3J0M2m0J9n5Jj1q5P6M6
21652c2m8P2n3j7%m6M3L4MJ6p3l1M3J07mll2k3K2n8M4k6l6L0J6N9o3m3JL5lO4M8q4M6J8m7
21634b0qMJ5J5o1J9Lk2QL4k2J6Q9n8J5n1o5L0J5k8K7JQk7J9K1j6mJn0QM4j0j9Pk3Mm3J6J7
21615i1J5j6j2L5m2nKj9O5PrrJ8m1N0M7m6jK9n8rM0K1j7kk9RJ4K0K6p7qM0%jO0m8j1L5N6m9
21596a1M5K6o0K4l1ll3RK2k3Jj8j5J7J4o1k8P9Jk2N9Jm0K7Rk3j8jJ2K6m6n9L7K2q6%P5J16
21578D4j2j8k8p0J7M2K9l4m6l9j9N2O6l4l9L8M7oJ1q6L1j8mJ8J4O0lJ1l8L3n4oJ00j4l2m4
21560c1l9M4N3j8k6L5o0j3J3k2J2JL5k2j1m0l7J5L2J9K4K4l5K4kl4L0j3Nk2pk7M4M8j2P5m6
21543A6q9jR7k1j3n1l0M2k4J8k7m4K4JK2Pk4K0%L7O9j9k0K1j6m4O4J7l1j1j9k7n4RL5L7l1
$$ y = [-55, -112, -80, -22, -75, -68, -45, -54, -116, -145, -141, -108, -143, -96, -28, -56, -40, -17, 33, -29, -69, -51, -43, -86, -92, -84, -132, -73, -68, -35, -25, 17, -23, -4, -59, -58, -69, -154, -78, -32, -80, -8, -61, -78, -78, -124, -81, -47, -43, -27, -100, -131, -88, 19, 15, 12, -20, -43, -21, -79, -35, -61, -97, -67, -51, 8, -55, -98, -97, -62, -65, -1, 47, -37, 9, 27, -20, -28, -24, -9, 6, -55, -36, -33, -55, -47, -13, -35, -19, 70, 12, 27, -24, -89, -59, -44, -72, -45, -44, -36, -63, -44, -23, -39, -43, -42, -92, -84, -40, -50, -69, -62, -85, -81, -124, -108, -91, -76, -92, -104, -69, -111, -116, -114, -133, -68, -61, -70, -79, -61, -102, -52, -5, -51, -52, -23, -81, -90, -50, -29, -46, -48, -77, -68, -54, -34, -8, -85, -93, -53, -53, -54, 6, -42, -53, -18, 38, -11, 34, 60, 0, 24, -7, -10, -43, -34, -12, -35, -34, -52, -67, -50, -36, -97, -125, -46, -45, -67, -8, -7, -47, -20, -11, -34, -52, -53, -41, -15, -61, -120, -83, -61, -147, -147, -72, 44, 32, 14, -14, -84, -67, -25, 4, -30, -76, -115, -134, -82, -16, -50, -89, -51, -4, -10, 1, -85, -54, -72, -76, -58, -44, 16, 13, 24, -14, 19, -35, -41, 59, 45, 13, -31, -70, -26, 27, 9, -17, 18, -42, -55, -42, -64, -52, -51, -16, -38, -49, -89, -126, -111, -79, -60, -36, -12, -47, -23, -25, -59, -29, -42, -37, -59, -66, -93, -49, -1, -13, 62, 16, -73, -74, 23, 2, -11, -62, -92, -50, -74, -56, -83, -127, -103, -102, -80, -73, -97, -77, -77, -40, 29, 10, -10, 11, -5, -49, 15, 32, 1, -10, -29, -56, -110, -101, -66, -29, -60]
21525f0k5m0N0j3JJ9K6P9J4n2o0n0L8lK0L5Olkj5j5jJ0kk6OQ5q2l2O6l8k1K3LJ5J6q8R4%n2
21506g4Q2j7j4j5k7M1r0J4k0J3M2J0j5l9M9L7L4J1m1k9o0Q9j9O3L4p4m0l2L0o4K6K1L9n4J6
21489g3N9L9o3j7n0J1K0k3O5J2Nm4n0k0O9M6LM0j9l0o7L9j7J1K2j22O2K6J1M0JL6m8m0n4q
21472a28J1N4jj3Q7k8O8l5m2K1n3J8k2J7J8l4LjL4Q4p9J0M3n8J1n3j4J8jo1M6oN5K6j6L1l1
21454b1m6j4L6Pj4n0M1Q4k4M3k8lPK4j0J1N3o0l9O4k8k6j8K2k6j9k1NQO7l3n7J31r2n7PJ7
21437e9M4o0QL0K3J6l2J6q8K1kN3JN1n1n1K5J5k0K0l4n1N2Mj2P0l4m2N2n1O5M1j11J7K4M4
21420fJ7p3P6J0p5L4l0J6j5k5oQjM1Jo5L0L3l7mK8L6k5J5m6k7J5P3j6J2k1k5Mlo0l5O0J8k8
21401i6p8QN9M4N8m8nk5j0K3K2J3o7N4l5K9Nj1rn5L5%M2j7J7N2l8p8m4L1J4L4j5O1mJ6l8J02
$$ y = [-60, -85, -125, -75, -88, -87, -68, -42, 37, 51, -1, -61, -111, -73, -76, -56, -21, -15, -18, -20, -35, -50, -51, -41, -43, -69, -63, 22, -60, -92, -26, -64, -85, -62, -59, -44, -28, -116, -22, -22, -74, 8, -9, -23, -38, -65, -24, -114, -100, -120, -107, -65, -55, -70, -109, -60, -23, 11, 22, -19, -48, -108, -19, -38, 25, 59, -15, -55, -87, -57, -121, -95, -74, -35, -89, -73, -14, 25, -38, -55, -105, -94, -74, -97, -32, -20, -15, -59, -109, -129, -60, -14, -11, 29, 10, -20, -87, -48, -65, -54, -32, -154, -92, -66, -55, -15, -14, 22, -26, -66, -120, -128, -117, -63, -64, -77, 10, -18, 50, 15, -27, -6, -59, -41, -63, -46, -28, -62, -59, -60, -26, 58, -21, -11, 32, -26, -15, -68, -82, -64, -65, -126, -80, -86, -31, -5, -21, 10, -21, -67, -81, -45, -38, -52, -102, -61, 23, -1, 42, 14, 11, 18, 42, 32, 43, 96, 36, -3, 61, 33, 7, -11, 11, -15, -34, -55, -50, -42, 25, -8, -65, 66, -26, -83, -76, -59, -15, -75, -67, -37, -14, 2, -30, -14, -102, -81, -83, -30, -29, 22, -29, -80, -55, -40, -60, -40, -74, -125, -73, -69, -81, -11, -45, -87, -35, -86, -21, 20, -91, -74, -50, -6, 11, -62, 14, 24, -51, -17, -47, -31, -46, -71, -77, -69, -70, -29, -28, -93, -63, -30, -67, -71, -43, -7, -32, -17, -63, -90, -75, -2, -18, -6, -27, -52, -48, -51, -111, -146, -86, -68, -96, -174, -166, -107, -63, -5, -53, -58, -83, -93, -70, -48, -35, -102, -48, -83, -54, -49, -60, -69, -124, -89, -89, -47, -64, -47, 5, -33, -111, -155, -124, -110, -76, -91, -30, -34, -18, -56, 46]
21383D6L5n6N3kl1m8pl1o2j4K8J2lk5l2K7J0J8j3M0KL2k3jLN6k1Mpj04k4M2nj0L9M3o7P4R
21364a3o6N2K4m8k8n5K9O2rO9k0o1lJ6K9jN4o0jlK2k6J7l7K1K0m9kJ4N4m0l0m0K0P0o9J2N8
21346a8%L8N6q6n1j2m2L5M2pl5Q2K9j7j8Nm4J1K1j33L4Rk7K2O1K6l8k2j0N6N4l5j46J4N5M7
21329d4K8o7j9m0K4RL8pQR4rp6j6m6N3po6K4O0K7J5j6l7l3J5m9K2Nk3N5j7K1k6l4K4M5L7q3
21311a11lQ6K4j2o6J7k5L6J7J6j7Ll6J3L6Qn4r8MN1M6Q0m8K7Ko7lQo6R1j0MKj6k4l7L7K4J1
21292e0l7L9O%K9J6ok2LK3m4m9L4J8l2K0n7L1P7m0ql3J9j9L8L3jJJ5m5o9M9j3rPLM3q6J6K1
21273g9P8n4J1K2oMm7K9L4k9L7l5mj9n8L8K8OO6K2m5j5j7Pj3J4j5NJ9k9oJ14j09RK8M3m6R
21255crm1QK3k1n4m6M7J6l7L0JK8mL0J8k3k4K7j4j8k0lP3J4p5pJ8N3j1qj7j3M0m4l5L9P6K0
$$ y = [46, 81, 25, 78, 76, 45, -3, -10, -41, -103, -117, -89, -77, -80, -105, -137, -110, -100, -82, -95, -55, -53, -21, -44, -45, -42, 14, -7, -3, -10, -114, -138, -96, -101, -111, -72, -29, -96, -22, -13, -79, -27, -3, -51, -79, -134, -105, -43, -52, 17, -3, -64, -67, -51, -22, -23, 31, -29, -30, -33, -11, -37, -20, -57, -36, -16, -65, -67, -53, 1, -39, -69, -109, -89, -19, -88, -76, -18, -18, 20, 76, -10, -61, -73, -115, -80, -38, -45, -80, 2, 31, 14, -4, 1, -43, -32, -11, -144, -110, -101, -128, -106, -45, -19, -57, -79, -89, -33, 21, -14, -160, -146, -91, -44, -16, -83, -102, -142, -118, -109, -71, -78, -70, 24, 15, -61, -77, -123, -70, -77, -143, -119, -59, -32, -17, -33, -70, -103, -88, -137, -115, -110, -133, -78, -95, -74, -100, -134, -110, -65, -28, -111, -114, -28, -4, -16, -82, -65, -90, -54, -37, -21, -38, -35, -71, -58, -22, -14, -68, -166, -162, -111, -65, 15, -33, -6, -4, -71, -74, -66, -132, -41, -51, -47, -45, -61, -85, -122, -85, -61, -50, -87, -48, -42, -42, -13, 3, -3, -25, -22, 1, -43, -92, -58, -40, -72, -52, -109, -78, -1, -41, -49, -82, -63, -82, -44, -11, -12, -11, 4, -41, -110, -61, -74, -83, -76, -73, -30, -116, -100, -79, -1, -55, -44, -22, -28, -24, -71, -42, -8, -37, 0, -35, -39, -58, -116, -78, -50, -44, 22, 44, -1, -16, -33, -26, -39, -25, -40, -35, -16, -45, -51, 63, -46, -37, -9, 34, -12, -3, -12, -53, -45, -22, -43, -97, -143, -96, -80, -117, -87, -86, -58, -62, -32, -14, -37, -61, -34, -48, -66, -86, -89, -16, -2, -77, -84, -66, -13, -24, -32, -49, -62, -22, -66, -101, -62, 14, 34]
21237C4J0r3OM9r0K0Q7j4k6j0J8Kmr9J8J4K6k4M4O6j2k6K5K9n6J3m8lO5L1o5k1KPn2l3K8K9
21218e3oL7Nk2L6ok2qJ2j5m1M2J1J2J7n1j9L7L5Pn0K2k0k3M%J7lnLJ8PN5K5j08o2Q3O6k9m2
21199c4O0j5l3l2j3L3m7m4M8lk5J0K6N3J0Qm4k9L8J6j2k4nj4L4RK5l4oj4M3n2N8Ql6j4n0M5
21181e6K3m1P7l0k5L0rk4K3qK8j3Om7P8l7m4P3Qm9k9nL4Km9n3LK8J4Nj6L7N8K2m2L2Ll2L2
21163Gj7j16N5N5j7N2o8l3L2J0r9N1o0L2N4R3q4n0K7j3O7nj6l3k2N3k4lN8M5r6m3j5R0O7k9
21145Ek8J8l0L3p2oL9j8jK1k9J5L3qn6kP2L2p1l5N5K9j4n5o1j3L0rM6K7J9M5j2l3%j1L6lj3
21127b5%l0K6m3l6rK3J9J9L4Kk5l9N3N4oj39%oM9M7rKk3J08J7p2l6k9K4k9m4R8M4n7k7O7l6
21109c4M1l3k0j5Qp1K8K8O8J6j3q3ON2O2m4Qk3nkm8m7M7k9K0pJ7L3J0J8k7J1j6nJ8L9n8J6
$$ y = [34, 44, -49, -43, 6, -84, -64, 23, 9, -17, -27, -9, -7, -11, -110, -92, -78, -52, -76, -32, 34, 22, -4, 21, 50, -6, 7, -41, -44, 21, 52, -13, -34, -32, -25, -77, -110, -82, -53, -59, -22, -17, -39, -3, -9, -31, -39, -27, -42, -83, -41, -30, -18, -1, -52, -71, -34, 1, 8, -42, -20, -40, -63, -59, -59, -42, -45, -50, -47, -29, -22, 33, 58, -50, -112, -29, 37, 8, -34, 26, 11, -22, -54, -67, -34, -81, -125, -77, -80, -105, -95, -69, -16, -6, 2, -42, -71, -33, -17, -29, -53, -58, -72, -38, -29, -4, -38, -44, -58, -15, -67, -9, -1, -37, -51, -101, -56, -33, -74, 3, -27, -52, -22, -31, -55, -32, -40, -12, -25, -19, -66, 12, -25, -69, 4, 12, -37, -66, -71, -37, -35, -84, -137, -134, -106, -92, -87, -103, -66, -8, 14, -28, 4, 7, -25, 7, -10, -126, -71, -16, -33, 19, -49, -82, -50, -40, -139, -88, -148, -116, -62, 31, -53, -103, -76, -89, -22, -27, -43, -76, -98, -45, -69, -72, -14, 31, -65, -108, -123, -33, 34, 5, -23, -5, -35, -2, -74, -80, -41, -59, -60, -39, -68, -53, -20, -28, -84, -86, -14, 18, -53, -88, -33, -4, -18, -73, -134, -147, -117, -126, -80, -53, -34, 11, -1, -34, -34, -45, -9, -12, -25, -25, -55, -29, -72, -108, -117, -94, -75, -56, -22, -20, -45, -84, -31, 23, 17, -122, -122, -128, -79, -32, -41, -39, -62, 46, 63, -9, -45, -74, -50, -79, -123, -25, 19, -38, -65, 2, -34, 7, -26, -46, -61, -53, -124, -96, -68, 0, 16, 3, -80, -74, -22, 40, -4, 4, -19, -24, -26, -74, -121, -74, -103, -83, -90, -73, -40, -30, -12, -39, -28, -44, -49, -31, 8, -50, -34]
21091c4J6J0K0l5jk7Q1m3L7kn1K4k0j3N0r3n0l4M7M0k6K5l5L8P0k4j5j1l1J9K1M0n2nl2M3
21073e3J1kJ00o0q4j2L5K5K5pJ6o5n3RR2M8n9L4j18RM7om1L1J3M1o7rL7J2l0J7K7J0nm6Q1
21056Crl9o7ok8R0L4J3m2p2L1k6K1K0j1M1m2N7JnO2m3ol4nmj2K3j7k4K0j2M9j1J5j12PJ07
21038c3n5oM5O3j0k3J0L4l8m0L9rp3K3J06p7k7l6j9L4J0L4J7L8J0L2j3j6J9K0rqj53N1%oQ5
21020A9m1J2k2KQ3j23N6Ql8J7J6o3l8JM4K5j3oK9k1O1ln9n0K8m4J6J11n6r1R5J5M3L6n5L5
21003B9kn3l2m3L5O5k8M6k5PjK3m7PL9l8rjK9p2l1L2K6K7qm1P6m3J8j8Jo6J5l4N7oNL7qk6
20984e8J1J1l2l0J1QpK2K5K1j6J6j7Rl2K0j8L2L9Or6l4JO0Po4N4K0N5Oj0J4l7n2L7j2jlrm1
20965h4O2K7p2p7L4P6N8j6o4J1K2K4j4j2M5q5k0K1n3qL7JQn0L8L8n2R4L9mm4k6KJ0k1PO2K
$$ y = [-34, -18, -8, 12, -23, -24, -51, 30, -13, 24, 22, -29, -5, -25, -38, 12, -81, -131, -165, -118, -78, -104, -79, -114, -76, -6, -30, -45, -56, -87, -68, -47, -7, -59, -64, -96, -53, -42, -44, 56, -4, -88, -100, -65, -40, -15, -22, -6, -71, -124, -115, -23, 25, -34, 0, -118, -109, -62, -68, -109, -78, -65, -24, -91, -100, -63, -51, -81, -64, -37, -27, -32, -78, 3, -6, -45, -112, -118, -146, -56, -22, -9, -51, -123, -92, -118, -97, -77, -88, -47, -89, -32, -31, -36, 26, -17, -23, -57, -62, -66, -78, -55, -72, -96, -76, -88, -39, -50, -35, -147, -140, -33, -88, -94, -49, 14, 4, -19, -9, 25, -13, -53, -14, -23, -96, -73, 33, -44, -71, -107, -126, -92, -82, -48, -31, 7, 17, 49, 36, 20, 39, 59, 50, 42, -111, -60, -60, -66, 19, -22, -10, -32, -30, 53, -70, -14, -6, -44, -27, -11, -74, -112, -111, -67, -42, -55, -61, -32, -53, 8, 5, -54, -104, -76, -120, -104, 7, -49, -140, -45, -30, 13, 49, -6, 29, 27, -26, -58, -101, -66, -1, -29, 17, -8, -1, -2, 21, -26, -19, 20, -18, -27, -28, 1, -71, -102, -70, -44, -17, -25, -66, 10, -33, -15, -33, -32, -98, -83, -117, -60, -66, -61, -24, -32, -58, -47, -36, -68, -98, -87, -79, -86, -64, -39, -18, -34, -18, -35, -26, -58, -38, -56, -24, 15, 21, -75, -109, -108, -48, -41, -105, -51, -31, 24, 30, 20, 34, -3, -55, -18, -30, -31, -34, -43, -84, -22, 5, -67, -144, -110, -34, 24, 8, -56, -45, -23, 1, -13, -25, 20, -65, -85, -64, -117, -125, -88, -87, -79, -129, -91, -53, -105, -11, 28, 24, -20, -46, -44, -34, -55, -48, 14, 16]
20947A6l8K4J6k6j2k7l8KK6oK4Q9MNk3q6N6QoJ7m9j1Np4J9PL6Jl8M7l4j4L7m7j4K4M2J7j2
20928c3j9k4k6O0M4j07j9K0k3j8M7J2N1ol6K5j8M7j5j1K1p1L7OK0l0M8p3j2K8Lj0N3j5Kk2
20911f4J3N5q9o3P8J01k3J4J9l8q0%K2j9K4N6Jn4o9M4l4R7l1P6o5J7m5OJL9k7l0J8M7q4J0
20894g7M9j5mJpK0KOJ3ml5K7P3n3m8n4O8J0N3l1p7P2J6n4L4n9K0j1j6j8J9K1r9J06O2Lm4L7
20876FMlm1k8m0o4J21N7k7p9R3k9l3pP4m1j12J06k6oP7P0ml7n0l2l3L5j4N8n4pk3nJ6rm8K4
20857a11R9j1k5O7O7l7p9q9Q6l4%P3m5o1nQ6m9OJ3j%n8M8N8n3m8J8k7J%l3K1O2O3k3m1K4l5
20839g3j2M3J5n8J3K1jO4l2j1J6k5L4J5k4N8m6j06K0K9K3kN0k0J4l1k4KJ3J1M7j7j6k8PP2
20822D1r5l3M3k5k4j0Q1P4k8j15O2k2rL4jn2k5P3J4L8kMm8L2L6l0l2j5j8K6nk5l4M9nm9P5
$$ y = [16, -22, 2, 18, -8, -20, -47, -85, -83, -57, -63, -39, 50, 54, 59, 36, -50, 6, 14, 8, 25, -24, -35, -30, -104, -85, -78, -42, -41, -79, -32, -66, -80, -43, -90, -104, -80, -38, -21, -33, -52, -76, -102, -42, 2, -105, -124, -104, -127, -145, -98, -86, -35, -41, -77, -52, -70, -23, -38, -49, -28, -99, -62, -56, -36, -66, -18, -91, -103, -75, -72, -82, -29, -44, -42, -64, -51, 4, -85, -148, -70, 31, 8, 22, 41, 3, -77, -77, -55, -74, -50, 6, 7, -47, -116, -72, -106, -9, -40, 36, -29, -12, -57, -51, -50, -11, -38, -68, -50, -3, -87, -77, -28, -43, -47, -46, -53, -33, -31, -25, -12, -16, -51, -24, 49, -4, -52, -106, -38, -28, 25, -6, -83, -11, 5, -49, -15, -74, -54, -65, -81, -99, -80, -59, -158, -52, 10, 13, -31, 6, 10, 7, -34, -62, -102, -166, -45, 12, -15, -94, -1, -30, -63, -70, 4, -37, -149, -43, -69, -75, 2, 72, 68, 31, -19, -51, -84, -49, -63, -5, -59, -66, -89, -94, -78, -87, -135, -111, -12, -23, -48, 19, 86, 49, -30, -119, -33, -67, -67, 6, -39, -100, -105, -19, -68, -62, -49, -50, -50, -108, -60, -2, -55, -103, -85, -112, -111, -111, -144, -123, -61, 2, -21, -62, -38, -73, -85, -42, -27, -85, -72, -51, -52, 12, -20, -31, -15, -40, -6, 9, -15, 43, -3, -109, -89, -60, -37, -39, 11, -9, 5, -26, -50, -48, -35, -24, 23, 6, -10, -38, -31, 41, -54, -87, -44, -69, -93, -103, -22, 52, 24, -91, -29, -51, -60, -26, -27, -79, -104, -31, -17, 21, 19, 23, -25, 7, 43, 13, -19, -34, -52, -26, -31, -56, -90, -41, -46, -95, -20]
20805b0n9oK7K3kJ3k9j9L2m7MK0LJJ9Q0l5n3J2lPk9JK1k9j4J7k2OL1mJ02p5n8J1ON6nj09P8
20785d8M1M3L1j02k9Q8ro8m5M8K3KL9MM6k8m7q2rL1K8qM1Nj5Qm1M7Qn0M5K4%q4lK5rJ5o8l2
20766a35k2J1R4j0KL2l9L3J4J1Kl5K0qn6K8Q8p7L4%k7Pq9J2KQ7j5lj7J1l7k2M3j3Njk5O0q
20748d3M5o1n8M6L8l1l3l3kJ11k8l6ml9j4J14%l2k7N9lO6q1j2L5k6k4K9L6L8k2n9n7K3k1M8
20731e8j1k6N2J5M1p7MK6l6j8O7M7n7J0n8K5N6nJ7L9pn1J2m8K5l2o9O1MJ5qK1nN4m9J2l8l3
20713h3n7M2K2M1N0n2N4jk8j2K7k8j9J8J9Rnk0pL6n3KK2m1J2l0K3L5l6Om1J4R6nk5m2K0kM6
20694GK0P4m8k7o9j6M7n2J3m8P1QM5k0K6n1M2Pr4QRO6j0r9KL2l2J11JKL1o8MJ7j2M0J2l1N5
20675G3j6k9j2j4m5O5mn2q5%R5L0j1lm4J0J6J5k9J9JO6K0o3p9LK3km9N2n7P4Q4k5m0rn1J2
$$ y = [-20, -79, -85, -58, -35, -37, -24, -53, -72, -40, -87, -83, -63, -60, -59, -40, 40, 5, -48, -36, -39, -32, -61, -60, -39, -68, -82, -65, -87, -81, -50, -54, 48, -27, -85, -74, -68, -12, -17, -126, -48, -7, 36, 67, -35, -64, 24, 15, -53, -98, -50, -27, -25, 14, 18, 64, 36, -11, -93, -102, -71, -43, -51, -10, -5, -20, -12, -53, -6, 2, -48, -3, 21, 21, -63, -66, -41, -50, -35, -103, -135, -157, -146, -52, -62, -60, -28, -67, -34, -20, -9, -7, -42, -22, -30, -86, -58, 30, -47, -13, -13, -40, -33, -122, -110, -108, -21, -36, -39, -56, -45, -82, -104, -61, -74, -69, -70, -95, -35, -43, 2, -59, -117, -71, -33, -64, -97, -130, -132, -21, -49, -85, -89, -128, -142, -28, -28, -60, -87, -28, -31, 35, -46, -58, -23, -49, -73, -44, -8, 30, 8, -51, -108, -85, -106, -58, -69, -95, -43, -28, 13, -64, -60, -34, -70, -88, -21, 26, -31, -21, -79, -54, 2, -3, 14, 53, 46, -5, 7, -41, -16, -48, -117, -56, -52, -37, -45, -24, -29, 25, -24, -12, -50, -83, -140, -98, -76, -35, 15, -37, 17, 16, -12, -24, 3, -25, -44, -26, -7, 2, -3, -23, -30, 6, -47, -45, -23, -64, -52, -82, -59, -24, -60, -54, -95, -81, 15, 10, -15, -57, -37, -39, 7, 27, 101, 53, 26, -43, -59, -12, -64, -51, -99, -28, -20, 25, 5, 31, -20, 22, 29, -65, -57, -48, 18, 8, -91, -89, -57, -89, 22, 23, 25, 56, -12, -8, 9, -3, 37, 49, 18, 73, 57, 28, 16, 2, -43, 22, 18, -34, -119, -119, -24, 6, -5, -8, -52, -42, -26, -11, -40, -21, -20, 46, 66, 3, -76, -73, -50, -52, -101, -49, -106, -32, 52, 27, -13, -22, -73, -61]
20657f1qJ4O6J4l3k3lk3K0k6k2J2L0nm7O8k5j2K5N7j41L3L4j7j9QN0M1kL8n9q8q7M7Q7K6q
20640c9q9M9K7L2m9K1K8J8l7j5N1J3l8p9O8M5Ko1K4Km4N7k4L9krJ7r3j2L1M4M7p7l2O6l9k2
20622h0L5J7N2j0r3l2L8k1N3n2n0N1PN8J9m7RL9jj4k7Kj8N7k1Rqj7L5J4No2N5l4L3n4k2M6
20604b9j6p8M8M4k6qK7Nk9J3M5m5p8J3J33Nj1l8p5J7K1NL3J4o7k6O1kk9k5RM6JrPj8k4M7n3
20585i2k7O0P1q3m6M6L3m2L7L9k7rp5JO4j9j0M1lj5PJ1K5n5M2Ll1%L1m1J4MM0Jl3NN4p5m4
20567i8l3N7M9M6r1j2nM9K9m1OJ5K4k7J2l9J4M1l7L7L1k3r0J6Q%J6k9J5L1N1O3m9q6J0MpK1
20548b2Op0O8l4j1L1P6o0k0j8M9j8o7l2K7P0q7k7K7rM9M0J5q5j5Q1K2k2k5K8K8k7J2q%J7l8
20531d9L8jL2k5n7k7j0oL2J0k2L4Nr5P4NK8K4rkj8k0n4k9O5J31r1ql0J0M2j5qJ7k8l1O1m8
$$ y = [-61, -69, -55, 11, 25, -8, -31, -34, -57, -37, -63, -85, -73, -43, -48, -95, -27, -52, -64, -39, 18, -123, -90, -56, -73, -92, -84, -34, 7, 5, 43, -16, -104, -191, -144, -57, -31, -39, -128, -79, -52, -20, -69, -48, -20, -2, -39, -54, -3, 10, -28, -107, -39, 6, 8, -53, -29, -27, -71, -14, -38, 1, -1, -10, 7, -86, -98, -67, -23, 24, -53, -85, -19, -58, -80, -45, -28, 24, 14, -79, -111, -73, -94, -41, -93, -143, -92, -85, -27, -8, -55, -46, -7, -8, -22, -49, -47, -65, -8, -29, -20, -28, -45, -10, 4, 9, -53, 2, -32, 1, -53, -75, -29, -45, -123, -75, -31, -57, -65, -38, -33, -62, -49, -4, -49, -127, -114, 19, 24, 13, -25, -100, -83, -62, -57, -24, -10, -77, -103, -42, -44, -73, -98, -89, -43, -42, -51, -44, -62, -86, -39, -92, -119, -59, 12, -71, -117, -71, -38, -80, -43, -4, -31, -40, -115, -114, -50, -69, -79, -38, -41, -56, -49, -38, -13, -68, -26, -23, -54, -54, -23, -64, -50, -46, -6, -5, -38, -33, 21, -54, -98, -131, -74, -25, 21, -70, -82, -87, -38, -9, -50, -44, -29, -5, -32, -20, -59, -45, -4, -41, -4, 27, 4, -86, -70, -62, -62, -46, -75, -60, -29, 22, 85, 36, -50, -40, -36, -43, -22, -16, -86, -18, -52, -63, -32, 44, -16, -36, -54, -5, -23, -90, -122, -95, -25, -112, -139, -112, -121, -72, -32, -17, -102, -117, -36, -14, -36, -61, -33, -5, -32, -20, -28, -28, -11, -49, -11, -12, 20, -5, -62, -89, -99, -105, -73, -63, -85, -51, -46, -141, -67, -62, -34, -10, -19, -21, -39, -59, -113, -142, -77, 54, -37, -45, -75, -65, -23, -38, -46, -29, -57, -88, -27, -75]
20513g5l2Nj4pP5k2k1nqM0lQK8J2Lk3nJ4p4K5Q0Kn4J6j4K5l8K9Pm5L1m1%j0ML1JL0r3NN8n
20493f0k1N3M7n8n5M4jN9K3k5LnJ0rq6k1O4k7nnJ4jK7P8K%m9lN2l3kQ9k4k7l8l1J4k0M0m9
20474c6j6L4K0K6o6K0jn9L2L0j7l1M2K3k9k9l6pN0Q8m5ML1jM3l7p2m1j2O4RJ0o6m5n5P5O1
20456c9K3q6j2K9l6j3O2j6m9JKJ09k2%J9k7n7O0M9jm3o8J2M8j8KpL7j4M4K1j5J9K1m0j2o8
20438h5k8MK6L8j5K8J8Rq4K6M2M3m7n3J5K2L4M7p5%L6l4o5oN7j1N3mk4m0l6K4M5K5k0l6L6
20421c5L9K0o6m7K5R4r1q6O9kJ0%L2OJ7j9j1L1o7mN3nk5nL3j4K4P4p4Ok6q2J25l8l9K4k4N
20403g3J0PK1KJ01l3p9M9Jn8l2j2K8m3J2l0L3P6l0l1j1J6O1m2M1J9PL1l2n7o6J9m6P6j5pO2
20385b5N1p5k3J7J5n2nM1j9nL8om4J5j00M8K7M1l8rP0M2j4j07J7M0k3j9N5N6j5Mn8M2J3j6
$$ y = [-75, -107, -102, -116, -123, -48, -70, -91, -96, -104, -64, -67, -59, -31, -19, -16, -39, -44, -30, -104, -79, 1, 3, -51, -35, -49, -24, -62, -33, -26, -71, -40, -81, -81, -91, -87, -56, -55, -25, -118, -113, -55, -60, -81, -28, 19, -39, -94, -50, -51, 8, 31, 6, 9, 4, 14, 5, -81, -102, -38, -65, -70, -75, -61, -62, -35, 43, 45, 45, -4, -7, 45, 12, 10, 99, 75, 48, 10, -21, -7, -27, 13, -36, -52, -18, 2, 28, -38, -18, -19, -78, -46, -16, -33, -64, -22, 1, -28, -57, -93, -100, -50, 38, -7, -3, 28, 27, 70, 33, -39, -80, -92, -28, -19, -9, -75, -120, -175, -100, -39, -16, -102, -114, -85, -121, -134, -72, -88, -137, -136, -134, -25, -47, -47, -28, -55, -112, -52, -3, -4, -47, -115, -103, -55, -73, -71, -78, -41, -55, -11, 10, -5, 14, 35, -5, -17, -85, -113, -109, -83, -45, -60, -32, -14, -5, -89, -63, -21, 22, -25, -78, -63, -41, -7, 40, -35, -35, 1, -33, -98, -104, -47, -58, -5, -9, -33, -73, -109, -85, -40, -15, -35, -71, -35, 4, 24, -42, -89, -64, 30, -61, -147, -78, -80, -70, -70, -38, -32, -15, -34, -45, -14, -81, -85, -32, -37, -62, -67, -34, -48, -24, 50, -24, -18, -44, -126, -1, -39, -78, -54, -78, -73, -63, -56, -35, -33, 68, 35, -44, 5, 6, -52, -84, -96, -68, -111, -99, -129, -96, -20, -50, -81, -92, -76, -15, -57, -16, 3, 10, 41, 9, -48, -114, -95, -141, -65, -80, -87, -25, 26, -49, -72, -55, -40, -92, -97, -56, -75, -80, -42, -48, -92, -77, -177, -129, -102, -61, -99, -108, -38, 4, -10, -117, -100, -60, -83, -102, -47, 9, -6, -2, -60, -18, -5, -21]
20368b1K8j03j5Q1k4o4O4j5J1K3K%J9pj7J6Qn3k5K0L5K4j2k9L9j8m%l2j0J7j7NNJ2m8L3J7
20350e5LmL9k2q1R7J2q2N1j4p3k1O8N8M8l2m1j7k2l1M2K9M6j9j0k0k4L5lRP5m1N2l5p6Ml2
20332h7MP9k6m8L2K1k5k7j1RJ2K0J13m9k2k3J9%MK0Qo0m7K0m4j3M1J0oJ1jn3LP0L2m8l2J05
20314A1n3n1L5K6p3rL0N9Ol5M9m0k0n1J7N3M9j08m6L7P2m5nM9O0On1Rk0k8P9J4j5k1j9Mk6
20296e1j4L6J9l8j6O2l7m2N2jm7K6l9J4K9j8O6j8m9N7J7k5p2K7k2K7J6m5M7rq7L4N5K9K9L4
20279D6n9qj7qm5K6N0l9qK6O7J4n0o0jJ9K7m9J3K9pl5nL3mn6jN9kK4k6k1j3k6JN7M6K0O3r1
20260a1n8J5J3j1P0J2l4k6k4K0n7K7O3j2KL5j8j7l6j8K4JJ1j9Oj9K3l3K8j2KK2J6O2k2n6j5
20242d6%L6K0j1M1j08lJ00l2k9J0m0K1jJ7L5m1m6QN1Qk4NLN2jk1q1j4rmj2L6k9N8P4p3Ql5
$$ y = [-21, 7, -96, -111, -30, -54, -118, -54, -69, -58, -35, -33, -33, -14, -21, -38, -22, -14, -67, -92, -72, -37, -13, -25, -54, -15, -33, -37, -37, -69, -79, -62, -79, -74, -69, -57, -105, -72, -55, -52, -56, -17, -39, -120, -23, -11, -93, -42, -56, -129, -150, -82, -24, 24, -8, -49, -66, -88, -119, -77, -48, -2, -21, -31, -51, -75, -40, -43, -34, 41, 0, 52, 17, -59, -55, -87, -83, -4, -30, -78, -46, -25, -50, -77, -88, -79, -67, -47, 66, 17, -5, -28, -9, -9, -5, 15, 23, -37, -84, -64, -108, -121, -80, -70, -76, -65, -66, -119, -116, -46, -14, -62, -94, 11, -42, -93, -58, -32, -105, -114, -84, -25, -19, -54, -5, -45, -65, -116, -99, -46, 3, -105, -151, -114, -42, -87, -92, -43, 17, 23, -28, -19, -39, -67, 12, 26, 11, -10, -29, -25, -51, -65, -29, -10, -48, -64, -2, -39, -81, -29, -30, -77, -51, -90, -76, -47, -65, 1, -17, -66, -9, 8, -17, -89, -62, -84, -57, -41, -86, -39, -48, -135, -101, -46, -17, 12, 46, -13, -21, -38, -46, -91, -65, -15, -54, -62, -36, 31, 45, -5, -65, -66, -47, -20, -69, -56, -27, -34, -69, -74, -41, -45, -101, -102, -43, -45, -21, -47, -68, -81, -107, -106, -49, -3, 17, 80, -11, -69, -54, -41, -52, 18, 30, -4, -30, -54, -34, -91, -64, -1, -13, -11, 24, 6, -11, -47, -65, -41, -40, -29, -48, -42, -61, -38, -71, -43, -55, -53, -31, -15, 47, 25, -31, -46, -46, -10, 10, -1, 40, -68, -71, 29, -3, -32, -22, -62, -41, -42, -25, 10, -31, -77, -69, -18, -10, -34, -29, -26, 26, 25, 4, -77, -91, -100, -104, -116, -80, -109, -51, 23, -50, -42, -77]
20224g7QO6lk7q5L6J4j8J4j8k2R4l5nj6k3K3M6pQ%j6%l3L1j4k0k4J3J05p7Nj1qM3K0L5Pk5
20205Do2j6K9k5J1K5N2k7jl5l0nK4l5J4LO4m3n0N8k6P4%j2j4J6QJ5p6k9M7J4n5N6L5j17J7
20188i2K9M1j1J8N8J2r9o7O6N5lj09O7L7jk3N1mr8M9j3%N1k0Jn7lk0Q8j5p2J7K1N2J2k0n0
20170e2o1O1n5MR8o1l2Q7K3K7Op1j7k4q2M7J7K2J0K3kk7k6O1krK7n3o6L5Q3j7p3%rKM6N7l8
20151d1k0N3n7J4m6j7k6O4N0jk5O5j7L7n9LM6m9nN5mj9Lj8pK6o1j0j1J6rkLk8L0l7L8KJ0P
20132d7MJ0rj2K8Pj1q8jK1O6L1k4K0J9r8m8M4N1Nq0O8P0n9l7O0lK6l6l4JJ0nQJ8j2Mj07R3
20114d7j5qK2o5M9M6l0n8N8lM1L2m7k7ko5O3p8RM6j4j7M9m3K6J6N6NL0Pm4o6J1L2J1n1j2l7
20095a20N6L5NK1np2RM1n9pM0j6Jl6O6j9l5R0k5l2M3j2j7l1K2K9M7p1j2k5M1p5M2N0J3p5j7
$$ y = [-77, -69, -3, -6, -33, -118, -82, -68, -86, -72, -90, -112, -18, -53, -58, -74, -97, -74, -28, -35, -27, -27, -43, -43, -76, -45, -59, -79, -103, -90, 15, -62, -57, -68, -76, -33, -13, 22, 29, 4, -58, -74, -45, -70, -59, -34, 18, -9, -10, -45, -75, -80, -56, -91, -77, -74, -10, -53, -103, -45, -71, 3, 3, -9, -23, -7, 1, 16, -60, -89, -42, -28, -83, -27, 8, -109, -92, -63, -22, -33, -15, 43, 55, -44, -111, -45, 10, 7, -102, -35, 2, 1, -22, 29, 25, -73, -24, -37, -37, 14, -6, -5, -62, -65, -85, 3, -12, -84, -67, -46, 6, 18, -2, -52, -113, -52, -107, -103, -5, -66, -98, -11, 12, 39, 45, -26, -43, -67, -149, -102, -85, -63, -53, -30, -32, -59, -85, -24, -26, -35, -8, -61, -127, -92, -9, -26, -99, -99, -108, -106, -60, -3, -41, -61, -8, -65, -51, -97, -114, -140, -76, -26, -27, -52, 13, -4, 33, -26, -23, 23, -26, -31, 24, 20, 1, 4, -14, -21, 5, -56, -66, -77, -61, -70, -72, -69, -97, -67, -104, -66, -64, -54, -47, -43, -33, -42, -54, -26, -19, -30, -118, -119, -98, -32, -1, -25, -5, 14, -84, -132, -88, -37, -32, -112, -44, 26, -33, -70, -10, -13, 13, -23, -57, -56, -46, -51, -43, -25, -37, -33, -140, -47, -62, -70, -48, -113, -64, -18, -48, -106, -48, -51, -10, 22, -25, -52, -54, -119, -56, -134, -125, -79, -93, -110, -61, -104, -78, -62, -6, -1, 29, 36, -8, -74, -63, -31, -20, -71, -83, -120, -64, -29, -24, -3, -8, -80, -71, -30, -89, -96, -56, -72, -71, -107, -41, -60, -95, -5, -30, -62, -19, -31, -48, -79, -57, -28, 19, -52, -64, -89, -48, -123, -81, -31, -18, -93, -110]
20078a10rK0N2K3K3Mj6n9j1N0k7l4l6jO3N6J0L4lk0l0n9Q5N5Pl3l5l3N3J6j1J5K7l5m9O0o7
20060b5K0l5K5J2j3m8P5N1j08OLQk0M9J2m6l6l4R5j6l4OMK1Q%l6L0km4j6J5OO4Rj4m1L1O5
20042D7j1K2J6P1o8l0M5K7N6J08J8J02Q1K19O86J618M471L862l850m795j398n27k84j91r9
20030A96j26o4O8j8n3QK1K7l1o8j0M8k6jl1J8Q5M4j7q9PL2m1RmK0L2Lj6p5pk8K7K7j0K5RK6
20012A7n2n1L0N2M1J3m6ojL4NjK5L9rj02mK0q7k1J13L9kj8p1P9pk1J1j11J2M6pLl4J0N7Rp0
19993f6nn4L5M4k3lJ12o4kk3pK8PK5Kp6M7L5o1L2l6L9J9k5M1n1L1Nl2m3O1J7j1l0n1J4N2o3
19975h0k7l5lO5R1o2j4L4o2J4j6rO4K3L9lrL6Qn4m5J8j4j8M7m5l7L6L5J3J9O6n5Om8k6l1Q
19957g1l2J8K0kJ19o2o6N8j0o8l0nJ10K2q0O2J6P6p2n6N4K7j7n9m3L8oj2k3P4P4j22rK5K1
$$ y = [-110, -119, -99, -47, -24, -1, 3, -13, -72, -83, -33, -60, -94, -130, -131, -68, -12, -2, 32, 29, 9, -21, -80, 5, 60, 67, 34, -1, -34, 19, 35, 24, 39, 66, 31, -18, 42, -25, -5, -40, -15, -3, -16, -64, 11, 62, -46, -40, -37, -29, -49, 0, 12, -34, -70, -104, -9, -25, -59, -53, -49, -28, -20, -20, -56, -26, -28, -72, -88, -73, -67, -3, 6, -8, -49, -18, 47, 36, 58, 74, 145, 77, 47, 92, 119, 175, 283, 301, 403, 484, 703, 1389, 3007, 7478, 11340, 7490, 2695, 1297, 770, 486, 295, 196, 70, 6, 74, 56, 3, 11, 32, 59, 28, -40, -50, -2, -28, -29, -60, -42, 43, 87, 70, -19, -12, 20, -21, -12, -16, 4, 36, 39, 23, -52, -59, -87, -60, -33, -43, -18, -9, 17, -35, -86, -56, -4, 37, 50, 4, -2, -3, 31, 36, 35, 60, 99, 90, -12, -16, 4, -83, -104, 9, 48, 46, 28, -43, 36, 29, 8, 19, -92, -80, -34, -41, -38, -72, -62, -5, 4, -66, -71, -125, -90, -46, -69, -72, 40, -24, -26, -49, -56, -28, -21, 4, 6, -70, -23, 12, -49, -17, -53, -14, 5, -20, 21, -30, 1, 6, -26, -69, -8, 9, -2, -32, -83, -69, -17, -80, -107, -142, -145, -80, 11, -51, -65, -31, -93, -79, -95, -104, -40, -17, 22, 19, 10, 46, 54, 0, -45, -27, -41, -59, -12, -57, -94, -58, -23, -10, 9, 75, 20, 26, -22, -48, -79, -71, -103, -85, -65, -67, 52, -10, -76, -18, -28, -96, -126, -131, -21, 1, -79, -17, -1, 75, 3, -53, 1, 28, 11, -48, -91, -53, -59, -71, -94, -20, 54, -68, -77, -52, -31]
19940c1j0p4M5L4Qk1J3j7mL6mn0j6N2K7Oj0K0l6om1J3L0rn9L9K6n2p2L9NK7NK1P4jm4K7p2
19921h2K8N9j7M6J7j7J5k4mRk1n8K4qNk2L8ml8k0j0L6N4J5nlLk1M9Nn6l7K1k3l1N1O2p6m7
19903h7K2Rj9k3j9N3N9j5k7j0M5l0J0o4J5L5q2K3L8pM0m4J8L1Ml3R0n9n3nKK5L0n8N2N7m4
19885b1o4P8nJ1m5k3jL1J1j6J8Ll2k0J6MM1Kk2o6K2O8J6l6po7k5rJ2L8J5K6k0J6k6j4K9mR
19867e7J2kj9j7M0K3j3o2M7k2L9n1P2QJ3j2m8Rn1N8K5m6nM7l5OJ7n5j2M9P1l3n1k7L0J3l9
19849g8J7K9NM3l7p7mJM2n1K6O8l7K5Rk5J5L1l5L8n6L0l7J1n2K7J4moqn2O2NL8l6n7M9k3l8
19830a28O6o3N8J05p2Jj1l2M0k3N8Rl3n9M5pj9K5NRk4JL6p0K3nl6ol3K4K5O3rLLjm3k0N3k5
19811f7M6J9J6m7qRm6m9nJ00m2l2M3O6J2Nj9L2l8m7J4L4L0o2Jm4RK0n1N6lj4l0oO7Np7J3J6
$$ y = [-31, -41, -115, -70, -36, -28, -49, -36, -53, -57, -21, -25, -75, -91, -39, -12, -6, -16, 4, -32, -38, -79, -66, -36, -45, -104, -65, -39, -91, -163, -124, -119, -92, -87, -66, 8, 7, -37, -10, -82, -54, 5, -12, 34, 51, 34, 49, 25, 21, 30, 9, -49, -25, -33, -28, -50, -12, -16, -54, -74, -84, -48, 6, 21, 16, 13, 16, -5, 44, 49, -7, -44, -23, -46, -77, -26, 36, -40, -87, -65, -56, -75, -98, -117, -64, -5, -20, -47, -57, -12, -42, -32, -96, -81, -46, -128, -105, -67, -74, -34, -78, -60, -29, -25, -58, 32, -27, -80, -85, -83, -58, -28, -86, -34, 23, -21, -85, -7, -12, -1, -46, -69, -70, -39, -28, -44, -26, -23, -55, -75, -59, -55, -14, -12, -34, -100, -78, -10, 6, -30, -37, -104, -129, -138, -126, -88, -73, -47, -67, -51, -77, -91, -62, -66, -57, -45, -47, -66, -83, -43, -20, -33, -95, -48, -70, -31, -82, -10, -2, 11, -1, -49, -40, -91, -33, -8, -54, -59, -12, -47, -41, -24, -79, -91, -42, 29, -4, -55, -82, -52, -39, -78, -61, -32, -27, 16, -21, -98, -102, -101, -59, -110, -84, -16, -53, -28, -19, -44, -29, 2, -33, 5, -51, -21, -58, -47, -99, -72, -58, -62, -68, -76, -128, -66, -61, -23, -59, -116, -67, -90, -128, -62, -125, -67, 38, -34, -33, -44, -76, -36, -59, -1, 8, -25, -84, -39, -46, -65, -40, -35, -26, -50, -49, -13, -83, -60, -65, -101, -107, -140, -116, -91, -28, -37, -34, -31, -32, -75, -95, -42, -67, -21, -2, 14, -33, -41, -32, -78, -127, -132, -32, -74, -106, -63, 3, 15, 20, 1, 33, -5, -52, -38, -4, 26, -36, -35, -79, -70, -50, -101, -45, -48, -62, -92, -98, -31, -26, -103, -90, -74]
19793g4N7PJ2j02J1MJk8lnO7k3k9O9K5ook6%m6k0pPj2O7j6M2NPJ4k7O7o0r0N5LJ5l2np0O6
19773h6K4p0mK7L2K6N2Nl5M3m9lp2MJ2M7L2rk4K4pk1L7J0m4J4j8Q1k4l6M5M5j10k4L7Klmj1
19755e5J6M6mj0j0m0p5L3RP6l3j1J2K3O4q6Ml7J5J5m4L5Rll7k0k1M8K9P3lpo5J9k3k9Q7l4
19736c4p1K0oL5l7m0O1kk7N2Nl3N9L8n9m8m8j3R6j7m2K9kP0n4l7J9J7OLR8mJ8l9q3J2nJ6P
19718d0m5j9L5j1M4K1k4nM0m7p9L8PO2l9J6orjN2l3j7O3rm3Ljkk2M6j9k4Q9k4m0qM1N2K3j8
19699D7p9J4Km5JL9oo3J0L1L5Nl0J4Jj5l3k3l1L8L0K8P2K7j15k4J0j5K5j6K4J2n7K0K7l9K2
19681e7lJ3o1N1J0J5J9j03K4J2K4LN5k3l9J5j1J9M5Kn0J5j7j09J6R9%Pn4On7L4J9L9k0j5J6
19663f1m4l7N1J7J5M8L2q7j3N5J5J7q4MQ4l6k6lOK5l4Pj8m3N1QN0m1n0%l4nN1N3J5j1M5l9
$$ y = [-74, -17, -10, 2, -100, -89, -85, -84, -112, -115, -120, -53, -76, -105, -36, -11, -17, -23, -49, -49, -95, -115, -122, -115, -127, -60, -76, -34, -29, -22, -8, -35, 32, -28, -118, -63, -60, -45, -77, -82, -152, -86, -62, -132, -136, -109, -77, -51, 1, 6, -29, 14, -35, -38, -110, -106, -94, -47, -15, -24, -48, -24, -31, -52, -15, -5, -49, -35, -53, 28, 4, -32, 13, 58, -52, -76, -39, -37, -40, -44, -55, -39, 7, 3, -7, -17, -57, -132, -99, -90, -14, -47, -58, -46, -23, 41, -45, -41, -78, -63, -48, -92, -57, -48, -51, -88, -108, -129, -81, -52, 21, 18, 11, -54, -35, -58, -87, 0, -34, -105, -85, -91, -56, -93, -133, -72, -74, -101, -49, -44, -77, -18, 20, -39, -87, -135, -148, -52, -69, -111, -82, -84, -14, -68, -105, -86, -69, -63, -60, 38, 34, 52, 13, -70, -58, -63, -47, -40, -85, -104, -69, -80, -36, -15, -39, -44, -4, -51, -130, -92, -85, -23, -62, -46, -52, -61, -62, -10, -43, -60, 3, -6, -49, -46, -47, -49, -71, -25, -44, -68, 21, -3, -43, -51, -10, 42, 65, 47, -32, -18, -16, -61, -60, -21, -27, -90, -80, -49, -14, -9, -39, -25, -24, -39, -72, -95, -126, -88, -58, -30, 42, 69, -46, -70, -60, -75, -50, -66, -42, -30, -87, -67, -40, -79, -57, -60, -47, -108, -57, -47, -32, -13, -116, -92, -80, -56, -53, 2, -21, -60, -45, -56, -37, 8, 10, -40, -25, -42, -151, -135, -36, -36, -29, -83, -77, -134, -100, -81, -42, -62, -77, -61, -105, -142, -91, -74, -59, -11, 21, -66, -79, -24, -9, 8, -76, -72, 12, -24, -50, -53, -47, -22, -56, -49, -67, -110, -59, -51, -1, -42, -92, -92, -126, -131, -80, -27, -12, -23, 22, -17]
19645a7j7o%j0k4QM8k3%L5j6J1p2qQ0l4j5K6J4k2O4j6n7P0m7l9L3Jl3K3L9m4jk5O2j10JN2
19627f9O1K5l9l1k7L3mK8K3l2m8Nm2k2R0l0K4l9M3Kr4M1K3K1J0o9Q5N3m9O5o8l5JL1K9k5n6
19610h6J09Jj13j0j1p0N6M5J2L6O6j02M3nj1j4jJ7j0Pj3l7N7M7N6qj9l7m9L7m6j0M7j0n6l3
19592a15J07J4l1o7M5j9%L3l7K3pj0l0kJ8m7R5NMnj1j5k6O8j4o7oL5L2l0K4P8l9l5mK7J7q
19574@m1KL7Ro6M4l2nj8q3RN8K8kK1L2m0LJ0j0n3j3J3M7Mo9kK1mN9k2j08N7M6pm4m2J07K6
19556b8l5N3M1m8J2p4N4M0j3oq1N6N2jon8p0k5L7QNL2%KQ4m9Poq3O6J2l7k1K6J7K2p7j9M0
19537g1p9J5j1K2K8J2j3L5j1kk6O4J3j05j9P3Q5Qk0j3l5J3K5pk6o4L0K7n4J17m8k1KM7qn9
19520g6J8J4m2P7lo0mK5L1pLm0l9qJ4LrN3K4J7q4rL2k6k3mj2J48Qo4MK1L3p5K9M8j3k8j0l8
$$ y = [-17, -34, -40, -40, -50, -74, -66, -18, -41, -41, -6, -22, -11, -83, -91, -11, -45, -60, -34, -20, -42, 22, 6, -51, 19, -28, -67, -34, -33, -66, -43, -4, -48, -49, -74, -12, -122, -121, -69, -8, 17, -22, -53, -80, -47, -51, -23, 0, -32, -80, -75, -117, -139, -49, -79, -55, -94, -51, -49, -143, -102, -79, -58, -48, -117, -32, 21, -28, 37, -31, -66, -65, -34, -5, -30, -86, 23, 24, -89, -99, -110, -180, -124, -79, -67, -31, 35, -67, -24, -29, -40, -54, -55, -38, -48, -41, -54, -91, -34, 13, 69, 61, 42, 5, -44, -7, -53, -63, -16, -26, -82, -115, -8, 6, -25, -92, -47, -66, -66, -33, -70, -47, -54, -64, -94, -96, -78, -125, -30, -25, -21, -26, -37, -52, -78, -10, -24, -91, -97, -62, -30, -60, -36, 42, 3, -32, -36, -9, 8, 0, -41, -39, -2, 7, -59, -15, -47, -52, -70, -153, -144, -86, -58, -60, -39, -7, -47, -44, -34, -44, -97, -110, -97, -50, -46, -115, -117, -96, -100, -41, -63, -171, -114, -68, -75, -119, -161, -54, -28, -63, -10, 31, -17, -5, -79, -25, 15, 2, -4, -85, -29, 23, 22, 16, -42, -112, -137, -100, -92, -87, -55, -55, -53, 31, -18, -11, -17, -100, -34, -22, -59, -80, -54, -37, -15, -92, -111, -71, -150, -135, -146, -124, -96, -84, -97, -62, -73, -75, -101, -37, -24, -129, -148, -75, 10, 18, -2, -15, -50, -37, -12, -19, -45, -109, -79, -52, -106, 11, -37, -58, -56, -9, -17, -76, -58, -44, -86, -9, -12, -72, -76, -51, -20, -27, -24, -64, -103, -111, -97, -94, -103, -50, -26, -9, -93, -102, -70, -96, -119, -123, -135, 13, 21, -43, -39, -18, 15, -60, -31, 17, 4, -24, -34, -72]
19501g2NQm2K4L2J0J0k8m8l0M2M8NMM5j8l8jM1rkjj00rN3M0j5O7j4r6j4J10ok9J3l9M7j4k5
19482d6j2r9L5L6K5k5M5m3k3k6O0Q2J3p3p9N0Q5m1j8o7oM2J2L4J5m2j6K3K1m3nLL7PM9L1o5
19465b4rj6L6J1k6l4RM1L5J4j7p1L9m7m9L2R3lj00K7O7n6kj6J3k2J4J7k4M3P7J5m3l9K2j4
19447gj7j7rO8j4l9l0KJ6m5j4K4n3%N2j3K9nJ2N4lNJ6j7n9mN8%J8l6K0k7j4mm2M8N0p0J9j5
19428f3M9JJ3K3kk7nJ8j2mj2J9k1Kl9L1O2p5No9K1O0K2j4K8K9oJ6n8n3K4L1l6n8K4LK5J3k8
19410f3N1j8L5L0n7o2l9L6O6m0l3RL0Pk6L1L1K6j4n1J3k3J9m4P6Rk3J4M6l6p6O8j2J8n7rK1
19392d7j6L7m2m4j6J02J6l9L1K8j3o4n4pK3Jj5L0M2ln1L6O8J8n9k8RM9k3p3Rj9N4mOJ5Q8N
19374E0m1J8n6j3J8%l0N3j6k1pqm2L1m5PQK9k5K9R9k2qj8o2N0J9J5k2JLo2j5L4j0N6Ql1k4
$$ y = [-72, -67, -59, -101, -77, -45, -35, -25, -53, -101, -131, -89, -41, -36, -32, 13, -5, -43, -44, -3, -12, -14, -15, -115, -124, -71, -31, -46, 21, 7, -89, -103, 7, 1, -28, -15, -54, -7, -21, -46, -58, -157, -122, -86, -61, -86, -41, -84, -107, -133, -73, 9, 22, -51, -130, -80, 5, -36, -54, -121, -127, -85, -73, -39, -24, -66, -82, -59, -38, -81, -86, -83, -46, -39, 10, 41, -24, -33, -49, -13, -2, -28, -62, -53, -12, 23, 37, 20, -51, -12, -59, -108, -76, 17, 14, -86, -59, 8, -48, -50, -66, -53, -75, -61, -44, -68, -25, 52, 67, 24, -15, 7, -7, -24, -41, -50, 18, 4, -35, -65, -63, -47, -92, -106, -82, -135, -135, -83, -96, -67, -72, -60, -6, -9, -4, 12, -5, -64, -68, -10, -10, 8, -28, -8, -35, -49, -53, -95, -47, 3, -67, -48, -63, -14, -13, 0, 23, 21, -6, -11, 7, -5, -9, -21, -2, -23, -21, -60, -29, 33, -42, -37, -106, -85, -25, -3, -17, 11, 40, 34, 50, -8, -61, -37, -6, -42, -100, -76, -73, -48, -35, -63, -12, -30, 5, 35, -22, -84, -123, -87, -21, -61, -94, -85, -55, -48, -74, -43, -12, 14, 0, -51, -38, -61, -42, -86, -10, -1, -24, -10, 36, 0, -76, -8, -20, -2, -59, -68, -47, -63, -26, -68, -112, -128, -26, -10, -49, -18, 10, -3, -67, -121, -128, -105, -104, -119, -89, -47, -50, -101, -65, 3, 21, -38, -66, -57, -8, -31, -104, -95, -114, -60, -64, -58, -43, 45, 50, 9, 27, -29, -42, -24, -24, -54, -1, -17, -38, -45, -53, -95, -64, -109, -102, -94, -65, -90, -61, 38, 16, 8, -10, -72, -22, -3, 12, -10, -9, -6, -68, -83, -49, -59, -3, 5, -26, -50]
19355e0M1j7jK0L6L7m4p3m3lpK6P8k0k0j4RJ0M6o6p9J8P4m8k4L7k8j1Q0J9JJ6p1K3l8K0J01
19338C5O0n5r2M2Pj1n1k5R4m4j11O9N1j6mk7L0K4O1J1j5Rl0n0J0j8K4kk0n4N2l8n9N6L2o1
19321a16n5J14Q6o3o2K5K0J0Q9m7n3K5q0l3O1Pk1k4K8j9K2O3LM7K9k1l8j01K4P1rmP3l5m1
19304b5N8k3m5j1KM5J1j4p2k6L0M8j7%j2pL4J1NM4m6k1k1j8J03J6l5k2N1n3k4k6OrK6kMKk3
19285e6N3kn4Rm4M5Nl2J0k0K6J8k1M9mj2NJj7j8rP4l7p8J5O9l5R1k3m2n2J7P7j3Rj9Nn0n9
19267a19k7O1K6J3J5qp4L0kl6J4M7l5J1M2L0kj9Oook1jl8p0M7K8N0L7M5Mj05o3L7%J1M5l5
19249f8MMj0O7P6p0k2m6p7L4N6K6M7K8q2q7L3L3J3j6M9O9r3kk1k2j5L7K6M3M4r1l3kJ3K5M4
19231A4M7J7l7l4n5j0l4J8J5NO0LL2p9m1L1j2l7m0J5O6L0J8j0m5%M5kn7K5N3j1p9K9OJ7q2
$$ y = [-50, -9, -26, -27, -7, 29, 66, 22, -51, -94, -97, -104, -78, 0, -20, -40, -54, -45, -35, 11, -55, -134, -116, -42, -90, -114, -77, -105, -116, -36, -17, -16, 0, -71, -48, -86, -66, 35, 95, 40, -52, -10, -3, -14, -65, -90, 4, -40, -151, -82, -31, -47, -51, -78, -48, -24, 37, 48, 33, 42, 12, -38, -28, -46, -22, -24, -44, -98, -46, -84, -143, -87, -55, -116, -171, -57, 29, -34, -96, -71, -51, -41, 48, 1, -52, -27, -107, -140, -79, -72, -93, -117, -89, -108, -86, -23, -20, 27, 56, 35, -3, -104, -80, -9, -18, -22, 51, 16, -25, 33, 10, -35, -46, -44, 1, 12, -2, -74, -100, -70, -22, -39, -39, -51, -58, -24, -13, -8, 36, -10, -31, -52, -70, 33, 49, 14, -8, 43, -10, -34, -60, -54, -63, -37, -39, -35, -33, -56, -3, -5, -59, -50, -94, -49, -44, -76, -66, -86, -60, -42, -63, -14, -18, -30, -25, -24, -41, -59, -68, 6, -31, -109, -94, -25, -60, 31, 8, -34, -86, -69, 8, -5, 4, -15, -10, -60, -119, -146, -85, -59, -46, -31, -39, -113, -83, -85, -121, -107, -60, -95, -84, -42, -12, -14, -33, -27, -33, -39, -60, -61, -99, -169, -122, -94, -44, -7, 38, 42, -63, -126, -89, -89, -78, -33, -68, -64, -60, -70, -3, 73, 3, -19, -65, -142, -108, -52, -26, 21, 49, -33, -120, -87, -54, -41, -57, -8, 61, -32, -34, -55, -77, -92, -55, -29, 14, 58, -33, -66, -68, -55, -30, 14, 61, 78, 41, 7, -48, -58, -92, -74, -59, -54, 6, 9, 41, -38, -79, -48, -60, -97, -137, -122, -56, -26, -8, -18, -63, -63, -18, -20, -77, -52, 1, -10, -89, -60, -54, -37, -119]
19213a19J4L4J2K3NM1k2k0KO2m3n0M6j2j1l4NlJ0Nk5k5J7j8L9o2L4R7rn0j5PM5Ll3j8J3j5
19195g0N0qJ2j2J1K1m3j6J9j7J4k9l2J1K3L2NLk8K0j4J4j7k1j1J3O1j5oj3ok0K8j6OjKj4l
19177f7k0J03n7n8P5J3j2J5n4jL0K0J8l9J2k8j2rJ8L9j2Lp2P8j7j9Lk2l4j1jqR3L4m9J8nk8
19159f3Ok6l6M1P1N4j6Mm3j5j2k0k0L6k1J8L2r2P1l7o4RQ5Pj0m2ro1N3N4j3K6n5k4K6N3q2
19141a15N1ML1K4K3j6L8n2J3m2m5l3rQ2j7p1N2K7J7k5j5o%q%K6K1n3N8M0j7n1Lj9k2M7K6l
19123c6kK5rj9j9Kj7K7k8l2O0oNL2K1n9m3L9K1k5M3j9J7j3P2J7o8mMK8L9l7m3mm2M0J9j9q2
19104a15l8J9P7j4RK2N1q3j7N2j3q1N9N7%J4P3k3o9j7qJ5K6j3p8O9k1k7%jM0O7l3m6j1j5k
19087g5M5k6L2p1j9P9J4K8n3L8n4K7lrM7qQPj1J5L7p8l1k8m9L1K8P2J2jp3L1rp8l1kP6L9K8
$$ y = [-119, -105, -71, -59, -36, -31, 10, -12, -32, -30, 32, -11, -61, -15, -27, -38, -72, -67, -70, -60, -55, -80, -105, -88, -106, -67, -129, -95, 2, -7, -57, -72, -65, -20, -17, -50, -68, -55, -70, -20, -28, -16, -28, -17, 4, -39, -55, -36, -53, -39, -68, -100, -89, -66, -34, -29, -26, -54, -34, -48, -34, -51, -72, -83, -70, -9, -24, -30, -43, -49, -69, -41, -57, -51, -52, -50, -64, -67, -87, 16, -41, -99, -24, -11, -23, -8, -62, -63, -33, -13, 5, -34, -22, -50, -62, -71, -53, -14, -26, -23, -95, -17, -34, -53, -50, -72, -106, -117, -118, -126, -33, 1, -48, -30, -35, -63, -57, -83, -119, -78, -7, 47, 31, 35, -8, -23, -35, -55, -75, -39, -60, -42, -10, -102, -31, -68, -132, -123, -38, -31, -41, -83, -92, -153, -100, -46, -59, -33, -88, -112, -86, -33, -115, -64, -60, -29, -5, 18, 2, 40, -12, 1, -41, -86, -119, -128, -46, -63, -134, -82, -55, -38, -63, -78, -84, -84, -92, -92, -66, -45, -98, -40, 0, -17, -68, -65, -84, -106, -59, -33, -36, -38, -13, -22, -41, -60, -58, -75, -48, -76, -108, -48, -54, -49, -17, 4, -55, -98, -59, -38, -63, -20, -39, -22, -35, 37, 54, -14, -18, -14, 14, 53, 16, -27, -31, -73, -33, -14, -33, -115, -153, -134, -57, -71, -62, -40, 11, -72, -89, -37, -50, -131, -72, -15, -15, -1, 72, 49, -20, -37, -45, -30, -4, -17, -95, -26, -47, -74, -74, -75, -35, 32, -1, -47, -58, -73, -75, -30, -56, -24, -95, -114, -35, -21, 7, -46, -8, -62, -35, -38, -47, 0, -8, 0, 7, -4, 11, 48, -30, -61, -89, -138, -107, -79, -7, 5, 4, -69, -38, -47, -125, -156, -158, -82, -43, -15]
19068a5m8Lk5K2K8Pj7m0j7k4mJ8%L3J7K2k6l3J0J6L5j0OK7k8q3L4Qk2J2JK1O1j9j1M1K8j2
19050A6n3L5J12o5K4o1q3oJ0J3jpJ4k0j6k9P1O9o9j4JM9k6l5K5j7K0%K0k8J9nj0NJ3m4JRl1
19031i4M7j5J1JK6L3l4qL2m3l8J2M3L6Jk3K1pk8J3m4j0O0k6qm0K8J1j1J7m8K3pjO3J7p4p7
19013a41jQ5N9qm3j3M5lm9Q6k3j7j6OL9%Jr6R5J08l9r4M7n5ol5qL4M6N4n9m0m7L8j1j2P7q
18995dp6j7jM0P5j4j5N2J1m3r6j5K8LJ3N0j3K7j7l1lK9jm5k2jM4qj1K5L0M0n1j8Jm5L0nm1
18976i5j6RJ9pk3R2m2j6%N3M5m0l9l2L0m4RJ06Ll3l0KpJ5j6o5k0O7K9mL6l5k5l1L1O2m5%j5
18958g2m2RM2Q6j4l2K1J9p1j2k1j8PM9N1jj0j7K8m6nMj7J0K5jqM6J3q5l0K5PkL3j3n3M7k6
18939g4j6L0J0k2oJ8o8O1J9M7k8L6N7l0m9M3pm9j9jOL5n9N8m3j4j5k7M3Q7om8J3m7j8K4Rj7
$$ y = [-15, -63, -60, -85, -63, -35, -28, -45, -85, -102, -126, -130, -112, -112, -79, -62, -40, -66, -99, -89, -73, -38, -48, -42, -15, -43, -126, -92, -84, -106, -94, -93, -72, -11, -30, -41, 0, 28, 16, -37, -2, 110, 45, 69, 8, -75, -81, -71, -58, -59, -66, -52, -72, -88, -117, -46, 23, -46, -60, -59, -10, -36, -71, -46, -63, -43, -43, -23, -51, -32, -37, -47, -42, -29, -73, -72, -63, -94, -47, -62, -51, -50, -24, 9, -25, -33, -1, -44, -82, -70, -27, 9, 10, -13, 8, 1, -27, -14, -58, -68, -8, -34, -42, -82, -54, -43, -54, -37, -85, -62, -69, -70, -7, 10, -64, -141, -142, -57, 2, -6, -49, -62, -17, -20, -69, 17, -6, -23, -39, -33, 6, 6, 7, -89, 6, 114, 75, -19, 28, -27, -33, -68, -76, -42, 4, 58, -1, -41, -88, -50, -61, -73, 4, -4, -80, -97, -98, -58, 17, 3, -12, 40, 51, 8, -88, -103, -75, -72, -59, -9, -22, 5, -12, -43, -46, -17, -18, -63, -85, -86, -42, -50, -61, -36, -6, 34, -17, -35, -34, -79, -49, -54, -95, -111, -102, -83, -90, -113, -21, -63, -79, -79, -26, 19, -21, -60, -92, -62, -106, -97, 9, 12, -21, -51, -49, -56, -41, -57, -122, -142, -75, -46, -50, -14, -49, -74, -105, -74, -12, -57, -57, -72, -114, -105, -63, 23, 9, -23, -2, 17, -54, -66, -87, -105, -98, -49, 2, 1, -9, -26, 2, -44, -49, -45, -62, -52, -27, -28, -36, 10, 23, -62, -92, -67, -60, -62, -29, -42, -95, -48, -74, -90, -60, -50, -72, -78, -60, -128, -67, -48, -1, -29, 7, 64, 34, -15, 28, 21, -28, -47, -48, -42, -7, -66, -8, -51, -65, -80, -107, -64, 23, 17, -31, -18, -65, -83, -59, -50, -67]
18921f7K7ll1N0L8L0n1pM4n7Km0Lk9J9L7mJ6J0%o0Rpl7%J0J2K8M0kN0r5k3%j7K4nkl6K3ML7
18901f0k3Q%m4L8k4K1QJ6QK2o0j05O1N7o3L2K1j8K0N2o2M3P6J6rK0o8%p5L6j6j1O7k7k8l5
18883a06K3nJ6J4K5P7m2k1p9K5jN7L9q9m2M8J6K2Ol2N5l6l2o2Q2L1k8J7l9j6K3j1K2Rp6J6
18866i4l2J7K9L5pJ0j4m9M7O7nk3M5r2J1M4l9N6k8o8mM3l4n2N2j0M6ln9O8J8n4J8M7J2J2l8
18849b8k6K3N0k4n9j7L7J1n3Ko7N3j4K6O8K6l0l9M0k2K9k1o5j7Q3K9j7M4Qm5lM7j7k3rj6m5
18831h1J9J5m3m3K7P3Rj7k4Q3L5jm5r3O2J5m8j9J6K6n8K7L1l8%kN4K1pp3M2k1M6n2l4Q7k6
18813c7N5j4rj2L6J2p2m0j5%J3PM4rmK3K3J6k6l7m5M3j6n4PP5l6j4O8k6M8Jl1j9m3K5J6j6
18795f3p2J9O9J2j2o7L5j7m6K2P5j2L7l0k1l6QmL6J2OrQl1M3qj1j2J6J3M2n2k2J6n9L0J5l4
$$ y = [-67, -40, -43, -74, -24, 14, 44, -7, -14, 30, -27, -25, -65, -62, -91, -72, -35, -39, -23, -13, -13, -73, -64, -71, -108, -108, -98, -86, -58, -18, -20, 30, -65, -88, -88, -105, -81, -86, -88, -124, -101, -97, -60, -83, -75, -75, -119, -81, -105, -84, -76, -60, -52, -30, -90, -195, -134, -77, -140, -108, -87, -105, -85, -33, -95, -52, 24, 40, 31, 51, -17, -17, -92, -56, -72, -83, -16, -43, -71, -106, -83, -88, -72, -58, -33, 44, 2, -19, -98, -73, -74, -17, 22, -67, -109, -61, -45, -23, -17, -49, 6, -30, -62, -124, -42, -11, -39, -22, -61, -77, -54, -65, -43, -34, -110, -94, -126, -109, -80, -45, -52, -42, -56, -105, -58, 9, 4, -19, 26, -66, -55, -11, -50, 6, -22, -90, -94, -51, -85, -137, -85, -95, -49, -52, -111, -43, -25, -79, -61, -14, -2, 10, -28, -54, -31, 19, -5, -64, -81, -44, -33, -86, -84, -151, -98, -112, -86, -18, 8, -22, -61, -21, -43, -14, -35, -100, -117, -34, -5, -22, 22, 30, -15, -18, 29, 12, -11, -20, -36, -81, -62, -47, -90, -133, -106, -33, -24, -41, -65, 18, 53, 52, 7, -86, -24, -9, -57, -76, -60, -34, -92, -65, -34, -72, -72, -74, -20, 1, -6, -79, -37, -58, -12, -64, -98, -11, -37, 18, 4, -5, -17, 19, 31, -41, -81, -96, -96, -83, -76, -32, -41, -45, -22, 1, 17, -9, -46, -91, -48, -64, -118, -111, -36, -72, -86, -18, -44, 4, 5, -26, -45, -88, -63, -47, -63, -135, -116, -47, -35, -47, -114, -79, -96, -142, -120, -45, -57, -20, -50, -71, -107, -99, -103, -67, -55, -49, -58, -50, -81, -38, -46, -57, -69, -53, -40, 2, -50, -72, -56, -115, -85, -70, -104]
18777a04Q0l7m6M5k6rJ5OK6J9J9pM0k1j4K1q%l4o4mJ9JO6K0Ooq9J8O9lk6k9K7K7Qn4M2k5j9
18758e1l7LM0mL3M6j8ln2N0J8n4n9L0K0n1l2m8K4P2P1k0J0oN7nj33RN7MJ7M9m1k0q2L9N3m8
18740f2o5M5K8o0KJL7N7j5K0l8l1J2m9jM1M0m0M1lL5j6KJ1mk7N0k9Rk4M8Ok6J2n0J0L8n0l9
18721h4J2j3k8rM4k4J4Ql1K0j3k1J4L4P2k7m3n8M9Ml0Rk7J6Q2N6r0N9l0J4l3PJ6K3J4kn4j0
18703f0K2m1m4Q9l1N0n8j8K7pK6j6j3O4p5m9O6M0l5K6L2q4k2K4P3k9m0j2K9QO4Ooj4j0o5j5
18685i8M7j7j5K3n0M6RJ6Pk0j5o0N4jk0K5M0Q0j15kq1j8N3O7K6nk6ok0qj6J3Q1l2k7l3O6K8
18667do7k6k7N7NM1%n0J5l2NN0M3p8l3j0K1lpk6L6N3no2N0j9K0J3l8O0L3ql5o3M3JK8rJ1K5
18648HNnj3K9n5K0k6jo8P6K3m3N7j9K4l0m8K1lK5kj0k8K2j4o4l2O1N3r3J02k4L8J3k4k6j1
$$ y = [-104, -24, -61, -107, -62, -88, -97, -82, -76, -50, -31, -12, -19, 21, 0, -14, 7, -1, -1, -35, -99, -103, -84, -83, -17, 3, 9, 3, -86, -68, 1, -2, -28, -57, -30, -3, 5, -49, -7, -32, -51, -88, -85, -45, -49, -16, 30, 12, 9, -43, 7, 25, -29, -88, -58, -38, -89, -121, -169, -145, -73, -2, -22, -12, -18, 39, 34, -99, -90, -33, -29, -12, 37, -4, -24, -106, -67, -14, -62, -127, -82, -54, -114, -112, -111, -74, -17, -32, -12, -50, -81, -69, -118, -119, -78, -38, -78, -37, -40, -5, -21, -19, -8, -12, -39, 11, -18, -9, -33, 15, 21, -5, 7, -43, -33, 5, -45, -84, -72, -85, -113, -122, -78, -102, -88, -80, -111, -91, -104, -125, -111, -77, -5, -32, -75, -133, -84, -80, -110, -101, -128, -112, -30, 26, -64, -5, -35, -21, -54, -47, -31, -8, 6, 4, -50, -60, -38, -79, -123, -34, -65, -15, -73, -91, -64, -71, -45, -61, -74, -10, -85, -134, -68, -28, -63, -37, -5, -89, -111, -87, -14, -43, -83, -95, -66, -58, 6, 12, 6, -8, -18, -83, -98, -51, -68, -83, -60, -110, -64, -55, -39, -32, -52, -67, -127, -73, -74, -94, -69, -29, 51, -64, -66, -147, -165, -112, -45, -19, -24, -50, -56, -76, -84, -100, -87, -6, -38, -65, -98, -32, -4, -71, -97, -124, -67, -62, -21, -21, -71, -56, -88, -83, -33, 10, -68, -101, -111, -90, -93, -100, -126, -90, -37, -42, -104, -54, -73, -53, -40, -78, -18, 15, 7, -28, -91, -48, -47, -19, -28, -17, 8, 13, 8, -5, 24, -31, -11, -37, -38, -106, -30, -7, -50, 7, -12, 12, -18, -66, -45, -48, -23, -25, -35, -63, -41, -55, -119, -151, -90, -37, -130, -28, -52, -14, -1, -25, -51, -62]
18631f2N6Rl2j6Rn5JM1N9oO0n3m1M8l3KL2o2n9Q7k4K3Jnj5j4jo7RL2m8NL3N6Jk1M3j9pP7k6
18611A8K7p2j22nQQ1M9K5K1o3l7m8K0N8NO4j5k8qJ5m1o5M5P0k1OL6n4j2QM1j7m1l7MOK2p2
18593a29M0L7J6L2L8rj4q7L1kl6QL4qJQl9j0J9M2l0M9k5PPK5n2J3mk5%O0l9L5k2Qk0m3Pj0
18574h7L9k9o3JK2L3J5J2mm9RJ07K0k6p6n0K4l4L5P7n1l7L6O5ln4K9l4J2K1m7Mj1N1J3l8k1
18556h9O6KN7p9k2Q1L8j18k8J1pJJ30j0k3j02n5Q2N6p3l9N4Om3N5m7J2M7Ol2N3j3q9l6M7L7
18539f4J9L8m8o1N3M4m1JL1M3l2k1J4KlJm0K0M5Mnl7nlm3L2Q5j0m7K6oK9p4mK3j4p2M1P0M7
18520C8q5J9K1LL0q3p3J5M5J6M2rj7qn1j3O3pN2j5j5m3OJ9J0ll6K5M5k8k5m6JKJ7N9K7m8n
18501e5K3n3N5l7mJ2J8K5L5J1k3J6n3j2k4K7M4jq5k4K3Lj2Q0OL5Kk3k7QkmnM0J1r4k6M4n7
$$ y = [-62, -6, 3, -29, -45, -36, -91, -90, -49, 10, 4, 64, 11, -30, 18, -15, -13, 19, -43, -102, -15, -39, -16, -15, -20, -35, -49, -50, -117, -108, -76, -124, -119, -86, -30, -29, -50, -7, -26, -33, 44, 18, 45, -27, -149, -154, -146, -65, -16, 9, 30, -33, -70, -118, -98, -40, -35, 29, 14, -14, -22, -7, -48, -113, -68, 2, -19, -13, 23, -31, -43, -35, 6, -11, -52, -89, -85, -79, -57, -129, -89, -52, -36, -4, 34, 25, 11, -76, -45, -47, -83, -75, -41, -49, -48, -40, -79, -89, -70, -28, -58, -9, -34, -27, -20, 5, -47, -34, -38, -63, -63, -3, -42, -7, -29, -21, -41, -84, -77, -87, -48, -77, -140, -139, -117, -84, -69, -57, -61, -110, -101, 6, 26, 0, -76, -126, -102, -136, -101, -24, -75, -112, -76, -11, -14, -68, -39, -73, -61, -40, -87, -83, -94, -43, -30, -68, -89, -23, -21, 36, -43, -65, 16, 54, -64, -92, -81, -88, -87, 43, 33, 10, -92, -147, -65, -9, -82, -121, -67, -61, -104, -49, -96, -84, -37, -31, -63, -10, -23, -112, -148, -101, -64, -45, -7, -55, -116, -63, -19, -60, -59, -28, 15, -17, -38, -24, -22, -25, -24, -64, -44, 1, 5, 0, -37, -42, -45, -88, -56, 29, 19, -28, -2, -8, 21, -53, -57, -34, -48, -120, -79, -9, 38, -47, -28, -7, -4, 26, -57, -130, -115, -70, -54, -12, -21, -38, -46, -97, -110, -47, -54, -2, -17, -32, -75, -69, -50, -40, -43, -79, -54, -9, -37, -62, -108, -107, -105, -88, -29, -2, -50, -55, -32, -85, -30, -67, -71, -59, -41, -16, 19, 30, 7, 23, -30, -42, -66, -39, 5, 4, -81, -105, -82, -79, -91, -11, -5, 30, 32, 9, -18, -10, -12, -16, -21, 19, 30, -64, -90, -46, -103]
18483a03PoJ3MM0O6k4l5p7N9qP2qj3K6K9jj1p1n6N3J6n3O2k1L4k4m4Rk0j4N5O0n1m3K5j3L5
18465c1k5lM3M3J7n4n7K6QPn5OlQO8Kj1j7L2p5j09J22K6m6mN6nk3j3K8k4KO8kj27L3O0k4p4
18446a27L0L4nK9L3R3m6n3n8j6J1N9oj5o5L8M0M5o0Nj0k5K9o8rLM8o4J0M3j7R5rk4p9o4n0
18428b25J64Q2p3M2K0l9j16P2N5pQn1n8m1P1M8j4K8rk8J3L5K0o5l4M1m0k0k7K0O4K0j7M5m7
18412f3mKN3mj3Pj0K9N9n5l7qk9P4K6j6l2l9m2M5q0J2L4L6k1K8Rn7QLMl3P4Jm7m1J0O9J9j1
18393d0PK7n2l6pQ0Rk0pm5O8Qj5m6m9J6N1K6q3K9N8L9k0j5o0O1k9M3J2k8l2k6j8l5j4J3N1
18375g9PpL3%%M4OJ1Kj5k9J5QJj1o9lk6j3J9oM6L0p2mP2j8J3j7J8M9l2m8m6L8L7J5L3m2n0
18356i0%m3n2J8J13j9n3l7O4N8J4k7Np0J2j8P5J9K4J9r5L7j4N5l2K9ll5Q2m0j16pL6jK1p6
$$ y = [-103, -96, -102, -89, -85, -45, 21, -3, -38, -115, -56, -64, 8, 0, -13, 13, 42, 41, 30, -41, -97, -44, -28, -81, -19, -40, -6, -30, -74, -65, -85, -99, -44, 16, -35, -78, -53, -66, -31, -56, -59, -16, 27, 44, -10, -67, -41, -33, -26, -81, -75, -78, -70, -2, 0, -11, -28, 4, -71, -180, -58, -32, -78, -82, -26, -31, -54, -67, -39, -63, -61, 7, 5, -122, -89, -29, -53, -127, -97, -63, -68, -39, -6, 87, 41, -12, -70, -86, -75, -16, -22, -37, -102, -64, -24, 21, -39, -34, -44, -69, -40, -108, -117, -114, -66, -130, -120, -77, -94, 1, -8, -32, -111, -175, -225, -61, 21, -52, -10, 10, -29, -145, -73, -18, -25, -17, -68, -126, -167, -96, -48, -62, -34, -43, -71, -58, -23, -3, -68, -102, -61, -101, -121, -148, -128, -64, -44, -61, -16, -63, -67, -65, -12, -16, -29, -22, -32, -3, 56, 1, -36, -44, -73, 1, 27, 11, -21, -60, -102, -57, -137, -125, -91, -55, -76, -48, -39, -96, -88, -85, -81, -114, -40, -39, -86, -127, -117, -48, -29, -40, -33, -6, -58, -94, -101, -21, -12, -32, -39, -84, -16, -8, -23, -69, -118, -102, -51, -25, -108, -79, -21, 18, -2, -17, -77, -16, -45, -2, 10, -18, -50, -76, -94, -129, -143, -130, -79, -72, -79, -46, -46, -46, -2, 4, 15, 17, 2, -27, -12, -4, -3, -14, -83, -86, -112, -125, -106, -112, -66, -36, -108, -112, -40, -58, -45, -62, -44, 5, -27, -75, -121, -83, -46, -31, 2, -40, -90, -90, -133, -185, -167, -54, -73, -126, -163, -99, -41, -27, -54, -49, -119, -107, -125, -50, -31, -7, 12, -83, -46, -60, -5, -37, -8, -11, -46, 36, -4, -120, -127, -91, -92, -71, -147]
18339a47K8L1Q4N3k0m1l5K7l2J1o7lj2qN5J8Om6L0Jj12O7O1M7j4L9n1o1j6M3m9K5j1N9K2j
18322a9Rn1k0N6lJ1Nn2M4J9m1O8NQRj0j0m0NK7m2rL7L0n1p1k8j1P0J7j8k2K4qN5J6L2l9m4
18303d2K2k5m4N4P7m5j23J4L4rM7K4m1M2L7l7j4k9O2Jk1M1k7m4J3n5Lj5M3M9l4j6%k6M5K0
18286a9j02N0O8n8qj3LJ4RM6j3l8L8o8l9L9j1k7N2N4m5m2N7j6L2j0l1N2L6o4J8L7o4l1M8l5
18269h1N6L9j00K2L7Mk3k6L0K7mm3L5l0L1K1l3j7qO1j3k0N6K0j05jl5M9Kk2oM2n0J5N7k5n8
18251i6Nok1M1K1J4nL7N6j08J5J2l4mM5L2n6J5l1M3k0OJ21l0Lp4J7LL2l1o3m6M8k9qN2J2K6
18233fo7L6Nk8oJ9l2K2Lk5K3nM4L2jL9r9M7qK3m0J5m2%P1L4kq7j7M4nk1m6R3n6n6L5O6Qk2
18214a2L6j5o5j2M8K2m7m1L6L7l0l5jm9J0Ol2J07nn0M7l5j6L5M3lk5L6KQq8N8k1j7M1k2K3
$$ y = [-147, -119, -88, -4, 49, 29, -12, -47, -20, -52, -41, -108, -111, -123, -131, -76, -58, -52, -98, -68, -67, -179, -112, -51, -4, -18, 21, -30, -91, -107, -64, -113, -88, -99, -40, -18, -19, -10, -61, -81, -25, -28, -17, -12, -64, -20, -1, -42, 26, 31, 39, 48, 38, 28, -12, -7, 20, -22, -31, 6, 36, -15, -86, -114, -125, -55, -38, -56, -78, -54, -62, -7, 9, 41, 2, -42, -20, -45, -89, -35, 42, -3, -126, -112, -78, -87, -40, -16, -57, -15, 22, -15, -29, -58, 4, 5, -16, 25, -2, -46, -33, -88, -85, -100, -57, -8, -42, -58, -58, -84, -39, -19, -121, -71, -3, -61, -69, -82, -79, -65, -56, -10, -23, -61, -23, -91, -130, -91, -102, -129, -77, -23, -68, -110, -53, -69, -37, -47, -78, -26, 10, -54, -36, 1, -63, -94, -46, -81, -25, 14, -86, -64, -27, -23, -46, -72, -42, -15, -19, -62, -27, -57, -26, -5, -38, -55, -63, -2, -15, -35, 21, 41, -64, -65, -100, -51, -49, -71, -77, -35, -85, -70, -13, -38, -96, -91, -97, -118, -77, -56, -42, -47, -10, 46, -62, -47, -35, -69, -73, -28, 4, -52, -37, -68, -25, -45, -39, 82, 52, 55, -19, -2, 1, 33, 2, -61, -107, -59, -88, -96, -44, -32, -6, -73, -37, -32, -60, -66, -47, -79, -57, -54, -79, -56, -61, -17, 15, 14, 53, -46, 1, -7, 16, -24, -9, -51, -51, 20, 54, 52, -35, -52, -8, -13, -34, -80, 13, -43, -99, -64, 2, 10, -12, 24, 9, -56, -68, -20, 2, -45, -86, -50, -13, -43, -78, -79, -128, -118, -112, -144, -37, -42, -92, -45, -80, -96, -61, -18, -21, -46, -10, -8, 0, -88, -30, -51, -68, -27, -49, -26]
18196b6J0M2oj8q5OM7k6Jm6N9k9l3J9l3m4R7L9q1J1Q0m4%O4n1m4K7l8j2L0K9k1Nj3K6K7M9
18179A8r7OJ5l8Pl4M0L3o5j7M8m4ML3j5R2J1l3M1n1pkl2M5LLk3k5K2l3M0n0K8M7l8J3n0J1
18160i4j7L4O5j3j2K4nk2Rj9P3LKn0l1jK9K9m8n4K8kO3k5m6M5q3lPN5L7o4J1N2Kk1m5QJ9l7
18141i7L7Kl6K7L6l9j1N4M2j7qk6L0k6M4k8Jq6N9p9k9M6rR2J2Rq0N7Nj4l9m6K5K4PK2L2k5
18123c2K5k8N1m0j0Nq6M0L6l0l5LP2m9j5j6QM0qK2q7O3J0l1m6K7J2m2l5O1MM1N7j8k0Po7N
18105a06J7J0N1l8jN4J6k7J1Ln0O1j8m5nK8lL8j5l1M7k3m3oM4k4K0K5m8N0l8r0K2M4J0m7j4
18088a21L5M5J1p3N6lp6l4N7OK2M9n2k7L9J3J6j0L8pj7p1QJ4j7nJ5M9P4o6L1m3J2m9J4J2j7
18070g2l9j7P5Rm1%J9L2oj3lj8M7j9o5K5K3J3J8q3J4K9Q4J4p2ql9M1R3ll4k1qN7m1o5QJ9R
$$ y = [-26, -16, 26, 20, 2, -83, -77, -30, -56, -55, -101, -42, -71, -104, -85, -118, -162, -65, -26, -107, -96, -16, -60, -60, 4, -47, -91, -64, -102, -114, -84, -55, -76, -71, -84, -58, -31, 18, -79, -73, -58, -96, -89, -123, -83, -50, -115, -132, -84, -128, -124, -91, -106, -14, -3, -36, 5, -46, -53, -55, -87, -42, -39, -36, -59, -84, -62, -95, -55, -105, -77, -30, -68, -55, -105, -94, -111, -77, -12, -25, -37, -13, -18, -40, -31, -50, 23, 26, 28, -22, -53, -54, -25, 4, -44, -98, -70, -72, -9, -34, -80, -35, -118, -121, -114, -59, -22, -86, -75, -23, -21, -42, -87, -79, -60, -97, -60, -58, -94, -67, -31, -70, -81, -27, 15, -2, -10, -36, -6, -32, 12, -16, -15, -101, -42, -121, -150, -104, -113, -21, -9, 0, -80, -23, -18, -32, -71, -117, -92, -68, -61, -39, -7, -32, -7, -35, 16, -24, -34, -29, -115, -75, -39, -69, -104, -101, -29, -78, -93, -109, -101, -61, -69, -47, -134, -71, -61, -92, -138, -111, -99, -141, -176, -115, -111, -70, -13, -31, -51, -44, -111, -106, -89, -79, -28, -66, -67, -13, 3, -24, -13, -10, -60, 1, -17, -62, -67, -39, -42, -4, -19, -50, -3, -26, -69, -75, -31, -55, -35, -10, -58, -8, -46, -136, -114, -70, -60, -107, -121, -86, -41, -30, -103, -47, -50, -126, -160, -103, -97, -75, -26, -78, -105, -66, -53, -37, -47, -9, -16, -33, -104, -96, -82, -99, -104, -89, -40, 34, -32, -1, -44, -32, -81, -67, -55, -72, -111, -128, -53, -44, -85, -85, -66, -34, -40, -53, -56, -74, -27, -46, -111, -86, -63, -50, -32, -115, -101, -72, 12, 26, -46, -54, -93, -52, 41, 38, 4, -17, -25, 32, -9, -74, -66, -47, -38]
18051c8J2J2J9l7q9M1mk8O8o3%J01l8p1J9j0M6L7J1Kn2L6J8j3%j0nk1j9P0o4k8L1j7m4jL2
18034i7qM0L2m1j6k9O4n9K4LL8j2jkN8K3n9j7K9K5n2qL9J0j3K3j2k8LJ4Pk0j8K3n6K4QM6O
18015ij7qjn6N1K8o9LJ4J8J04n3K6l7k4k0o5K3Q8Ok1o6M4K5q1O9Ol5j6J1Jl8m8Q3l9J7j0O4
17997c2J6K8r8lK0j5j3J5j4J8k9n2j0P8J7K1L3k7jN0n3j1Mj4n3MN4K4%L1j3k0q5Q5J4J1L6
17979A6j6k4n1m0K0L0k3J9J6npj0M4mpn4n8O4P7kjJ6K2m8l6k3PrN4l9M3J9n1K4L7J1l4Qj0
17961b5k6j7PJ3O4J7k8q9lN7r5K5O5k1JM2l8l9K6j6l6N0N4K0m0q5p2P7K3JM6L8Mr6P0pl7J2
17943e8l2J8K7L9p4l3k5N2rL8l1N2ql0k5J7L1Rk7J0L6k4j5k0K2J6N3p5M4K5lPnO2m9r9m0R1
17924c3j4j03L6R2k1rq8R0K7k7L1J5Ol3O6j5m4k5J5L8j0k4l4M9o0j4N2OO4qo8M8n1o1K5N3
$$ y = [-38, -26, -14, 5, -32, -121, -80, -84, -112, -44, -107, -107, -6, -44, -115, -96, -106, -60, -23, -12, -10, -62, -26, -8, -21, -21, -31, -36, -57, -76, -6, -70, -98, -67, -84, -128, -129, -97, -105, -65, -33, -74, -90, -119, -55, -114, -90, -87, -49, -61, -62, -64, -6, 17, -42, -59, -30, -5, -57, -65, -26, -16, -29, -6, -18, -46, -43, -29, -22, -42, -60, -37, -93, -69, -61, -15, -9, -26, -34, -35, -91, -40, -12, -81, -78, -64, -46, 58, 5, 31, -6, -30, -50, -115, -92, -4, 2, -19, -85, -41, -16, -97, -28, -22, -57, -73, -62, -61, -99, -147, -64, -103, -86, -96, -32, -16, 12, -86, -89, -69, -84, -97, -82, -96, -78, -107, -159, -169, -91, -74, -53, -20, -47, -48, 2, -51, -62, -58, -72, -125, -121, -67, -43, -43, -12, -25, -45, -130, -45, -31, -20, 16, 0, -24, -75, -115, -95, -65, -88, -69, -53, -58, -65, -75, -31, -35, -42, -96, -154, -90, -13, -15, -16, 0, 22, -26, -62, -85, -78, -87, -33, -72, -29, -10, -61, -37, 0, 11, -23, -15, -25, -51, -68, -61, -48, 16, 33, 5, -84, -87, -30, -125, -100, -35, -56, -55, -13, -51, -90, -64, -80, -116, -66, -12, 8, -32, -117, -189, -112, -89, -88, -42, -4, 0, -96, -26, -33, -70, -58, -90, -72, -45, -6, -80, -113, -138, -86, -95, -57, -88, -36, -44, -74, -99, -82, -51, -42, -69, -59, -23, -47, -62, -82, -60, -44, 9, -66, -22, 3, 0, 7, 2, 64, 15, -84, -124, -33, -47, -150, -114, -22, -43, -52, -140, -50, -23, -50, -19, -4, 2, -31, 35, 20, -24, -49, -34, 4, -6, -30, -64, -15, -75, -89, -37, -31, 33, 25, -43, 5, -46, -107, -82, -29]
17907b9j9J0J2M1rq3R5j8j22OK4N4L6j3J9m0L1L6j0K4n3l3KL2q1J5jk1J8J0k1OJ1N3Jm8N8
17890gM3q9O6j3k0l7q3O5J8N9l6j0pJ0kJ6J2J1ppk4L4rK7M4r4p3M4nQO%J9M9J2J6j2m8K7j6
17871a3j6k2l4j6j4L9l7J00J9m7j9j6m0O2rrJN6m0j8QN3j1%o0q3N2L9ll1J6k7j9L9NK5L8k
17852c4jl8Rj7RkrN3O6Nm5Lp2o4K0L7j6O6l7j1j4P1N3o5M4p8K3Q6%r3%J9k3K9jpm7j6%M9J
17833d7L4n8q3M7K5K8KJ0k5R1km3K6l0m5nm3O8K0KN8m4j1N4l2k1j6MJ5l5P2J0m1p0j1J1L5
17815e0j5j7k0n5P0kkN3J5qK1j0m9n7L1N4m5om2j1J53j5k8M2L2j24m5M8L0K9%j3K1m1m8M7
17798e7pJQ9k5Qp6J9NJ7k2k9O3j0m5%M6l7lJ8jm5K0M6O7lJl4l7N9k8j26l9K4L5Lo4N2NJ5P3
17779b2QKJ7j6pj5k2j1J17O0q8l0J7n1k2K6M3J3m0J8KK3rj8L1k8m0K0l3k7P6k0Rp8Lo7rP3
$$ y = [-29, -48, -38, -26, 15, 6, -77, 18, 0, -122, -116, -92, -38, -2, -15, 4, -36, -5, 31, 21, 45, -8, -41, -39, -7, -88, -73, -74, -95, -77, -67, -88, -82, -71, -18, -17, -65, -7, 36, -53, 13, 0, -20, -57, -140, -75, -57, 2, -34, -44, -51, -41, -43, -27, -15, -4, -11, -18, -42, -8, -17, 10, 54, -40, -113, -69, -74, -66, -60, -60, -41, 8, 20, 36, 24, -24, 3, -13, -29, -51, -85, -101, -115, -76, -113, -13, 6, -41, -60, -76, -116, -54, -63, -72, -71, -15, -55, -73, -65, -12, -23, -23, -83, -166, -114, -75, -78, -109, -93, -120, -139, -100, -95, -70, -32, -34, -35, -73, -64, -81, -72, -74, -83, -30, 36, 41, -4, -1, -73, -137, -117, -80, -96, -30, -67, -78, -92, -21, 32, -33, 11, -67, -44, 42, 42, -51, -51, -32, -55, -26, -27, -34, -81, -97, -97, -48, -47, -13, -71, -154, -107, -82, -54, -52, -42, -67, 24, 22, -21, 5, -25, -70, -75, -118, -50, -30, -28, 30, -14, -25, 29, -3, -24, -40, -36, -21, -56, 16, 26, -15, -85, -96, -85, -50, -65, -82, -102, -157, -87, -89, -91, -38, -23, -31, -10, -20, -69, -126, -95, -41, -86, -92, -134, -145, 8, -7, -35, 7, 39, -85, -130, -82, -52, -23, -23, -36, -15, -56, -104, -57, -64, -63, 26, 1, 9, -67, -48, -43, -26, -48, -77, -14, -24, -69, -69, -23, -60, -63, -45, -46, -91, -71, -25, 42, 39, 40, 6, -31, 28, 0, -126, -165, -141, -106, -103, -167, -115, -110, -95, -22, -14, -12, 5, -11, -18, -33, -55, -66, 51, 111, 23, -7, 10, -41, -63, -37, 6, 19, -21, -3, -1, 22, 13, -5, 26, -2, -42, -22, -55, -82, -6, -26, -17, -95, -92, -159, -168, -95]
17761i5j1K9K7N6l4n0Oj3N0N6q1q6KJ06mO5M3o7q6k0L7k1m2N8rK7ORJ2pk2L8N2l1k8k9k3l0
17743a10m5J4R2k4L4n2k1O6P1p6r7L6N3k8J2n7J7m0N4Q0jK3p2l2L3P9n1m0k5M6J8RJ6Pm4%
17726e5L6o9L3J1k0k7K4J0N2l3pl6j6J5O3k9J2Kj2k0j1o5l9R1P0p6k6K4L1j5J3j7K9K5k3N6
17708Am2p9J3KM7Mj3m6M7l5K1j9k2j1M4M0L0kM6J4o7n4j9l4O4M0n4J1l0m6K8N3L7N2m9n9M5
17691d2M2Lj11P6N3j04J4K2l1J7l2j3M6L1K8l7k0J4oJ9JNJ5j5n9m8R5j4%LLkr%J0m9nQL1k4
17672h5K0K2LO4j1m3j6%k5l1M1N0o4n9o1R0J1M4N2pl5k4Q1Rj8l4l3P4J8l4j2J5%K3M9p6m8
17654e0J1j0n1K0K1k1k4J4l9P5mm3k3k8P1k1N2mJlK6n1Q6M0j7m5N1Qm5j0Rl5Lm0oj1J7j9M9
17635d6k2j1j4QO0l5n8N1l9K4O5l4m6J8P8k%l5l0N6Lj4j3nN5l1j7J1nj1j6rJ1M5j2mJ9J3p2
$$ y = [-95, -106, -77, -50, 6, -28, -78, -72, -85, -35, 21, -60, -146, -144, -38, -42, 23, 66, -1, -87, -107, -70, -91, -133, -75, -84, -57, -51, -42, -30, -37, -59, -21, 31, 0, -28, -57, -80, -110, -155, -141, -49, -73, -39, -91, -112, -46, 25, -51, -148, -112, -59, -87, -75, -132, -115, -155, -101, -21, -22, 1, -71, -103, -70, 9, -42, -82, -107, -61, -43, -34, -18, -11, -55, -55, -19, -88, -55, -44, -64, -91, -67, -57, -5, -38, -45, -81, -97, -82, -19, -48, -36, -34, -46, -66, -77, -142, -181, -90, -20, -96, -122, -98, -67, -82, -69, -86, -57, -32, -55, 1, -41, -120, -107, -105, -58, -54, -67, -113, -66, -101, -80, -99, -121, -132, -88, -48, -18, -20, 26, 40, -27, -81, -100, -134, -70, -30, -84, -73, -103, -149, -121, -68, -31, 21, -28, -87, -42, 0, 3, -108, -32, 21, -83, -69, -47, -78, -61, -93, -106, -60, -29, -1, -38, -58, -44, -50, -31, -30, -25, -10, -25, -84, -132, -37, -51, -51, -48, -45, -47, -56, -56, -46, -95, -100, -92, -61, -85, -65, -43, -40, 24, 13, -30, -46, -46, -71, -102, -61, -11, -75, -134, -195, -105, -94, -50, 2, -5, -40, -64, 17, 26, 8, -26, -59, 15, 33, -1, -13, 2, 2, 25, 74, -2, -50, -39, -49, -100, -80, -59, -80, -104, -90, -129, -54, -58, -101, -124, -152, -81, -102, -50, -54, -53, -56, -30, -81, 5, 45, 28, -17, 34, 42, -3, -13, -4, -39, -36, -76, -82, -93, -76, -95, -46, -68, -79, -93, -85, -25, -60, -118, -67, -106, -82, -17, -51, -97, -79, -1, -3, -3, -38, -68, -12, -9, -23, -36, -41, 14, -17, -34, -23, -28, -39, -55, -64, -53, -8, -20, -24, -5, 8, -64]
17617f4m0K8K2qj1jJ7L5J2j4Km2o2PO1m8M9J7k0PM6l7rK3l9mNqm0O0Lm3J2O6j6k9oL8l8m8
17598a17qM1O6pm4M0L1q7l1kK8L7j6n0l9Q6J2K0N0JJ8J5J1k2ql8M4o8lk6j4l2LO5K0jn1O1
17580a5j1j8k3n0jM4j6M4Rk0k4L7q2j6P7M6J2p9kmj7N5ql4J7nk2L0m5O3L4RLn7L3j6Km7n8
17561a55M9%M9P1n1P4m7j9N0o8J2J9M5Mr1n5m7P1J0j4JK3P5M2o4k4J8K7o2n4Q4o5n0K2k4O3
17544h1O0M0l9k7LK5j1JPj7k4L7k4l0M5n7L0L9l2J8k9k9J7n2K8O2K6J1rl1o9J1Q9%N1n4k0
17526c5J4LK2n9o8QR5J6l2k4L1L7o0L3m5j8K1O6n8j3P4lJ9kM2j4L7rj20k2OJ1N0P8n0o9rN2
17508El5j2j9L4KJ1L2Lk8j8pL6nO5l6r2n0J2j6M1M5J2j9Mkq4nO7L7m1m1ML2m2l7Q8K7n8P1
17490a9M8pm1qj9n9L4KrrJ8j1Pm0O6K0K2n1J1nl3k2K3R3J6k7qj5k7%J1j1M1j4L0l7%l3N2k
$$ y = [-64, -104, -76, -54, -62, -73, -74, -57, -22, -10, -24, -22, -64, -126, -119, -58, -106, -57, -40, -60, -53, -7, -44, -53, -30, -69, -73, -68, -76, -116, -56, -53, -96, -84, -18, -34, -63, -69, -31, -69, -117, -125, -84, -18, -25, -69, -29, 2, -85, -116, -118, -90, -53, -69, -119, -158, -72, -60, -40, 10, 11, 29, 44, 55, 33, 25, -13, 31, -37, -40, -66, -80, -112, -109, -44, -24, -25, -76, -15, -26, -44, -67, -117, -118, -74, -90, -46, -37, -57, -81, -44, -126, -142, -65, -19, -7, -86, -88, -92, -109, -54, -62, -96, -79, -84, -106, -76, -121, -58, -24, -15, -12, -69, -36, -52, -50, -97, -155, -106, -106, -57, 14, -37, 37, -10, -29, 21, -47, -35, -16, 29, 33, -58, -113, -160, -89, -79, -93, -92, -69, 6, 48, -16, -40, -22, 5, -57, -111, -27, -92, -142, -120, -144, -81, -21, 19, -20, -47, -44, -19, -30, -29, -22, -39, -63, -26, -50, -80, -35, -92, -62, -23, -55, -37, -66, -95, -78, -130, -102, -40, -14, -3, -12, -43, -112, -101, -12, -12, 39, -15, -35, -21, -18, 4, -55, -123, -115, -20, -4, -36, -60, -29, 8, -52, -19, -64, -82, -61, 5, -53, -66, 8, 5, 24, 22, 64, 50, 87, 78, -42, -64, -58, -47, 3, 81, 31, -38, -47, 5, -30, -42, -61, -27, -25, -14, 18, 21, -7, -25, -32, 4, -1, 64, 28, -64, -114, -102, -118, -77, -32, -20, -39, -35, -37, -121, -126, -59, -22, -63, -104, -100, -68, -110, -147, -59, -32, -90, -19, 29, 22, -19, -27, -46, -105, -71, -69, -78, -87, -69, -80, -73, -113, -47, -27, -5, -56, -45, -50, -83, -105, -82, 11, 27, 0, -8, -23, -50, -50, -39, -50, -9, -23, 7, -30, -30, -63, -11, -13]
17471a3mN5l3j0M6m6M1o5l9l2l5MJ02l3j1J2k4K9P0l7l1l0NmN3Q6m8k7p1J6J7k3R1rmk3N7
17453C2k9J0J0QK0N1OJ39K15K68O21J365L596M165j832m802k317p09l75j34q4r5l7m3r7L0
17440a8RJ1j1k1K2l1p6O5j5%jL1J4j0M1J5j33L3M7RmO4k8k5nm4mK9O8r0k5l0N5O5j8O6M1n4
17422D2O8p3n6k9K7JO4k3n6l5J3M4M6L9l5o3L9Op9m0J2j0OO6L6jl1k3r4L5N1K1P0Qk4m4Qm7
17404f1M5J0L5K7j14J8l8j2K8Q6M2l9q8M3L1n3n2K5M2l4N0k9PL0L1l3n9o3%L2Rk2R9J1ok6
17387b8Kk3l0NJ6j5J6K2l2K6PJ7k1l4j3K6L7n6N0l4J2J9L9o3l9Q7K5n3Pj5MP7m3l1l0K8rK
17369d5ko3O5K7j8n5Q4L9l3k9JL1l6n2kM%p1M8%K1j1L1O8O1q4o1mK4n4N6O3M9NOm6n2J23M1
17350A29j17j22k2K3J7P7o4N0l9K3L4jQK9Rj1n6k0P1L9J16O0J25K99L92R39K621M502k80m571
$$ y = [-13, -17, 38, 5, -5, 41, -5, 36, -29, -68, -100, -135, -131, -29, -62, -73, -61, -85, -56, 14, -23, -54, -84, -79, -83, -30, 56, 8, -19, -90, -74, -57, -80, 11, 2, -2, -25, 32, 3, 13, 23, 31, 51, 102, 108, 247, 462, 730, 1351, 2716, 6312, 10477, 8645, 3843, 1526, 817, 442, 308, 224, 129, 92, 49, -48, -18, -9, 2, -9, -30, -8, -39, -115, -50, -65, -65, -66, -35, -21, -31, 10, 25, -108, -75, -28, -19, -23, 41, 13, -12, -17, -61, -65, -36, 32, -58, -83, -113, -58, 7, -11, 55, 96, 42, 110, 37, -19, -48, -21, -20, 44, 21, -35, -70, -57, -13, 33, 72, 37, -26, 13, 19, -60, -100, -88, -98, -92, -26, 10, 9, -22, -45, -139, -104, -53, -32, 38, 46, 22, -22, -14, -61, -16, -6, 29, 56, -58, -40, -78, -90, -62, 24, 66, 27, -61, -18, 13, -40, -92, -67, -25, -59, -9, -38, -31, -1, 30, -3, -62, -125, -125, -93, -84, -106, -7, 4, -2, -28, -26, -49, -79, -74, -58, -73, -57, -35, -67, -41, -34, -17, -38, -72, -85, -59, -22, -78, -28, -62, -50, -31, 8, -55, -94, -7, 18, -35, -28, -43, -39, 38, -5, -36, -66, -38, -47, -45, -47, -110, -45, -18, -36, -91, -7, 32, -1, -30, -29, 2, -34, -86, -88, -84, -84, -155, -107, -107, -86, -97, -66, 2, 63, -21, -82, -86, -62, -116, -60, 3, 52, 57, 63, 17, -35, 88, 129, 12, -110, -132, -109, -92, -15, -79, -29, -68, -45, -11, -12, -4, 25, 34, 23, -33, -53, 18, 57, 173, 233, 358, 657, 1049, 1988, 4609, 9111, 8831, 4260]
17336D260k526o81l50k91r8r3j56Jk1k3mP5J5j16JJ0L2O1k4p0kJ1K9N8M6r9n6Pj2l6M9N1L
17320E1l0J4K5j0l1l0j2J6K3J7j8m7m8N3J02n4o6Qk8K1Kk8L3K0j2Q6k3n0K6J7j7n4M0j7l4
17304e5K0MK3m6jm2M9O2J6J3J8k6joK5o7k3P5J1j8p8m3J3l1j2K8N5Rn1KMN4oj9K4Po1M2L9
17285Gj4j8l3m0LO0J11m7K4m0l8l6l0O3N9m0Rj3oo9K1j8MP4mj7m5K8L2J3M1l5KL2J4j0K9l0
17267D3K6m0L8j5l9m4k1J4n6J8N4J9n0j5K5qM3L8m7k8K7J7m0j9N7O2J0ok4l2K2k7k0j3K4K6
17250A9J1k7n2J4LJ6J0k0K9J3K4L5J8P0R5P2O3K64L97R42K237M513K127l842m133j588n75
17237G35k80k17q3j3k1jM2Pk4j11m9N0%l0k0k3m0M5L4Ml2q4M1k7M5K3N7p2n4N6jJ0j8n7JN1
17220e6k6R2n4K9JlLLJ5kl4j5J7J8k7m7J4N9K5PRJ9O4nj07m0k2K4Rl2N2O0L1o7p5K8Lj8k7
$$ y = [4260, 1734, 1053, 703, 412, 314, 221, 65, 66, 45, 22, 18, 93, 108, -8, -7, 3, 35, 96, 72, 2, 0, 11, 40, 98, 144, 45, -11, -4, -16, -52, -3, 48, 51, 21, 35, 60, 50, 19, -11, -23, -7, 16, 33, 15, -32, -80, -27, 75, 21, -45, -37, -65, -44, -42, -70, -37, -17, -29, 57, 34, -16, 10, 27, 10, -44, -4, -21, -55, -35, -31, -8, -54, -55, -97, -48, 14, 30, 43, 61, 35, 34, 28, 53, -14, -37, 38, 49, 31, -47, -90, -77, -108, -120, -92, -37, -28, -79, -77, -73, -19, -25, -44, -20, -13, -74, -32, 7, -7, -25, -58, -98, -95, -35, 76, 29, 53, 13, -25, -61, -91, -28, 31, -9, 0, -13, -19, -88, -67, -85, -81, -7, -11, -28, -73, -45, -13, 0, 41, 6, 8, 40, 54, 44, 73, 43, 69, 29, 67, 52, 13, -31, -52, -38, -94, -76, -22, -3, -53, -68, -43, -51, -8, 30, -17, -45, -18, -1, -41, -60, -3, 59, 69, 63, 39, 7, 29, 2, -18, -31, -7, 19, 30, 3, -49, -35, -32, -16, -6, -26, 3, 16, 40, 75, 93, 163, 258, 330, 393, 657, 1054, 1996, 4233, 8746, 10873, 7031, 2898, 1310, 735, 455, 238, 155, 142, 121, 120, 162, 169, 145, 34, -15, 35, 35, 5, -15, -38, -78, -33, 1, 5, -27, -111, -70, -97, -52, -29, 28, -44, -98, -42, -43, -33, -51, -108, -107, -56, -82, 10, -44, -15, -14, -17, -14, -11, 4, 2, -32, -47, -30, -12, -39, -86, -72, -13, 12, 19, 28, 47, 111, 106, -1, -41, -63, -39, -30, -62, -10, 50, 81, 14, -61, -33, -30, -48, -75]
17201g5O3J8rJ7k4j0M8m4j3m6M1Qm7oQ2K0k0o3L0m1%RK9J2m4l5OJl9M9Pl5L3N2oK8n3koK8
17182c7j0n0J2%J8m1L1J7N7O9l6Pl4j9L2l9k3J7j5O9l7K4k1n0n0M2P0Np4rO8Qn1j9k9n2P0
17164h0n2K5J02K2NOq5p4L4N9j6pN4Qm0m5M8ol4KQJL3J9%K6l8m4p7O5R6m8M2p4J3J6J2rJ3
17146b0Jm8K7R4n7l7Kk0Mo6M6L6j0J9m4j9K0PN6Mp6J9N3l2p1L1L0M2K0K2rp0J4O2m0j7L5m7
17128c9%K0j8j4L6j0n0K5L1o0K7jl4N8K0m8m1N2Oj2PQmm1ON6p0P9RlJ2qJ1k2Rm3ojJ7K2m4
17108e8K5k9k2K5J6N2j0l4O6l5l2R7p3O8l3o0k6M9L2n4J8k5N6q5K0K1m9j0MP5Nk5K2O1k2j9
17091A1k4j0J7k8l6jM8p1m0Q0Nql7LK9N2Jq3K7O2j16L2J0k1J19n3k6K3j4J1l0Pj0K2k1k8%
17073i8O2J8%k9l4po0Q7K2k3oN1L8n3oNm9L0M6j1m3o0j3N8J3n2k1L4P2P8n0m6M6Kn3j0KP9
$$ y = [-75, -12, 6, -3, 14, -10, -20, 28, -16, -29, -75, -34, -26, -73, -79, 3, 23, 3, -60, -30, -71, -71, -62, -33, -21, -65, -100, -94, -93, -132, -83, -76, -111, -78, -26, -32, -4, -57, -59, -65, -37, -47, -97, -85, -85, -67, -108, -77, -60, -3, 66, 30, 37, 3, -16, 16, -23, -46, -29, -44, 25, -12, 12, -9, -59, -109, -67, 3, 8, -66, -75, -7, 1, -50, -69, -98, -150, -80, -132, -107, -5, 17, 22, 28, -57, -131, -97, -38, -54, -61, -7, 1, -39, -84, -36, -42, -76, -74, -66, -65, -32, -13, -13, 13, -25, -69, -146, -81, 15, -33, 9, -65, -52, -36, -24, -33, -20, -19, -67, -40, 54, -3, -40, -38, -58, -54, -120, -74, -38, -48, -29, -73, -92, -72, -65, -9, -5, -81, -62, -9, -41, -112, -81, -51, -9, 11, 33, 24, -46, -32, 30, -10, -27, 8, -39, -39, -19, -37, -51, -15, -25, -75, -50, -19, -79, -52, -53, -87, -29, -9, -57, -98, -46, -40, -52, -45, -37, -41, -82, -76, -20, -90, -11, -2, -5, 7, -1, 10, -12, -3, -46, -52, -53, -36, -14, -58, -33, -62, -84, -59, -43, 9, -1, -35, 31, -4, -36, 61, -12, 56, 23, -37, -63, -14, 18, -36, -18, -43, 13, -72, -52, -31, -80, -90, -86, -11, -6, -31, -9, 52, 30, 11, -13, -23, -6, -34, -70, -71, -23, -94, -134, -54, -49, -57, -94, -91, -62, -10, -9, -92, -65, -3, -119, -87, -77, -98, 21, -32, -58, -35, -49, -38, -68, -61, -71, -49, -70, -98, -98, -36, -18, -18, -47, -81, -88, -148, -61, -39, -62, -68, -17, 21, -32, -38, -33, -82, -52, -6, -17, -60, -120, -133, -75, -62, -114, -135, -101, -29, 49, -1, -47, -1, 1, -52, -62, -60, 19]
17055A9l0l4ol5o0M6P0qj1J8Kj2lN1oJ0J1j18K3k0N9jq1JK3N6Kl1K5j3j1Q6m4j3pn3M0k5Q2
17037Bk0j1O0l4o9jL4j4l7O9n7K2P2k3n3k4Nm5Pn1Q5K4k6n7M5K9k3L3lJ5J5k4m2K3J2Mm2L4
17018f6l5N8MJM5m9l2J9K6N5l2o8k2QJQL7r1P2l1J8o0Q0Pk3Jj8k3M6M8j5j1k1k3MN6J1j0l
17000b8k1J8L0m3K3rmK6l0Jj6K8Po5K9K2j2k7Om2K9Om9j5K5Jj1K6N9k9Jj7mL8J4j6k0O3l6
16981d2L1qk9kJ2Lo2J7JK8j4%J5J4k2m3K6L0j3k1qK0J4j6K3j2N9l1j4j9N9N0j08Ml4N8N1o3
16963d6lQK0n4J8M1r1L9K3j7O9Lp6O1J0j2kl5LrMK2m4k6N1J2o6kk0M3K3rJ6k9Rl5K1K8o2N9
16944e5J6lj0L7K3j8o0QlK6L1n7Qj2l6k5L3J0N7m1J3l3N1k0k7j8L3M0l8l3rM6K7m1P4J9k7
16926a4l1q2L3Ojr4J26M3k5k7J4j3m5qK6L1K7m2k8j1MO0j4J4j3J9k9J0LkQ1QK2p4K3NK2l9
$$ y = [19, -11, -45, -51, -86, -146, -100, -30, -38, -49, -31, -29, -41, -44, 7, 1, 11, 22, -96, -73, -93, -34, -35, -116, -115, -92, -36, -34, -65, -40, -53, -64, 22, -22, -35, -42, -95, -55, -80, 2, -18, -29, 31, -3, -72, -73, -39, -53, -90, -21, -78, -56, 16, -7, -60, -84, -79, -124, -117, -168, -83, -59, -85, -142, -97, -68, -91, -58, -61, -46, -31, -55, -97, -74, -62, -58, -100, -66, -101, -43, -39, -38, 7, -42, -74, -55, -29, 26, -6, -74, -96, -88, -87, -79, -42, -133, -61, -92, -74, -134, -54, -47, -70, -69, -87, -110, -64, -16, -31, -42, -63, -86, -82, -26, -15, -25, -28, -49, -31, -1, -44, -21, -30, -34, -8, -38, -37, -53, -25, -18, -83, -54, -32, -44, -71, -65, -107, -78, -72, -121, -136, -111, -110, -121, -95, -36, -65, -64, -81, -85, -47, -33, -49, -69, -6, -42, -11, -19, -48, -50, -38, -35, -97, -80, -79, -51, -65, -65, -50, -36, -58, -101, -75, -45, -58, -79, -87, -67, -53, -69, -46, -58, 1, -30, -44, -63, -4, 46, -62, -58, -92, -34, 17, -46, -49, -41, -21, -75, -57, -16, -107, -68, -45, -62, 7, 10, -66, -5, 5, -7, -9, -44, -41, -50, -46, -24, -68, -94, -43, -31, -97, -99, -119, -76, -53, -62, -46, -75, -66, -101, -80, -52, -114, -55, -39, -42, -52, -15, 8, -10, -70, -62, -65, -39, -8, -65, -57, -69, -105, -130, -97, -87, -30, -71, -58, -91, -40, -60, -87, -105, -72, -32, -70, -103, -112, -66, -39, -80, -6, 13, -14, -45, -127, -94, -88, -89, -183, -57, -14, -39, -66, -52, -65, -110, -118, -92, -61, -34, -76, -104, -115, -111, -51, -65, -51, -64, -45, -74, -64, -61, -63, 18, 26, 48, -26, -3, 2, 24, -15]
16908a5m4J7k0K6ll6onk8LK7l4M6J8l1L4ll3K5l7M2M5N6o7l6PJ9n1M6p5K3j5Mn5M6L6M3m5
16890g6l7KR1K4j0n3J1j2Rp6k1M0L9Q3p8l3kL8J2r5P6O6l4l3K1N8m4j6o0J2l5k6R4PK9k6q5
16873a40j6P2M0n8N3j6L6lK1K0jl0J1p8Jj2L5%N4J5p7%K9N6p9L6J4l2j5K2M3J3rj4M1l7k0
16855b5K1o9l1N7K6j3K7nQQm7o7K5O8jm4j0J0k3k8M2m0L7J7N5j2l4J8j5M1j1P7o2K8oo8lq
16837e7m8nN1OKl9M3p9N0j0K0J4o9K3Mo3M5O6RL5L9mk7J8J9l1p1M1k1p3PO4K9Po6oQ2j00l1
16818a26M8L2k5l3NJ0L5nK9J7l2k4J3OM1rlL5o2lnP2j6n2l9j6M0k0PJ9J2L2m4k2J4P5j5k3
16800c2l6J5J5k2N8j2M4n2j12JN2P0n0l4L8jj6J9j4K6j8J2j0oK4O3j08jQ1lj1L3nj2l0M5j0
16782Ap3JQ4m6m9J8k7O2ml2L8K5J4j25m1J00mL0L4K0j17J0k9k3N2Q3k7l8k7K9No6K9L9N5J9
$$ y = [-15, -59, -42, -62, -36, -39, -75, -81, -86, -114, -111, -84, -118, -72, -54, -85, -51, -54, -87, -62, -99, -57, -12, 44, -23, -59, -52, -33, -84, -38, -113, -90, -105, -101, -156, -110, -74, -31, -76, -113, -111, -20, 4, -6, -59, -48, -60, -51, -127, -148, -108, -69, 14, -64, -97, -99, -61, -49, -144, -68, -2, -36, -69, -48, 10, -34, -50, -110, -98, -133, -159, -65, -58, -29, -55, -140, -156, -84, -44, -102, -49, -65, -29, -32, -11, 9, 8, -22, -11, -89, -88, -100, -65, -65, -11, 4, -73, -73, -44, 12, -67, -31, -17, -49, -64, -42, 1, 14, 5, -9, 32, -5, -25, -4, -73, -104, -47, -21, -34, -7, -12, -4, 4, -43, -110, -85, -17, -18, -62, -72, -62, -85, -113, -71, -111, -74, -57, -2, -14, -48, -30, -45, -4, -15, 62, 0, 28, 22, -46, -49, -57, -105, -110, -59, -53, -51, -90, -47, -126, -76, -86, -66, -52, -121, -98, -94, -157, -112, -46, -37, -2, 37, 33, 6, 24, 43, 12, -59, -18, -39, -112, -105, -41, -12, -5, -71, -77, 5, -95, -126, -78, -46, -71, -104, -99, -89, -54, -59, -30, -13, -45, -69, -56, -50, -9, -18, -21, 14, -48, -51, -56, 16, 0, -52, -91, -107, -67, -87, -80, -61, -49, -17, -61, -83, -69, 6, -9, -32, -68, -53, -38, -60, -2, -14, 30, -22, -134, -133, -81, -11, -61, -95, -57, -58, -74, -55, -69, -43, -61, -49, -59, -65, -41, 22, -86, -87, -6, -9, -20, 13, 8, -4, -34, 11, 1, -72, -71, 13, -33, -82, -64, -91, -29, -33, -65, -27, -2, 12, -113, -154, -54, -58, -28, 6, 26, -91, -81, -110, -133, -81, 2, -25, -63, -90, -61, -56, -122, -93, -54, 1, 20]
16765B0o6l5m4M3O2L5p0L6MO1n0p6k8j4P1Q0n0K3l8r4O3Lj1l3k0J6J5Jj4M0P4r7L4K4n9M1
16748e3o1mK0K2O3k6J5k5oj6l3O8M4Nmk0J7k4k6j9O7l5p5J1J2L6m3K6jo1J5K4L6OJ7K2k3k9
16730e8m2L8RK4M9k9m1M0K2m2J5oRL1K9j9n1ol3l2O4j4n5K3J0K2QL0n3j6l4O5Jj9K6JK0l9
16712e3oRm6qM7l5J4l5MK8kOL0L2l2l7k8J9K9Lk8K8o8N4K6Mp7J8M9RL9n1kJ4l8K8j2qJ2m1
16693a05J4Q2lj6l6k1L1o6k2O1O2M7j07j7l0M9j8qP2O2on5Jk7K4K9j7l8k8J8M7pj0q9J2J2
16676a03J8K1L0j1L9l3q3P5J4J8k4m8J1rL1k4lN9J4n3L0K6l6k1L2J3K3p4n9qL3P2j9LNj5J3
16658d3q3N1L0MK2K3j5k5J5K0n1N6k0o0%K7o1K7O7j2jM3j14n2M9k8P7n5m2O8J8j1l7J2M8K3
16641c0l6Rk4k4NM3j5K8L6J8q3j6J2Jk5Kl1j4Q3N0k3o3O5k1j4k3N6M5Ln6kj1L9L2k3n9N3k6
$$ y = [20, -46, -81, -125, -82, -20, 15, -55, -19, -15, 46, -4, -80, -108, -122, -51, 29, -21, 2, -36, -130, -67, -64, -75, -108, -128, -112, -97, -96, -110, -70, 4, -93, -59, -35, -94, -53, -114, -118, -98, -76, -13, -39, -24, -49, -55, -71, -104, -36, 8, 13, 9, -11, 6, -18, -44, -63, 4, -31, -106, -95, -83, -47, -90, -64, -65, -126, -111, -87, -51, -45, -28, -6, -29, -58, -100, -62, -53, -29, 20, -9, -50, -10, 12, -30, -15, -21, -12, 19, 48, 29, -22, -28, -61, -93, -29, -43, -98, -75, -65, -43, -35, -5, -58, -74, -108, -43, -42, -61, -35, -34, -14, -53, -59, -50, -96, -104, -57, -92, -78, -113, -109, -81, -83, -77, -47, -15, -47, -84, -112, -93, -64, -61, -89, -61, -129, -75, -49, -45, -122, -104, -55, -46, -7, -58, -60, -46, -84, -56, -68, -76, -64, -105, -91, -9, -12, -28, -64, -85, -54, -120, -142, -81, -19, 28, -79, -96, -126, -77, -95, -103, -31, 31, 25, -30, -29, -56, -32, -3, -20, -58, -86, -68, -21, -28, -38, -127, -115, -103, -85, -64, -34, -45, -6, -39, -122, -47, -33, -15, -39, -87, -76, -85, -54, -78, -81, -22, -8, -61, -31, -5, -41, -62, -30, -17, 6, -68, -127, -135, -102, -30, -49, -46, -41, -56, -43, -126, -75, -45, -41, -19, 4, -11, -36, -21, -1, -52, 4, -16, -76, -76, -49, -110, -83, -16, -28, -29, 14, -100, -152, -103, -131, -54, -109, -151, -83, -65, -76, -113, -101, -53, -30, -66, -57, -81, -105, -100, -57, -72, -44, -8, 10, -73, -89, -77, -76, -101, -99, -130, -144, -61, -11, -34, -97, -32, -53, -67, -90, -34, 11, 14, -42, -44, -55, -16, 16, -7, -66, -13, -39]
16623c9L8L5k5j1Ko4P2op7lK1J16p7k6M9j6n6KM9Ql4l1jM6J7m1l2l2M9q1O6P3o8k9k4O6j6
16605h0K1M6m8K7M7m2l7M8m0Jj3J9jj5j4nj0k6L6M2p0k0M0K2j5m5R8p9J5k1K6M2K6J0k9oL6
16587a4K6J6rK1p4K3Kj7j5Qr0LK4K1n1J3K9ol4rL7N4j7j4l6m9R0MJjNK9m3nqM3J1l4j9M1J0
16568c4oK1kJ5jm9L3n8pJ8JKJ3l1l3M6J9k3lM1M9On9K4l0KK8j9o4L7k0K6J09j8m8l2Nj3j7
16549g2L2K1J6pJ4Lk9l0m9M1P8Jq3K7o8j2l0LM3k4O7PJ1l8j0k%O2J3k5n3J8K9R5Lm2Qn2n%
16530c9mm3o0O0L4k1J0LjoOn2mK6J1l0M9L5k7K0l1M7J4M4q3J6J7M2n1k1q6M7L8M0L2pO2pq1
16512al5J7P1PL5k6m9l2O2j6m4J8j4k2On2N2OJ8k9koJ4PO6Kk9k1oQJ5m8O1P0L7l1j1J0P7n
16493A80k7kj10J1J0kJ05R8M5qk2kJ2mN4ON7J38J10K33K40M03O14R61J761L258M973L614k151
$$ y = [-39, -1, 34, 9, -2, 0, -64, 8, 2, -75, -78, -57, 59, -18, -44, 5, -11, -67, -65, -16, -8, -42, -73, -74, -28, -11, -52, -84, -116, -67, -148, -82, -9, -77, -106, -130, -64, -80, -59, -13, -61, -34, 13, -29, -66, -18, -58, -57, -70, -51, -52, -67, -81, -86, -96, -122, -86, -44, -114, -134, -94, -72, -87, -132, -34, -113, -98, -119, -93, -51, -25, -15, -44, -50, -14, 12, 28, 19, 40, -34, -11, -9, -26, -41, -33, -123, -120, -96, -75, -126, -113, -84, -90, -124, -133, -96, -42, -59, -73, -109, -158, -68, -64, -63, -64, -59, -30, -73, -78, -86, -43, -32, -66, -85, -44, -34, -40, -19, -21, -6, -7, -56, -23, -81, -88, -70, -69, -67, -54, -85, -118, -72, -53, -76, -79, -38, 11, 17, -42, -18, -48, -46, -18, -37, -101, -64, -84, -58, 51, 33, -15, -47, -42, -55, -72, -40, -19, -3, -10, 4, 7, -22, -52, -101, -60, 18, 19, -64, -37, -105, -117, -147, -144, -101, -125, -58, -51, -40, -78, -88, -90, -90, -28, -15, -40, -93, -75, -46, 49, 52, 10, 18, -34, -39, -39, -43, -86, -146, -86, -52, -73, -63, -60, -61, -67, -61, -113, -117, -91, -80, -110, -61, -26, -53, -33, -64, -17, -3, 41, -42, -26, -9, 33, -18, -39, -125, -78, -40, 0, 32, 25, 87, 80, -1, -36, -19, 52, 59, 94, 68, 19, -13, 49, 33, -11, 7, -7, -29, -23, -75, -23, -17, 1, -28, -30, -36, -22, -15, 51, 53, 24, 3, -3, 5, 20, -28, 33, 103, 140, 109, 98, 108, 185, 180, 153, 151, 41, 52, 62, 60, 165, 263, 308, 300, 278, 276, 288, 284, 338, 344, 401, 539, 649, 882, 1122, 1525, 2139, 3100, 4861, 8119, 13092, 16706, 14555]
16479A4555n324l762j963j080o68m56k75j39j77n9n7o6qn0o5k5J7j0K8Q0Q6J6J14K26K29K49
16466A416L76O64J023J738L062M657L594j730n049l831k075j142p15m33l37k81o1j12m3qj1
16456G02Rm3J7j02o4j16p7l9l6m6k1k2jQ4n8L4M0k8K2J0N1Ok3J14P6P2J13N0J40J89K89L77
16441A719O78J452L089O204P341l96p818o141k771j354o41l54j92j59j49j14l3Rp8l1m5p7
16431A39k3p6oO3m2pl1KJ3Qnj5kj1Rk8K1op5L9oM9O2n2o7N8L5k2K4J8o5Rkj4P8Ko2l3N1J6
16411D6J9P5k2j0J9m1k2l9Q1QM7n3k0j5k4kr3m6P7M9M9m3k7j3J3n8m7M6m1J1o7N1O2rpmkl3
16393h5M9j0j3L3KJ2J3l3M4N3k3kM1r3n4L6M6l7N7m0m3K3N3J6o3LK1K2M8Q6J5Pj03j9r1MK7
16376Bj5N9pn0N2N9n5n8L1QJ5k4J8K6j6n8J2R5L7q4j5l4L3N0J01j8R8M9ML4J80K89O33J633
$$ y = [14555, 9231, 5469, 3506, 2426, 1758, 1302, 1027, 888, 711, 652, 595, 529, 521, 471, 406, 381, 398, 388, 416, 496, 582, 598, 712, 938, 1167, 1416, 1792, 2456, 3479, 5217, 8279, 12936, 16530, 14800, 9751, 5920, 3845, 2703, 1988, 1555, 1218, 937, 876, 764, 721, 713, 702, 711, 668, 685, 583, 519, 403, 326, 287, 251, 205, 184, 162, 161, 245, 187, 221, 261, 233, 255, 265, 316, 322, 299, 413, 489, 561, 674, 724, 864, 1053, 1342, 1719, 2397, 3849, 6938, 13142, 20483, 20087, 12269, 6128, 3357, 2003, 1362, 1008, 816, 657, 508, 394, 361, 370, 292, 261, 216, 139, 116, 40, 34, 97, 55, 48, 17, 19, 32, 40, 35, 20, 18, 7, 16, -12, 9, 3, -72, -33, -39, 10, 72, 20, -47, 11, 46, 24, 48, 66, 1, 10, 8, -6, 72, 74, 12, -21, 30, 46, 65, 140, 118, 108, 127, 86, 64, 25, 106, 114, 161, 108, 88, 73, 49, 47, -46, -92, -15, 34, 83, 40, 13, 0, 13, -45, -92, -46, -87, -76, -143, -92, -30, -39, -46, -50, -52, -85, -36, -46, -59, -26, -24, -12, 1, -32, 12, 65, 42, 40, 81, -12, -66, -30, 16, -21, 36, -4, -47, -24, 29, 45, -18, -15, 6, 28, 76, 162, 177, 184, 81, 62, -29, -25, 2, -13, 46, 39, -11, 41, 100, 45, -13, 18, 26, 41, 17, 35, 61, 45, -13, -1, 94, 131, 47, 32, -2, 31, 81, 182, 164, 262, 311, 315, 349, 529, 818, 1451, 3084]
16359C084M131M685j268n326l310r43m34j99j92jnl5q2K1p2mJ6j29JL3QN2o0n2K7J30J6k9
16346F3r6k5k0J0k1M3P1m3%%M8Qn2Jm4N7J9k9l2J9Jn4j3M3KRqJ2K3J7o3K4L9m9J4mJ2n6J8
16328e6QK9P4kj8q2Lk0L0J5lL6O1M1q5J9J2r6K2J4n1N3Ml1l8O0r5j2K2OJ05K6q9k3%J7L8R4
16309H8l2j06J6J9q3L8nK0M9Kj0m4M3l9P1j1L9J0k5j5mJp0L5K0l7J1N9l5m0K7k2lM6Ql2m6
16292e7L6K7p0m3Q9m3j9rQ7J0K9j5L4j6o6L3mj6m7j6M8loM0m2J3J2n9K8M9m5PJ2O6o2o4N0
16274c2j9l4K3k6R1J3l2m0O5K4n1o1qk3N7K5j1M1mQL7P5Ko6k0n6j1j6Q0M6L0q3l8j0J1O6R1
16256A44J4J1j7q8k3NK2J0qL4j3L3P4K7L9j07J2K2j21k6K3j0l2l7O4j2K7J5Kk6N1K4m2M4j1
16240A24l4qO0N1Q7j2n7l5k6L5o7qn6M7n6O1J19Q8N2O1lO4J21M0O9K38L18O26J229K684N390
$$ y = [3084, 7215, 11900, 10632, 5306, 1996, 1053, 619, 420, 228, 227, 222, 187, 105, 126, 54, 50, 66, -63, -62, -29, -21, 31, -29, -81, -54, 76, 92, 63, -33, -58, -78, -68, -89, -46, 25, -18, -18, -18, 30, 38, -14, -13, -57, 0, 19, -10, -42, -23, -22, -76, -89, -46, -44, -35, -43, -31, -8, 9, -54, -30, 9, -40, -26, -30, -18, -74, -56, -48, -19, 55, 53, 35, -47, -44, -64, -34, -19, -22, 14, 75, 116, 31, 50, 62, -34, -12, 2, -49, 4, 8, -23, -61, -1, -96, -108, -86, -80, 25, 51, -38, -61, -61, -44, -6, 88, 56, -50, -34, -15, -98, -60, -65, -45, 4, 6, -4, -48, -5, -44, 27, 16, 55, 65, 40, 25, 21, 22, -48, -13, 7, -30, -19, 40, 5, -35, -8, -30, -33, 13, 21, -11, -57, -21, 6, -64, -107, -18, -61, -80, -89, -2, 8, 37, 22, 56, 40, -26, 7, 3, -13, -60, -76, -28, -31, -37, 3, -39, -26, -14, -73, -45, 4, -41, -34, -22, 44, -18, -82, -32, -51, -85, -62, -88, 3, 16, -16, -56, 9, 33, -18, -79, -87, -110, -53, -28, -39, 2, -2, 6, 43, 118, 120, 54, 34, -22, -33, -49, 31, 77, 107, 24, -14, -24, -13, 53, 144, 158, 169, 152, 64, 41, 46, 68, 78, 70, 104, 91, 124, 198, 225, 264, 157, 169, 191, 70, 44, 67, 57, 25, -12, 52, 40, 67, 82, 84, 58, 109, 133, 91, 135, 124, 90, 82, 142, 193, 280, 268, 211, 176, 150, 185, 118, 110, 54, 101, 45, 106, 225, 313, 365, 426, 423, 487, 608, 648, 717, 955, 1273, 1899, 3128, 5812, 11202]
16225A1202P518J717o781o675l317j434p19l86k62j23q3j12j21j40o9Mo2mk1nk6m3%j0L4k6
16213E6m1Q5j4k3n0k2K6oN2k6QO%%J3l9K6rk9M1J8J3po3N1O0L1J1o5j3q1M9J0K5Qj11K7k9
16194a2L8K8K0m3O0rr0j8QNK2k9mM1j6k9J2j2L1j5n2L9N2qj0r1L1J1Pk1k2N3M2Pq9J6J4K5
16176hl4k3M8J5%Oq0L5J5k9J6K6n8J2j6K0K9J7K4jom2lK2j1QQK6J4lo3k1K9NNN2m4m2P%K1
16157b4rk1N1m8O8K7Lk5o7K5J3ql1J1mO9LJ2j9k7p5L9Q3l0n5J8PJ0K3J0n8r9O3M4K4j0n4k1
16139h2N4n5mJ1K8p3N5M0q4N3O4N7J5j14o6J8K1o1M7Q3j4k8N4L7qN3N6o9J4K6K8j31k9L5L6
16122F7%nJ5l2m6K0Oj5o4K0j2J6L5J4N5k1l2m9R8Q4Q0l8o8J9J24rl9j7k7L1N8o6k1J81J81
16105E43J56P5K87N59R66J723L705P327O278m302q245m294j960q74n56l42j16OJ8j09n0q4
$$ y = [11202, 18720, 20437, 13656, 6981, 3664, 2230, 1511, 1125, 863, 740, 657, 545, 424, 284, 215, 219, 157, 153, 132, 127, 101, 58, 58, 48, 82, 56, 15, 100, 86, 63, 13, -9, 17, 11, 63, 37, 45, 51, 51, 51, 64, 25, 51, 42, 13, 54, 72, 85, 78, 15, 66, 126, 157, 168, 103, 90, 9, 58, 68, 93, 101, -10, 17, -12, 26, 54, 74, 31, 91, 82, -8, -26, -18, -13, 9, -20, -24, 17, 1, -28, -16, -28, 3, -12, -64, -25, 27, 19, 9, -82, -51, -40, -33, -54, -76, -23, 19, 26, -63, -47, -33, -8, -42, -65, -17, -2, -2, 4, -76, -41, -26, -55, -39, -13, -71, -59, -75, -55, -26, -9, 15, 14, 8, -34, -37, -15, -26, -18, -10, 16, 30, 27, -36, -57, -28, -23, -18, 34, -10, -52, -45, -45, -24, -33, -54, -3, -51, 17, 44, 47, 22, -45, -20, -7, -15, -46, -35, -39, 30, 33, 45, 26, -1, -76, -37, 46, 16, -39, -21, -14, -4, 19, 29, -29, -128, -65, -21, 3, -7, -61, -82, -28, -83, -87, -76, -48, -121, -66, -26, -110, -57, 7, 64, 79, -35, -101, -83, -62, -123, -76, 7, -7, -35, 19, 56, 48, 101, 157, 88, 102, 128, 156, 25, -4, 31, 67, 67, 62, 77, 45, -1, 19, 25, 10, -54, -34, -46, -30, 5, 19, 74, 53, 21, -28, 70, 154, 234, 196, 128, 147, 271, 262, 223, 206, 179, 210, 268, 202, 181, 362, 543, 699, 774, 1061, 1620, 2586, 4309, 8014, 15341, 21619, 17317, 9072, 4778, 2818, 1944, 1388, 1046, 930, 936, 954, 845, 795, 711]
16095G11J7J18R2J8J94L49P33J390K869O071Q195j34q615n999k643j121o53l44k52j24n1l5
16084G86r8j29o8p7q9L8K7k7J9P6K9J3l7n8N9p5l8n5p3rj4L2L0L0q8K7ol7l3nj8P2M1k8m7
16068A70k2L8J28M5j70q8M8L1n4o2m1j8j7j1L4K8o6J3L7m1L9J4K2nK9k2p7m3L7M9M5k2k1L7
16051F4l3k8jj6M0J0l0k5l6l4J23M6m8J7J9o9j8k1j0N2M5J9m2k1n2lO1l1LL7l2N3m2n8N1N
16034eJ6j4p4K6M2o5l9J2J7R3k2M0K9q9j7k4l6LN8M0J1j6l3l0KO0R1M6J5p6m5j6K5L6l8o6
16017d3P1L5j3p7k6O6j3J2q5k8N0oO2K3J9n1J2k9o3K1ml8Q2m0l1Q2K2N1mp8L2P5N0j4J13n1
16000A84J8o9n2j9Nom8M6o4LJ1QL6n3q2lL0L6j1N6N4rJ1N0J4ROR3R5O6J43R0O4R6K78M45Q01
15982B332J406K904N611O707m63p128n434k608j241o87l33k29j65p9q5j07j6m0M7j2j71n7
$$ y = [711, 728, 846, 938, 956, 1150, 1499, 2232, 3622, 6491, 12562, 20757, 20623, 12008, 6009, 3366, 2245, 1592, 1248, 996, 872, 821, 786, 688, 559, 491, 414, 325, 363, 390, 363, 382, 458, 487, 500, 463, 405, 464, 389, 351, 296, 223, 214, 200, 232, 262, 292, 204, 231, 225, 188, 155, 150, 132, 204, 245, 217, 170, 148, 186, 314, 359, 189, 101, 149, 180, 126, 64, 23, 5, -12, -23, 11, 39, -27, -14, 23, -18, 21, 35, 57, 52, 81, 59, -18, -61, -24, 25, 70, 48, 27, 64, 31, 3, 2, -14, 26, 36, 6, -19, -55, -89, 34, 80, 32, 49, 68, -1, -19, -40, -50, 2, 47, 66, 24, 3, -49, -52, 9, -22, -19, 18, -14, 39, -3, -61, -10, -5, 11, -3, -77, -51, -9, -74, -113, -101, -84, 9, -13, 27, 56, -33, -50, -74, -110, -107, -49, -9, 2, -14, -47, -77, -75, -15, 76, 122, 137, 61, 16, 0, 25, 61, 23, -43, 28, 63, 50, -27, -53, 13, 0, 12, -73, -101, -51, -57, 5, 28, 47, -4, 8, -21, -84, -63, -67, -105, -23, -63, -94, -12, 10, 61, 57, -21, 11, 86, 136, 122, 235, 184, 202, 133, 81, 62, 67, 61, 13, 59, -5, -2, 9, 17, 53, 0, -82, -85, -55, -19, -30, 26, 80, 71, 82, 132, 146, 155, 161, 254, 349, 415, 558, 648, 712, 808, 1086, 1531, 2332, 3738, 6642, 12253, 18960, 18497, 11369, 5935, 3327, 2086, 1399, 1066, 837, 672, 593, 508, 401, 385, 345, 392, 380, 209, 152]
15972A52L1r9k9pK5N9j9q2MNN0J2m7k5m6M3Qj4K0j9l6J18L8o1omj0J16N0K2j5r6q3m1R4k8
15955H0J0L8n0Lj4j02M2RNk5%j1K9nk5L0L9L7q0RJ05k0N7P8rlm9j02j0n8kl0jP1m5%K6Nj6
15936A6p4l0Q5O6n6p4J3KQNK5k5K2k2K0M0Rn9j3Pk4J6O3k6q7M8L5km6k3j8O8M8n2%Qol8m1
15917a12M8L5m9Q4L4n6m3J0%N1m3N0K4k2l2Lj7m9r2N5M1L8K2n2lJ13l6m3L7M3N9j11OL6m2
15901a3k5J6M4J8m6o6RM4J9qJ5j3o7rL0pl9N3l5m6RL8kj7N7K4Qk2j9j9P5j3k4QK6k9nOm0K4
15882d1M6j5l1Mk0l0P2l3QJ8k0q0Q8M1q5K8K6m8Rk3m4j4Q9JQ0q0L2l4k2Q2l0JN1n1l3k8JJ7
15864f8j3j4j3K1N4N3K7r1l3K1L9n4k2J6M2pOJ0RK0m4pL6j18j1L9K7MjK8mk1K0J4j4L3j1k
15845b9K7L3m8j9MM1j8k0k3k2%L9J8k9L0M0o3rl8O6oj8k1L7J3qJ0L7m7K1l7L5l0mJ7j0Plj5
$$ y = [152, 183, 84, 55, 48, 73, 132, 113, 31, 35, 40, 90, 102, 55, 30, -16, 27, 35, 21, 41, 22, -14, 104, 142, 81, 75, 71, 61, 177, 227, 249, 234, 138, 55, 14, 108, 80, 90, 128, 78, 81, 67, -35, 7, 16, 21, -4, -4, -15, 14, 9, -16, 14, 53, 90, 10, 19, 124, 104, 161, 239, 230, 227, 178, 76, 66, 8, 6, -24, -25, 46, 1, 1, 27, 32, 16, -58, -88, -3, 63, 7, -67, -54, -52, -44, -39, -14, -39, -17, -39, -19, 21, 30, -29, -42, -35, -59, -43, 20, -6, -93, -45, -10, -12, -58, -81, -99, -31, 17, -35, -35, -27, -33, -71, -112, -64, -29, -78, 6, 40, -16, -59, -49, -49, 2, -41, 9, 33, 11, -21, -18, -35, -84, -176, -121, -80, -42, -20, -72, -75, 38, 2, -41, -4, 39, 98, -13, -7, 29, -13, -38, -22, 22, 40, -6, -72, -63, -19, 0, -8, 7, -6, -73, -82, -52, -59, -98, -45, -80, -126, -117, -79, -81, -98, -41, -17, -9, -31, -50, -69, 6, -7, -31, -23, 3, -26, -31, -25, -65, -41, 5, -10, -41, -37, -57, -87, -15, -48, -40, -22, -42, -122, -34, 7, -78, -50, -24, -72, -63, -86, -130, -144, -55, -54, 26, -54, -22, -56, -78, 4, -26, -25, 26, -25, -58, -86, -85, -68, -81, -95, -108, -87, -33, 20, 47, -44, -77, -56, -17, -71, -93, -77, -35, -42, -36, -26, -17, 3, -41, -48, -12, -130, -141, -102, -75, -71, -72, -44, -48, -69, -49, -35, -49, -16, -27, -29, -2, 31, -17, -36, -32, 9, -9, -29, -52, -74, -74, -35, -17, -46, -16, 24, -39, -48, -86, -20, -26, -44, -65, -28, -15, -23, -13, 24, -23, -2, -39, -4, -34, -38, -21, -31, -24, -27, -42]
15827d2Rlk6NM3O0k6m9Rl1J5l9L2n6rN5J0j6J9l5k6rJ04oKl1p3N1M4m0roL1m1j2j4N9M9qJ0
15808@n0l6L2qr0J11L5PNK3j4o4L4n7Kk9oN7mRj3%l0N6k1l9K9J3L7O1l2q7l3j0P8L8j1L6p7
15789d8k8OJ7j0P6J2m1k8J3J7k1n8l8m3K1K9K2lj1N6J6m4o3l1N6N3K6j5O7lj7pN1k4mo3k5
15772h7L9j1M7l4l8J2nl4J3J06M3Po1k7jqMk2K9l5N8oqK1N4k2o2k5K6o0oK9Oo%L5JK1kk2K
15752b9l0l9M5L7l6L0k6j2k6j2n0M2N4j9MM3K9n8L1j6k7Pj2K6j3MO9k8o0L1j0k5P3J4Kk8j7
15734c2pRJ4L9K4o4J5nj8j1k8m8M3k6M4kL2J6J3J0n9L5l5LK4o6j5K4M2j1n4L2K2oJ1mk7LJ7
15716d6K8%l5N2M4n3J7M8l6k6qm3j0j6O3N9k4n6rN1m1L0K9l7J4j38J9N6PL9j0j9l3QK3Pj3
15698e9l1l8K8R0L9l7lj6l7k4RN9O0p7k2j0j1K0l2K0LrK7j2j3Mj8KM0L4K5J6j2k4J8J1Llm3
$$ y = [-42, -33, -36, -62, -57, -14, 46, 20, -29, -20, -51, -36, -75, -43, -99, -108, -53, -43, -59, -40, -75, -101, -110, -6, -12, -10, -41, -114, -63, -19, -59, -68, -74, -43, -84, -96, -110, -51, -2, -10, 0, -50, -86, -54, -62, -152, -41, -6, 1, 6, 29, 15, -49, -15, -72, -70, -99, -105, -48, -52, -43, -56, -56, -86, -30, -51, -90, -61, -48, -11, 50, 18, -69, -102, -112, -34, 4, -7, 29, -48, -76, -70, -53, -63, 13, 25, -16, -44, -31, -14, -35, -93, -131, -174, -153, -124, -102, -105, -116, -60, -44, -88, -151, -182, -126, -73, -47, -62, 5, 2, -15, -22, 29, 5, 1, -62, -87, -48, -59, -12, -46, -84, -72, -77, -111, -98, 8, 51, 58, -3, -30, -31, -39, -35, -57, -28, -63, -5, -11, -19, 2, 56, 34, -28, -53, -27, -87, -93, -64, -58, -64, -64, -29, -28, -7, -9, -31, -29, -59, -98, -53, -16, -52, -22, -48, -60, -86, -98, -148, -106, -52, -71, -67, -24, 5, -53, -22, -38, -65, -58, -70, -44, -57, -53, 16, -12, -72, -41, -51, -76, -3, 11, 13, -15, -32, -39, -30, -16, 23, 47, -17, -2, -7, -25, -36, -64, -112, -69, -95, -51, -53, -21, -5, 8, 18, -41, -6, -41, -38, -14, -80, -95, -71, -29, -40, -94, -62, -40, -46, -35, -39, -66, -63, -46, -18, -18, -53, -1, 43, -10, 7, 55, 19, -7, -15, -58, -68, -84, -21, 38, 14, -42, -51, 0, -41, -11, 18, -19, -5, -143, -124, -68, -61, -22, -32, -51, -84, -76, -53, -46, -59, -90, -128, -100, -10, 29, -8, -11, -27, -64, -88, -79, -20, 40, -37, -59, -69, -80, -60, -92, -72, -69, -78, -51, -63, -76, -72, -90, -88, -48, -14, 11, 27, 15, -9, 9, 20, 23, 20, -23]
15680b3LL6m5o1L1J9M4L9j6j0p9J1O7n0qO2qj4%k2ML1p9J5j9N9m5oO3l8K7J9n9M6O2J5o8o
15661co0L4j7K4J3KkjjM5m1J9m6J06RL5L2K1J27K37M47R48K646L759m23l991k347o97l61k28
15647B86j27J3lj34l9Q5n5N7k7jn9M0No4M0K4k9n8k5L3KL6l4j5M2J6r9oM4n0LO0lM7mq9J7
15629g1j7K8l0k9k8M2J9N3L1m6k4k9L7k7L4Qn4M9L2j2K5N3p1k8J1N6J8q8k7M9l8JrK5K8oJ9
15612a6L5pm8m1J4j0l1M4L5mk8J1J2nJMR2q0k0M5m2K5p0KL5N3k2PkK2l1j6m4K7M2N3p7M3R
15593A7q0J7K7n2M0K2J0jm1j8K6j2ok1J1pJn8P1J6%l3qL5Q1K7k6q3l0M9l9k0J5J7OJ3M3qm
15575cn4m5J9k7N8M0MQOk7j31j4M3j0L9Q3n1m7J0L1J9Ko3M3O6n5k0l4M6jJ7RJ2m6k8k3K3N0
15556e1L1q7O0m6J34q7k2j0m5R3k5k0L4o5L3M9j1M0l5j0n6j1K4j6j1M6M9nj7Kk4j2M9J1KL7
$$ y = [-23, -20, 16, -29, -90, -59, -40, 4, 43, 27, 17, -62, -51, 16, -34, -42, 20, 12, -2, -2, -24, -20, 11, -68, -53, -72, -13, -58, -64, -1, -39, -12, 7, -52, -6, 56, 71, 3, -3, -63, -29, -46, -22, -9, -7, -9, -10, -11, 34, -7, 12, -34, 72, 81, 116, 148, 169, 296, 533, 980, 1928, 4574, 8333, 7910, 3919, 1572, 875, 514, 286, 159, 172, 169, 35, -4, 81, 26, 83, 56, 55, -4, 36, 41, -23, 17, 41, 12, -46, -71, -38, -36, 0, -34, -49, -7, 9, -90, -96, -52, -102, -99, -39, -42, 5, 1, -88, -71, -88, -60, -90, -119, -147, -105, -86, -33, -2, -48, -72, -101, -64, -91, -57, -49, -103, -54, -22, -34, -9, 44, -27, -55, -44, 12, 30, -58, -85, -36, -74, -73, -82, -57, -29, -35, -16, 19, 12, -36, -77, -63, -73, -104, -60, -25, -29, -57, -46, -34, -39, -38, -34, 58, -22, -42, 3, -39, -14, -84, -82, -47, 6, -16, -9, -11, 11, -20, -36, -80, -53, -11, 42, -35, 8, 17, -63, -46, -19, -71, -31, -9, 1, 0, -41, -59, -33, -45, -51, -72, -61, -68, -67, -125, -54, -38, -38, -71, -79, -44, 37, 64, 38, -45, -75, -26, -65, -85, -70, -53, -47, -34, 9, 1, -3, -57, -102, -83, -110, -52, -12, -8, 0, 6, -21, -152, -166, -123, -133, -94, -11, -62, -109, -99, -68, -49, -47, -110, -67, -1, -56, -76, -110, -64, -65, -48, -39, -27, -73, -101, -124, -101, -51, -20, -107, -47, -93, 41, -46, -68, -78, -123, -30, -55, -75, -41, -106, -73, -24, -35, 5, -30, -40, -96, -107, -83, -99, -110, -64, -15, -20, -37, -35, -59, -71, -22, -11, -9, 28]
15539B8p5L2n2J9L9l3o8L1j8k3J9MJ3N8J4lj5l4m6N0Ro4pN7J1p2O8k0M8K2j2L2l3o6%J5l7
15522a09k3J02J1pP1l8k2J4n4l2O7k2k0lM1k3PQN6j7o5N1p7l7N1Q0l9M2k4Mn0k3Ok4j5N6J9
15504c8jj3Rj1m1mL0M3k9l2k0M5Q1J4k0J3J2m5k6m6K5k8nN9K0M8pl8ML9p6l6j2L0Ok1L7J8
15486a6j4L2j6L7pl3m7J3K3j2q%l1L1N0mo2J2L7J4l1M6k3m2K8%k0ON9p5l1N2KJ6j1J1LM1j7
15467A3J0K7J27M7N0J71K91L18Q51K357M761Q32m689l206r44l23j66j62j26n7L8q0j12j8K3
15455C3q%n7k1N4N0n5qOlk9L2J6k9l6j0K1O3K4n3l6jJ8j1j7K1j0NJ8O5l2n0n5M3Q5l0l5K8
15437dK3n6On3N5N4r1j4L9J6j7Q7ql1n6K4M7J32J1o2k8m9r1JL9pl1M7RK1k0j56M0M6M5J6n
15420b1n0NmQj8N9j9j0m4j6N5l9K5j2mL8L1K3j6Pl6j1N6j7QP9l3K8J3n9j01M3RoqQ8Rl8r1
$$ y = [28, -47, -15, -67, -48, -9, -42, -110, -79, -97, -120, -101, -97, -84, -26, -12, -15, -30, -64, -110, -60, -51, -115, -122, -65, -54, -126, -58, -78, -30, -8, -20, 12, -21, -87, -87, -72, -109, -132, -30, -19, -26, 45, 7, -15, -1, -55, -87, -20, -42, -62, -65, -24, -47, -40, -32, 24, 7, -58, -7, -84, -121, -70, 10, -29, 13, -11, -7, -57, -80, -74, -98, -113, -57, -38, -39, -52, -43, -54, -95, -99, -69, -26, -55, -87, -107, -62, 19, 33, 13, 26, 38, -7, -33, -79, -54, -82, -87, -28, -8, 40, 33, -5, -1, 38, -38, -74, -86, -56, -50, -71, -34, -16, -30, 2, -14, 23, 16, -17, -64, -51, -28, -40, -48, -48, -79, -48, 2, -2, -64, -52, -15, -1, -32, 14, -9, -51, -23, -23, -43, -37, 22, -53, -84, -32, -30, -14, -25, -14, -11, 30, 13, 23, 50, 177, 224, 274, 445, 736, 1054, 1905, 4262, 9023, 9855, 5166, 1960, 1016, 693, 527, 365, 239, 182, 220, 140, 28, 10, 33, 25, 25, -32, -53, 1, 51, -4, -12, -6, -9, -38, -6, 10, -19, -55, -65, -44, 19, 43, -10, -46, -47, -29, -40, -57, -36, -46, -41, -23, 42, 10, -40, -95, -52, 33, 3, -32, -4, 19, -37, -31, -84, -29, 25, -66, -80, -41, -25, -42, 45, 37, 6, -50, -26, 21, 153, 164, 102, 74, 25, -66, -65, -26, -33, -64, -17, -8, 13, -7, -163, -123, -77, -32, -16, -21, -71, -66, -70, -62, -80, -21, -40, -50, -94, -110, -55, -94, -69, -81, -85, -47, -16, 7, -9, -2, -38, -49, 7, -10, -2, 77, 44, 72, 85, 26, -75, -32, -23, -29, -37, 51, 60, 22, -69]
15401f9J7N4k0n2K0rl0Q3Np0j2J1L5K2j6L9K3q0N8j8m5M6n5J3K7n5Pj5N4k3PK1l1N9Rp8k8
15383i6L4pP4J0n5K8N1l0m7Rp5K5M1oQ3p7N3L7q3kj3OM5o8L9l5J4ro6k4J05np6J5m1Roj3M7
15365a09J5N3k3r5O8M7l7k4M8k8J6J9q8L6L8n2m8k6L8R6J2m1O9o7n6J23kq2nR5N9o7j8P1l8
15348cJ5k4l9l3pR2K3o9qk2PK9O2J9rK3j7o0N7Mj8o4k5j0Q0l3q1J5OJ5m6K8K5j8L6j4L6l2
15330f0K8kJ3l0k1N5Pk3oo5k2j5J8L1N5L9q2j9k4oQ6L6n1j6K3K9k3K9o8J5M8o9Oj1j7%M4O8
15312@l1l8j7jM9K3mQrpJ8j1n3oO2N2k8l8M2n6l5j0L9k9J0J9k4ML9J7n4K0kj9n8K7k7N7L2
15293c9l2k3ml0N9M5K1l4n5mN2J7n3P6m9K0rJ9j7n2m5oQ3K3L6Ok8pJ5n7L0l1L6K6k2n6K6K2
15275d1NJ2m7M7Pm8K9o4O0M8k1q2n9JK3J2M6N1oRl0j1n8J1M6Jj7j0k9J1k1K3K1j9K3N0J1o3
$$ y = [-69, -52, 2, -18, -70, -50, -59, -89, -6, -1, -71, -83, -72, -37, -15, -31, 8, 31, -49, 9, -9, -54, -8, -63, -50, -23, -78, -71, -86, -32, -55, -48, -27, -58, 1, 10, -68, -96, -62, -69, 5, 15, -40, -12, 39, 9, -38, -29, -104, -79, -38, -44, 39, -38, 15, 52, -31, -33, -46, -40, 5, -63, -24, -59, -45, -54, -120, -144, -39, -44, -120, -105, -146, -137, -143, -156, -109, -94, -41, -64, -159, -91, -44, -81, -105, -57, -85, -69, -50, -138, -102, -64, -116, -164, -190, -152, -56, -44, -85, -16, -83, -139, -16, -18, -100, -105, -10, 49, -18, -36, 35, -3, 12, -12, -51, -84, -91, 1, 24, -45, -53, -75, -68, -39, 23, 42, 33, 56, 39, -21, 36, 40, 22, -42, -67, -77, 3, -30, -111, -96, -90, -75, -121, -93, -68, -86, -50, -64, -28, -60, -32, -34, -21, -51, -72, -17, -10, -33, -39, -104, -126, -141, -123, -92, -37, 2, -80, -99, -123, -129, -43, -7, -58, -74, -51, -22, -45, -16, -84, -69, -21, -90, -84, -95, -112, -112, -68, 0, -31, -69, -86, -87, -38, -15, -19, -11, -20, -27, -9, -20, -73, -79, -17, 35, 7, -31, 11, -45, -80, -90, -51, -80, -70, -51, -75, -71, -32, -15, -69, -49, -51, -70, -128, -101, -128, -71, -39, -71, -94, -98, -128, -69, -24, -3, -37, -92, -96, -44, -27, -80, -4, -53, -33, -42, -23, -40, -92, -137, -143, -60, -37, -1, 5, -23, -30, -15, -72, -42, -73, -37, -11, -33, -89, -63, -41, -36, -24, -71, -24, -17, -65, -36, -100, -40, 8, -13, -95, -154, -153, -130, -118, -72, -21, -27, -18, -48, -59, -117, -106, -60, -59, -76, -86, -115, -104, -125, -102, -81, -100, -77, -27, -16, -79]
15257g9jk8RJ0JK4j0m3pM9L7J2kL2l5lM8N7l6on0M3n5m5L2M5K8n2j5LJ3j9m6m9%N5RL8NmJ15
15237H0l7pJo9j7mN3m5m2O0m8n6j6N6M9Jl0L8K8n4L0l6O5jj1mLmp8K6M6n2J0O9J3%ro0Rl7
15218h0P9K6q2j9N6m4LN8J6k4m7P4l0l7k6N4K0l3KK8o3L0OJ4kJK3N9lm7k9l1NK0j00oM0jL2
15200e8N5o2L7j6k7M5J2ro1L7M2n4J6j4QL2n9J9N1M8p1q3M2N9J5m4n9K1N6n0m3j6K6K7J9j7
15183g6k3OQk0K9k4R9Q7n9J2m6rRm1L5j6k0N8R7ol3q1k4k1L6q5k4J62k7l4j5o4J5M2K6J2R4
15165G9q3Rk1j5Jk3K2J3P6n3j9JK5o7n3N1L9R6K1p2K6o3l8PM8Q0j12m3J7M0QM8p5PK6L7J1
15147E1n5O0kkPkPl5L3kn5M3mmK2j2J9p6L3O9k5KP6L1PM1N1K1K36K17L23M30O88J081K611
15131E885N540Q244J334p936o461k879j282p67m77l26k29r7j12j48l0m5n7J7p5j7O2K2n2%
$$ y = [-79, -80, -108, -99, -89, -88, -64, -74, -117, -124, -75, -38, -26, -28, 4, -31, -34, 14, 71, 35, 29, -21, 22, -33, -78, -46, -1, 27, -25, -40, -37, -24, -43, -89, -138, -138, -83, -74, -36, -31, -35, 80, 43, 36, 37, -32, -49, -53, 0, -45, -87, -27, -75, -131, -147, -91, -42, -41, -71, -33, -5, -59, -29, -65, 0, -1, -12, -16, -13, -17, -95, -69, -23, -75, -65, 4, 17, 17, 8, -52, -43, -80, -1, 25, -57, -76, -20, -64, -61, -3, 13, -11, -58, 16, -14, -51, -77, -23, -3, -36, -34, -6, -69, -39, -33, -19, -21, -20, 3, 62, 59, 12, -17, -48, -43, -23, -123, -129, -89, -90, -58, -3, -65, -28, -44, -71, -26, -14, -23, -84, -47, -5, -59, -43, -57, -49, -17, -76, -57, -6, 42, -29, -112, -70, -11, 4, -40, -99, -78, -22, -72, -115, -131, -105, -78, -59, -76, -99, -93, -85, -105, -76, -100, -1, 86, 27, 39, -7, -16, -7, -48, -13, -29, -49, 9, 106, 100, 67, -14, -38, -59, -23, -108, -132, 30, 3, -31, -46, -110, -95, -53, -27, -15, 79, -4, 5, -16, -31, -30, -53, -31, -18, 58, 5, -14, -13, 12, -55, -108, -57, -18, 78, 99, 27, 53, -10, -48, -41, 7, 87, -25, -68, -51, -11, -3, 45, -30, -23, 3, 40, 51, -4, 56, 54, 52, 59, 57, 64, 29, 62, 60, 5, 48, 44, 40, 62, 50, 69, -7, 26, 95, 70, 72, 148, 179, 186, 227, 278, 299, 535, 752, 1075, 1505, 2193, 3274, 5885, 11425, 19669, 21003, 13067, 6606, 3727, 2445, 1678, 1201, 875, 646, 549, 437, 289, 259, 214, 157, 174, 99, 82, 144, 166, 114, 114]
15119A14K1M3p4j7l3m6N7k2k2J7N3nNK8Qo0o1N1k3n5m7M7k8J4K1L6N4j8K0M1k3o9n5L2m1k2
15102e9Q0jk2K2J4p0O7K6J0K1po3l6P7m2O0Jk8M5j4n5k3L4m4lL2L8m2o6j7K5j7l0M3Q2OJl2
15084A3K2m2m6k0O8k4j9P3m9k0J4n3M8J4Jj1Rk7k7j4lL4K8J8m9QmO7LRrK0Kk7MJ7%l5Pn9k8
15064h7O4M4k2n4JJ8j4K3K3l6m2Pj3l2N1l7K4P0J5l6mk0N0J4K4L5m8j6l5K3o5J6J09q9M1o5
15047f3m5K2M4l1J4O6qk3OM0j2oK2lJ5m6p2RJ8k7J18P6j05l4J3J9l8%K3J4p2k0O0K3L9l1l9
15030c4l0k2ln1O3P4l4J6K9ro4LL3JKJ8Pj3l5K8M1m4L1k2l2J8N5K1k7j1p6N3J8l9k7M6M3l3
15011fj6mK8ll4m4n5rM5K8N4j3J1Pk6o4J7J7J6oM5n6oM9j4L3l3Rj4J2M0L0Mpl1K5k7l4%L7
14992El9j5M4l3l0N8N6p7J9n4LN5j8J1Lj1p3o5M8R4M2Pn8k2l1L4Mm4QON3j7l2O4Pq8N7Oqk0
$$ y = [114, 135, 178, 104, 87, 54, 8, 65, 43, 21, 38, 91, 86, 91, 119, 127, 67, 6, 57, 34, -21, -68, -21, -49, -35, -14, 22, 76, 58, 78, 119, 96, 27, -28, 4, -37, -59, 21, 20, -2, 20, 34, -36, 31, 57, 67, 88, 81, 18, -18, 59, 17, 77, 78, 50, 95, 81, 26, 3, 37, -7, -10, 22, 60, 18, -48, -65, -40, -57, -87, -44, 38, 44, 45, 13, 35, -7, -53, -73, -5, -29, -48, 25, -24, -44, -30, -83, -35, -21, -20, -31, -22, -49, -76, -90, -93, -59, -31, -13, -62, -54, -58, 9, 12, 21, 12, 32, 34, 7, 11, 28, 28, -7, 0, -59, -87, -23, 21, -1, -55, -54, -36, -50, -27, -4, -40, -82, -75, -88, -120, -69, -106, -82, -12, 3, -33, -37, -57, -7, 7, 31, 66, 18, 2, -33, -10, -75, -59, 50, -39, 2, -63, -108, -86, -42, -73, -59, 7, -1, -24, -18, 22, 10, 4, 26, 23, 38, -8, -80, -71, -53, -80, 38, 114, 9, -25, -12, 7, -31, -31, -8, 6, -66, -86, -26, -3, 36, 5, -34, -64, -86, -89, -140, -77, -3, -37, -21, 8, -1, -65, -62, -29, -28, -26, -8, -1, -14, -49, -21, 20, -24, 7, -15, -47, -29, 26, 47, 20, 9, -67, -14, 4, -35, -62, -16, 27, -6, -22, -26, 2, -1, -35, -79, -134, -143, -98, -70, -16, -29, -18, -11, -37, -101, -84, -67, -51, -57, -12, -68, -74, -25, -39, -6, -39, -30, -44, -32, 8, 38, 42, 35, 4, 29, 2, -32, -32, 5, -34, -49, -5, -38, -68, -10, 46, -31, -12, -66, -63, -8, -26, -15, -12, -23, -96, -161, -113, -19, 23, 30, -28, -50, -81, -47, -43, -87, -79, -73, -20, -37, -69, -5, 2, -86, -29, -23, -31, -51]
14973e1q6M5nK6J2NM0kn8L1j1J02m3n8L2j1M0j13J7R1J5M2k8mo6rj5L2K7q7ll2O1nM7p1l1
14956a24N2MQ9l4l4pk5R8o4J1k0l3J23pm3K6Nj8qP3n2n7O1MK8j13Jj2LN1l5m8M9l6l1O4J9
14938d0K0Rl6n9O4P3k5o4p0L7n7O9L2n7j9K6j0J2l3J8O6Jn0Nj0K4P6p0n8L4L5j3RK7m1j1M0
14920d6K8J9q6%K3MK1r4K0M8M2j9n5M9M7n6N1M0n8N5j0q4OpN5J1p2N2k5l4j2J0mm5J17m7j
14903e7K8l2J6n4R9l2k5k4L5j4L7j1l7j9J1N0k1l4%M6lk5J3rK3On1n7K4O6o7OK6kJ35k3kn9
14885c7N5rl6qM2M1M3p2k3n5K3N7j0q7pJ0MN5J8k9m6J2p1OJ00j6J8mo7m7P2O0qo9j0ol7O1
14866g7N1J6l3k0j6nK8l6O1j1n2L8k2j2NK2o6M7L1l9n0l1J2K8M5M9J1oK1n7K0l0JJ9K9j8o4
14849a11N0O5n8m6N1j5m7M3J1l9K5K0j2RL3K6K8l6j6k5k4L5m2LK2%J8J7r5j2Q6N9p1Pj6L7
$$ y = [-51, -137, -92, -97, -71, -59, -54, -14, -16, -74, -43, -54, 48, 5, -53, -21, -32, 8, -105, -88, 3, 18, 60, 32, 28, -38, -47, -62, -30, -3, -90, -93, -125, -64, -69, -22, -93, -124, -72, -68, 21, -13, -47, -54, -79, 19, -45, -34, -54, -87, 36, 29, -14, 12, 17, -1, -9, 64, 12, -45, 16, 20, 48, -65, -64, -76, -73, -22, -57, -105, -56, -92, -123, -59, -40, -20, -11, -47, -106, -42, 31, 6, -58, -128, -91, -148, -79, -47, -104, -123, -97, -107, -95, -128, -110, -44, -43, -93, -88, -98, -74, 2, -68, -126, -92, -57, -70, -61, -34, -75, -86, -46, -18, 1, -85, -85, -62, -58, -37, -131, -111, -63, -21, -40, -95, -46, 1, -55, -4, 36, -22, 33, 23, -61, -55, -62, -7, 4, -68, -16, -41, -75, -87, -77, -81, -126, -9, -56, -57, -29, -61, -45, -99, 0, -32, -57, -81, -46, -60, -23, -34, -71, -90, -79, -29, -50, -84, -84, -38, -41, -66, -53, -62, -39, -33, -84, -141, -117, -51, -118, -112, -86, -88, 47, 24, 22, -37, 18, 9, -27, -35, 7, 48, 91, 19, -4, -59, -36, 21, 11, -76, -83, -73, -69, -14, 4, -25, -71, -59, -130, -124, -24, -40, -22, -26, -93, -140, -68, -8, -16, -85, -95, -101, -138, -77, -26, -10, -43, -63, -79, -84, -56, -92, -31, -42, -94, -56, -78, -90, -85, -63, -129, -82, -51, -90, -140, -171, -159, -131, -86, -37, -26, -32, -11, -68, -48, -78, -77, -58, -29, -47, -111, -61, 4, -54, -100, -49, -64, -111, -68, -57, -96, -71, -51, -63, -54, -21, 5, 33, -3, -19, -44, -68, -33, -75, -72, -50, -50, -32, -15, -110, -122, -36, 23, -48, -41, -57, -20]
14832b0L3q7l8O3L8J3k5l6o0j6O9ML2K4rK1j3j09J8J3K4l8o6P8K4OJ9L1LO7o6m9k3L1M1p8
14815h1K6K8m8K0K6M0q3K8N3m2pj5QK9K6%n3K2j9k2N8o9L8m4O9m6k1J20l8o6J7j7M1J2o7K7
14797e0k3O0Ok1k2K4pJOJ5k4k0jj3q3k1P9J5M4M0M4j6o7J7p6K4K8n5l6Q3Pk9N4p8O0K8j23
14780a30J9j3L2n1K3L0M7k9j0n5M4L4k3J3l7K9k5L5J7q9N3N9QN6m5kl5m2K1M6k8M3NJ4j2m8
14763d6R3o7j7jjM6j4m4l7jJ0P7rn5M1j1k0k4N7k7k4MRok7o9M8O9R%l3J3k5J6Rl2qM4k8O0
14743b1M3o8L2q0J3Pk4J2M0j7M7rl0l4o1M0Q2N4ln2p3K0J5P8l4m4j4M9P2r3O3j4l0%J6J0L
14726erNK2l5OJ1PL0qk4L1k9OM6n4l3j1lJ1l4K7p6O4O7q8K2l0m7k1N9N3K6jLl0p6N2K5m8O0
14707b9J9p4nP2j2LJ8k7kM7op7O0m4j7L0J1Kj9k4K1j3K8j5l2J4O8Jm4o0K0k0K1Q9m5k2N6K9
$$ y = [-20, 13, -74, -112, -49, -11, 2, -23, -59, -119, -135, -66, -62, -30, -6, -15, 6, -7, -116, -98, -85, -61, -99, -165, -87, -63, -57, -38, -7, -4, 63, -3, -52, -75, -44, -3, -81, -55, -27, -75, -55, -29, 11, -72, -44, 9, -33, -40, -55, -47, -18, 8, 8, -45, -23, -42, -64, -6, -75, -37, -81, -12, -58, -79, 41, 3, -63, -46, -63, -22, -10, -77, -50, -73, -13, -7, -28, -50, -26, -33, -32, -26, -11, -35, -55, -56, -69, -152, -173, -94, -79, -35, 5, 49, 33, -34, -17, -93, -69, -41, -96, -132, -49, -42, -71, -17, -95, -35, -7, -130, -111, -124, -92, -143, -120, -90, -43, -72, -82, -137, -93, -59, -82, -69, -106, -77, -102, -67, -50, -139, -86, -27, -19, 37, -8, -10, -45, -87, -66, -20, -48, -5, 0, 14, 2, -46, 47, -20, -37, -38, -39, 7, -7, -51, -88, -89, -79, -2, -11, -66, -25, -36, -56, -80, -23, -50, -74, -70, -61, -67, -94, -163, -115, -46, -37, -37, -70, -57, -82, -66, -57, -89, -97, -53, -81, -21, 22, -46, -14, -94, -81, -74, -98, -86, -46, -63, -16, -25, -55, -89, -150, -110, -28, 26, 23, -29, -102, -82, -67, 11, -23, -67, -81, -32, 40, -53, 10, -4, -34, -34, -18, -8, -5, -14, -9, 13, -22, -16, -5, 2, 32, 24, 0, 31, 2, 8, 54, 0, -33, -44, -47, -36, -70, -43, -119, -55, 12, -76, -54, -84, -131, -152, -93, -40, -14, -15, -12, -42, -118, -66, -41, -89, -29, -10, -84, -89, -17, -29, -26, -8, -35, -37, 10, 4, -73, -13, -57, -74, -44, -33, -31, -50, -74, -53, -66, -38, -53, -85, -71, -3, -2, -46, -106, -86, -106, -85, 4, -41, -63, -7, 22]
14689B2p5K9M9k1j1l9K5n7RK4K1n5qJm0k2O1K3k5Kom9NQ3q8P4K7l1L0M4n2j6L7Mp8m5N0J2
14671h6Q2L6j01J0J0jj2O9k9l7M4k0m8k1PR7K0J8o1p7OrN6J4L0pL7o6Ml6j6O8k0l2%qO9o0
14652g0m1P3k2Km1J1K8LK9rJ0K3J9j1m0J3L2K7j6q5J5Oo3K6k2K2Pk3N8j2N5m2J3knK6j2m3
14634f1m1J9rJ3Jn2k3N9Rj7M7m1L3K2n1M4K8L0L4J1o8QlLk3kJ8p2L8k0m7jQ3NlM6Jl9J2p5
14615h4L9m%o3L1n1j3P4J5j3M2K0l6JL5q0J9L9p5K4N5J5J4j20K9P2m2m6O3pl2N6p7o7K6P3
14598f8n7l6J43km1rJ1%J0J7n4P2N0n8p5J8Qj2O8qr8kL1O2QL4r1j9N3M3L5k6m6K2q8j2nJ0
14580a12JKP7mm5lpl7LJ8K4N7j8%k4K5l5K1k3N3L6o6J1n4M9K7m2o4j8L4M6J8J1k3ql8k2j2
14562a42RK4J2K4l7M9j5k3%L9M8p0kK0J7L1o5mK6m8j1R9k5PJ6l1K6P4jo5L2ml6p0%m1M2j2
$$ y = [22, -53, -24, 25, 4, -7, -46, -21, -78, -69, -45, -24, -79, -87, -86, -126, -148, -87, -64, -89, -87, -93, -142, -137, -54, -142, -68, -41, -72, -42, 2, -50, -66, -29, -25, -103, -148, -98, -86, -4, 32, -69, -59, -49, -50, -62, 7, -22, -59, -15, -35, -83, -104, -97, 0, 20, 38, -23, -100, -94, -103, -47, -33, -3, -10, 27, -39, -35, -71, -87, -19, -39, -71, -71, -79, -10, -70, -111, -38, -60, -58, -99, -88, -60, -57, -28, -37, -27, -4, 15, 4, -36, -23, 9, 36, 20, -65, -50, -44, -107, -81, -103, -81, -74, -97, -39, -51, 4, -38, -25, -27, -32, -6, -18, -61, -102, -83, -92, -79, -78, -130, -153, -94, -85, -102, -55, -96, -63, -41, -92, -48, -20, 10, 44, 55, -13, -5, -8, -5, -28, -30, -12, -84, -46, -66, -113, -114, -31, -26, -29, 17, 18, -21, -9, -84, -45, -49, -49, -112, -81, -132, -145, -71, -56, -69, -27, -7, -43, -42, -7, -87, -68, -29, -104, -80, -25, -10, 4, -116, -87, -15, -57, -103, -40, -47, -79, -23, -100, -167, -141, -68, -125, -161, -18, -20, -61, -70, -59, -59, -49, -32, -86, -14, 36, -22, -97, -79, -71, -83, -15, -23, -121, -123, -92, -30, -22, 12, -79, -98, -45, -2, 33, 7, -39, -17, -105, -117, -122, -112, -111, -109, -32, -36, -81, -84, -91, -128, -125, -107, -83, -26, -44, -44, -68, -43, -78, -57, -80, -27, 9, -57, -46, -100, -51, -24, -66, -130, -148, -114, -68, -50, -39, -62, -70, -108, -130, -142, -133, -109, -97, -73, -110, -61, -76, -99, -99, -60, -12, -82, -84, -64, -47, -16, -81, -85, -59, -107, -118, -19, -44, -37, -21, -52, -26, 48, 47, -18, 14, 10, -26, -96, -96, -137, -95, -107]
14544a07N3N1ll9l4L3L4m9rK0K1QMj5k5L7Kn9l0J7N2p2LM0K0L6q4k6N9m9J9kn0N8l5N0Pj8
14526h2K5RJ3l4OJl6m2J9J7j5rLJ5%M9n1N3K6L9K7onk5J3M4j7l1k0K9O0j1o0ok2pk2M7j6l4
14506e6K6plp6lM9%m4L6kN7L0o2N0J1o2o6j0N1L4j0j7J8o5K3K3K7m0j1M9p8M8M9lL5j8rN0
14488B4kl6K7l7J6L6m7%k3K6l7p4%O2j2O7l7Mnl0J1K9l7K5p5K2J13q1k0K0K4K1K8j8K9k6l3
14471d6j2j8J6K8k7j6j2M6m4j4J5P2pn5k0mK5omO0pL5k8rpk8K0j0oJ9L1L8k7oj6l1Om9QM8
14452d2nj5N0l6k6J4m1J1n5R9K1j3o6o6L4L6R0Rj3j5Nk6jM0qm2L6l7K6K2K2K4o0n4ojo2J20
14434c1j0n5l5P5j0J3L8Jo7nQO5l3p7NK9P9M1k9l0on7j6lL9N3o3k4Q4k7lq6j3P3M1j6L7l3
14415d8m2M5k7J6K9J0M2Nr2k2J39n0j7m1L5L0r5lL9J0n3K9N0nm3K2J5j7l4J6o7jL6M0K4j49
$$ y = [-107, -54, -3, -6, -45, -79, -46, -12, -61, -70, -50, -29, -21, -17, -32, -57, -20, -18, -77, -107, -90, -38, -110, -107, -67, -47, -11, -95, -121, -62, -111, -92, -94, -144, -86, -121, -71, -64, -82, -57, -48, -35, -69, -63, -62, -98, -140, -121, -104, -119, -128, -125, -110, -110, -61, -112, -59, -33, 6, 33, 27, 22, -3, 10, 54, 37, 6, -14, 15, 75, 64, 4, -2, -24, -31, -53, -6, -22, -56, -30, -37, -40, -116, -119, -70, -70, -114, -78, -80, -23, 7, -55, -5, 6, -56, -122, -132, -81, -47, -57, -74, -56, -121, -98, -75, -48, -88, -99, -50, -128, -80, -31, -34, 1, -17, -26, 24, 22, -14, 13, -24, -8, 28, -19, -19, -42, -16, -53, -127, -127, -65, -77, -10, -47, -43, -48, -78, -67, -38, -75, -50, -125, -103, 10, -71, -91, -71, -47, -26, 2, -16, 13, -13, -46, -58, -76, -60, -32, -59, -75, -87, -41, -85, -99, -84, -12, -19, -74, -94, -98, -73, -79, -83, -23, -30, 5, -23, -32, -39, -67, -47, -57, -63, -44, -13, 25, -2, -8, -24, -55, -49, -98, -90, -42, -47, -62, -12, -48, -74, -60, -101, -90, -145, -46, -25, -38, -104, -170, -136, -100, -10, -1, -14, -29, -24, -50, -51, -11, -19, -61, -25, -62, -36, -14, 8, 32, -28, -82, -88, -89, -151, -31, -41, -96, -131, -56, -66, -53, -15, -14, -81, -86, -78, -13, -46, -123, -118, -89, -10, 31, 2, -28, -34, -91, -107, -110, -71, -18, -81, -105, -21, -48, -51, -137, -150, -77, -36, -52, -15, -48, -90, -45, -72, -56, -27, -17, 25, 30, -62, -84, 55, 5, -12, -53, -18, 12, -83, -86, -47, -37, -90, -61, -11, -16, -59, -37, -22, -39, -73, -57, -124, -125, -89, -49, -25, -174]
14398a74L5N2L4K2j9l9N8k5k8kL0m5J2N5l7J7kK7l3O0n1K1l7j1Qj6Q6l1Q0K0m3r9KL9l8l4
14381a06P1J0k6R5j4l8J9J6p0qJ5q9P8%L8j3q7J1L8j9j3j4k2oO3J1M2Ol6j9J4o8L5K8m1k4
14364a23M9m7j3M0l0J7oN6l4Lj5L3l4J2O7n2lM8m3K%ml5M9K4n2L4N2p0J8J7k0k2J6kK5K6k4
14346d1l4oJ6OL0k5J1r5J0O3M2rON8l8k0m2l6L1j4j0J9L5j7j1jJ9j4l9K1M8P4j6qk6K0rn3
14328e5J4j4m5J5M2qJ4mjk5l0j2kP1L7o9k7Mm7L0M1O3m8k4m3j3P5K9lo7k8OM0L5mM4m7p0R3
14309c3L3q0oJ06kl5k8m0q4pJ18K2J5k9m1qK9RMJ08k0m8l9n0N9Pl9MoM6L5o2N3rm5o8l9Q6
14291h4J6lJ9J0l6J9J04o7o5O0k2j9K7J2l1j6J1p9K8M6QP1kL0m8n0L9J3j1j00NL9N6L4m2p0
14274i8KN0Mk2M4kK0k1J4j1M5j9o0m6rO9m9J8M1M3l0j9l0l7OO4NPJ5m2qN9M0o1m7j6R8Rp5
$$ y = [-174, -139, -87, -53, -31, -50, -89, -31, -56, -84, -86, -56, -101, -89, -34, -71, -54, -56, -29, -62, -2, -53, -32, -69, -80, -72, -88, -2, -33, 47, 67, 24, -75, -73, -34, -72, -106, -35, -25, -51, 44, 30, -8, 11, 27, -43, -51, -36, -125, -47, -47, -9, -22, -109, -98, -60, -79, -92, -106, -128, -134, -71, -60, -18, -12, -48, -67, -53, -121, -86, -58, -99, -123, -74, -121, -134, -94, -124, -107, -113, -57, -91, -88, -103, -70, -104, -92, -25, -77, -80, -32, -75, -73, -73, -77, -112, -63, -39, -91, -57, -5, -75, -57, -40, -60, -82, -66, -68, -43, -17, -41, -75, -81, -65, -59, -29, -54, -43, -138, -128, -65, -23, -32, -26, 32, -6, -26, -68, -104, -73, -87, -97, -78, -43, -60, -71, -72, -53, -67, -106, -85, -37, 37, 21, 13, -13, 7, -2, -55, -41, -55, -100, -85, -43, -51, -37, -41, -42, -67, -97, -109, -111, -40, -3, -72, -99, -95, -142, -112, -71, -8, -56, -80, -123, -136, -61, -32, -35, -102, -130, -124, -84, -49, -53, -9, -56, -126, -33, 0, -80, -86, 20, 18, -17, -45, -85, -169, -176, -58, -36, -21, -50, -91, -99, -70, -61, -57, 51, 31, -17, -56, -106, -47, -40, -79, -75, -81, -35, 0, -62, -9, -18, -63, -131, -170, -84, -68, -71, -52, -42, -78, -59, 45, -22, -87, -27, -49, -68, -41, -29, -60, -76, -65, -144, -116, -70, -62, 9, 7, 37, -11, -61, -22, -9, -20, -120, -115, -76, -20, 14, -28, -98, -96, -46, -42, -64, -20, -22, -2, -23, -9, -20, 25, 6, -54, -100, -109, -40, -89, -71, -30, 13, -17, -36, -66, -103, -97, -33, -28, -21, -6, -48, -56, 3, 43, -18, -65, -81, 17, 26, -49]
14255d9k7kK8L7o7L4Oj0Qm7M5%L5m6k8P6k7l5K0krJ5l8L5O%NLpJ9K3m7m1J1K2L4j0o2J1R1
14236A0j4n5n9L3L7M5l6l8j7j2K9K8J7J2RqL4l2PL1M4J2l8j8j4op0k7QN6L9l9l9o7N7n8Q2
14218e7J8J4q7M0J7L0p3p7P7J6K6k9J8O4p6Rl2PL5LNqj4N0NK6l5k6K6L9l1J0J4K2p7j5k6P6
14200a6kp3OQ2%o4j9l9N5k6L9o8O6L3pPm1O9m1l1K8l4J5j6k7R8l7L4L2m2J4j27K3J4rl1M1
14183i4L6n1jj4L7M2L3j5%j4k5n1J7P1m0M3ok5k3k5m6J1L8j2J6k4j6O7n9N4L9R8J5k5Pll6
14165A9j04jM6j2O8Qn4M0m2K2n7o3N3M7J1m6M5n0rP4n8l2K2k2J8M5k5J9j8QKj5O4m8NK2L8
14147B0k5o0qk8K1j5Rk4j6O1l8l8L9O0k9J4Q6m0k2n1j5O7Ln1O5k0m6JL5J5J3J3r8JP0Oo6J4
14129g7rO3L6J9n0k4m1n8N8O2l8m9j8l0O2K0O1M2Qj3r0jj0ln4P4j7pm0L9J8kj0l2lj0LpK9
$$ y = [-49, -76, -78, -50, -13, -80, -46, -40, -50, -42, -89, -44, -44, -9, -55, -83, -7, -34, -69, -49, -51, -60, -45, -83, -48, -42, -42, -37, -34, -41, -22, 1, -46, -87, -76, -54, -20, -30, -92, -81, 10, -4, -59, -118, -85, -48, -3, -39, -77, -94, -106, -77, -49, -32, -20, -11, -19, 15, -17, -10, 21, 65, 77, 39, 21, 7, 1, -69, -96, -88, -32, 7, -32, -71, -138, -81, -139, -57, -39, -25, -112, -72, -55, -25, -98, -175, -98, -82, -56, -85, -67, -3, -79, -70, -102, -95, -60, -57, -52, -60, -74, -24, -19, 7, -28, -54, -28, 11, -20, -10, 4, 26, -51, -66, -92, -16, -18, -91, -85, -3, -3, -67, -86, -125, -70, -96, -57, -125, -59, -26, -33, -26, -67, 2, -39, -70, -42, -76, -61, -77, -104, -6, -43, -9, 23, -19, -5, -132, -109, -95, -104, -135, -94, -58, -109, -110, -124, -87, -45, -12, -27, -27, -41, -66, -117, -100, -29, -69, -26, -32, -57, -80, -105, -151, -140, -102, -114, -98, -122, -138, -71, -130, -76, -37, 61, 76, 51, 58, 55, 19, -85, -86, -40, -52, 16, 24, -30, 10, -32, -10, -67, -130, -77, -30, -19, -65, -20, -70, -79, -5, -63, -95, -73, -95, -77, -32, -57, -38, -56, -48, -46, -61, 3, -45, -40, -18, 20, -5, -65, -73, -101, -80, -95, -86, -110, -126, -65, -103, -141, -102, -42, -71, -57, 29, -11, -33, -84, -99, -32, -29, -80, -15, -35, -81, -80, -45, -30, -17, -4, -102, -101, -31, -25, -91, -77, -86, -23, 13, 32, -18, -42, -83, -141, -83, -21, -59, -108, -126, -156, -94, -74, -13, 29, 37, 24, -66, -67, -77, -80, -134, -60, -77, -84, -124, -85, -67, -69, -79, -111, -114, -124, -121, -128, -99]
14111i9NL9P4p9J8j6O4J5m8q0M6k4j02P5Q6K8L1q1m4L5K1J9n2nQL0k5l3K0KK1Jk1KnJm9Q1
14093d1kmmj7jM7l8M7k2PKk3L1rNm7KQ0n0pj6o4P0K7loj0l7m3P1%K9n9Rj2N0Lj02Q2J9l4J6
14073e4k9LL3l1J4Mj0O5J3l8n6M8L5mm4M5o5l2N2mJ1o2O1L0m1J0Jq0j3L5L2RJ4J2j7k4M6m9
14054h0lL6m2RN1L6n9m7k5j3M6M8P5l8k6k1N6k4J5k9l9j1qL2L6qO2p1j8LM0l7k7O1k6l9L8
14037d7L2l0j6oj0L6j4J2m8j8M3k0K3j7N9rk7k6M0J0K9k8m6L4k2J5M9l9pL9J1m8kK3k0j8l1
14019i4j6N8K3n7N0mL4n9J7j0j9j2oM1r%O0KNk2J6M1l0n8l9K5k6pK0oJ0M3J3J9Qm1k9k3P1
14001a1n6J0N3l5k5j3l4K9M6l3JL2n4J4M7l7j7mj2K4nM2Lq8M2om0L8P4L4q0m7NJ5N0m8k1N5
13982e2rj8k2R9k7m1l2J0pM0mml5jM7N8JpJ2l2m2l8j2J30J2p8MOm4N9l0k3P4Nn0k0OO2Jm9
$$ y = [-99, -94, -55, 19, -60, -42, -58, 6, 21, -27, -107, -61, -85, -187, -112, -26, 2, 33, -48, -92, -57, -36, -17, -69, -74, -66, -36, -61, -94, -74, -72, -51, -50, -71, -69, -74, -73, -122, -41, -43, -47, -51, -68, -69, -22, -60, -13, -35, -28, -26, -49, -18, -27, -22, -69, -67, 13, -37, -44, -60, -124, -54, -27, -30, -36, -46, -83, -126, -55, -55, -26, -85, -76, -88, -38, -35, -137, -55, -36, -70, -54, -83, -80, -47, -78, -64, -60, -70, -5, 8, -30, -86, -38, -3, -7, -51, -6, -71, -103, -51, -55, -44, -106, -45, -15, -56, -46, -45, -125, -138, -103, -71, -62, -48, -36, -53, -77, -31, -80, -83, -47, -89, -80, -29, 7, -52, -99, -124, -137, -91, -43, 32, -6, -32, -53, 3, -21, -6, -35, -74, -85, -93, -61, -25, -33, 29, -42, -60, -57, -17, -54, -81, -20, -46, -85, -47, -15, -45, -61, -67, -77, -41, -55, -43, -91, -109, -66, -86, -63, -80, -21, -30, -57, -83, -43, -33, -4, -32, -78, -44, -66, -51, -2, -41, -48, -9, 2, -46, -48, -25, -45, -63, -94, -110, -52, -29, -86, -36, -40, -6, -65, -48, -58, -77, -89, -95, -54, -63, -63, -3, -1, 4, -18, -2, 39, 9, -49, -88, -63, -89, -96, -76, -82, -72, -29, -16, 3, 11, -30, -59, -82, -11, -67, -57, -4, -39, -64, -77, -111, -82, -36, -69, -68, -36, -90, -76, -29, -66, -83, -87, -99, -75, -80, -38, -35, -123, -81, -87, -127, -89, -15, 19, -61, -108, -103, -88, -38, -86, -107, -52, -61, -79, -101, -2, -29, -70, -102, -92, -99, -59, -63, -67, -102, -103, -56, 2, 3, -4, 8, -24, -66, -104, -116, 14, 26, -52, -48, -42, -86, -27, -57, -80, -6, -1, -51, -71, -65, -3, -2, -51]
13963e1k4j0P5k7p2L2O6o2N8K0k0n5M7O0k2k0k7K7lPKp1N3L2j36l2NP3J7p7L5K8J9m3pRJ9
13946g5l3J1N0m5K6K5L8o9Nj3PJ2K1K7j9l9j6O4j4qj4K6J9J2l5k9mj9N0M4q9J0k7M6K3K1q
13928a9k4q1LO1L8J0q4j9L6j8j7L7Ll2N8Kj3kJ9K9n0j0k0L9k7n8M1jj6J5L3K0j4K3k6o5n4
13910a83O0Q4L8p2N5K9p4J2L5q3k7N8J0nL2ll7m4J4K9l7lM3N7J2n0O6p6J9k8M2j5l7M1J1k0
13893d7m0LM3qm7QpM5K1m8N2p0k7k0Q7m5J20j0m1n0L6j3J0K8k8k1OOK2j1rl2K1K1j6l4PK8
13875f0l0K8O0m0k7L0j7L6m4N5K5q0Q0j6J3r4rPM1r0QL1k4Rl1O7j8m9k0M1P7j5l1Jk4Q7K5
13858Bpj6j9l8m0R3j0NKj3kMn5o6K0L3lk8J1M3j1K1n6L0J4KRK8K6j1j1m0qn8p1J22L6N2q1
13839i1J9O4j6J3o5j9m0N5Nrk3Mp3J4n9P0K05r4J0j8Oj4j5q2L3N2O5L2j6K4pm6L8o1l9J0q9
$$ y = [-51, -75, -85, -10, -37, -109, -77, -11, -73, -15, 5, -15, -70, -23, 37, 15, -5, -32, -5, -8, -1, 1, -70, -17, 15, -121, -153, -148, -75, -58, -135, -100, -72, -53, -96, -103, -94, -75, -108, -97, -47, -92, -66, -41, -3, -72, -67, -80, -73, -61, -40, -13, -32, -71, -87, -23, -37, -45, -59, -33, -14, -2, -37, -66, -70, -89, -39, 5, -84, -74, -101, -55, -32, -11, -19, -43, -124, -121, -60, -22, -12, -96, -115, -79, -97, -114, -77, -74, -106, -48, -46, -59, -61, -42, -13, -63, -73, -93, -54, -81, -139, -98, -99, -115, -100, -67, -47, -61, -38, -64, -129, -183, -123, -39, -1, -73, -18, 11, -63, -51, -16, -99, -126, -68, -58, -63, -31, -34, -71, -115, -101, -72, -109, -112, -69, -12, 0, -50, 16, -60, -41, -69, -27, -42, -79, -38, -27, -47, -87, -84, -41, -49, -96, -88, -95, -50, -29, -77, -25, -95, -122, -142, -55, -100, 20, 10, -31, -81, -45, -58, -48, -20, -48, -69, -63, -57, -35, -46, -55, -87, -66, -45, -61, -95, -88, -60, -90, -62, -2, -42, -69, -39, -56, -20, -64, -9, 16, -64, 16, 0, 13, -81, -90, -83, -42, -132, -124, -93, -117, -108, -139, -72, -90, -139, -159, -118, -41, -56, -87, -86, -110, -23, 2, -5, -21, -40, -78, -118, -25, -35, -30, -28, -41, -43, -39, -94, -160, -140, -107, -110, -138, -127, -84, -95, -74, -130, -100, -86, -84, -75, -47, -21, -32, -43, -83, -91, -149, -220, -98, -62, -10, -91, -72, -8, -24, -11, -76, -95, -135, -80, -75, -84, -107, -103, -176, -162, -221, -151, 54, -40, -30, -48, -42, -56, -71, -153, -120, -68, -3, 29, 13, 37, 30, -16, 22, -39, -78, -68, -157]
13821a57KR4j2KM5j6QL2L0m1m1J05o6q1pN6jl4j1j8J4L7O%J7L3m2m7L4qN3Ol6k0rj9k2RRO0
13802c6K4l4J6n0L8M0m9L6o1L9Q1n9k8JN7oJ0km3ml6K9k4k1J6%l3Jn5M5K3J1KJ1j6N9K4o5
13784e9o0l5PP4J9N2p3m0ON4j3%K7l1Npn2j7O2lm4j6K0Q0J0MN8j7j3ln1jl1J7jL2O%r6J5Q5
13765c0l8rM1jJ0k4K1p1O9K4J8n7pj1L1J7jmm0k2K7ml0Q3j4m6k3J7K4n5%M7N0Lr0M8Q1Rl0
13746A3k5K6l8J5K3o6N1n6pj8j2L1m1l9Q1j8j8k7J1P8NM3p5K2Kk7K1n5qR0j8N8oj19rloL0
13728i1K1K6mkk6pJ3nQK8M0l0m5k8o9Q0J0l1nP9l4l8J2K5m2mP1rQM5r7NL0K0LJ8L0J0n5J3
13709b7Rk2K1p9LK4K0J8J6n2J9J1L6j6j9k3PN3K8l1j18j4J0M5qm2l7P1M8lPj1k3M4k1m0L2
13691f4j8j6K7L8j7K2J0j1k8Rl1L5K3k8l0L5rK5J2m1prk2k0N0L4KJM2l3o1k1K2L1J0j0k2N1
$$ y = [-157, -155, -61, -73, -71, -26, -42, -34, -2, 28, -13, -54, 51, -15, -96, -103, -47, -48, -82, -93, -111, -97, -60, -54, -54, -37, -4, -46, -93, -59, -67, -14, -8, -44, -64, -73, -92, -114, -105, -96, -36, -12, -46, -30, -80, -42, -2, -51, -15, -76, -37, 44, -15, -43, -42, 15, 9, 19, 17, -26, -30, -66, -37, -61, -82, -66, -66, -99, -98, -153, -108, -85, -74, -72, -61, -77, -18, 6, -59, -119, -154, -147, -73, -54, -2, -75, -115, -109, -55, -68, -68, -41, -72, -67, -74, -126, -143, -81, -84, -128, -144, -124, -44, -34, -30, 28, 11, -2, -5, -56, -57, -88, -71, -72, -40, -34, -34, -130, -115, -30, -68, -77, -36, -37, -27, -51, -30, -101, -32, -8, 10, -47, -54, -65, -34, -17, -18, -22, -62, -84, -57, -61, -91, -8, -22, -68, -91, -74, -50, -105, -105, -58, -8, -5, -95, -47, 34, 43, 13, -12, 14, -24, -9, 14, -52, -1, -57, -64, -82, -94, -63, -104, -143, -62, -80, -98, -125, -114, -36, -31, 12, -63, -41, -39, -66, -45, -100, -108, -18, -36, 22, 16, -103, -112, -115, -121, -91, -70, -44, -48, -50, -76, -83, -70, -75, -67, -39, 1, -29, -74, -102, -171, -91, -81, -112, -117, -38, -72, -110, -98, -73, -115, -119, -48, -57, -49, -4, -101, -96, -66, -46, -43, -25, 5, 15, -40, -27, -18, -40, -19, -98, -95, -71, -51, -33, -17, -69, -50, -39, -3, -19, -38, -61, -54, -1, 27, -4, -122, -136, -126, -81, -89, -131, -168, -97, -49, -52, -45, -56, -79, -35, -56, -96, -64, -82, -98, -71, -33, -50, -28, -18, -29, -57, -48, -79, -44, -21, -49, -79, -44, -53, -28, -16, -57, -64, -73, -95, -115, -65, -31, -29, -28, 14, -19, -80, -101, -79, -48, -38, -48, -70, -19]
13673a9J9n8j05L3M7k3K1j8j7ML7J2K8K1j8RK7n2j1L5j9NqN9m0p6K3O6rj6l7l5J8O7k2j1J02
13655C9m6j1O3%n3m7M6p2kO1m4j0m5J0J0N6L4k9LJ9j5o6RK3K3l4N4J8J1l2k7J0n3rKm0N3N3
13637c8Jj9K3N2j9k2q7n5O3J6l7j0kK6J18l9k3qk7M3pJ10q3m1k5L8O3J6n0p3OL1qOM1k2m4
13620h6lM0Mj0J8n0K5M0m4K7J8mK2m6nqJ3j4Q5m9j7M0l0Nk2JQm2rK6L2j8l2K7n9j2qL4N0k
13600e5n6L4J5q4J0l6O5N0m3j1N0jl3J05o8K1L9k2L1p4k3J04j2m7j9mM5Kj21O1j2nJ26j0j6
13584Fj4o1l2k4JJ2LP5Mj8k9k4O1j9J7J9Jll0j6N0NN0n9pl8L5J7K8n4m8m1k0J57o3j15P0P0
13566c4j4k5M6Ol9m4J9l6KJ1RMk3K3L4q0j3J5L4M2L5M1j2k9J1l0j4k9L1j4L1m3o3L3J12k3
13549b6m7mk2M0l1Jj8M0o3KN5k9N4J2l1rk6L1O4m0j0n5N0M4j8j5n5n%M5n2j4QM5m8PM7n2l7
$$ y = [-19, 0, -58, -163, -130, -83, -106, -85, -103, -120, -116, -79, -67, -39, -18, -36, -27, 0, -52, -63, -28, -47, -42, -50, 9, -31, -107, -84, -18, -27, -43, -80, -115, -97, -30, -52, -63, 39, -7, -18, 45, 45, -8, -55, -9, -81, -83, -22, -66, -76, -121, -111, -101, -45, -11, -40, -37, -18, -33, -99, -90, -67, -44, -78, -24, -6, 5, -27, -54, -44, -97, -106, -104, -144, -91, -38, -37, -56, -33, 19, 0, -22, -109, -164, -101, -85, -122, -132, -134, -108, 10, -29, -52, -60, -87, -44, -51, 59, -24, -65, -90, -52, 11, 27, -23, -96, -90, -59, -67, -61, -20, -42, -86, -89, -49, -45, -55, -37, -87, -62, -22, -66, -39, -21, -25, -3, -49, -54, -62, -49, -63, 22, -27, -44, -4, -34, -29, -51, -50, -42, -84, -93, -67, -35, -53, -85, -58, -117, -129, -137, -103, -53, -55, -111, -77, -62, -146, -136, -172, -107, -57, -100, -111, -61, -62, -95, 10, -58, -37, 2, -20, 11, -63, -86, 18, 6, -41, -60, -64, -19, -17, -138, -77, -89, -94, 32, 22, 6, -8, -69, -101, -125, -124, -112, -109, -34, -30, -48, -77, -101, -40, -59, -42, -23, -22, -25, -55, -71, -21, -16, 34, -25, -32, -70, -35, -18, 10, -44, -92, -133, -153, 4, -59, -174, -104, -34, -48, -73, -27, -21, -60, -104, -85, -121, -119, -108, -99, -95, -118, -95, -61, -141, -154, -139, -105, -63, -28, 13, 1, -28, -17, -47, -61, -90, -59, -73, -42, -85, -148, -115, -3, -26, -73, -77, -99, -59, -90, -89, -107, -67, -130, -128, -73, -102, -48, -36, -67, -76, -102, -71, -7, -47, -57, -112, -62, -18, -36, -51, -106, -111, -111, -66, -118, -132, -124, -79, -127, -120, -73, -125, -162]
13530a62O4K9j0K7J5nk9K1m0K6K4%j9m0rO0%j7k3R2J2o6K2O5j07QM4p8qN6M5m5LK5m6m4P4
13512c6j1k8ojl3J9n3M9M4l3rLj7l3P8N0k4k8j6n3k7l3K8O2M5M5n0K7j4M0K0m3K0l1o2k9J00
13495d0M6j4K0q5J3M5j5j3K9L5l7n2Q7m0J4L6k9J0l3n5K5J4lJ4l5K9n8m8N9N3o1LP4N2j6k6
13477bk1m7m1N2J3J2K8rK4Mq5L0qMJ8n6K0N1j0j1n5l8N3M4j6k1n0J6K7L6j0k8ql6M6m8L9m
13459h7P1k4j8J2oKq9K1N6rK6N3j08k7j6L8J13l7k5M8k8p1Lk7PJ2K0KJ9m3m7M0NRl7J1MQ2
13441d5k0jN8P2k8j6m6n6pRj8NK4K6j5k7L6J9k9J5kPQm4no0K8M7M9Lk7l8JM4j5o8OPN1p1L4
13422h9N9M1K4j03l3k5P7K2K6l9m4N2M1j06kK6k8l6l0Q6N4j1j9j2K9L3j29L4J9J4rpK8j3J6
13405e4J7j5p4N3KpPm4M2j7J1N9LJ9l2o6j3J5L5Qj6l6K8K0J9Q9p8L6m5J9K1o1o1J5PJ9l1N5
$$ y = [-162, -98, -69, -79, -52, -37, -42, -71, -50, -90, -64, -40, -40, -59, -99, -108, -48, -48, -65, -88, 4, 16, -50, -28, 37, -70, -62, -18, -96, -104, -48, -3, -48, -45, -20, -66, -110, -36, -47, -75, -81, -82, -115, -96, -149, -100, -56, -89, -98, -95, -112, -145, -67, -17, -41, -69, -85, -138, -165, -198, -170, -108, -63, -18, -68, -41, -55, -15, 5, -38, -18, -49, -111, -140, -40, 6, -8, 12, -73, -60, -15, -30, -43, -14, 21, -16, -68, 19, -21, -7, 29, 0, 10, -23, -78, -53, -39, -42, -28, -63, -34, -92, -140, -81, -28, -89, -86, -12, 40, 24, -2, -23, -70, -111, -59, -46, -34, -6, -15, 9, 13, -72, -42, -50, -46, -28, -84, -64, -13, -23, -34, -89, -127, -74, -30, -46, -67, -117, -101, -74, -38, -48, -76, -84, -120, -74, -122, -83, -87, -16, -40, -58, -46, -52, -50, -139, -118, -62, -71, -45, 8, -100, -127, -143, -105, 8, -29, -54, -6, -34, -105, -102, -129, -122, -110, -90, -88, -69, -112, -159, -119, -114, -105, -142, -131, -127, -45, -65, -66, -8, 64, 36, 20, -26, -82, -89, -80, -98, -93, -69, -43, -58, -85, -49, -30, -59, -44, -46, -39, -31, -75, -80, -140, -112, -65, -16, -13, -40, -78, -77, -33, -48, -116, -110, -103, -52, -123, -89, -30, 11, 35, -68, -101, -126, -49, -27, -1, -40, -84, -32, 9, -97, -99, -73, -101, -137, -167, -81, -27, -38, -57, -69, -40, -7, -136, -102, -83, -69, -78, -85, -57, -70, -54, -37, -52, -126, -73, -71, -78, -71, -115, -73, -90, -79, -20, -17, 2, -30, -96, -109, -94, -59, -51, -67, -103, -75, -55, -36, 53, -25, 11, -34, -15, 6, -55, -116, -101, -94, -75, -106, -51]
13387e1QK2J0m9k0J8l6k2Q7j4k6Nk4M3j1k7rn7P3P6l8m1pK6k5K5LK3k5K2l1PJ9Rn1O0O6k0
13369A8r7j3K0K2O1j5p4j0j2m3K2M3N3l9M4o0mNM9J5jj9l7RL6mJ6l0J2m9L2nj9mkN1n7j2j8
13350a16qO2Lk6k3K3j3M5o3LR7M3k4j12rQ2j0K6J7np2p6M9k0o2Q2N8n7j4j7P1J5n0k5Q2M8
13333Dj6q2mlM6LM1J1J3Jr6o1O4M8j5j3m7N0%KL5l3l5qN4l0K0j6Kjl3n2N0O0L5J3l8r0P4o0
13314a07nJ4n4mP7OMJ6QN0m0k3m3O9O4lPl7j8l6ql8m2P9O0L6l1j4om6Lj9J4L1p8j0L4J7nJ3
13295f5l0J3j0l8O6j5j2K0k4J8P1j7m3j3p4k1M8K6M3k1oL7l0K9p2K7P5K8n7K2j7om6nj3J5
13278i7O2O1p1l4L3k2K0OO5l5n1m7l6O8L0r7J7Q6Ml6J9%m0j5M6n9KJ14m0M8k9j1p7K0J4M6
13261c6O8K3m9KQl0n3k1K1m6P2m7J05J9j8n5l3j4l5M3KP1MoKo3m6L4J9o5K1L6m3J5Oj3m0P3
$$ y = [-51, -43, -21, -11, -60, -80, -62, -98, -120, -33, -47, -73, -68, -92, -49, -60, -87, -96, -153, -80, -4, -42, -83, -90, -64, -89, -64, -61, -38, -63, -41, -72, -65, -46, -37, -88, -28, 38, 18, -79, -92, -72, -50, 11, -4, -78, -88, -100, -143, -121, -78, -25, -64, -20, -80, -84, -79, -30, -15, -16, -35, -72, -63, -27, -31, -15, -45, -33, -82, -50, -55, -74, -78, -80, -29, -86, -98, -116, -124, -62, -59, -85, -108, -85, -98, -53, -116, -113, -16, 27, 3, -109, -118, -36, -46, -20, -3, -8, -80, -156, -107, -127, -189, -107, -49, -106, -120, -137, -66, -51, -101, -126, -44, 4, -12, -94, -98, -101, -55, -52, -11, 0, 13, 14, -82, -143, -79, -31, -46, -59, -106, -56, -56, -54, -19, -52, -87, -95, -41, -71, -51, -67, -65, -66, -99, -151, -101, -41, -6, 7, -31, -121, -47, -107, -112, -98, -152, -156, -79, -73, -69, -53, -45, 5, -35, -58, -101, -32, 32, 29, 36, -1, -19, -55, -63, -101, -143, -64, -4, 32, 1, -13, -19, -65, -62, -81, -67, -36, -114, -124, -90, -73, -78, -65, -95, -82, -92, -130, -64, -79, -91, -71, -95, -77, -6, -23, -66, -79, -153, -174, -126, -100, -57, -78, -84, -47, -77, -48, -120, -93, -18, 10, -47, -25, -42, -48, -94, -99, -112, -97, -35, 26, -45, -79, -46, -68, -48, -42, 23, -12, -63, -110, -146, -78, -48, -145, -128, -42, -38, -74, -55, -55, -95, -110, -64, -123, -121, -7, -47, 1, -28, -39, -116, -96, -82, -36, 32, 55, 6, 8, 16, -14, -67, -88, -67, -113, -41, -88, 17, 36, 18, -37, -70, -84, -119, -76, -74, -3, 1, -5, -3, -66, -112, -78, -59, -124, -103, -67, -110, -95, -89, -102, -142, -69]
13242f9N3J3ol3J4n1m2j8k5N3l1J9J2k3M3p1N9j2N3L1j4K8K1lm6j7l0MJ1Pl3m7K0O3M5m0J3
13225d9M2J9q1M9oj7j0q8N5p1P4L5l8l4K8M9qL2k2K7OK9l0j2km1J3MM2pop0k5Q0J9qm2Nl6
13206i5J2k4J7rN0prK8l2K2M8j8J8j4rK6k3ONj4J0pnln9m1LP5l4L9M1l0k6m5l9J2Q0N0oo1
13187f8M0m6j6J0J7nO6oJ2%LO4Op2n6K5l0O4L4o9k9K6nj8MJL6kn5J5j2k3j6o7M1L7K6K3M3
13168bjn2K0l4k0JQj1J8m3%J6j0mN1M3nL6m0Ppl3Q9Nj00n3L1j2L6J7L0k4K3o2o2O2K1n5N5
13150f1j9N0kl6K5K9on6K8m9J6L8L7mk2l4M2mJ1l1n3J1l3l3K7L7P1o5n6K5J6M1l5MO2k3k2
13132g4P0M7k5l9No7K7J3J5Qr3O2k4l7O1k8kL2K8J7n1m9QN0J3l5l0JN0L9l2o6P7P2n8J1k7
13115c1j6M9m0o1J3J4O2N3j03M5rj5K9k3rJ1nnj4l6mj2L4M3k6o6K8n5M4L5M0k5J6kn7K0nO2
$$ y = [-69, -16, -3, -9, -42, -28, -79, -121, -139, -164, -111, -142, -123, -111, -134, -91, -162, -103, -115, -62, -31, -45, -17, 4, 1, -45, -62, -92, -88, -77, -70, -103, -150, -130, -67, -22, -62, -49, -7, 12, -69, -20, -26, -43, -53, -141, -86, -157, -83, -48, -86, -120, -92, -43, -51, -19, -41, -14, -8, 21, -9, -21, -23, -64, -51, -47, -5, -12, -18, -88, -113, -33, -14, -22, -64, -59, -95, -83, -107, -90, -99, -49, -56, -65, -37, -69, -47, 1, -17, 1, -13, -22, 4, -19, -13, -8, -22, -12, -19, -24, -27, -86, -127, -124, -49, -83, -44, -3, -33, -59, -104, -143, -131, -51, -1, -7, -68, -28, -74, -90, -80, -63, -68, -2, -8, 4, 4, 7, 71, 77, 5, -51, -26, -56, 8, 42, -27, -56, -30, -35, -53, -49, -48, -12, -14, -69, -54, -66, -89, -105, -172, -131, -94, -68, -45, -2, -3, -55, -35, -69, -89, -88, -80, -91, -73, -116, -116, -100, -110, -114, -63, -20, -25, 11, -29, -22, -29, -62, 27, 32, -68, -121, -90, -102, -66, -49, -19, -43, -20, -82, -144, -82, -61, -116, -61, -80, -30, -32, -68, -43, -14, -20, -76, -48, -97, -81, -43, -6, -10, -32, -66, -24, -28, -17, -48, -101, -90, -123, -156, -129, -92, -21, -86, -142, -117, -101, -60, -95, -91, -29, -52, -74, -4, 43, 18, -21, -16, -83, -56, -43, -28, -20, -113, -51, -75, -112, -51, -79, -81, -49, -21, -4, -55, -104, -96, -46, -33, -68, -98, -97, -47, -8, -40, -106, -29, 43, -15, -4, -31, -47, 2, -38, -99, -86, -72, -10, 43, -60, -15, -24, -39, -10, -33, -42, -31, -36, -41, -55, -91, -95, -107, -73, -30, -56, -122, -94, -149, -105, -70, -30, -55, -39, -41, -98, -78, -83, -21]
13096b1N7p0j4M7J3J6j06k7K1MKJ0j7N7K0k1j4n1N3J8m1k9M1k7k3OQ9N8n9q0M1n8O3j06n5
13080b03R9Pm2J12k0JkL3p0l6k4O6k8NL6m6M2QJQ6r8l5NRRK2j5j7oK8K5j9o5JN1Kj7K4J8k3
13061g6K8M5l7J5K2l1%J8k9o6oM5M5M2n8Mj8k5RJ3P3l2m8L6J8J7k2l9j0M9K0l4j1qRj0n0l5
13043a37k3M2KnK1N7k8L7J3l9n6l2O7J7M0M4Lj8j10l2POl0j2JM7K3J2pJ3O5J0p6rN6n3L4K9
13024b1n8o2L1J9j1P4J4n5k4k4q0O2L1q1M6J01k8q0K0M5Q2j3p5n8J5M1k1K0m2jO9O8l5M6r
13008Fj9m7ok6%N4K9kk9o0mQ1J7o3Pm4N8JK1Om0j6L6L2j9j9m4n4N3JOLO4kN1m8mk9j8q1K9
12988a19N6k1j3m6Q9k0k3k3J5M3L5M3j0p1J1o1k4J3R2k5n5J8RK9m0l3L5L5M7pJ9p5l9Q5M0
12972Im5M0l2l0N7q1Qk0l7o2k4R6J1J7P5p1K2NJo1N4O6m6J0J6j0mL3j4m2M8K3j5j7JL0m1j1
$$ y = [-21, 36, -34, -48, -1, 12, 28, -78, -105, -84, -80, -78, -68, -85, -28, -8, -29, -43, -94, -41, -23, -64, -93, -52, -79, -102, -96, -7, 51, -8, -88, -47, -105, -42, -148, -203, -104, -97, -139, -27, -47, -46, -48, -15, -85, -121, -145, -79, -107, -102, -66, -112, -70, -62, -61, 25, -73, -108, -103, -94, -85, -63, -78, -95, -101, -73, -48, -67, -132, -131, -80, -78, -95, -71, -53, -76, -48, -3, -40, -25, -3, -34, -34, -16, -45, -111, -117, -72, -27, 15, -43, -39, -57, -82, -73, -60, 13, -19, -67, -31, -13, 4, -18, -57, -67, -18, 2, -32, -43, -51, -42, -52, -102, -137, -160, -118, -116, -121, -100, -43, -71, -34, -21, -60, -116, -148, -81, -64, -24, 20, 23, 5, -105, -137, -130, -124, -154, -166, -165, -118, -95, -83, -90, -77, -12, -2, -78, -87, -31, -84, -50, -21, -79, -141, -110, -91, -102, -28, -14, -69, -93, -117, -197, -135, -104, -185, -139, -38, -66, -146, -126, -81, 1, -12, -87, -145, -130, -89, -110, -90, -132, -133, -64, 4, -31, 15, 6, -13, -60, -66, -92, -92, -38, -9, -11, -40, -100, -104, -23, -6, -69, -62, -106, -48, -47, -26, -20, -60, -76, -40, -8, -27, -46, -90, -144, -91, -90, -84, -81, -17, -19, 32, -16, -20, -49, -67, -148, -119, -63, -84, -97, -143, -54, -74, -97, -120, -105, -62, -27, 16, 6, -65, -54, -115, -139, -126, -34, -59, -114, -96, -87, -58, -98, -131, -96, -61, -14, -21, -2, -77, -116, -31, 9, -36, 4, -28, -58, -1, -82, -74, -94, -131, -193, -217, -121, -110, -93, -18, -89, -67, -62, -61, -122, -68, -2, -48, -38, -22, -32, -36, -3, -17, -59, -11, 12, -3, -20, -19, 11, -30, -41]
12953d1%j9Pl9J6NLn8MM4Q2J4j26M6J8k2l3k7N3L9k3kpM9K6n0J8k8L3m2Q3Mj8K5j5nl8jm5
12935g0Mj7l7j2n9N6J04M2m7O5l5k3l3L5M1m4K0J1kj5l0%jk7o2Q7N6Mj9p0J7M9k0M3m8m0j5
12917i2J0L6j0L0m6k1M2P4ko1Nk0lN0M3q7n6L5M3j6K4N3p2MN9j4l5QL6Rm9p2M1L3j7Rm2j6
12899h7k3K7K7k2k5l6j6O5J9JL0Jj01l1P4N3J7m0j0J0L1J5j1j7p6Q8Pqk2L5Pn3jm1K7OK0L3
12881b7L2n1K7K2q3l4N6%JK2L2k6k9L2j2p3L4J3K9l8n5L1P0J1j7%q2K8L6o1P1J6j15J6P7j7
12864f4p7K3O8mNj14j8P7J1k4M2K4ql9N3J7k4p4l2J21Pj1p3RM2Jj1J6m8%n1%R1lnk2K9M2k7
12845e1N1M7m4r3J8K7m8J6J3l7K4l3LK7J2J8L2J3m3pN6n4l0N4k9M3jl6qj0K2nl2j4K9P4l0
12828b6n9j7K1K7K6kj5n5J4k3j7k1N6J0p8L9N9L3RJ7K4n3o0l1j4P2j1m5M8k8K4JK9Ol6K7J
$$ y = [-41, -41, -60, -53, -92, -76, -71, -68, -126, -122, -78, 4, 18, -108, -62, -44, -66, -99, -126, -73, -34, -57, -59, -66, -17, 9, -41, -23, -51, -18, -60, 23, 27, 9, 34, 19, 14, -24, -25, -70, -66, -83, -120, -132, -191, -135, -31, 11, -36, 29, -6, -29, -62, -27, 14, -30, -10, 1, -1, -16, -46, -46, -47, -74, -136, -49, 7, 11, -8, -78, -61, -12, -32, 11, -37, -77, -92, -82, -46, -56, -26, -72, -93, -51, 23, 21, -40, -35, -55, -58, -8, 35, -52, -108, -73, -30, -46, -22, 31, -41, -37, 22, 8, -27, -19, 17, 26, -23, -95, -54, -21, -38, -29, -71, -87, -110, -83, -56, -78, -103, -139, -155, -90, -71, -70, -40, -39, -140, -171, -97, -44, -27, -67, -77, -67, -36, -21, -32, -49, -125, -37, -30, -38, -60, -25, -18, -71, -72, -113, -86, -80, -60, -27, 5, -46, -19, 3, -80, -114, -58, -58, -57, -35, -3, -29, -58, -26, -38, -111, -77, -64, -35, -73, -128, -97, -27, -16, -33, -33, -115, -87, -51, -112, -41, -25, -140, -124, -47, -64, -141, -118, -50, -54, -49, -163, -181, -104, -93, -117, -75, -51, -59, -98, -45, -28, -52, -126, -158, -37, -30, -41, -114, -105, -63, -62, -73, -57, -105, -105, -156, -156, -65, -68, -73, -95, -66, -24, -51, 0, 47, 3, -90, -72, -45, -93, -77, -64, -101, -77, -110, -107, -80, -68, -50, -18, -5, -48, -55, 1, -53, -83, -29, -58, -15, -16, -52, -60, -70, -48, -53, -85, -99, -70, 4, -26, -85, -102, -81, -54, -28, -30, -45, -100, -86, -109, -126, -147, -91, -81, -159, -120, -61, -28, -19, -2, 22, -31, -91, -122, -136, -64, -75, -120, -72, -100, -76, -75, -46, -40, -76, -49, -48]
12810d8J4l4k8JJL6l9J6N4l5j4R6m6o6L9j5j8k6M1M5m0K1j3l2k3M2j0L9K4OJ5pk5o4k6J24
12793EMm0k0K1j4l3K2l0j1M3L2L0N1m4o2N2j3Jo9k5L8J8N6LqM6r0J3j0q4l4M4L4K8k4K4o9
12775a15K5O3Rj3n3j7J6k8l3J6P9j4l2L0K2P2J4j43L3j5k6J3p4K1O3l0M8K2n7J6Kk9N3JJ5
12758d6l3j0n0N0J4k4J6k4NM3J0jL0J6l5l2NQ1N1p0o9MJ1Jm5k3j6J5M2N8L4l9p3k4J2J01M3
12741B8j03j3L9k0J7n6o0N6J4O6L0l2n2J0P1K9o0J0l1j3L6Llo3L1k3q8N3O8K0k6K9Mn2K2n
12724f4L8K4k2l7K1j1n1OP3M6K7K9q5l7m3L9m9KK2MK7m2R2J6o1M9k4J8j11l0m0K9O6K2n3j3
12706a23L2L5L0pJ7m1j7j9OM6M3j4r0L3lj5Jpj6J9P1k8lk2l5j0O5l1K2L7n7J3Kk9J0Qj7j5
12688a09Ql7M0L9qm7kP5K6Jrql4k6m0L6K9k8J2O3l4o2rO1P4p3kJ3l0Nj7j2K3M7l0NM1l9nJ4
$$ y = [-48, -34, -68, -96, -95, -94, -58, -97, -81, -27, -62, -76, 20, -26, -92, -53, -68, -86, -112, -71, -26, -66, -45, -58, -90, -113, -71, -81, -42, -18, -12, 3, -4, -29, -93, -119, 5, 9, -31, -51, -30, -44, -77, -55, -85, -96, -53, -21, 9, 60, 16, -46, 6, -7, -6, -75, -100, -62, -44, 12, 15, 7, 53, -37, -24, -34, -118, -152, -108, -74, -46, -70, -46, -115, -90, -27, -18, -31, -84, -101, -85, -113, -146, -130, -51, -65, -97, -67, -45, 27, 41, -102, -69, -84, -110, -97, -171, -150, -87, -117, -69, -47, -104, -88, -86, -115, -62, -61, -46, -79, -89, -139, -89, -75, -99, -83, -107, -102, -59, -49, -50, -20, -4, -39, -71, -66, 15, 66, -4, -73, -69, -58, -57, -102, -125, -141, -126, -84, -26, 8, -31, -104, -128, -116, -15, 28, -75, -88, -49, -69, -52, -108, -168, -112, -98, -32, -2, -34, -86, -76, -5, 24, -36, -26, -57, -70, -34, -31, -34, -97, -66, -89, -177, -124, -56, -36, -62, -33, -29, -81, -59, -64, -26, -2, -24, -61, -40, -51, -102, -96, -23, 23, 50, 79, -6, -43, -86, -47, -96, -94, -72, -68, -41, -83, 9, 25, -36, 13, -11, 7, -104, -134, -174, -145, -79, -57, -110, -123, -91, -56, -26, -33, -16, -57, -74, -93, -87, -41, 2, -12, -102, -69, -72, -87, -86, -93, -109, -90, -19, -47, -50, -72, -107, -117, -52, -83, -61, -24, -81, -68, -66, -95, -85, -77, -94, -109, -101, -138, -98, -59, -67, -114, -116, -41, -15, -14, -23, -31, -65, -91, -131, -95, -66, -94, -82, -19, -53, -115, -124, -63, 11, -62, -64, -51, -81, -76, -93, -105, -82, -35, -65, -60, -19, -58, -63, -49]
12669d9n0L1N1l2lmJ4k9J8kj6n6NN4K7rk5qK3J3nj8n6O5L3Qmm1L8J4K8m4PJ7n2m1J7QL8l5
12650g0L8j9o2M1j3LN2Mk4m1k4N1rn4pnL5L4L4k1K6Rj2K1M7j6m2l1j6nk0k0J32o2kj1pQ8k2
12632@k5P3n5j01P4j6l2P4l8j6k4nL6q9P2J6p0%O4L9j3j0l8L3l0k4L7K0lQN3k5pj4nnJ9l4
12613f1N4k9K2rL5K3m2n0L2K2k4k9k4J1mM5L2Jj38qQj5j0%mL5M5rM6O8n5l0l0kJ2J4l0K2P
12595f9j4%N8om8L0o9O2Qkl1m6N4M2N9r8pR3k0l3m0N1K1p1M7p2K4L4K1l5jm7O7N0po2k8OM9
12576c0n2j1P2m1k0J10J9q9k7k7J0j0k1O0J3K9j0n1%J2Q3j14J8R1m0m1n5O7OK9k0Q0ql9p6
12560h3p6P3J5N3L5n2k7o5j3j3KP7kl7N8J6n6j1J7N0j6RJ3k3L3j4j43L7L0O5j8M9j7M8j0k9
12542b5l5J5l3q0L8P8j2K9J3Pn3N0j4j18J7O7L8J3q5NmJ1O1m1j2l0N6rl7l6K7P0Ok2k3PJ8
$$ y = [-49, -99, -68, -17, -49, -52, -56, -42, -71, -53, -55, -71, -127, -122, -68, -41, -50, -75, -83, -60, -47, -52, -70, -126, -61, -28, -20, -24, -65, -27, -13, 15, -29, -22, -5, -57, -98, -81, -73, -35, -70, -32, -51, -113, -72, -85, -82, -30, -26, -50, -91, -115, -64, -73, -127, -134, -139, -104, -70, -36, -57, -31, -22, -34, -13, 34, 18, -24, -55, -71, -76, -96, -116, 16, -46, -48, -59, -66, 22, 0, -25, 48, -7, -108, -34, -50, -82, -8, -46, -62, -86, -91, -55, -144, -72, -56, -126, -126, -62, -23, -36, -46, -84, -51, -81, -105, -68, -48, -51, -43, 10, -15, -22, -36, -41, -46, -27, -61, -7, -36, -14, -23, 12, 35, -7, -57, -25, -3, -27, -56, -80, -69, -73, -28, 4, 5, -133, -141, -133, -148, -158, -158, -162, -127, -82, -91, -45, 23, -32, -62, -92, -94, -82, -68, -98, -76, -69, -83, -83, -25, -31, -79, -49, -118, -56, -48, -50, -81, -127, -73, -31, 28, -70, -77, 16, -4, -37, -77, -26, -5, -76, -29, -101, -77, -43, -22, -57, -58, -105, -38, 12, 5, -57, -85, -79, -30, -82, -93, -21, -62, -82, 28, 47, -42, -69, -96, -86, -96, -117, -57, -44, -15, -25, -76, -76, -64, 19, -95, -77, 14, -26, -67, -122, -55, -49, -20, -40, 40, 32, -7, -83, -159, -86, -71, -18, 17, -35, -62, -127, -140, -153, -151, -74, -76, -113, -55, -39, -95, -106, -89, -39, -55, -46, -33, -56, -23, -37, -180, -143, -113, -48, -66, -17, -34, 14, 4, -25, -60, -45, -78, -158, -120, -42, -54, -25, -12, -5, -58, -8, -22, -140, -123, -56, -18, -5, -90, -85, -89, -78, -17, -58, -70, -100, -44, -53, -90, -126, -99, -29, -23, -45, -68, -61, -43]
12525d3m7j1L4M9k3nK7j7n6m4M6j1l3L0K8O5p5J5j5L7RK0k1j1J8KK2k9K4n3n6J3J7L5J6j8
12508f1l5N0K3j1L8Pp4J1%lRK5k0o9mR9p6m3M4N8Jn9r2n0J31Pm2L4k8M7J7OLpl3O2j9K6J5
12489a3m8K8j4n4NQk0O3J0mM7j0K0o4nJ6j1j3j8rM1Pl4L0q6J2J7K4J6J7J8Npn0k4%K1j2M3
12470d8j3k3pj0J3m5J2jj3K4M9QN3J5p9o0N0ol4k4M5mL3rK1mm0K3M1J4n3qJ3m4q%N1O8j7J2
12451er6L5O0p6M7k4o0K4O7j0QMj8m0k2K9m3M4J1%k1j08O2rnJ05jk7lL5q7K8O5J8j6m5j8O8
12433b4j11M5N5L1k9LJ2N1k2LM0p9k7L6j9Q0o4Jn1l0l2J8M5NL0j7j3k4O0On5j4j6M8J5J0j8
12416e1O1k8olJ3OJ7p8L%r9LO9J7K5M0k0j6L9Ql2M7mj1K3m8nm5n6J1M7M0k8O6o4j09n8R0M2
12397i4K3J2K0j0J2k4K4J24p8J6N5lj49n0LQRN7n4K3L9l9J5l3M4L4%k0j3K9K1m6m3NN0k0n4
$$ y = [-43, -90, -101, -67, -18, -41, -46, -19, -36, -92, -136, -90, -101, -134, -104, -76, -11, -86, -71, -86, -49, -40, -20, -41, -52, -34, -32, -10, -39, -15, -68, -124, -111, -94, -59, -43, -61, -96, -46, -23, -34, 4, 11, -63, -52, -52, -55, -46, -21, -41, -110, -114, -15, -91, -134, -90, -32, -31, -90, -182, -232, -101, -94, -136, -102, -130, -83, -66, -60, -57, -64, -97, -35, -54, -28, -13, -61, -33, -47, -101, -96, -88, -108, -45, -35, -39, 8, -2, 18, -46, -51, -35, -46, -59, -77, -86, -45, -38, -72, -42, -128, -116, -99, -75, -59, -42, -24, -19, -26, -76, -100, -100, -79, -91, -48, -61, -84, -91, -101, -88, -133, -121, -122, -135, -111, -62, -54, -1, 14, -65, -125, -75, -81, -115, -139, -94, -98, -65, -74, -53, -57, -97, -74, -33, -19, -72, -80, -67, -111, -119, -119, -68, 0, -17, -5, -101, -66, -6, -82, -35, -59, -119, -95, -28, -38, -30, -26, -44, -84, -106, -77, -120, -76, -65, -65, -86, -194, -132, -141, -146, -41, -42, -69, -72, -37, -124, -96, -31, -13, -29, -74, -92, -24, -135, -90, -35, -4, -33, -30, -18, 33, 11, 14, 54, -25, -52, -16, -35, 45, -19, -18, -69, -99, -131, -113, -68, -63, -33, -50, -63, -87, -27, -21, -76, -90, -106, -58, -43, -33, -51, 10, -18, -24, -27, -14, -8, 9, -69, -66, -66, -165, -162, -93, -76, -51, -11, -31, -47, -8, 0, -32, 15, 11, 0, 23, -25, -30, -75, -131, -120, -73, -33, -61, 5, -59, -168, -226, -136, -94, -71, -59, -39, -49, -37, -61, -37, 87, 9, 25, 80, 77, -72, -122, -119, -111, -102, -45, -99, -76, -37, -76, -61, -94, -50, -16, -16, -36, -49, -20, 1, -45, -88, -83, -33, -53, -107]
12379a07j7J9K8J4M4m1OLk3l3k3kPM3l0lN8q1j8Q0M3m5M2m8l5M9K6M7q7j6L6k2J9n0j0N0N
12362g2M4K9m7j1J1m1JPM8l1nl0R5k9jQJ4M5k4n7n4M8J7k8n5L4K4oJ6k6K5j7jK7O0o2J0J6
12344a8m1p1J4P2rm9J8P6l4n6o4M2J5Q6m3j2JK8L9QL4m7n4J6N3l1o6rK2L8l3nj0mjL4j3J4
12325f0l3Ml9K8Jj7l5L2J9J55m3p4OM8N5m0l3M4n1k0M0k5k9k7m8L8J06l9l1J8m8J6nP3l6n8
12308a08l7l9P5L9Ol2k6O7Pm7M0NL5qn4l4K7qR0mp4K3k5j4J4O6OL3K5j05NK6K6l3o6j7K7L4
12290e5l9Lo7J05jj9m%L5O0l9m6L3L7m7p0J3olL5K6qKn8K8M1j2NJ9Omo6K0k6j3J2K6qN2Rj0
12271c4l2k8K5JK8l8k4M8O2l8J5K0m4n2l4J9O3q9N3kK0K1l4J2R7qjjp5j3nj05O3L3pM5K1m3
12252f1mO7m9l2J4j2Nk4Q5k0m1q6Q2j1k4M1M4k4o0K8M1QJn3Q6j4K8k3k6ll1L1l5P5L9k5q4
$$ y = [-107, -124, -105, -77, -63, -19, -60, -54, -51, -74, -107, -130, -132, -125, -82, -112, -115, -57, -138, -156, -76, -33, -78, -36, -84, -119, -70, -44, 3, -84, -100, -64, -86, -67, -117, -127, -77, -72, -28, 1, -46, -57, -46, -87, -86, -79, -31, -62, -67, -97, -2, -31, -32, -24, -10, 35, 11, -46, -100, -52, -35, -63, -118, -84, -60, -66, -50, -76, -51, -68, -69, -42, 18, -44, -34, -18, -59, -130, -116, -44, -53, -102, -84, -8, -42, -98, -162, -120, -105, -19, -62, -74, -73, -45, -6, 2, 36, -11, -65, -49, 4, -27, -93, -102, -80, -42, -75, -80, -90, -94, -95, -61, -74, -60, -93, -89, -128, -100, -99, -116, -151, -119, -100, 55, 12, -62, -56, -8, 47, 7, -26, 18, -33, -53, -13, -38, -67, -94, -142, -104, 2, -37, -68, -50, -98, -82, -87, -14, -50, -108, -145, -184, -109, -70, -64, -96, -122, -55, -48, -95, -55, -50, -15, -23, -77, -111, -84, -92, -2, -6, -80, -57, -82, -96, -82, -16, -10, 23, 48, -57, -52, -26, 0, -33, -99, -116, -89, -55, -94, -91, -158, -53, -54, -73, -77, -77, -42, 18, -21, -67, -34, 3, -44, -114, -101, -107, -110, -75, -49, -57, -55, -113, -85, -44, -56, -51, -32, -26, -30, -96, -76, -102, -115, -103, -77, -85, -33, -24, -34, -66, -94, -69, -68, -40, -78, -102, -54, 8, -30, -15, 5, -39, -91, -125, -106, -43, -132, -79, -81, -61, -40, -74, -62, 35, 27, 26, 25, -50, -63, -68, -173, -110, -77, -84, -39, -18, -61, -65, 2, -47, -79, -65, -77, -72, -96, -11, -31, -72, -158, -76, -87, -111, -70, -26, -50, -110, -82, -41, -33, -32, -85, 1, -13, 15, -8, -34, -37, -68, -37, -72, 3, 42, 17, -67]
12235f7k0N5j00M8jo6K4mj0O4J8J5J4j3J9k3Jn7j4k1P9%J1k6J4M8j6q2k8P1j3M5rl4j4P2P
12217a3Mm6o6Mo3M4M5L2l9k8j7K5LK9L3l5k8J7J3n1K8N6j5jk8RM0k0kJ0Jl5J7k3k9N4L2j6
12199e9n1J8O5MpL2m7L3Qq3m8Q0Q2M6q8p4K4J17L1q6n4n4J1L5K1j2l3K1L1j1MK4Jm6J4o7M3
12181g5N6j0K%m0K0j5lJ7n8J6j2n1OM3J6n5L2J1%K2j4l6Ml2Q5M3j8Jk5m8PJ3nO2mK7j04m7
12163a69O5J7o8J3K7Mk7J2N8pj5K0lM1k2L3J5k5L0k5o1j1rn0L7M0L0l5L1j6l5M8J3n1m8N5
12146h8L4k9k2M8K9kK6rkm1l4k7MK1oL8NoOm9J8nQ1p3j8j6lM4k5QK2JK5pl0N0M0p6o8KJ00
12126c4l6Lo1L5J5J2Nk5l2L1O8k1n0k9N9J3j8K2K5pkK7J2j1r3k3lm8K6M4K0Q2j0Kl7l3o3P5
12108f0m6j5O5k0J3k1Oj6m2J8O7O2n5m7m7K4P5l4n5N7J2R7l4nq9JL3l3j0L2L7mm9JO4n0J3
$$ y = [-67, -87, -32, -132, -84, -85, -151, -127, -131, -141, -77, -59, -44, -30, -43, -24, -47, -46, -103, -117, -138, -59, -59, -48, -74, -60, -12, -28, -110, -138, -67, -80, -35, -44, -78, -92, -20, -13, -9, -55, -121, -117, -180, -136, -91, -59, -98, -126, -143, -118, -115, -86, -53, -88, -116, -99, -86, -137, -109, -53, -68, -69, -97, -88, -48, -68, -70, -60, -59, -94, -77, -100, -129, -75, -43, -59, -110, -92, -27, -23, -30, 2, -45, -12, -4, -87, -135, -55, 27, 73, -15, -89, -65, 52, 83, -3, -57, -111, -100, -65, -44, -56, -89, -68, -37, -48, -44, -20, -19, -65, -51, -118, -75, -19, -29, -27, -27, -67, -47, -62, -65, -48, -106, -90, -102, -153, -147, -104, -88, -143, -111, -100, -100, -78, -92, -128, -124, -156, -71, -28, -46, -45, -70, -118, -111, -98, -103, -41, -45, -18, -122, -169, -104, -87, -155, -142, -115, -111, -138, -126, -68, -75, -90, -70, -73, -32, -54, -21, -6, -31, -1, -26, -87, -98, -107, -157, -120, -80, -50, -85, -54, -70, -105, -57, -44, -95, -143, -88, -54, -83, -105, -57, -28, -30, -4, -13, -15, -56, -90, -117, -113, -92, -98, -60, -55, -61, -55, -104, -86, -91, -10, -83, -101, -117, -120, -76, -101, -93, -71, -70, -45, -52, -82, -32, 8, -68, -136, -134, -34, -70, -67, -128, -93, -78, -66, -61, -86, -118, -87, -19, -40, -90, -119, -60, -47, -65, -43, -18, -25, -27, 0, 12, 1, -92, -115, -118, -166, -140, -96, -76, 6, -4, -2, -39, -72, -135, -60, -106, -121, -56, -76, -63, -84, -78, -94, -136, -118, -51, 11, -44, -91, -138, -114, -39, -73, -128, -71, -59, 38, 4, -1, -90, -89, -56, -89, -99, -67, -30, -34, -83, -82, -18, -68, -55]
12090e5jm2k9J0m9N6K9L7J4K6p6l8J5M9N6LK1p8J7j0o2L1mJ7J5j2L1J4j6K5K0q9lM2k9N6M0
12073C1p1nRn1m0N5K2KNk9qPQRl7M3%k0o4q1n9J4J05Q5j6N1l5J2qJ6k1o3N5k5J3l3M2K2K2
12054c8k5M5j8m0L1mK1m5l0l3N1L8J%k3j5j8k7PN1J5k9L7L6l6n7N1m7l3n2N4O0k7L2L7o1l2
12036a23K6J00k9j0k8Jo3L4M8l0jn0l6M3k2RK1Rlj8Q1J6K7j04K9N2M8m2l3L8m3k9r7M7J6K8
12019h8J9J6L3p5J0K5m4k1J3L8K7Jj0J4n3rM1j9o7J15M5p2n1L3l5MN0j8K0op5J3K9L3J6J5
12002c3omJ7K1L5m2j7J6r0l3M1QP9p3RL5mL2n2J6l7K6NPj1Pj8k8j4O8o9L9J7m8L3j2o1N7Q
11984g6j8K3jl9L7l9k2Q7K3j07J5J5k3O9j1ql1L3o7K4O9k4l9J7N6o2p5J3K5K2O3M9j6o3J1
11967g0m5K0K4M3q2N2j8J0M2k7j2k3j1JK8M5l8m1J6O1kn0o1N0J6K7n5rP7M0JPm4M4m8m9m3
$$ y = [-55, -56, -98, -127, -117, -166, -110, -81, -44, -30, -4, -80, -118, -103, -54, 2, 5, 26, -52, -35, -45, -107, -76, -80, -63, -48, -60, -29, -15, -31, -6, 14, -75, -78, -36, -65, -9, 31, -40, -45, -36, -87, -127, -72, -50, -48, -43, -72, -80, -73, -65, -56, -93, -50, -50, -70, -134, -215, -274, -260, -155, -70, -86, -35, -70, -58, -66, -50, -71, -134, -79, -104, -91, -124, -82, -60, -38, -63, -18, -36, -76, -45, -49, -28, -73, -103, -136, -85, -47, -46, -46, -69, -84, -102, -129, -122, -71, -56, -85, -48, -12, -48, -105, -54, -101, -134, -186, -132, -72, -99, -67, -30, -91, -123, -97, 3, -26, -36, -64, -63, -126, -92, -44, -74, -75, -125, -161, -118, -140, -131, -110, -101, -104, -122, -41, -25, 2, -102, -73, -21, 27, -15, -48, -10, -53, -82, -179, -132, -116, -88, -69, -53, -20, -95, -85, -60, -104, -125, -112, -74, -47, -46, -56, -42, -95, -104, -63, -82, -149, -34, 11, -61, -112, -79, -114, -110, -60, -78, -58, -64, -139, -126, -97, -64, -48, -33, -39, -43, -26, -5, 30, -12, -29, -13, -103, -136, -95, -87, -8, -81, -72, -37, -41, -9, -61, -45, -82, -56, -51, -44, -55, -48, -66, -94, -108, -40, -109, -70, -53, -101, -68, -80, -141, -84, -76, -94, -71, -72, -111, -74, -113, -135, -48, -25, -132, -117, -102, -125, -56, -67, -75, -106, -73, -140, -116, -47, -71, -110, -93, -37, -99, -174, -161, -136, -114, -51, -2, -18, -81, -70, -115, -95, -71, -28, -110, -58, -76, -66, -24, -51, -63, -86, -97, -96, -68, -23, -61, -102, -86, -25, -27, -77, -138, -88, -72, -45, -100, -109, -32, 8, 9, 16, -28, 16, -32, -81, -124]
11949a24K9J4%l6j9K9j7%K4K6k6M2jK4L9o6J7O6k1r6l1N2%j9K4K9j8k4n6M7O7j5Rjm3Rq5P5
11931g6qJ1J9MJl1Qj4L0NpJ5O8k4o1o4N5oL2M6p7lj6J0OPj6O0Jk7K2J6j2O3j20K1n0j9N0Q8
11912Gj4jl3ll6QL4KM1km4o8O1K2jn5K8m9MR1p4K5Q3n4K6L8m7okj8Pn1k8K3QJ9l8K3qKj0J6
11892g4M1p4l1N4Pj1K7O5J9j28K0M7J1k1o8N9N6l1j6J2n1rk3K6N4k4m5P9l6l2Q4L2p8m5M1
11875f3j7k2J8M7ll0Mm1p2P6J3M0l6J8Mq8pM2J4J0L0j5L2K5o8M6m8j0K0n3K0O9om8M0qO9p
11857eM9l6p0n5P5j0m4K5n8J1M8K8J7l3k4N8j8m5kj7PL9o1pN2Pm1N8Q1n2n7l3lP0M1Pm9o2
11839a09n3L0R3jo7L9L9l4m6J2L4P6l7J4n6kLJ4l5Lj6oK1J1N7p2k4O1m1J7mK5pL0K2j5m8p7
11821a49N6pn0L7nN8O0o5k0k1kO4jo9j5M1K7jk4J4kj8J9kj2j8PRL0j8J8l0N2k4O6r0j8P9K4
$$ y = [-124, -95, -81, -81, -117, -136, -107, -124, -124, -100, -74, -100, -58, -59, -35, 4, -62, -45, 21, 0, -96, -127, -75, -75, -94, -70, -41, -59, -83, -139, -92, -25, -40, -31, -32, -75, -66, -151, -76, -84, -73, -54, -50, -49, -80, -72, -86, -56, -51, -58, -43, 25, 1, -60, -124, -69, -75, -43, 3, -74, -77, -93, -83, -77, -70, -86, -26, -25, -52, -30, -14, -26, 37, -83, -62, -112, -131, -81, 7, -7, -8, -41, -44, -80, -72, -38, -36, 5, 3, -41, -109, -48, -26, -27, -82, -54, -103, -99, -8, -82, -57, 26, -28, -2, 36, -11, -17, -19, -37, -30, -81, -109, -86, -78, -59, -97, -74, -82, -80, -90, -74, -33, -107, -138, -84, -77, -88, -61, 4, 23, -105, -85, -38, -27, -48, -116, -57, -1, -32, -48, -36, -87, -96, -119, -93, -39, -63, -108, -29, -65, -97, -13, 19, -59, -104, -63, -80, -102, -84, -37, -40, -70, -66, -107, -179, -103, -90, -50, -86, -68, -64, -152, -159, -117, -103, -93, -63, -78, -46, -21, -89, -43, -91, -101, -81, -134, -114, -45, -51, -99, -59, -67, 2, -5, 44, 8, -62, -117, -42, -52, -96, -71, -129, -118, -70, -42, -25, -58, -82, -24, -42, -87, -89, -106, -99, -60, -121, -128, -76, -69, -110, -52, 29, -23, -80, -113, -116, -46, -5, 2, -47, -109, -162, -132, -39, -40, -107, -68, -29, -63, -109, -97, -63, 13, -24, -10, -66, -68, -65, -51, -86, -83, -99, -105, -84, -73, -16, -88, -112, -51, -92, -75, -79, -54, -61, -31, -9, -24, -72, -149, -93, -100, -150, -113, -118, -60, 0, -65, -85, -106, -108, -44, -45, -114, -129, -88, -61, -62, -86, -72, -74, -92, -73, -75, -87, -105, -98, -89, -59, -77, -59, -89, -37, -61, 5, -85, -103, -24, 0]
11802@l2j7j6J5l3OL3P6j15l4L2l2L5L5J1j0ok9m2N5M1m3P0J6k1j7k7M4m6rm2k7M5k3k0Ol0
11785a51RK6l0k8L5Q4l0n7j6J7N8m8L4L7j4m9Q9Mk7M4jj0M6p3J1qLJ8m3K1nplJk7j3J3j8J8
11766i0M2L1k2k6k5o0mJ0O9l3pM1QM7K6l4lL1m6k2mKL4l8o2J9O8L7k3J8l6j5M3k6Kmq3j5n
11748a55M3mJ4M3Ml9k8N1ol4L0J0L7k7N6m3k4Q9j03l2K2L7n9l1N5L6P2k3Rk5m4m5m3L9Jn3
11730a70M8M3o0m8L9K7%M1M0l7J8q4L8N1k2o1M7Krj1J0mM1krn8J8N4j3J6R3k0o0Jk4l0K0L1
11712d4m5rO1O4Mn9j3M8k1j7j2M2K6j05j7J1M2m4JJ5J9m1j0mK4J1L2J2l6J5l9LJ5PP9lo5n1
11694a04R0q1L4K2K8M9m5m1l6NPL7L7rm6j0j0K1n4L3Nk0N%j8j3L6O2o3oL6Oq5KJ3L2N2j6j2
11676e7qL4l4Jj2K9jj0lk7Ol2j5O0N7n8k4k3M1mn3K2j6NJ27K6%l6K6n0l1n3k4oN7Qm0L4N0
$$ y = [0, -32, -49, -65, -50, -83, -77, -44, 32, -83, -117, -85, -117, -82, -47, -36, -46, -52, -81, -123, -68, -27, -70, 0, 16, -5, -22, -49, -5, -51, -60, -102, -129, -84, -107, -127, -121, -151, -142, -116, -146, -174, -139, -55, -85, -142, -158, -141, -83, -131, -97, -60, -74, -123, -34, -30, -57, -13, -14, -24, 22, -51, -40, -48, -45, -27, -70, -49, -54, -61, -64, -63, -90, -103, -90, -108, -90, -48, -17, -39, -65, -90, -150, -154, -144, -75, -108, -115, -74, -66, -19, 7, -27, -30, 1, -45, -67, -71, -69, -35, -73, -135, -116, -48, -11, -34, -16, -52, -67, -24, -50, -48, -52, -135, -150, -155, -112, -116, -102, -59, -55, -94, -122, -71, -77, -111, -81, -71, -34, -61, -5, -48, -72, 17, -86, -118, -96, -59, -118, -149, -94, -58, 14, -9, 0, -25, -69, -114, -157, -118, -117, -170, -122, -79, -139, -187, -148, -121, -121, -80, -40, -77, -59, -143, -105, -54, -76, -137, -90, -88, -97, -108, -98, -102, -61, -63, -72, -130, -112, -58, -71, -55, 38, 18, -42, -41, -65, -95, -75, -44, -89, -98, -37, 27, 31, -28, -41, 7, -14, -31, -43, -1, 25, -80, -97, -86, -44, -88, -87, -72, -53, -94, -104, -108, -84, -73, -41, -29, -65, -50, -89, -86, -71, -64, 15, 12, -53, -104, -14, -95, -61, -39, -11, 38, -7, -48, -84, -79, -72, -35, 2, -7, -53, -63, -73, -52, -106, -73, -68, -88, -83, -83, -101, -114, -78, -16, -79, -85, -49, -43, -128, -126, -113, -81, -29, -45, -57, -65, -31, -65, -64, -76, -47, -48, -58, -61, -88, -82, -114, -129, -69, -12, -70, -94, -117, -76, -80, -133, -111, -127, -122, 5, 31, 31, -5, 21, -29, -60, -113, -137, -143, -86, -78, -118, -84, -34]
11657c4k2j5jJ6l8K0J9j3o4M9N1pk4n3j9J5J7M8K6k6l7km2J1N5o2J7O6RkLm2RM4k5o0J0L0
11639g3ok9L2J6L0Mj8k3l0J3L5kL6n2k0K7o6J0pk3mR4L5j6k1l5J1l4M9L9k4q5J14k6QM5M2
11621D6m2PL7n3k3pm8J7M7J5K4o0j6j9qK1rm4Qn4J15R4k2m5n5k9N1L5k5n6QpoM4N6m3o3K0
11603h9J8K4n0k1KMJ3M7qk6j2L9oj9j2Mj9Q3qK9j4m1jk7L0j7O1qo7N5k5J6l5Om4Ml8Q6K6l4
11584g4n4n7N9N8l1J5P3J1m0k0K9p1k6J7M5R0lj8l6jn5J2kN0Rj9K3Ol1K7J1J0mK6k0m0qQk3
11565e4k3NQL7K2On7kk8l6oK2J0K0jn0L8N6m6l9J2M8k3L6K0PJ5J2N4j02n4LL2N1MKj13KJ3
11547i9l2N8PL3L5n0m0j9J5m5O9L6j6p3N7K5j3k9k3J3pll4KN9l4m3O6m2Oj6N2m4P0m3K5N5
11529b2n2RK0L6j2k4j2J9K4l4Kr8N1Jk9K0Q7k7nL0L2m4o3J9n2k6Q0L5m2m4kL7l4k5kN8PnL4
$$ y = [-34, -56, -71, -72, -56, -94, -74, -55, -68, -132, -83, -32, -39, -63, -116, -135, -120, -103, -55, -29, -55, -92, -94, -136, -125, -70, -132, -115, -49, -40, -42, -39, -81, -72, -28, -53, -113, -103, -73, -79, -108, -76, -60, -30, -26, -44, -67, -97, -84, -49, -51, -15, -67, -87, -60, -126, -116, -123, -146, -150, -56, -21, -37, -58, -93, -82, -116, -67, -28, -52, -137, -23, -49, -41, 4, 46, 4, 11, 48, -5, -28, -35, -83, -66, -19, -4, 20, -40, -56, -75, -83, -62, -71, -115, -107, -161, -46, 48, 26, -19, -74, -103, -52, -17, -42, -98, -90, -97, -103, -59, -3, -46, -109, -89, -71, -47, -97, -118, -116, -112, -99, -52, -60, -86, -98, -59, -65, -84, -96, -92, -111, -28, -36, -7, -21, -62, -63, -90, -60, -77, -16, -24, -91, -36, -61, -45, -80, -74, -118, -114, -152, -66, -40, -74, -128, -185, -126, -68, -99, -84, -11, 0, -40, -60, -31, -102, -128, -111, -66, 24, 21, 3, -33, -34, -89, -77, -79, -29, -20, -39, -16, -10, -41, -14, -3, 7, 3, 29, 9, -31, -39, -31, -54, -77, -72, -64, -27, -5, 1, -56, -58, -86, -122, -128, -106, -96, -76, -77, -127, -89, -33, -79, -118, -106, -58, -81, -45, -25, -18, -3, 9, 63, -39, -93, -90, -58, -7, -3, -1, -114, -112, -99, -131, -73, -66, -33, 2, -48, -88, -107, -92, -137, -68, -32, -48, -121, -64, -39, -52, -81, -104, -91, -98, -101, -135, -133, -74, -108, -151, -85, -127, -121, -137, -85, -129, -59, -102, -77, -22, -74, -65, -45, -9, -21, -45, -57, -38, -14, -48, -46, -144, -93, -92, -121, -101, -14, -41, -46, -16, 16, -28, -91, -72, -124, -150, -70, -35, -77, -121, -123, -86, -120, -145, -147, -89, -82, -87, -53]
11511e3Mo8j5QJ7J7L2L0K6l7QOQl7r6O6O6Ol3k8J7k5Q8l1o2k9N0j3q4N8Q8m8k6L7Mk7k9j2
11492a17P5J3m1j9K7J9J2q6L6O6K0pp0L0Q5o9o7j7L3j3oL5K4j9m5k2R4J5J0n2k6M7KL5n2o2
11475a12k1L0K4p5jL7M9M0n0j8n2K1P9J7o1qJ2L0k4j2KK4kLm3N5OJ6K3JJ5lk0l4j8l2L8lk2
11457h9J6j9J3J3L3l5J2J7k1J5k1k5N6ok9k7m8K9J2L9Mn7nJ2Q5lp2O1lo9O6J1Ml6l6oK5m4
11439a28O4J6pK8j5k2M1j3%n9K3K6n8k6K8Mjj8K1l8N5K8j30L6P1k0l7L3O9L9q6O6n8M8jM5
11421B4j03L5M5l8J0k0j0k3O0L1n3m4K3k0RJ6L7ko6K9K0l0R3n3rl2QJn7J8K8m3J4L2J0k6J6
11404g0J7k0OR7m2j0n4m4j8J8L9k1L7QJ3om1O9j6j5K0k3j7pM7n8m3M1J02K7J2m9lmo9L1L7
11386io6o1M8L1k0M1N5l6n2l1J4j0L1o5J7K0M3j5q8J4L0L6qj9Ol6K1P3l0Rm3m8K8N9L5%k0
$$ y = [-53, -49, -117, -132, -124, -107, -90, -58, -28, -2, -39, -31, -25, -17, -54, -150, -84, -18, -12, -45, -73, -56, -81, 7, -24, -86, -115, -65, -78, -162, -104, -16, -64, -90, -53, -49, -76, -105, -117, -42, -29, -70, -89, -62, -43, -31, -117, -81, -15, 5, -2, -72, -42, 43, -26, -93, -110, -77, -90, -96, -61, -37, -56, -101, -123, -29, -14, -4, -56, -82, -35, -33, 2, -50, -112, -133, -103, -79, -154, -155, -118, -69, -29, -79, -97, -149, -128, -49, -32, -93, -101, -89, -59, -83, -95, -93, -69, -71, -68, -111, -56, -50, -34, -11, -10, 5, 2, -18, -52, -70, -102, -64, -67, -89, -73, -92, -79, -66, -33, -68, -56, -39, -60, -45, -66, -91, -35, -41, -70, -97, -145, -116, -104, -65, -61, -118, -123, -111, -26, -29, -101, -40, -43, -112, -46, -35, -31, -67, -103, -109, -84, -128, -64, -48, -55, -27, -42, -64, -23, -36, -36, -95, -72, -46, -104, -130, -102, -98, -99, -117, -96, -134, -79, -51, -181, -145, -74, -94, -131, -98, -29, 10, -76, -10, -68, -20, -21, 24, -79, -44, 1, -37, -27, -47, -57, -80, -20, 11, -42, -86, -63, -83, -74, -58, -21, -23, -89, -60, -40, -70, 23, -30, -39, -71, -63, -62, -119, -101, -73, -116, -102, -70, -60, -86, -70, -53, -73, -67, 30, -12, -22, -76, -120, -138, -120, -81, -102, -65, -57, -44, -50, -91, -22, -38, -53, -33, -56, -73, -80, -33, -91, -134, -93, 9, 36, 48, -1, -4, -8, -77, -46, -9, -75, -136, -88, -57, -77, -36, 19, -17, -69, -100, -86, -96, -65, -130, -113, -93, -50, -65, -153, -139, -109, -73, -81, -100, -94, -130, -109, -36, -66, -57, -100, -148, -120, -61, -26, -26, -46]
11368d6l8J4n1L7R5j05K1Q4Jj01L4JL6K0K2p5L7N9p7p8K4O1o9kK0J7l4M9Ql2K4l2J6K1j4j1
11351f4lk7J2lKo2m3P9N9m6O8k7p8k8J5O7J8K1K1q0l1Ol5J04rJ0RJ4j8J9K1r6K7K9L0L7Ln1
11333c0jk3j26k2Q3J5o1P9RL0N6l5n7M1M0j6o6k5k7J3Q4k5M6ol5J3mJ5j0N8l4pJ6qK7K3k1
11315Iq2m0J1k0O3Q9o5m9L0pKj2J3l3j7J11J6RK7j15Lk7N9l1%Jq1j2O6K1n0K8K7j7M9j4j11
11298a49Lk5J5N2j8J4L6o6p5M2L7K7j9k1N1n2PLO0m1m1P2P3k1L8m8PPQK3l5j1l6J3rLJ3j9
11280h2L2j4n3J2K0k2L8k5m3K8M1m0L1JlK4j4m5L1l0L1Q0j3m1n6K1j3l6K2J19j2l4o2LK6M3
11263c5l7k3k9M2kJ8K4j9m3l6j8J2J9k5P2MJ6l3n0L9l0J08j8qK9l4m7j3RJ6J1l2LO6K2p4p
11245a03P4mNj9m4N1K7O4j1k7L9n3p3j0k5l5N7MPj4J1J8l5J7M4L0j9n0J1L8o4K8K8l1M6l9
$$ y = [-46, -84, -70, -121, -84, 11, -94, -73, 11, 12, -89, -55, -54, -18, 2, 24, -51, -14, 45, -32, -110, -86, -25, -94, -96, -76, -59, -93, -44, -36, -68, -44, -76, -60, -39, -53, -64, -67, -94, -82, -85, -83, -145, -188, -109, -50, -96, -28, -55, -133, -161, -146, -79, -61, -40, -19, -99, -130, -124, -159, -55, -64, -54, -45, -31, -49, -30, -9, -105, -78, -49, -19, 18, 21, -30, -31, -54, -180, -202, -119, -104, -165, -86, -77, -47, 9, -26, -83, -42, -2, -18, -84, -109, -136, -123, -39, -64, -18, -24, -59, -46, -50, -35, -45, 13, -21, -28, -12, -20, 7, 30, 9, -73, -113, -102, -122, -59, 30, -35, -84, -54, -61, -59, -71, -58, -91, -108, 3, 19, 28, 55, -60, -57, -84, -25, -56, -56, -55, -136, -148, -82, -61, -111, -83, -56, -73, -24, -38, -149, -146, -171, -156, -104, -122, -108, -72, -138, -213, -171, -134, -107, -126, -147, -96, -148, -141, -138, -78, -119, -160, -88, -15, -36, 2, -46, -39, -32, -24, -1, -36, -47, -83, -70, -79, -76, -63, -82, -50, -64, -117, -105, -85, -107, -69, -94, -137, -109, -68, -108, -77, -76, -79, -55, -69, -114, -83, -113, -82, -2, -15, -56, -112, -91, -104, -140, -118, 1, -11, -45, -107, -104, -78, -35, -72, -95, -124, -82, -84, -66, -42, -61, -104, -140, -158, -146, -127, -152, -80, -76, -60, -93, -143, -104, -134, -26, -44, -52, -23, -57, -104, -117, -108, -92, -81, -113, -110, -44, -22, -96, -103, -29, -33, -28, -47, -91, -40, -13, 51, 40, 13, 52, -1, -74, -84, -109, -144, -87, -83, -76, -90, -79, -61, -96, -79, -35, -5, -24, -74, -63, -25, -89, -61, -33, -64, -18, -57]
11228e7L1JJ3o9LJl0l2KK5K0jn5L5L2n8K4M9rl7J08l9l0p7K8L8rj6K2K6m5k6P8k1%J8n4oL7
11209h0K9j3K3M9p5n7n5K8P3m1j8L6K7J1J3o1N0jj6m8PK4KJ8l7m5l5M9Q5OqJ5j7PM6k3J4n5
11191g3l8K1nM1PoOm4j1N5Nj4jm7J3QJ5l0L4lOM3K7j0o5M2k9l2L9j0l0L6j1k5k3O8l1n4L0
11172i6O9k0L7r5m0R1l3lO0l6j5j1k8L8Qo4nR3Mm8lJ6RJ8l1r4M3nJ8m6R8L8q3k0lQ2l3LM4
11154d3lK6n2qj4k6qJ8m0K5Oj1O0Rk3K5k1L0L8P2k9r6mM2m5nJ9qp2O1PK1l4J0K9L2Jl6l2K2
11135e7J4k2n5L8N6m5qJ0l9qj8K6L5O0K9l3o8K9K0L7q2j2k5m6M4M2N4o8L3K4o7k7L9M1J6k5
11118e8j2k6K7K2Qk6jm2J6J4j2mO0k9n0L4M4J3o1j6M2oOK5o1N1jnk6m2P5k5L2l4J3Ql9L3L
11099e0l3Q3l0l2l3N1L7l8l4k6N6j2k8NJ3J5J3J9%l2k3KM1J9L8n2j8o0j6L6KLk4M8jQj03J2
$$ y = [-57, -26, -25, -12, -81, -78, -77, -107, -139, -137, -112, -92, -93, -148, -113, -81, -139, -115, -66, -75, -112, -4, -43, -73, -150, -122, -84, -93, -109, -87, -61, -106, -132, -54, -75, -75, -57, -111, -117, -80, -51, -64, -41, 8, -67, -124, -179, -151, -78, -119, -137, -101, -74, -63, -50, -111, -61, -62, -78, -126, -119, -95, -93, -75, -112, -157, -192, -143, -58, -52, -60, -45, -62, -55, -9, -32, -18, -73, -111, -90, -95, -54, -47, -53, -47, -91, -102, -47, -42, -56, -57, -104, -91, -83, -68, -98, -64, -67, -61, -18, 9, -1, -66, -24, -53, -85, -46, -56, -86, -50, -61, -86, -109, -41, -72, -126, -96, -27, -47, -10, -105, -145, -54, -87, -90, -30, -66, -81, -92, -120, -82, -74, -138, -143, -50, -46, -94, -97, -81, -72, -54, -85, -179, -136, -141, -123, -169, -71, -33, -116, -136, -139, -57, -90, -87, -43, -46, -20, -72, -80, -94, -120, -128, -110, -150, -125, -119, -130, -70, -61, -84, -59, -80, -50, -12, 60, 31, -65, -69, -27, -72, -77, -58, -66, -138, -77, -70, -49, -83, -73, -44, -12, -11, -47, -79, -57, -43, -65, -120, -82, -26, -71, -79, -69, -108, -116, -134, -108, -73, -13, 16, -17, -85, -56, -36, 1, -81, -93, -118, -164, -120, -78, -24, -92, -59, -35, -102, -129, -90, -49, -33, -58, -70, -96, -69, -47, -39, -65, -66, -108, -92, -78, -90, -94, -34, -63, -113, -79, -35, -22, -83, -99, -57, -63, -57, -32, -93, -42, -43, -48, -74, -116, -41, -66, -34, -68, -55, -47, -86, -53, -50, -83, 0, -30, -62, -95, -44, -7, -45, -79, -105, -49, -61, -89, -84, -71, -56, -43, -24, -24, -56, -79, -77, -36, -17, 21, -31, -49, -109, -125, -89, -87, -84, -108, -60, -61, -53, -156, -144]
11081a44P4N8m5k5m6M6J0j7kJ1KrL8J0N5p3l5j3JL3o0O4JLK3J5n7O3K5Kn5QM0J1o5j1m7j6
11063a27j8J1O0k8O9m9k9L1M8Rj7rj8j3k4K0J2l5K8p5Q8L0M5q0j3k5O7k2m3nM9k0J02p8m7
11046a06Q5l2OL4l4j9k3M6J3k0p4N0N7R6l8r6k1P4on3mMlm2J3Kn1M5K8l7L0K0k4nkP3M0m0
11028a4Ql6k2k8L7P9%l8m5K0m9k2kP5j6M7l2Mm3l8k9R9j5Jj4J8kj1j5O3nr3M1k1K8pJ4K3l1
11009g1l6JJ9K2K0p3m9N0N1m4jLk5O9N0k5m5P6l8n5Ll1Q8k9OO7k1k3k7J9k9J8jJ1K1j5J6k9
10991e7p9O4M9rm4j9KJ8j1J0j7pJ1K4J6j00O2M6l6l8MKM6k1l5M5J8M5k4l9J3j9k5pK1K5l6
10974a02J6J5j7j7P8k0Pk0k9M9o5LO6n1k9N8l7nj4m1Pm4j6J50L7j3Oo8K0J2p2L1L7k2O6%n
10956b9j1l9kM2M9l0M2q9m6L9J9L9q0m7KR8J5n3n7M8j9%k0J9O2j3o4l6N8RJ4M7k3k2o1j5M6
$$ y = [-144, -70, -12, -57, -82, -128, -82, -72, -89, -91, -80, -78, -87, -49, -39, 16, -57, -92, -105, -104, -71, -131, -67, -66, -63, -40, -25, -82, -19, 6, 8, -47, -39, 1, 12, -53, -64, -111, -127, -145, -134, -74, -102, -33, -82, -111, -80, -32, -23, -40, -49, -67, -80, -104, -84, -72, -107, -79, -154, -66, -36, 9, -71, -84, -109, -42, -64, -107, -112, -63, -83, 19, -59, -106, -21, -53, -47, -13, -47, -66, -89, -43, -30, -50, -124, -74, -17, 79, 41, -55, -76, -2, -8, -61, -65, -61, -64, -106, -93, -91, -142, -97, -69, -106, -76, -56, -80, -85, -87, -14, 26, -14, -6, -42, -64, -92, -55, 24, 24, -14, -59, -39, -88, -110, -112, -37, -53, -6, -38, -34, -77, -115, -144, -45, -60, -59, -73, -55, -57, -68, -83, -20, -25, -118, -77, -98, -70, -77, -63, -40, -71, -107, -106, -87, -65, -45, -118, -167, -117, -66, -110, -111, -108, -133, -64, -14, -39, -84, -8, -46, -101, -98, -129, -41, -70, -64, 3, -18, -41, -68, -49, -78, -60, -61, -50, -29, -44, -28, -57, -136, -72, -23, -32, -76, -95, -93, -75, -86, -76, -93, -100, -89, -65, -49, -149, -87, -41, -77, -115, -111, -109, -63, -84, -119, -74, -56, -11, -35, -74, -61, -80, -105, -112, -91, -66, -102, -86, -71, -88, -105, -27, -47, -40, -60, -89, -40, -105, -102, -36, -87, -116, -58, -95, -100, -114, -155, -148, -192, -208, -58, -21, -34, -28, -96, -76, -64, -136, -105, -68, -90, -24, -24, -29, -40, -79, -81, -39, 10, -20, 22, -67, -113, -74, -55, -16, -96, -143, -141, -43, -28, -81, -138, -90, -109, -109, -129, -110, -48, -61, -125, -161, -103, -94, -80, -33, -56, -78, -139, -154, -108]
10938a08J17p1j2m5K2%k6J2Ql1K6M7j9q2OJ03j7k6L2j7k0N8J8Qq2j3M7o5l2M7j0Q9J9m9jk
10921f9L0o6k4K0L2K0o7o6M2M2l6m4J9R9j8kMJ8N4l4o0rP3j3RJL8j2k3J8m4OK0j9J4K3O5Q
10903D9n5n5o3lM9o6j5J0J6N5K4l0L7ko2j5N6J8j3M6m3lK7om7L1j6jQK2Mm9k6KQN0m7N0m8
10884a03k6J6N7k1r3K9M9J4j8j1KPO2N2l3q9P2J1k2m4ljRo5oP8Jk4PmK0k2L4r1rR7lm3o1P
10865a68O5L6m5m1J1M0Oll5M9O5o0n5K3K6k7N2m3P4k2k7k4n9K1M0M1Lkok7k6k5j4O1J5N1R
10848b1k8l0k7n5L4K6kM7m0l7N2M6j5lk8k9kNpK1j7K9k0K5m2J4M2j4j2j3L1J7j4L5k6o8oM6
10830h6J3qJ3pk9M9N4OKl2n7Jl1NMK9L6l1k5M2km1M8mPk6l2m9K3N6jR0m8q1j5O3K9j6j2m7
10811a10RQj0L3%j5M6K8k4j9K0k8l1M8O8r1n7K2k5N4J6j8k7K%J3pjk7LK8l4m5N3M4Qr2O2K4
$$ y = [-108, 9, -62, -74, -119, -97, -97, -123, -111, -103, -134, -108, -61, -80, -162, -156, -53, -70, -96, -64, -81, -101, -43, -25, -17, -99, -112, -65, -130, -162, -115, -125, -36, -17, -66, -67, -69, -39, -105, -129, -109, -77, -57, -124, -190, -148, -106, -142, -186, -167, -68, -86, -88, -84, -66, -12, -46, -106, -115, -42, -55, -46, -45, -7, -19, -42, -24, -68, -62, -42, -61, -47, -24, 41, 49, -6, -61, -124, -127, -78, -144, -159, -149, -133, -78, -54, -84, -47, -49, -111, -126, -70, -52, -65, -19, -62, -65, -38, -44, -91, -60, -76, -77, -69, -47, -43, -92, -118, -116, -108, -58, -105, -55, -103, -129, -113, -56, -77, -170, -141, -92, -78, -96, -107, -105, -98, -36, 16, -17, -106, -34, -23, -45, -89, -92, -93, -84, -149, -155, -77, -76, -100, -93, -97, -77, -99, -65, -156, -165, -68, -71, -114, -175, -168, -103, -67, -112, -153, -142, -102, -96, -99, -134, -85, -20, -80, -135, -112, -86, -113, -61, -104, -30, -52, -79, -103, -162, -141, -101, -60, -57, -59, -65, -92, -118, -143, -157, -96, -81, -30, -21, -49, -79, -106, -161, -127, -101, -103, -56, -96, -133, -81, -35, -50, -53, -81, -110, -112, -107, -114, -93, -110, -81, -101, -76, -118, -104, -62, -76, -88, -101, -70, -53, -67, -32, -58, -126, -132, -86, -73, -81, -68, -75, -104, -55, -1, 5, 7, -25, -82, -81, -112, -107, -103, -74, -38, -69, -94, -52, -54, -95, -47, -51, -44, -70, -102, -151, -128, -72, -73, 17, -31, -112, -127, -64, -35, -51, -63, -110, -101, -93, -103, -70, -70, -85, -39, -11, -35, -54, -34, -62, -93, -45, 23, -68, -125, -103, -128, -74, -58, -76, -103, -101, -101, -88, -95, -96, -123, -120, -92, -126, -171, -118, -74, -66, -158, -96, -72]
10792g2l0oJ1pj5Rj6O1pJ5M5N1j7l1m8M0k3OLk3L9k3j2K5l3K3mm1L5N5l5n8m6L4M9l0L3nQ
10773d0K7J4Rm0n6%M5l6j0J03MPj6p2k8o5M9J4m4N8m2M4J1O1mn0K5k0mL0%l9mK2o2j2lK5K7
10755g2o6O7M6L5j1n4l1L7j1K8k3j8M0M2r5k7K2M7J06q0r5J9R3m3K4K7pm4Mn1n2J1kM8j8l3
10738a37M6L7qL8k2K5oj6O8o3k9k5%K9K2p1O7J9N8k7k2l7o1k7Q6k8m8O6j7l1K5ll6M0M9K6
10720a3M9q1j1M3j7pl9P2K3p3k3p1K6%J2q2J4R0N7m6oQ8n8K5o1j5N2l4l3M1k3rO7O9kq8J3
10703e1L3j2Nm0n9j2L4L2K0k4n4N6P5n8m0jO6M2j7J5m5%n5Nm1L0J6kL0m1n4KK1P6kl0RJ8j0
10684f3l8L5J1m3M1moLl9OL3K3j5J0K4j2lL3k7K4r0K7K0L7K4p6m4QO7J8k7Qm3K9J6Pn5k7m1
10666a49K5L6K2L2K1o3P3oj5Oo7n5K4q8lP0K3j2kJ5L7nm7m5P5L2j5n0J6J2M2l7p1L2M9j3M0
$$ y = [-72, -102, -108, -97, -104, -119, -110, -126, -65, -72, -57, -12, 39, 22, -9, -57, -17, -40, -34, -31, -54, -15, -38, -50, -25, -58, -35, -39, -80, -45, 10, -25, -83, -129, -95, -46, -76, -43, -48, -40, -13, 1, 10, -30, -86, -86, -41, -77, -87, 16, 20, 27, 11, -61, -89, -154, -105, -91, -135, -77, -119, -75, -64, -3, -7, -57, -32, -52, -56, -26, -26, -65, -69, -47, -109, -121, -124, -99, -72, -138, -71, -25, 10, -1, -55, -86, -49, -60, -32, -55, -73, -33, 9, -86, -113, -91, -44, 62, -18, -113, -94, -1, -44, -20, 7, 0, -44, -40, -91, -143, -132, -134, -86, -104, -137, -91, -54, -62, -24, -46, -21, -27, -43, 25, -38, -67, -92, -92, -63, -41, -112, -45, -26, 32, 5, -17, -54, -115, -142, -56, -84, -132, -66, -83, -114, -89, -92, -128, -88, -39, -13, 36, -45, -56, -13, -30, -37, -76, -4, 19, -54, -77, -148, -122, -122, -110, -192, -178, -88, -31, -77, -83, 5, -53, -28, -89, -104, -52, -86, -119, -78, -101, -110, -43, 26, 24, -64, -51, -18, -30, -25, -65, -124, -136, -102, -70, -50, -74, -128, -72, 3, -55, -95, -96, -30, 12, -5, 10, -35, -35, -90, -85, -126, -96, -80, -82, -52, -93, -147, -145, -124, -48, -50, -80, -71, -53, -63, -101, -66, -55, -98, -57, -61, -67, -64, -103, -97, -64, -41, -56, -46, -22, -34, -37, -4, -31, -7, -97, -70, -50, -13, 11, -65, -109, -101, -34, -16, -43, -35, -78, -49, -33, -26, -81, -108, -149, -124, -88, -66, -34, -13, -76, -3, -9, -24, -18, -85, -140, -116, -204, -207, -137, -114, -126, -128, -113, -76, -81, -128, -173, -98, -66, -81, -131, -115, -103, -61, -98, -169, -137, -88, -101, -61]
10648f1M2j5l9j3o2L2P0K7l0nM5Kp1n1M6M7q0N1JKL4o2Rk1m1K9N1JK1LK7J0q2j6NN1l9Ql6
$$ y = [-61, -19, -34, -73, -86, -148, -116, -46, -19, -49, -54, -9, -7, -78, -129, -83, -36, -116, -65, -64, -62, -28, -90, -81, -102, -143, -114, -63, -62, -41, -38, -11, -1, -83, -99, -94, -43, -82, -74, -110]
$$ [...]
-1793b
##END=		$$ NMR SPECTRUM
##END=		$$ LINK
